FailedConsole Output

Skipping 467 KB.. Full Log
[INFO] ------------------------------------------------------------------------
[INFO] 
[INFO] --- tycho-packaging-plugin:1.0.0:build-qualifier (default-build-qualifier) @ be.uantwerpen.ansymo.semanticadaptation.cg.cpp.tests ---
[INFO] The project's OSGi version is 1.0.0.201801011726
[INFO] 
[INFO] --- tycho-packaging-plugin:1.0.0:validate-id (default-validate-id) @ be.uantwerpen.ansymo.semanticadaptation.cg.cpp.tests ---
[INFO] 
[INFO] --- tycho-packaging-plugin:1.0.0:validate-version (default-validate-version) @ be.uantwerpen.ansymo.semanticadaptation.cg.cpp.tests ---
[INFO] 
[INFO] --- xtend-maven-plugin:2.11.0:compile (default) @ be.uantwerpen.ansymo.semanticadaptation.cg.cpp.tests ---
[WARNING] 
WARNING: 	CgCppAutoTest.xtend - /var/lib/jenkins/workspace/ridCosimulation_development-7CHFDKZ477AWP5WGVIV7ZEYJ7TBQYODTBA2CXNIBOFPOTJGJR3PQ/DSL_SemanticAdaptation/be.uantwerpen.ansymo.semanticadaptation.cg.cpp.tests/src/be/uantwerpen/ansymo/semanticadaptation/cg/cpp/tests/CgCppAutoTest.xtend
19: The import 'org.eclipse.xtext.generator.IGeneratorContext' is never used.
[INFO] 
[INFO] --- maven-resources-plugin:2.4.3:resources (default-resources) @ be.uantwerpen.ansymo.semanticadaptation.cg.cpp.tests ---
[INFO] Using 'UTF-8' encoding to copy filtered resources.
[INFO] skip non existing resourceDirectory /var/lib/jenkins/workspace/ridCosimulation_development-7CHFDKZ477AWP5WGVIV7ZEYJ7TBQYODTBA2CXNIBOFPOTJGJR3PQ/DSL_SemanticAdaptation/be.uantwerpen.ansymo.semanticadaptation.cg.cpp.tests/src/main/resources
[INFO] 
[INFO] --- tycho-compiler-plugin:1.0.0:compile (default-compile) @ be.uantwerpen.ansymo.semanticadaptation.cg.cpp.tests ---
[WARNING] Parameter 'useProjectSettings' is set to true, but preferences file '/var/lib/jenkins/workspace/ridCosimulation_development-7CHFDKZ477AWP5WGVIV7ZEYJ7TBQYODTBA2CXNIBOFPOTJGJR3PQ/DSL_SemanticAdaptation/be.uantwerpen.ansymo.semanticadaptation.cg.cpp.tests/.settings/org.eclipse.jdt.core.prefs' could not be found!
[INFO] Compiling 3 source files to /var/lib/jenkins/workspace/ridCosimulation_development-7CHFDKZ477AWP5WGVIV7ZEYJ7TBQYODTBA2CXNIBOFPOTJGJR3PQ/DSL_SemanticAdaptation/be.uantwerpen.ansymo.semanticadaptation.cg.cpp.tests/target/classes
[WARNING] Source directory /var/lib/jenkins/workspace/ridCosimulation_development-7CHFDKZ477AWP5WGVIV7ZEYJ7TBQYODTBA2CXNIBOFPOTJGJR3PQ/DSL_SemanticAdaptation/be.uantwerpen.ansymo.semanticadaptation.cg.cpp.tests/src-gen does not exist
[INFO] 
[INFO] --- xtend-maven-plugin:2.11.0:xtend-install-debug-info (default) @ be.uantwerpen.ansymo.semanticadaptation.cg.cpp.tests ---
[WARNING] Directory /var/lib/jenkins/workspace/ridCosimulation_development-7CHFDKZ477AWP5WGVIV7ZEYJ7TBQYODTBA2CXNIBOFPOTJGJR3PQ/DSL_SemanticAdaptation/be.uantwerpen.ansymo.semanticadaptation.cg.cpp.tests/src/main/java is empty. Can't process.
[WARNING] Directory /var/lib/jenkins/workspace/ridCosimulation_development-7CHFDKZ477AWP5WGVIV7ZEYJ7TBQYODTBA2CXNIBOFPOTJGJR3PQ/DSL_SemanticAdaptation/be.uantwerpen.ansymo.semanticadaptation.cg.cpp.tests/src-gen is empty. Can't process.
[INFO] Installing Xtend files into 2 class files as primary debug sources in: /var/lib/jenkins/workspace/ridCosimulation_development-7CHFDKZ477AWP5WGVIV7ZEYJ7TBQYODTBA2CXNIBOFPOTJGJR3PQ/DSL_SemanticAdaptation/be.uantwerpen.ansymo.semanticadaptation.cg.cpp.tests/target/classes
[INFO] 
[INFO] --- xtend-maven-plugin:2.11.0:testCompile (default) @ be.uantwerpen.ansymo.semanticadaptation.cg.cpp.tests ---
[INFO] skip compiling sources because the configured directory '[/var/lib/jenkins/workspace/ridCosimulation_development-7CHFDKZ477AWP5WGVIV7ZEYJ7TBQYODTBA2CXNIBOFPOTJGJR3PQ/DSL_SemanticAdaptation/be.uantwerpen.ansymo.semanticadaptation.cg.cpp.tests/src/test/java]' does not exists.
[INFO] 
[INFO] --- maven-resources-plugin:2.4.3:testResources (default-testResources) @ be.uantwerpen.ansymo.semanticadaptation.cg.cpp.tests ---
[INFO] Using 'UTF-8' encoding to copy filtered resources.
[INFO] skip non existing resourceDirectory /var/lib/jenkins/workspace/ridCosimulation_development-7CHFDKZ477AWP5WGVIV7ZEYJ7TBQYODTBA2CXNIBOFPOTJGJR3PQ/DSL_SemanticAdaptation/be.uantwerpen.ansymo.semanticadaptation.cg.cpp.tests/src/test/resources
[INFO] 
[INFO] --- xtend-maven-plugin:2.11.0:xtend-test-install-debug-info (default) @ be.uantwerpen.ansymo.semanticadaptation.cg.cpp.tests ---
[WARNING] Directory /var/lib/jenkins/workspace/ridCosimulation_development-7CHFDKZ477AWP5WGVIV7ZEYJ7TBQYODTBA2CXNIBOFPOTJGJR3PQ/DSL_SemanticAdaptation/be.uantwerpen.ansymo.semanticadaptation.cg.cpp.tests/src/test/java is empty. Can't process.
[WARNING] Directory /var/lib/jenkins/workspace/ridCosimulation_development-7CHFDKZ477AWP5WGVIV7ZEYJ7TBQYODTBA2CXNIBOFPOTJGJR3PQ/DSL_SemanticAdaptation/be.uantwerpen.ansymo.semanticadaptation.cg.cpp.tests/target/xtend-gen/test is empty. Can't process.
[INFO] Installing Xtend files into 0 class files as primary debug sources in: /var/lib/jenkins/workspace/ridCosimulation_development-7CHFDKZ477AWP5WGVIV7ZEYJ7TBQYODTBA2CXNIBOFPOTJGJR3PQ/DSL_SemanticAdaptation/be.uantwerpen.ansymo.semanticadaptation.cg.cpp.tests/target/test-classes
[INFO] 
[INFO] --- target-platform-configuration:1.0.0:target-platform (default-target-platform) @ be.uantwerpen.ansymo.semanticadaptation.cg.cpp.tests ---
[INFO] 
[INFO] --- tycho-packaging-plugin:1.0.0:package-plugin (default-package-plugin) @ be.uantwerpen.ansymo.semanticadaptation.cg.cpp.tests ---
[INFO] Building jar: /var/lib/jenkins/workspace/ridCosimulation_development-7CHFDKZ477AWP5WGVIV7ZEYJ7TBQYODTBA2CXNIBOFPOTJGJR3PQ/DSL_SemanticAdaptation/be.uantwerpen.ansymo.semanticadaptation.cg.cpp.tests/target/be.uantwerpen.ansymo.semanticadaptation.cg.cpp.tests-1.0.0-SNAPSHOT.jar
[INFO] 
[INFO] --- tycho-p2-plugin:1.0.0:p2-metadata-default (default-p2-metadata-default) @ be.uantwerpen.ansymo.semanticadaptation.cg.cpp.tests ---
[INFO] 
[INFO] --- maven-javadoc-plugin:2.9:jar (attach-javadocs) @ be.uantwerpen.ansymo.semanticadaptation.cg.cpp.tests ---
[INFO] Skipping javadoc generation
[INFO] 
[INFO] --- tycho-surefire-plugin:1.0.0:test (default-test) @ be.uantwerpen.ansymo.semanticadaptation.cg.cpp.tests ---
[INFO] Expected eclipse log file: /var/lib/jenkins/workspace/ridCosimulation_development-7CHFDKZ477AWP5WGVIV7ZEYJ7TBQYODTBA2CXNIBOFPOTJGJR3PQ/DSL_SemanticAdaptation/be.uantwerpen.ansymo.semanticadaptation.cg.cpp.tests/target/work/data/.metadata/.log
[INFO] Command line:
	[/usr/lib/jvm/java-8-oracle/jre/bin/java, -Dosgi.noShutdown=false, -Dosgi.os=linux, -Dosgi.ws=gtk, -Dosgi.arch=x86_64, -Dosgi.clean=true, -jar, /var/lib/jenkins/workspace/ridCosimulation_development-7CHFDKZ477AWP5WGVIV7ZEYJ7TBQYODTBA2CXNIBOFPOTJGJR3PQ/.repository/p2/osgi/bundle/org.eclipse.equinox.launcher/1.3.201.v20161025-1711/org.eclipse.equinox.launcher-1.3.201.v20161025-1711.jar, -data, /var/lib/jenkins/workspace/ridCosimulation_development-7CHFDKZ477AWP5WGVIV7ZEYJ7TBQYODTBA2CXNIBOFPOTJGJR3PQ/DSL_SemanticAdaptation/be.uantwerpen.ansymo.semanticadaptation.cg.cpp.tests/target/work/data, -install, /var/lib/jenkins/workspace/ridCosimulation_development-7CHFDKZ477AWP5WGVIV7ZEYJ7TBQYODTBA2CXNIBOFPOTJGJR3PQ/DSL_SemanticAdaptation/be.uantwerpen.ansymo.semanticadaptation.cg.cpp.tests/target/work, -configuration, /var/lib/jenkins/workspace/ridCosimulation_development-7CHFDKZ477AWP5WGVIV7ZEYJ7TBQYODTBA2CXNIBOFPOTJGJR3PQ/DSL_SemanticAdaptation/be.uantwerpen.ansymo.semanticadaptation.cg.cpp.tests/target/work/configuration, -application, org.eclipse.tycho.surefire.osgibooter.headlesstest, -testproperties, /var/lib/jenkins/workspace/ridCosimulation_development-7CHFDKZ477AWP5WGVIV7ZEYJ7TBQYODTBA2CXNIBOFPOTJGJR3PQ/DSL_SemanticAdaptation/be.uantwerpen.ansymo.semanticadaptation.cg.cpp.tests/target/surefire.properties]
Picked up JAVA_TOOL_OPTIONS: -Dmaven.ext.class.path="/var/lib/jenkins/workspace/ridCosimulation_development-7CHFDKZ477AWP5WGVIV7ZEYJ7TBQYODTBA2CXNIBOFPOTJGJR3PQ@tmp/withMavenfaf20857/pipeline-maven-spy.jar" -Dorg.jenkinsci.plugins.pipeline.maven.reportsFolder="/var/lib/jenkins/workspace/ridCosimulation_development-7CHFDKZ477AWP5WGVIV7ZEYJ7TBQYODTBA2CXNIBOFPOTJGJR3PQ@tmp/withMavenfaf20857" 

-------------------------------------------------------
 T E S T S
-------------------------------------------------------
Running be.uantwerpen.ansymo.semanticadaptation.cg.cpp.tests.CgCppBasicTest
Rootdir: /var/lib/jenkins/workspace/ridCosimulation_development-7CHFDKZ477AWP5WGVIV7ZEYJ7TBQYODTBA2CXNIBOFPOTJGJR3PQ/DSL_SemanticAdaptation/be.uantwerpen.ansymo.semanticadaptation.cg.cpp.tests/target/c-gen-tests/generated/powerwindow
log4j:WARN No appenders could be found for logger (org.eclipse.xtext.parser.antlr.AbstractInternalAntlrParser).
log4j:WARN Please initialize the log4j system properly.
2018-01-01 18:30:53,389 [INFO] Logger initialized.
2018-01-01 18:30:53,390 [INFO] >Getting scope for fmu within context class be.uantwerpen.ansymo.semanticadaptation.semanticAdaptation.impl.DoStepFunImpl
2018-01-01 18:30:53,390 [INFO]  Delegating scope discovery to super class...
2018-01-01 18:30:53,393 [DEBUG] No explicit container state set. Falling back to default.
2018-01-01 18:30:53,393 [DEBUG] No explicit container state set. Falling back to default.
2018-01-01 18:30:53,393 [DEBUG] No explicit container state set. Falling back to default.
2018-01-01 18:30:53,404 [INFO] <Scope found:ImportScope[windowSA.H_window.*] imports from org.eclipse.xtext.scoping.impl.MultimapBasedSelectable@a2ddf26 for type FMU
2018-01-01 18:30:53,405 [DEBUG] after getLinkedObjects: node: 'window' result: window
2018-01-01 18:30:53,405 [DEBUG] before getLinkedObjects: node: 'H_window'
2018-01-01 18:30:53,405 [INFO] >Getting scope for ref within context class be.uantwerpen.ansymo.semanticadaptation.semanticAdaptation.impl.VariableImpl
2018-01-01 18:30:53,406 [INFO] <Scope found:SimpleScope[reaction_force, displacement, speed, disp, tau, displacement, speed, reaction_force, height, reaction_torque, INIT_WINDOWSA_REACTION_FORCE, INIT_WINDOWSA_DISPLACEMENT, INIT_WINDOWSA_SPEED, INIT_WINDOW_REACTION_TORQUE, INIT_WINDOW_REACTION_HEIGHT, H_window, stored_windowsa_reaction_force, stored_windowsa_displacement, stored_windowsa_speed, stored_window_reaction_torque, stored_window_height] -> NULLSCOPE
2018-01-01 18:30:53,407 [DEBUG] after getLinkedObjects: node: 'H_window' result: H_window
2018-01-01 18:30:53,407 [DEBUG] before getLinkedObjects: node: 'stored_windowsa_reaction_force'
2018-01-01 18:30:53,407 [INFO] >Getting scope for ref within context class be.uantwerpen.ansymo.semanticadaptation.semanticAdaptation.impl.VariableImpl
2018-01-01 18:30:53,407 [INFO] <Scope found:SimpleScope[reaction_force, displacement, speed, disp, tau, displacement, speed, reaction_force, height, reaction_torque, INIT_WINDOWSA_REACTION_FORCE, INIT_WINDOWSA_DISPLACEMENT, INIT_WINDOWSA_SPEED, INIT_WINDOW_REACTION_TORQUE, INIT_WINDOW_REACTION_HEIGHT, H_window, stored_windowsa_reaction_force, stored_windowsa_displacement, stored_windowsa_speed, stored_window_reaction_torque, stored_window_height] -> NULLSCOPE
2018-01-01 18:30:53,407 [DEBUG] after getLinkedObjects: node: 'stored_windowsa_reaction_force' result: stored_windowsa_reaction_force
2018-01-01 18:30:53,407 [DEBUG] before getLinkedObjects: node: 'windowSA'
2018-01-01 18:30:53,407 [INFO] >Getting scope for owner within context class be.uantwerpen.ansymo.semanticadaptation.semanticAdaptation.impl.VariableImpl
2018-01-01 18:30:53,407 [INFO]  Delegating scope discovery to super class...
2018-01-01 18:30:53,408 [INFO] <Scope found:ImportScope[windowSA.*] imports from org.eclipse.xtext.scoping.impl.MultimapBasedSelectable@a2ddf26 for type FMU
2018-01-01 18:30:53,408 [DEBUG] after getLinkedObjects: node: 'windowSA' result: windowSA
2018-01-01 18:30:53,408 [DEBUG] before getLinkedObjects: node: 'reaction_force'
2018-01-01 18:30:53,408 [INFO] >Getting scope for ref within context class be.uantwerpen.ansymo.semanticadaptation.semanticAdaptation.impl.VariableImpl
2018-01-01 18:30:53,408 [INFO]  Getting scope within FMU: windowSA
2018-01-01 18:30:53,408 [INFO] <Scope found:SimpleScope[reaction_force, displacement, speed, disp, tau, displacement, speed, reaction_force, height, reaction_torque] -> NULLSCOPE
2018-01-01 18:30:53,408 [DEBUG] after getLinkedObjects: node: 'reaction_force' result: reaction_force
2018-01-01 18:30:53,409 [DEBUG] before getLinkedObjects: node: 'stored_windowsa_displacement'
2018-01-01 18:30:53,409 [INFO] >Getting scope for ref within context class be.uantwerpen.ansymo.semanticadaptation.semanticAdaptation.impl.VariableImpl
2018-01-01 18:30:53,409 [INFO] <Scope found:SimpleScope[reaction_force, displacement, speed, disp, tau, displacement, speed, reaction_force, height, reaction_torque, INIT_WINDOWSA_REACTION_FORCE, INIT_WINDOWSA_DISPLACEMENT, INIT_WINDOWSA_SPEED, INIT_WINDOW_REACTION_TORQUE, INIT_WINDOW_REACTION_HEIGHT, H_window, stored_windowsa_reaction_force, stored_windowsa_displacement, stored_windowsa_speed, stored_window_reaction_torque, stored_window_height] -> NULLSCOPE
2018-01-01 18:30:53,409 [DEBUG] after getLinkedObjects: node: 'stored_windowsa_displacement' result: stored_windowsa_displacement
2018-01-01 18:30:53,409 [DEBUG] before getLinkedObjects: node: 'windowSA'
2018-01-01 18:30:53,409 [INFO] >Getting scope for owner within context class be.uantwerpen.ansymo.semanticadaptation.semanticAdaptation.impl.VariableImpl
2018-01-01 18:30:53,409 [INFO]  Delegating scope discovery to super class...
2018-01-01 18:30:53,410 [INFO] <Scope found:ImportScope[windowSA.*] imports from org.eclipse.xtext.scoping.impl.MultimapBasedSelectable@a2ddf26 for type FMU
2018-01-01 18:30:53,410 [DEBUG] after getLinkedObjects: node: 'windowSA' result: windowSA
2018-01-01 18:30:53,410 [DEBUG] before getLinkedObjects: node: 'displacement'
2018-01-01 18:30:53,410 [INFO] >Getting scope for ref within context class be.uantwerpen.ansymo.semanticadaptation.semanticAdaptation.impl.VariableImpl
2018-01-01 18:30:53,410 [INFO]  Getting scope within FMU: windowSA
2018-01-01 18:30:53,410 [INFO] <Scope found:SimpleScope[reaction_force, displacement, speed, disp, tau, displacement, speed, reaction_force, height, reaction_torque] -> NULLSCOPE
2018-01-01 18:30:53,410 [DEBUG] after getLinkedObjects: node: 'displacement' result: displacement
2018-01-01 18:30:53,410 [DEBUG] before getLinkedObjects: node: 'stored_windowsa_speed'
2018-01-01 18:30:53,410 [INFO] >Getting scope for ref within context class be.uantwerpen.ansymo.semanticadaptation.semanticAdaptation.impl.VariableImpl
2018-01-01 18:30:53,411 [INFO] <Scope found:SimpleScope[reaction_force, displacement, speed, disp, tau, displacement, speed, reaction_force, height, reaction_torque, INIT_WINDOWSA_REACTION_FORCE, INIT_WINDOWSA_DISPLACEMENT, INIT_WINDOWSA_SPEED, INIT_WINDOW_REACTION_TORQUE, INIT_WINDOW_REACTION_HEIGHT, H_window, stored_windowsa_reaction_force, stored_windowsa_displacement, stored_windowsa_speed, stored_window_reaction_torque, stored_window_height] -> NULLSCOPE
2018-01-01 18:30:53,411 [DEBUG] after getLinkedObjects: node: 'stored_windowsa_speed' result: stored_windowsa_speed
2018-01-01 18:30:53,411 [DEBUG] before getLinkedObjects: node: 'windowSA'
2018-01-01 18:30:53,411 [INFO] >Getting scope for owner within context class be.uantwerpen.ansymo.semanticadaptation.semanticAdaptation.impl.VariableImpl
2018-01-01 18:30:53,411 [INFO]  Delegating scope discovery to super class...
2018-01-01 18:30:53,414 [INFO] <Scope found:ImportScope[windowSA.*] imports from org.eclipse.xtext.scoping.impl.MultimapBasedSelectable@a2ddf26 for type FMU
2018-01-01 18:30:53,414 [DEBUG] after getLinkedObjects: node: 'windowSA' result: windowSA
2018-01-01 18:30:53,414 [DEBUG] before getLinkedObjects: node: 'speed'
2018-01-01 18:30:53,414 [INFO] >Getting scope for ref within context class be.uantwerpen.ansymo.semanticadaptation.semanticAdaptation.impl.VariableImpl
2018-01-01 18:30:53,414 [INFO]  Getting scope within FMU: windowSA
2018-01-01 18:30:53,415 [INFO] <Scope found:SimpleScope[reaction_force, displacement, speed, disp, tau, displacement, speed, reaction_force, height, reaction_torque] -> NULLSCOPE
2018-01-01 18:30:53,415 [DEBUG] after getLinkedObjects: node: 'speed' result: speed
2018-01-01 18:30:53,415 [DEBUG] before getLinkedObjects: node: 'window'
2018-01-01 18:30:53,415 [INFO] >Getting scope for owner within context class be.uantwerpen.ansymo.semanticadaptation.semanticAdaptation.impl.VariableImpl
2018-01-01 18:30:53,415 [INFO]  Delegating scope discovery to super class...
2018-01-01 18:30:53,415 [INFO] <Scope found:ImportScope[windowSA.*] imports from org.eclipse.xtext.scoping.impl.MultimapBasedSelectable@a2ddf26 for type FMU
2018-01-01 18:30:53,415 [DEBUG] after getLinkedObjects: node: 'window' result: window
2018-01-01 18:30:53,415 [DEBUG] before getLinkedObjects: node: 'reaction_force'
2018-01-01 18:30:53,415 [INFO] >Getting scope for ref within context class be.uantwerpen.ansymo.semanticadaptation.semanticAdaptation.impl.VariableImpl
2018-01-01 18:30:53,416 [INFO]  Getting scope within FMU: window
2018-01-01 18:30:53,416 [INFO] <Scope found:SimpleScope[displacement, speed, reaction_force, height, reaction_torque] -> NULLSCOPE
2018-01-01 18:30:53,416 [DEBUG] after getLinkedObjects: node: 'reaction_force' result: reaction_force
2018-01-01 18:30:53,416 [DEBUG] before getLinkedObjects: node: 'stored_windowsa_reaction_force'
2018-01-01 18:30:53,416 [INFO] >Getting scope for ref within context class be.uantwerpen.ansymo.semanticadaptation.semanticAdaptation.impl.VariableImpl
2018-01-01 18:30:53,416 [INFO] <Scope found:SimpleScope[reaction_force, displacement, speed, disp, tau, displacement, speed, reaction_force, height, reaction_torque, INIT_WINDOWSA_REACTION_FORCE, INIT_WINDOWSA_DISPLACEMENT, INIT_WINDOWSA_SPEED, INIT_WINDOW_REACTION_TORQUE, INIT_WINDOW_REACTION_HEIGHT, H_window, stored_windowsa_reaction_force, stored_windowsa_displacement, stored_windowsa_speed, stored_window_reaction_torque, stored_window_height] -> NULLSCOPE
2018-01-01 18:30:53,416 [DEBUG] after getLinkedObjects: node: 'stored_windowsa_reaction_force' result: stored_windowsa_reaction_force
2018-01-01 18:30:53,416 [DEBUG] before getLinkedObjects: node: 'window'
2018-01-01 18:30:53,416 [INFO] >Getting scope for owner within context class be.uantwerpen.ansymo.semanticadaptation.semanticAdaptation.impl.VariableImpl
2018-01-01 18:30:53,416 [INFO]  Delegating scope discovery to super class...
2018-01-01 18:30:53,417 [INFO] <Scope found:ImportScope[windowSA.*] imports from org.eclipse.xtext.scoping.impl.MultimapBasedSelectable@a2ddf26 for type FMU
2018-01-01 18:30:53,417 [DEBUG] after getLinkedObjects: node: 'window' result: window
2018-01-01 18:30:53,417 [DEBUG] before getLinkedObjects: node: 'displacement'
2018-01-01 18:30:53,417 [INFO] >Getting scope for ref within context class be.uantwerpen.ansymo.semanticadaptation.semanticAdaptation.impl.VariableImpl
2018-01-01 18:30:53,417 [INFO]  Getting scope within FMU: window
2018-01-01 18:30:53,417 [INFO] <Scope found:SimpleScope[displacement, speed, reaction_force, height, reaction_torque] -> NULLSCOPE
2018-01-01 18:30:53,417 [DEBUG] after getLinkedObjects: node: 'displacement' result: displacement
2018-01-01 18:30:53,417 [DEBUG] before getLinkedObjects: node: 'stored_windowsa_displacement'
2018-01-01 18:30:53,417 [INFO] >Getting scope for ref within context class be.uantwerpen.ansymo.semanticadaptation.semanticAdaptation.impl.VariableImpl
2018-01-01 18:30:53,418 [INFO] <Scope found:SimpleScope[reaction_force, displacement, speed, disp, tau, displacement, speed, reaction_force, height, reaction_torque, INIT_WINDOWSA_REACTION_FORCE, INIT_WINDOWSA_DISPLACEMENT, INIT_WINDOWSA_SPEED, INIT_WINDOW_REACTION_TORQUE, INIT_WINDOW_REACTION_HEIGHT, H_window, stored_windowsa_reaction_force, stored_windowsa_displacement, stored_windowsa_speed, stored_window_reaction_torque, stored_window_height] -> NULLSCOPE
2018-01-01 18:30:53,418 [DEBUG] after getLinkedObjects: node: 'stored_windowsa_displacement' result: stored_windowsa_displacement
2018-01-01 18:30:53,418 [DEBUG] before getLinkedObjects: node: 'window'
2018-01-01 18:30:53,418 [INFO] >Getting scope for owner within context class be.uantwerpen.ansymo.semanticadaptation.semanticAdaptation.impl.VariableImpl
2018-01-01 18:30:53,418 [INFO]  Delegating scope discovery to super class...
2018-01-01 18:30:53,418 [INFO] <Scope found:ImportScope[windowSA.*] imports from org.eclipse.xtext.scoping.impl.MultimapBasedSelectable@a2ddf26 for type FMU
2018-01-01 18:30:53,418 [DEBUG] after getLinkedObjects: node: 'window' result: window
2018-01-01 18:30:53,418 [DEBUG] before getLinkedObjects: node: 'speed'
2018-01-01 18:30:53,418 [INFO] >Getting scope for ref within context class be.uantwerpen.ansymo.semanticadaptation.semanticAdaptation.impl.VariableImpl
2018-01-01 18:30:53,419 [INFO]  Getting scope within FMU: window
2018-01-01 18:30:53,419 [INFO] <Scope found:SimpleScope[displacement, speed, reaction_force, height, reaction_torque] -> NULLSCOPE
2018-01-01 18:30:53,419 [DEBUG] after getLinkedObjects: node: 'speed' result: speed
2018-01-01 18:30:53,419 [DEBUG] before getLinkedObjects: node: 'stored_windowsa_speed'
2018-01-01 18:30:53,419 [INFO] >Getting scope for ref within context class be.uantwerpen.ansymo.semanticadaptation.semanticAdaptation.impl.VariableImpl
2018-01-01 18:30:53,419 [INFO] <Scope found:SimpleScope[reaction_force, displacement, speed, disp, tau, displacement, speed, reaction_force, height, reaction_torque, INIT_WINDOWSA_REACTION_FORCE, INIT_WINDOWSA_DISPLACEMENT, INIT_WINDOWSA_SPEED, INIT_WINDOW_REACTION_TORQUE, INIT_WINDOW_REACTION_HEIGHT, H_window, stored_windowsa_reaction_force, stored_windowsa_displacement, stored_windowsa_speed, stored_window_reaction_torque, stored_window_height] -> NULLSCOPE
2018-01-01 18:30:53,419 [DEBUG] after getLinkedObjects: node: 'stored_windowsa_speed' result: stored_windowsa_speed
2018-01-01 18:30:53,419 [DEBUG] before getLinkedObjects: node: 'INIT_WINDOWSA_REACTION_FORCE'
2018-01-01 18:30:53,419 [INFO] >Getting scope for ref within context class be.uantwerpen.ansymo.semanticadaptation.semanticAdaptation.impl.VariableImpl
2018-01-01 18:30:53,420 [INFO] <Scope found:SimpleScope[reaction_force, displacement, speed, disp, tau, displacement, speed, reaction_force, height, reaction_torque, INIT_WINDOWSA_REACTION_FORCE, INIT_WINDOWSA_DISPLACEMENT, INIT_WINDOWSA_SPEED, INIT_WINDOW_REACTION_TORQUE, INIT_WINDOW_REACTION_HEIGHT, H_window, stored_windowsa_reaction_force, stored_windowsa_displacement, stored_windowsa_speed, stored_window_reaction_torque, stored_window_height] -> NULLSCOPE
2018-01-01 18:30:53,420 [DEBUG] after getLinkedObjects: node: 'INIT_WINDOWSA_REACTION_FORCE' result: INIT_WINDOWSA_REACTION_FORCE
2018-01-01 18:30:53,420 [DEBUG] before getLinkedObjects: node: 'INIT_WINDOWSA_DISPLACEMENT'
2018-01-01 18:30:53,420 [INFO] >Getting scope for ref within context class be.uantwerpen.ansymo.semanticadaptation.semanticAdaptation.impl.VariableImpl
2018-01-01 18:30:53,420 [INFO] <Scope found:SimpleScope[reaction_force, displacement, speed, disp, tau, displacement, speed, reaction_force, height, reaction_torque, INIT_WINDOWSA_REACTION_FORCE, INIT_WINDOWSA_DISPLACEMENT, INIT_WINDOWSA_SPEED, INIT_WINDOW_REACTION_TORQUE, INIT_WINDOW_REACTION_HEIGHT, H_window, stored_windowsa_reaction_force, stored_windowsa_displacement, stored_windowsa_speed, stored_window_reaction_torque, stored_window_height] -> NULLSCOPE
2018-01-01 18:30:53,420 [DEBUG] after getLinkedObjects: node: 'INIT_WINDOWSA_DISPLACEMENT' result: INIT_WINDOWSA_DISPLACEMENT
2018-01-01 18:30:53,420 [DEBUG] before getLinkedObjects: node: 'INIT_WINDOWSA_SPEED'
2018-01-01 18:30:53,420 [INFO] >Getting scope for ref within context class be.uantwerpen.ansymo.semanticadaptation.semanticAdaptation.impl.VariableImpl
2018-01-01 18:30:53,420 [INFO] <Scope found:SimpleScope[reaction_force, displacement, speed, disp, tau, displacement, speed, reaction_force, height, reaction_torque, INIT_WINDOWSA_REACTION_FORCE, INIT_WINDOWSA_DISPLACEMENT, INIT_WINDOWSA_SPEED, INIT_WINDOW_REACTION_TORQUE, INIT_WINDOW_REACTION_HEIGHT, H_window, stored_windowsa_reaction_force, stored_windowsa_displacement, stored_windowsa_speed, stored_window_reaction_torque, stored_window_height] -> NULLSCOPE
2018-01-01 18:30:53,421 [DEBUG] after getLinkedObjects: node: 'INIT_WINDOWSA_SPEED' result: INIT_WINDOWSA_SPEED
2018-01-01 18:30:53,421 [DEBUG] before getLinkedObjects: node: 'stored_window_reaction_torque'
2018-01-01 18:30:53,421 [INFO] >Getting scope for ref within context class be.uantwerpen.ansymo.semanticadaptation.semanticAdaptation.impl.VariableImpl
2018-01-01 18:30:53,421 [INFO] <Scope found:SimpleScope[reaction_force, displacement, speed, disp, tau, displacement, speed, reaction_force, height, reaction_torque, INIT_WINDOWSA_REACTION_FORCE, INIT_WINDOWSA_DISPLACEMENT, INIT_WINDOWSA_SPEED, INIT_WINDOW_REACTION_TORQUE, INIT_WINDOW_REACTION_HEIGHT, H_window, stored_windowsa_reaction_force, stored_windowsa_displacement, stored_windowsa_speed, stored_window_reaction_torque, stored_window_height] -> NULLSCOPE
2018-01-01 18:30:53,421 [DEBUG] after getLinkedObjects: node: 'stored_window_reaction_torque' result: stored_window_reaction_torque
2018-01-01 18:30:53,421 [DEBUG] before getLinkedObjects: node: 'window'
2018-01-01 18:30:53,421 [INFO] >Getting scope for owner within context class be.uantwerpen.ansymo.semanticadaptation.semanticAdaptation.impl.VariableImpl
2018-01-01 18:30:53,421 [INFO]  Delegating scope discovery to super class...
2018-01-01 18:30:53,422 [INFO] <Scope found:ImportScope[windowSA.*] imports from org.eclipse.xtext.scoping.impl.MultimapBasedSelectable@a2ddf26 for type FMU
2018-01-01 18:30:53,422 [DEBUG] after getLinkedObjects: node: 'window' result: window
2018-01-01 18:30:53,422 [DEBUG] before getLinkedObjects: node: 'reaction_torque'
2018-01-01 18:30:53,422 [INFO] >Getting scope for ref within context class be.uantwerpen.ansymo.semanticadaptation.semanticAdaptation.impl.VariableImpl
2018-01-01 18:30:53,422 [INFO]  Getting scope within FMU: window
2018-01-01 18:30:53,422 [INFO] <Scope found:SimpleScope[displacement, speed, reaction_force, height, reaction_torque] -> NULLSCOPE
2018-01-01 18:30:53,422 [DEBUG] after getLinkedObjects: node: 'reaction_torque' result: reaction_torque
2018-01-01 18:30:53,422 [DEBUG] before getLinkedObjects: node: 'stored_window_height'
2018-01-01 18:30:53,422 [INFO] >Getting scope for ref within context class be.uantwerpen.ansymo.semanticadaptation.semanticAdaptation.impl.VariableImpl
2018-01-01 18:30:53,423 [INFO] <Scope found:SimpleScope[reaction_force, displacement, speed, disp, tau, displacement, speed, reaction_force, height, reaction_torque, INIT_WINDOWSA_REACTION_FORCE, INIT_WINDOWSA_DISPLACEMENT, INIT_WINDOWSA_SPEED, INIT_WINDOW_REACTION_TORQUE, INIT_WINDOW_REACTION_HEIGHT, H_window, stored_windowsa_reaction_force, stored_windowsa_displacement, stored_windowsa_speed, stored_window_reaction_torque, stored_window_height] -> NULLSCOPE
2018-01-01 18:30:53,423 [DEBUG] after getLinkedObjects: node: 'stored_window_height' result: stored_window_height
2018-01-01 18:30:53,423 [DEBUG] before getLinkedObjects: node: 'window'
2018-01-01 18:30:53,423 [INFO] >Getting scope for owner within context class be.uantwerpen.ansymo.semanticadaptation.semanticAdaptation.impl.VariableImpl
2018-01-01 18:30:53,423 [INFO]  Delegating scope discovery to super class...
2018-01-01 18:30:53,423 [INFO] <Scope found:ImportScope[windowSA.*] imports from org.eclipse.xtext.scoping.impl.MultimapBasedSelectable@a2ddf26 for type FMU
2018-01-01 18:30:53,423 [DEBUG] after getLinkedObjects: node: 'window' result: window
2018-01-01 18:30:53,423 [DEBUG] before getLinkedObjects: node: 'height'
2018-01-01 18:30:53,424 [INFO] >Getting scope for ref within context class be.uantwerpen.ansymo.semanticadaptation.semanticAdaptation.impl.VariableImpl
2018-01-01 18:30:53,424 [INFO]  Getting scope within FMU: window
2018-01-01 18:30:53,424 [INFO] <Scope found:SimpleScope[displacement, speed, reaction_force, height, reaction_torque] -> NULLSCOPE
2018-01-01 18:30:53,424 [DEBUG] after getLinkedObjects: node: 'height' result: height
2018-01-01 18:30:53,424 [DEBUG] before getLinkedObjects: node: 'windowSA'
2018-01-01 18:30:53,424 [INFO] >Getting scope for owner within context class be.uantwerpen.ansymo.semanticadaptation.semanticAdaptation.impl.VariableImpl
2018-01-01 18:30:53,424 [INFO]  Delegating scope discovery to super class...
2018-01-01 18:30:53,424 [INFO] <Scope found:ImportScope[windowSA.*] imports from org.eclipse.xtext.scoping.impl.MultimapBasedSelectable@a2ddf26 for type FMU
2018-01-01 18:30:53,424 [DEBUG] after getLinkedObjects: node: 'windowSA' result: windowSA
2018-01-01 18:30:53,424 [DEBUG] before getLinkedObjects: node: 'disp'
2018-01-01 18:30:53,424 [INFO] >Getting scope for ref within context class be.uantwerpen.ansymo.semanticadaptation.semanticAdaptation.impl.VariableImpl
2018-01-01 18:30:53,425 [INFO]  Getting scope within FMU: windowSA
2018-01-01 18:30:53,425 [INFO] <Scope found:SimpleScope[reaction_force, displacement, speed, disp, tau, displacement, speed, reaction_force, height, reaction_torque] -> NULLSCOPE
2018-01-01 18:30:53,425 [DEBUG] after getLinkedObjects: node: 'disp' result: disp
2018-01-01 18:30:53,425 [DEBUG] before getLinkedObjects: node: 'stored_window_height'
2018-01-01 18:30:53,425 [INFO] >Getting scope for ref within context class be.uantwerpen.ansymo.semanticadaptation.semanticAdaptation.impl.VariableImpl
2018-01-01 18:30:53,425 [INFO] <Scope found:SimpleScope[reaction_force, displacement, speed, disp, tau, displacement, speed, reaction_force, height, reaction_torque, INIT_WINDOWSA_REACTION_FORCE, INIT_WINDOWSA_DISPLACEMENT, INIT_WINDOWSA_SPEED, INIT_WINDOW_REACTION_TORQUE, INIT_WINDOW_REACTION_HEIGHT, H_window, stored_windowsa_reaction_force, stored_windowsa_displacement, stored_windowsa_speed, stored_window_reaction_torque, stored_window_height] -> NULLSCOPE
2018-01-01 18:30:53,425 [DEBUG] after getLinkedObjects: node: 'stored_window_height' result: stored_window_height
2018-01-01 18:30:53,425 [DEBUG] before getLinkedObjects: node: 'windowSA'
2018-01-01 18:30:53,425 [INFO] >Getting scope for owner within context class be.uantwerpen.ansymo.semanticadaptation.semanticAdaptation.impl.VariableImpl
2018-01-01 18:30:53,425 [INFO]  Delegating scope discovery to super class...
2018-01-01 18:30:53,426 [INFO] <Scope found:ImportScope[windowSA.*] imports from org.eclipse.xtext.scoping.impl.MultimapBasedSelectable@a2ddf26 for type FMU
2018-01-01 18:30:53,426 [DEBUG] after getLinkedObjects: node: 'windowSA' result: windowSA
2018-01-01 18:30:53,426 [DEBUG] before getLinkedObjects: node: 'tau'
2018-01-01 18:30:53,426 [INFO] >Getting scope for ref within context class be.uantwerpen.ansymo.semanticadaptation.semanticAdaptation.impl.VariableImpl
2018-01-01 18:30:53,426 [INFO]  Getting scope within FMU: windowSA
2018-01-01 18:30:53,426 [INFO] <Scope found:SimpleScope[reaction_force, displacement, speed, disp, tau, displacement, speed, reaction_force, height, reaction_torque] -> NULLSCOPE
2018-01-01 18:30:53,426 [DEBUG] after getLinkedObjects: node: 'tau' result: tau
2018-01-01 18:30:53,426 [DEBUG] before getLinkedObjects: node: 'stored_window_reaction_torque'
2018-01-01 18:30:53,426 [INFO] >Getting scope for ref within context class be.uantwerpen.ansymo.semanticadaptation.semanticAdaptation.impl.VariableImpl
2018-01-01 18:30:53,427 [INFO] <Scope found:SimpleScope[reaction_force, displacement, speed, disp, tau, displacement, speed, reaction_force, height, reaction_torque, INIT_WINDOWSA_REACTION_FORCE, INIT_WINDOWSA_DISPLACEMENT, INIT_WINDOWSA_SPEED, INIT_WINDOW_REACTION_TORQUE, INIT_WINDOW_REACTION_HEIGHT, H_window, stored_windowsa_reaction_force, stored_windowsa_displacement, stored_windowsa_speed, stored_window_reaction_torque, stored_window_height] -> NULLSCOPE
2018-01-01 18:30:53,427 [DEBUG] after getLinkedObjects: node: 'stored_window_reaction_torque' result: stored_window_reaction_torque
2018-01-01 18:30:53,427 [DEBUG] before getLinkedObjects: node: 'INIT_WINDOW_REACTION_TORQUE'
2018-01-01 18:30:53,427 [INFO] >Getting scope for ref within context class be.uantwerpen.ansymo.semanticadaptation.semanticAdaptation.impl.VariableImpl
2018-01-01 18:30:53,427 [INFO] <Scope found:SimpleScope[reaction_force, displacement, speed, disp, tau, displacement, speed, reaction_force, height, reaction_torque, INIT_WINDOWSA_REACTION_FORCE, INIT_WINDOWSA_DISPLACEMENT, INIT_WINDOWSA_SPEED, INIT_WINDOW_REACTION_TORQUE, INIT_WINDOW_REACTION_HEIGHT, H_window, stored_windowsa_reaction_force, stored_windowsa_displacement, stored_windowsa_speed, stored_window_reaction_torque, stored_window_height] -> NULLSCOPE
2018-01-01 18:30:53,427 [DEBUG] after getLinkedObjects: node: 'INIT_WINDOW_REACTION_TORQUE' result: INIT_WINDOW_REACTION_TORQUE
2018-01-01 18:30:53,427 [DEBUG] before getLinkedObjects: node: 'INIT_WINDOW_REACTION_HEIGHT'
2018-01-01 18:30:53,427 [INFO] >Getting scope for ref within context class be.uantwerpen.ansymo.semanticadaptation.semanticAdaptation.impl.VariableImpl
2018-01-01 18:30:53,427 [INFO] <Scope found:SimpleScope[reaction_force, displacement, speed, disp, tau, displacement, speed, reaction_force, height, reaction_torque, INIT_WINDOWSA_REACTION_FORCE, INIT_WINDOWSA_DISPLACEMENT, INIT_WINDOWSA_SPEED, INIT_WINDOW_REACTION_TORQUE, INIT_WINDOW_REACTION_HEIGHT, H_window, stored_windowsa_reaction_force, stored_windowsa_displacement, stored_windowsa_speed, stored_window_reaction_torque, stored_window_height] -> NULLSCOPE
2018-01-01 18:30:53,428 [DEBUG] after getLinkedObjects: node: 'INIT_WINDOW_REACTION_HEIGHT' result: INIT_WINDOW_REACTION_HEIGHT
2018-01-01 18:30:53,428 [DEBUG] Syntax check OK! Resource: __synthetic0.sa
2018-01-01 18:30:53,464 [INFO] >CppGenerator.doGenerate .
2018-01-01 18:30:53,465 [INFO]  >CppGenerator.compile
2018-01-01 18:30:53,466 [INFO]   >Loading fmu "test_input/single_folder_spec/window/Window.fmu"
2018-01-01 18:30:53,466 [INFO]    Resolved fmu path: ./test_input/single_folder_spec/window/Window.fmu
2018-01-01 18:30:53,467 [INFO]    >Loading model description for fmu window
2018-01-01 18:30:53,467 [INFO]     Source fmu absolute path: /var/lib/jenkins/workspace/ridCosimulation_development-7CHFDKZ477AWP5WGVIV7ZEYJ7TBQYODTBA2CXNIBOFPOTJGJR3PQ/DSL_SemanticAdaptation/be.uantwerpen.ansymo.semanticadaptation.cg.cpp.tests/./test_input/single_folder_spec/window/Window.fmu
2018-01-01 18:30:53,498 [INFO]    <Loading model description for fmu window
2018-01-01 18:30:53,499 [INFO]   <Loading fmu "test_input/single_folder_spec/window/Window.fmu"
2018-01-01 18:30:53,539 [INFO]  <CppGenerator.compile
2018-01-01 18:30:53,539 [INFO] <CppGenerator.doGenerate.
2018-01-01 18:30:53,540 [INFO] Stored file: target/c-gen-tests/generated/powerwindow/sources/Fmu.cpp
2018-01-01 18:30:53,540 [INFO] Stored file: target/c-gen-tests/generated/powerwindow/sources/WindowSA.cpp
2018-01-01 18:30:53,540 [INFO] Stored file: target/c-gen-tests/generated/powerwindow/sources/WindowSA.h
2018-01-01 18:30:53,540 [INFO] Stored file: target/c-gen-tests/generated/powerwindow/modelDescription.xml
2018-01-01 18:30:53,541 [INFO] Stored file: target/c-gen-tests/generated/powerwindow/sources/main.cpp
Copied file to: target/c-gen-tests/generated/powerwindow/resources/Window.fmu
2018-01-01 18:30:53,575 [INFO] Stored file: target/c-gen-tests/generated/powerwindow/CMakeLists.txt
2018-01-01 18:30:53,575 [INFO] Stored file: target/c-gen-tests/generated/powerwindow/msys-toolchain.cmake
/var/lib/jenkins/workspace/ridCosimulation_development-7CHFDKZ477AWP5WGVIV7ZEYJ7TBQYODTBA2CXNIBOFPOTJGJR3PQ/DSL_SemanticAdaptation/be.uantwerpen.ansymo.semanticadaptation.cg.cpp.tests/target/c-gen-tests/generated/powerwindow
-- The C compiler identification is GNU 5.4.0
-- The CXX compiler identification is GNU 5.4.0
-- Check for working C compiler: /usr/bin/cc
-- Check for working C compiler: /usr/bin/cc -- works
-- Detecting C compiler ABI info
-- Detecting C compiler ABI info - done
-- Detecting C compile features
-- Detecting C compile features - done
-- Check for working CXX compiler: /usr/bin/c++
-- Check for working CXX compiler: /usr/bin/c++ -- works
-- Detecting CXX compiler ABI info
-- Detecting CXX compiler ABI info - done
-- Detecting CXX compile features
-- Detecting CXX compile features - done
Cloning into 'hcf'...
Submodule 'semantic-adaptation/third_party/into-cpp-fmi' (https://github.com/into-cps/into-cpp-fmi.git) registered for path 'semantic-adaptation/third_party/into-cpp-fmi'
Submodule 'third_party/googletest' (https://github.com/google/googletest.git) registered for path 'third_party/googletest'
Cloning into 'semantic-adaptation/third_party/into-cpp-fmi'...
Submodule path 'semantic-adaptation/third_party/into-cpp-fmi': checked out '799e4f1f6d4bce1fa291181a2f5de070ab025de9'
Submodule 'include/fmi' (https://github.com/into-cps/fmi.git) registered for path 'include/fmi'
Submodule 'thrird_party/zlib' (https://github.com/madler/zlib.git) registered for path 'thrird_party/zlib'
Cloning into 'include/fmi'...
Submodule path 'semantic-adaptation/third_party/into-cpp-fmi/include/fmi': checked out '45586e20877bfd97e47c1eeb19bfe227b4a46d58'
Cloning into 'thrird_party/zlib'...
Submodule path 'semantic-adaptation/third_party/into-cpp-fmi/thrird_party/zlib': checked out 'cacf7f1d4e3d44d871b605da3b647f07d718623f'
Cloning into 'third_party/googletest'...
Submodule path 'third_party/googletest': checked out 'aa148eb2b7f70ede0eb10de34b6254826bfb34f4'
-- Performing Test COMPILER_SUPPORTS_CXX11
-- Performing Test COMPILER_SUPPORTS_CXX11 - Success
-- Performing Test COMPILER_SUPPORTS_CXX0X
-- Performing Test COMPILER_SUPPORTS_CXX0X - Success
-- Found ZLIB: /usr/lib/x86_64-linux-gnu/libz.so (found version "1.2.8") 
CMake Warning (dev) at hcf/semantic-adaptation/CMakeLists.txt:57 (target_link_libraries):
  Policy CMP0023 is not set: Plain and keyword target_link_libraries
  signatures cannot be mixed.  Run "cmake --help-policy CMP0023" for policy
  details.  Use the cmake_policy command to set the policy and suppress this
  warning.

  The keyword signature for target_link_libraries has already been used with
  the target "hcf".  All uses of target_link_libraries with a target should
  be either all-keyword or all-plain.

  The uses of the keyword signature are here:

   * hcf/semantic-adaptation/CMakeLists.txt:50 (target_link_libraries)

This warning is for project developers.  Use -Wno-dev to suppress it.

FMI output is /var/lib/jenkins/workspace/ridCosimulation_development-7CHFDKZ477AWP5WGVIV7ZEYJ7TBQYODTBA2CXNIBOFPOTJGJR3PQ/DSL_SemanticAdaptation/be.uantwerpen.ansymo.semanticadaptation.cg.cpp.tests/target/c-gen-tests/generated/powerwindow/binaries/linux64
-- Configuring done
-- Generating done
-- Build files have been written to: /var/lib/jenkins/workspace/ridCosimulation_development-7CHFDKZ477AWP5WGVIV7ZEYJ7TBQYODTBA2CXNIBOFPOTJGJR3PQ/DSL_SemanticAdaptation/be.uantwerpen.ansymo.semanticadaptation.cg.cpp.tests/target/c-gen-tests/generated/powerwindow
Scanning dependencies of target minizip
[  4%] Building C object hcf/semantic-adaptation/third_party/into-cpp-fmi/thrird_party/projects/minizip/CMakeFiles/minizip.dir/__/__/zlib/contrib/minizip/mztools.c.o
[  9%] Building C object hcf/semantic-adaptation/third_party/into-cpp-fmi/thrird_party/projects/minizip/CMakeFiles/minizip.dir/__/__/zlib/contrib/minizip/unzip.c.o
[ 14%] Building C object hcf/semantic-adaptation/third_party/into-cpp-fmi/thrird_party/projects/minizip/CMakeFiles/minizip.dir/__/__/zlib/contrib/minizip/ioapi.c.o
[ 19%] Building C object hcf/semantic-adaptation/third_party/into-cpp-fmi/thrird_party/projects/minizip/CMakeFiles/minizip.dir/miniunz.c.o
/var/lib/jenkins/workspace/ridCosimulation_development-7CHFDKZ477AWP5WGVIV7ZEYJ7TBQYODTBA2CXNIBOFPOTJGJR3PQ/DSL_SemanticAdaptation/be.uantwerpen.ansymo.semanticadaptation.cg.cpp.tests/target/c-gen-tests/generated/powerwindow/hcf/semantic-adaptation/third_party/into-cpp-fmi/thrird_party/projects/minizip/miniunz.c: In function ‘change_file_date’:
/var/lib/jenkins/workspace/ridCosimulation_development-7CHFDKZ477AWP5WGVIV7ZEYJ7TBQYODTBA2CXNIBOFPOTJGJR3PQ/DSL_SemanticAdaptation/be.uantwerpen.ansymo.semanticadaptation.cg.cpp.tests/target/c-gen-tests/generated/powerwindow/hcf/semantic-adaptation/third_party/into-cpp-fmi/thrird_party/projects/minizip/miniunz.c:102:13: warning: extra tokens at end of #ifdef directive
 #ifdef unix || __APPLE__
             ^
/var/lib/jenkins/workspace/ridCosimulation_development-7CHFDKZ477AWP5WGVIV7ZEYJ7TBQYODTBA2CXNIBOFPOTJGJR3PQ/DSL_SemanticAdaptation/be.uantwerpen.ansymo.semanticadaptation.cg.cpp.tests/target/c-gen-tests/generated/powerwindow/hcf/semantic-adaptation/third_party/into-cpp-fmi/thrird_party/projects/minizip/miniunz.c: In function ‘mymkdir’:
/var/lib/jenkins/workspace/ridCosimulation_development-7CHFDKZ477AWP5WGVIV7ZEYJ7TBQYODTBA2CXNIBOFPOTJGJR3PQ/DSL_SemanticAdaptation/be.uantwerpen.ansymo.semanticadaptation.cg.cpp.tests/target/c-gen-tests/generated/powerwindow/hcf/semantic-adaptation/third_party/into-cpp-fmi/thrird_party/projects/minizip/miniunz.c:133:11: warning: implicit declaration of function ‘mkdir’ [-Wimplicit-function-declaration]
     ret = mkdir (dirname,0775);
           ^
[ 23%] Building C object hcf/semantic-adaptation/third_party/into-cpp-fmi/thrird_party/projects/minizip/CMakeFiles/minizip.dir/__/__/zlib/contrib/minizip/zip.c.o
[ 28%] Linking C static library libminizip.a
/usr/bin/ar qc libminizip.a  CMakeFiles/minizip.dir/__/__/zlib/contrib/minizip/ioapi.c.o CMakeFiles/minizip.dir/miniunz.c.o CMakeFiles/minizip.dir/__/__/zlib/contrib/minizip/mztools.c.o CMakeFiles/minizip.dir/__/__/zlib/contrib/minizip/unzip.c.o CMakeFiles/minizip.dir/__/__/zlib/contrib/minizip/zip.c.o
/usr/bin/ranlib libminizip.a
[ 28%] Built target minizip
Scanning dependencies of target intocppfmi
[ 33%] Building C object hcf/semantic-adaptation/third_party/into-cpp-fmi/CMakeFiles/intocppfmi.dir/src/FmuLoader.c.o
[ 38%] Building CXX object hcf/semantic-adaptation/third_party/into-cpp-fmi/CMakeFiles/intocppfmi.dir/src/FilesystemUtil.cpp.o
[ 42%] Building C object hcf/semantic-adaptation/third_party/into-cpp-fmi/CMakeFiles/intocppfmi.dir/src/uri.c.o
[ 47%] Building CXX object hcf/semantic-adaptation/third_party/into-cpp-fmi/CMakeFiles/intocppfmi.dir/src/Fmu.cpp.o
[ 52%] Linking CXX static library libintocppfmi.a
/usr/bin/ar qc libintocppfmi.a  CMakeFiles/intocppfmi.dir/src/FmuLoader.c.o CMakeFiles/intocppfmi.dir/src/uri.c.o CMakeFiles/intocppfmi.dir/src/FilesystemUtil.cpp.o CMakeFiles/intocppfmi.dir/src/Fmu.cpp.o
/usr/bin/ranlib libintocppfmi.a
[ 52%] Built target intocppfmi
Scanning dependencies of target hcf
[ 57%] Building CXX object hcf/semantic-adaptation/CMakeFiles/hcf.dir/src/HyfMath.cpp.o
[ 61%] Building CXX object hcf/semantic-adaptation/CMakeFiles/hcf.dir/src/Empty.cpp.o
[ 66%] Linking CXX static library libhcf.a
/usr/bin/ar qc libhcf.a  CMakeFiles/hcf.dir/src/Empty.cpp.o CMakeFiles/hcf.dir/src/HyfMath.cpp.o
/usr/bin/ranlib libhcf.a
[ 66%] Built target hcf
Scanning dependencies of target powerwindow
Scanning dependencies of target powerwindow_main
[ 71%] Building CXX object CMakeFiles/powerwindow.dir/sources/WindowSA.cpp.o
[ 76%] Building CXX object CMakeFiles/powerwindow.dir/sources/Fmu.cpp.o
[ 80%] Building CXX object CMakeFiles/powerwindow_main.dir/sources/main.cpp.o
[ 85%] Building CXX object CMakeFiles/powerwindow_main.dir/sources/Fmu.cpp.o
[ 90%] Building CXX object CMakeFiles/powerwindow_main.dir/sources/WindowSA.cpp.o
In file included from /usr/include/x86_64-linux-gnu/c++/5/bits/c++allocator.h:33:0,
                 from /usr/include/c++/5/bits/allocator.h:46,
                 from /usr/include/c++/5/string:41,
                 from /var/lib/jenkins/workspace/ridCosimulation_development-7CHFDKZ477AWP5WGVIV7ZEYJ7TBQYODTBA2CXNIBOFPOTJGJR3PQ/DSL_SemanticAdaptation/be.uantwerpen.ansymo.semanticadaptation.cg.cpp.tests/target/c-gen-tests/generated/powerwindow/sources/Fmu.cpp:3:
/usr/include/c++/5/ext/new_allocator.h: In instantiation of ‘void __gnu_cxx::new_allocator<_Tp>::construct(_Up*, _Args&& ...) [with _Up = adaptation::WindowSA; _Args = {std::shared_ptr<std::__cxx11::basic_string<char, std::char_traits<char>, std::allocator<char> > >&, std::shared_ptr<std::__cxx11::basic_string<char, std::char_traits<char>, std::allocator<char> > >&, const fmi2CallbackFunctions*&}; _Tp = adaptation::WindowSA]’:
/usr/include/c++/5/bits/alloc_traits.h:530:4:   required from ‘static void std::allocator_traits<std::allocator<_CharT> >::construct(std::allocator_traits<std::allocator<_CharT> >::allocator_type&, _Up*, _Args&& ...) [with _Up = adaptation::WindowSA; _Args = {std::shared_ptr<std::__cxx11::basic_string<char, std::char_traits<char>, std::allocator<char> > >&, std::shared_ptr<std::__cxx11::basic_string<char, std::char_traits<char>, std::allocator<char> > >&, const fmi2CallbackFunctions*&}; _Tp = adaptation::WindowSA; std::allocator_traits<std::allocator<_CharT> >::allocator_type = std::allocator<adaptation::WindowSA>]’
/usr/include/c++/5/bits/shared_ptr_base.h:522:39:   required from ‘std::_Sp_counted_ptr_inplace<_Tp, _Alloc, _Lp>::_Sp_counted_ptr_inplace(_Alloc, _Args&& ...) [with _Args = {std::shared_ptr<std::__cxx11::basic_string<char, std::char_traits<char>, std::allocator<char> > >&, std::shared_ptr<std::__cxx11::basic_string<char, std::char_traits<char>, std::allocator<char> > >&, const fmi2CallbackFunctions*&}; _Tp = adaptation::WindowSA; _Alloc = std::allocator<adaptation::WindowSA>; __gnu_cxx::_Lock_policy _Lp = (__gnu_cxx::_Lock_policy)2u]’
/usr/include/c++/5/bits/shared_ptr_base.h:617:4:   required from ‘std::__shared_count<_Lp>::__shared_count(std::_Sp_make_shared_tag, _Tp*, const _Alloc&, _Args&& ...) [with _Tp = adaptation::WindowSA; _Alloc = std::allocator<adaptation::WindowSA>; _Args = {std::shared_ptr<std::__cxx11::basic_string<char, std::char_traits<char>, std::allocator<char> > >&, std::shared_ptr<std::__cxx11::basic_string<char, std::char_traits<char>, std::allocator<char> > >&, const fmi2CallbackFunctions*&}; __gnu_cxx::_Lock_policy _Lp = (__gnu_cxx::_Lock_policy)2u]’
/usr/include/c++/5/bits/shared_ptr_base.h:1097:35:   required from ‘std::__shared_ptr<_Tp, _Lp>::__shared_ptr(std::_Sp_make_shared_tag, const _Alloc&, _Args&& ...) [with _Alloc = std::allocator<adaptation::WindowSA>; _Args = {std::shared_ptr<std::__cxx11::basic_string<char, std::char_traits<char>, std::allocator<char> > >&, std::shared_ptr<std::__cxx11::basic_string<char, std::char_traits<char>, std::allocator<char> > >&, const fmi2CallbackFunctions*&}; _Tp = adaptation::WindowSA; __gnu_cxx::_Lock_policy _Lp = (__gnu_cxx::_Lock_policy)2u]’
/usr/include/c++/5/bits/shared_ptr.h:319:64:   required from ‘std::shared_ptr<_Tp>::shared_ptr(std::_Sp_make_shared_tag, const _Alloc&, _Args&& ...) [with _Alloc = std::allocator<adaptation::WindowSA>; _Args = {std::shared_ptr<std::__cxx11::basic_string<char, std::char_traits<char>, std::allocator<char> > >&, std::shared_ptr<std::__cxx11::basic_string<char, std::char_traits<char>, std::allocator<char> > >&, const fmi2CallbackFunctions*&}; _Tp = adaptation::WindowSA]’
/usr/include/c++/5/bits/shared_ptr.h:620:39:   required from ‘std::shared_ptr<_Tp1> std::allocate_shared(const _Alloc&, _Args&& ...) [with _Tp = adaptation::WindowSA; _Alloc = std::allocator<adaptation::WindowSA>; _Args = {std::shared_ptr<std::__cxx11::basic_string<char, std::char_traits<char>, std::allocator<char> > >&, std::shared_ptr<std::__cxx11::basic_string<char, std::char_traits<char>, std::allocator<char> > >&, const fmi2CallbackFunctions*&}]’
/usr/include/c++/5/bits/shared_ptr.h:635:39:   required from ‘std::shared_ptr<_Tp1> std::make_shared(_Args&& ...) [with _Tp = adaptation::WindowSA; _Args = {std::shared_ptr<std::__cxx11::basic_string<char, std::char_traits<char>, std::allocator<char> > >&, std::shared_ptr<std::__cxx11::basic_string<char, std::char_traits<char>, std::allocator<char> > >&, const fmi2CallbackFunctions*&}]’
/var/lib/jenkins/workspace/ridCosimulation_development-7CHFDKZ477AWP5WGVIV7ZEYJ7TBQYODTBA2CXNIBOFPOTJGJR3PQ/DSL_SemanticAdaptation/be.uantwerpen.ansymo.semanticadaptation.cg.cpp.tests/target/c-gen-tests/generated/powerwindow/sources/Fmu.cpp:57:79:   required from here
/usr/include/c++/5/ext/new_allocator.h:120:4: error: invalid new-expression of abstract class type ‘adaptation::WindowSA’
  { ::new((void *)__p) _Up(std::forward<_Args>(__args)...); }
    ^
In file included from /var/lib/jenkins/workspace/ridCosimulation_development-7CHFDKZ477AWP5WGVIV7ZEYJ7TBQYODTBA2CXNIBOFPOTJGJR3PQ/DSL_SemanticAdaptation/be.uantwerpen.ansymo.semanticadaptation.cg.cpp.tests/target/c-gen-tests/generated/powerwindow/sources/Fmu.cpp:5:0:
/var/lib/jenkins/workspace/ridCosimulation_development-7CHFDKZ477AWP5WGVIV7ZEYJ7TBQYODTBA2CXNIBOFPOTJGJR3PQ/DSL_SemanticAdaptation/be.uantwerpen.ansymo.semanticadaptation.cg.cpp.tests/target/c-gen-tests/generated/powerwindow/sources/WindowSA.h:31:9: note:   because the following virtual functions are pure within ‘adaptation::WindowSA’:
   class WindowSA : public SemanticAdaptation<WindowSA>, public enable_shared_from_this<WindowSA>
         ^
In file included from /var/lib/jenkins/workspace/ridCosimulation_development-7CHFDKZ477AWP5WGVIV7ZEYJ7TBQYODTBA2CXNIBOFPOTJGJR3PQ/DSL_SemanticAdaptation/be.uantwerpen.ansymo.semanticadaptation.cg.cpp.tests/target/c-gen-tests/generated/powerwindow/sources/WindowSA.h:5:0,
                 from /var/lib/jenkins/workspace/ridCosimulation_development-7CHFDKZ477AWP5WGVIV7ZEYJ7TBQYODTBA2CXNIBOFPOTJGJR3PQ/DSL_SemanticAdaptation/be.uantwerpen.ansymo.semanticadaptation.cg.cpp.tests/target/c-gen-tests/generated/powerwindow/sources/Fmu.cpp:5:
/var/lib/jenkins/workspace/ridCosimulation_development-7CHFDKZ477AWP5WGVIV7ZEYJ7TBQYODTBA2CXNIBOFPOTJGJR3PQ/DSL_SemanticAdaptation/be.uantwerpen.ansymo.semanticadaptation.cg.cpp.tests/target/c-gen-tests/generated/powerwindow/hcf/semantic-adaptation/src/SemanticAdaptation.h:124:23: note: 	void* adaptation::SemanticAdaptation<T>::getInternalFMUState() [with T = adaptation::WindowSA; fmi2FMUstate = void*]
  virtual fmi2FMUstate getInternalFMUState()=0;
                       ^
/var/lib/jenkins/workspace/ridCosimulation_development-7CHFDKZ477AWP5WGVIV7ZEYJ7TBQYODTBA2CXNIBOFPOTJGJR3PQ/DSL_SemanticAdaptation/be.uantwerpen.ansymo.semanticadaptation.cg.cpp.tests/target/c-gen-tests/generated/powerwindow/hcf/semantic-adaptation/src/SemanticAdaptation.h:125:15: note: 	void adaptation::SemanticAdaptation<T>::setInternalFMUState(fmi2FMUstate) [with T = adaptation::WindowSA; fmi2FMUstate = void*]
  virtual void setInternalFMUState(fmi2FMUstate)=0;
               ^
/var/lib/jenkins/workspace/ridCosimulation_development-7CHFDKZ477AWP5WGVIV7ZEYJ7TBQYODTBA2CXNIBOFPOTJGJR3PQ/DSL_SemanticAdaptation/be.uantwerpen.ansymo.semanticadaptation.cg.cpp.tests/target/c-gen-tests/generated/powerwindow/hcf/semantic-adaptation/src/SemanticAdaptation.h:126:15: note: 	void adaptation::SemanticAdaptation<T>::freeInternalFMUState(fmi2FMUstate) [with T = adaptation::WindowSA; fmi2FMUstate = void*]
  virtual void freeInternalFMUState(fmi2FMUstate)=0;
               ^
/var/lib/jenkins/workspace/ridCosimulation_development-7CHFDKZ477AWP5WGVIV7ZEYJ7TBQYODTBA2CXNIBOFPOTJGJR3PQ/DSL_SemanticAdaptation/be.uantwerpen.ansymo.semanticadaptation.cg.cpp.tests/target/c-gen-tests/generated/powerwindow/sources/WindowSA.cpp: In member function ‘std::shared_ptr<std::__cxx11::list<Rule<adaptation::WindowSA>, std::allocator<Rule<adaptation::WindowSA> > > > adaptation::WindowSA::createInputRules()’:
/var/lib/jenkins/workspace/ridCosimulation_development-7CHFDKZ477AWP5WGVIV7ZEYJ7TBQYODTBA2CXNIBOFPOTJGJR3PQ/DSL_SemanticAdaptation/be.uantwerpen.ansymo.semanticadaptation.cg.cpp.tests/target/c-gen-tests/generated/powerwindow/sources/WindowSA.cpp:140:4: error: cannot convert ‘bool (adaptation::WindowSA::*)()’ to ‘bool (adaptation::WindowSA::*)(double, double)’ in initialization
    });
    ^
/var/lib/jenkins/workspace/ridCosimulation_development-7CHFDKZ477AWP5WGVIV7ZEYJ7TBQYODTBA2CXNIBOFPOTJGJR3PQ/DSL_SemanticAdaptation/be.uantwerpen.ansymo.semanticadaptation.cg.cpp.tests/target/c-gen-tests/generated/powerwindow/sources/WindowSA.cpp:140:4: error: cannot convert ‘void (adaptation::WindowSA::*)()’ to ‘void (adaptation::WindowSA::*)(double, double)’ in initialization
/var/lib/jenkins/workspace/ridCosimulation_development-7CHFDKZ477AWP5WGVIV7ZEYJ7TBQYODTBA2CXNIBOFPOTJGJR3PQ/DSL_SemanticAdaptation/be.uantwerpen.ansymo.semanticadaptation.cg.cpp.tests/target/c-gen-tests/generated/powerwindow/sources/WindowSA.cpp:140:4: error: cannot convert ‘void (adaptation::WindowSA::*)()’ to ‘void (adaptation::WindowSA::*)(double, double)’ in initialization
/var/lib/jenkins/workspace/ridCosimulation_development-7CHFDKZ477AWP5WGVIV7ZEYJ7TBQYODTBA2CXNIBOFPOTJGJR3PQ/DSL_SemanticAdaptation/be.uantwerpen.ansymo.semanticadaptation.cg.cpp.tests/target/c-gen-tests/generated/powerwindow/sources/WindowSA.cpp: In member function ‘std::shared_ptr<std::__cxx11::list<Rule<adaptation::WindowSA>, std::allocator<Rule<adaptation::WindowSA> > > > adaptation::WindowSA::createOutputRules()’:
/var/lib/jenkins/workspace/ridCosimulation_development-7CHFDKZ477AWP5WGVIV7ZEYJ7TBQYODTBA2CXNIBOFPOTJGJR3PQ/DSL_SemanticAdaptation/be.uantwerpen.ansymo.semanticadaptation.cg.cpp.tests/target/c-gen-tests/generated/powerwindow/sources/WindowSA.cpp:181:4: error: cannot convert ‘bool (adaptation::WindowSA::*)()’ to ‘bool (adaptation::WindowSA::*)(double, double)’ in initialization
    });
    ^
/var/lib/jenkins/workspace/ridCosimulation_development-7CHFDKZ477AWP5WGVIV7ZEYJ7TBQYODTBA2CXNIBOFPOTJGJR3PQ/DSL_SemanticAdaptation/be.uantwerpen.ansymo.semanticadaptation.cg.cpp.tests/target/c-gen-tests/generated/powerwindow/sources/WindowSA.cpp:181:4: error: cannot convert ‘void (adaptation::WindowSA::*)()’ to ‘void (adaptation::WindowSA::*)(double, double)’ in initialization
/var/lib/jenkins/workspace/ridCosimulation_development-7CHFDKZ477AWP5WGVIV7ZEYJ7TBQYODTBA2CXNIBOFPOTJGJR3PQ/DSL_SemanticAdaptation/be.uantwerpen.ansymo.semanticadaptation.cg.cpp.tests/target/c-gen-tests/generated/powerwindow/sources/WindowSA.cpp:181:4: error: cannot convert ‘void (adaptation::WindowSA::*)()’ to ‘void (adaptation::WindowSA::*)(double, double)’ in initialization
/var/lib/jenkins/workspace/ridCosimulation_development-7CHFDKZ477AWP5WGVIV7ZEYJ7TBQYODTBA2CXNIBOFPOTJGJR3PQ/DSL_SemanticAdaptation/be.uantwerpen.ansymo.semanticadaptation.cg.cpp.tests/target/c-gen-tests/generated/powerwindow/sources/WindowSA.cpp:189:4: error: cannot convert ‘bool (adaptation::WindowSA::*)()’ to ‘bool (adaptation::WindowSA::*)(double, double)’ in initialization
    });
    ^
/var/lib/jenkins/workspace/ridCosimulation_development-7CHFDKZ477AWP5WGVIV7ZEYJ7TBQYODTBA2CXNIBOFPOTJGJR3PQ/DSL_SemanticAdaptation/be.uantwerpen.ansymo.semanticadaptation.cg.cpp.tests/target/c-gen-tests/generated/powerwindow/sources/WindowSA.cpp:189:4: error: cannot convert ‘void (adaptation::WindowSA::*)()’ to ‘void (adaptation::WindowSA::*)(double, double)’ in initialization
/var/lib/jenkins/workspace/ridCosimulation_development-7CHFDKZ477AWP5WGVIV7ZEYJ7TBQYODTBA2CXNIBOFPOTJGJR3PQ/DSL_SemanticAdaptation/be.uantwerpen.ansymo.semanticadaptation.cg.cpp.tests/target/c-gen-tests/generated/powerwindow/sources/WindowSA.cpp:189:4: error: cannot convert ‘void (adaptation::WindowSA::*)()’ to ‘void (adaptation::WindowSA::*)(double, double)’ in initialization
CMakeFiles/powerwindow_main.dir/build.make:86: recipe for target 'CMakeFiles/powerwindow_main.dir/sources/Fmu.cpp.o' failed
make[2]: *** [CMakeFiles/powerwindow_main.dir/sources/Fmu.cpp.o] Error 1
make[2]: *** Waiting for unfinished jobs....
In file included from /usr/include/x86_64-linux-gnu/c++/5/bits/c++allocator.h:33:0,
                 from /usr/include/c++/5/bits/allocator.h:46,
                 from /usr/include/c++/5/string:41,
                 from /var/lib/jenkins/workspace/ridCosimulation_development-7CHFDKZ477AWP5WGVIV7ZEYJ7TBQYODTBA2CXNIBOFPOTJGJR3PQ/DSL_SemanticAdaptation/be.uantwerpen.ansymo.semanticadaptation.cg.cpp.tests/target/c-gen-tests/generated/powerwindow/sources/Fmu.cpp:3:
/usr/include/c++/5/ext/new_allocator.h: In instantiation of ‘void __gnu_cxx::new_allocator<_Tp>::construct(_Up*, _Args&& ...) [with _Up = adaptation::WindowSA; _Args = {std::shared_ptr<std::__cxx11::basic_string<char, std::char_traits<char>, std::allocator<char> > >&, std::shared_ptr<std::__cxx11::basic_string<char, std::char_traits<char>, std::allocator<char> > >&, const fmi2CallbackFunctions*&}; _Tp = adaptation::WindowSA]’:
/usr/include/c++/5/bits/alloc_traits.h:530:4:   required from ‘static void std::allocator_traits<std::allocator<_CharT> >::construct(std::allocator_traits<std::allocator<_CharT> >::allocator_type&, _Up*, _Args&& ...) [with _Up = adaptation::WindowSA; _Args = {std::shared_ptr<std::__cxx11::basic_string<char, std::char_traits<char>, std::allocator<char> > >&, std::shared_ptr<std::__cxx11::basic_string<char, std::char_traits<char>, std::allocator<char> > >&, const fmi2CallbackFunctions*&}; _Tp = adaptation::WindowSA; std::allocator_traits<std::allocator<_CharT> >::allocator_type = std::allocator<adaptation::WindowSA>]’
/usr/include/c++/5/bits/shared_ptr_base.h:522:39:   required from ‘std::_Sp_counted_ptr_inplace<_Tp, _Alloc, _Lp>::_Sp_counted_ptr_inplace(_Alloc, _Args&& ...) [with _Args = {std::shared_ptr<std::__cxx11::basic_string<char, std::char_traits<char>, std::allocator<char> > >&, std::shared_ptr<std::__cxx11::basic_string<char, std::char_traits<char>, std::allocator<char> > >&, const fmi2CallbackFunctions*&}; _Tp = adaptation::WindowSA; _Alloc = std::allocator<adaptation::WindowSA>; __gnu_cxx::_Lock_policy _Lp = (__gnu_cxx::_Lock_policy)2u]’
/usr/include/c++/5/bits/shared_ptr_base.h:617:4:   required from ‘std::__shared_count<_Lp>::__shared_count(std::_Sp_make_shared_tag, _Tp*, const _Alloc&, _Args&& ...) [with _Tp = adaptation::WindowSA; _Alloc = std::allocator<adaptation::WindowSA>; _Args = {std::shared_ptr<std::__cxx11::basic_string<char, std::char_traits<char>, std::allocator<char> > >&, std::shared_ptr<std::__cxx11::basic_string<char, std::char_traits<char>, std::allocator<char> > >&, const fmi2CallbackFunctions*&}; __gnu_cxx::_Lock_policy _Lp = (__gnu_cxx::_Lock_policy)2u]’
/usr/include/c++/5/bits/shared_ptr_base.h:1097:35:   required from ‘std::__shared_ptr<_Tp, _Lp>::__shared_ptr(std::_Sp_make_shared_tag, const _Alloc&, _Args&& ...) [with _Alloc = std::allocator<adaptation::WindowSA>; _Args = {std::shared_ptr<std::__cxx11::basic_string<char, std::char_traits<char>, std::allocator<char> > >&, std::shared_ptr<std::__cxx11::basic_string<char, std::char_traits<char>, std::allocator<char> > >&, const fmi2CallbackFunctions*&}; _Tp = adaptation::WindowSA; __gnu_cxx::_Lock_policy _Lp = (__gnu_cxx::_Lock_policy)2u]’
/usr/include/c++/5/bits/shared_ptr.h:319:64:   required from ‘std::shared_ptr<_Tp>::shared_ptr(std::_Sp_make_shared_tag, const _Alloc&, _Args&& ...) [with _Alloc = std::allocator<adaptation::WindowSA>; _Args = {std::shared_ptr<std::__cxx11::basic_string<char, std::char_traits<char>, std::allocator<char> > >&, std::shared_ptr<std::__cxx11::basic_string<char, std::char_traits<char>, std::allocator<char> > >&, const fmi2CallbackFunctions*&}; _Tp = adaptation::WindowSA]’
/usr/include/c++/5/bits/shared_ptr.h:620:39:   required from ‘std::shared_ptr<_Tp1> std::allocate_shared(const _Alloc&, _Args&& ...) [with _Tp = adaptation::WindowSA; _Alloc = std::allocator<adaptation::WindowSA>; _Args = {std::shared_ptr<std::__cxx11::basic_string<char, std::char_traits<char>, std::allocator<char> > >&, std::shared_ptr<std::__cxx11::basic_string<char, std::char_traits<char>, std::allocator<char> > >&, const fmi2CallbackFunctions*&}]’
/usr/include/c++/5/bits/shared_ptr.h:635:39:   required from ‘std::shared_ptr<_Tp1> std::make_shared(_Args&& ...) [with _Tp = adaptation::WindowSA; _Args = {std::shared_ptr<std::__cxx11::basic_string<char, std::char_traits<char>, std::allocator<char> > >&, std::shared_ptr<std::__cxx11::basic_string<char, std::char_traits<char>, std::allocator<char> > >&, const fmi2CallbackFunctions*&}]’
/var/lib/jenkins/workspace/ridCosimulation_development-7CHFDKZ477AWP5WGVIV7ZEYJ7TBQYODTBA2CXNIBOFPOTJGJR3PQ/DSL_SemanticAdaptation/be.uantwerpen.ansymo.semanticadaptation.cg.cpp.tests/target/c-gen-tests/generated/powerwindow/sources/Fmu.cpp:57:79:   required from here
/usr/include/c++/5/ext/new_allocator.h:120:4: error: invalid new-expression of abstract class type ‘adaptation::WindowSA’
  { ::new((void *)__p) _Up(std::forward<_Args>(__args)...); }
    ^
In file included from /var/lib/jenkins/workspace/ridCosimulation_development-7CHFDKZ477AWP5WGVIV7ZEYJ7TBQYODTBA2CXNIBOFPOTJGJR3PQ/DSL_SemanticAdaptation/be.uantwerpen.ansymo.semanticadaptation.cg.cpp.tests/target/c-gen-tests/generated/powerwindow/sources/Fmu.cpp:5:0:
/var/lib/jenkins/workspace/ridCosimulation_development-7CHFDKZ477AWP5WGVIV7ZEYJ7TBQYODTBA2CXNIBOFPOTJGJR3PQ/DSL_SemanticAdaptation/be.uantwerpen.ansymo.semanticadaptation.cg.cpp.tests/target/c-gen-tests/generated/powerwindow/sources/WindowSA.h:31:9: note:   because the following virtual functions are pure within ‘adaptation::WindowSA’:
   class WindowSA : public SemanticAdaptation<WindowSA>, public enable_shared_from_this<WindowSA>
         ^
In file included from /var/lib/jenkins/workspace/ridCosimulation_development-7CHFDKZ477AWP5WGVIV7ZEYJ7TBQYODTBA2CXNIBOFPOTJGJR3PQ/DSL_SemanticAdaptation/be.uantwerpen.ansymo.semanticadaptation.cg.cpp.tests/target/c-gen-tests/generated/powerwindow/sources/WindowSA.h:5:0,
                 from /var/lib/jenkins/workspace/ridCosimulation_development-7CHFDKZ477AWP5WGVIV7ZEYJ7TBQYODTBA2CXNIBOFPOTJGJR3PQ/DSL_SemanticAdaptation/be.uantwerpen.ansymo.semanticadaptation.cg.cpp.tests/target/c-gen-tests/generated/powerwindow/sources/Fmu.cpp:5:
/var/lib/jenkins/workspace/ridCosimulation_development-7CHFDKZ477AWP5WGVIV7ZEYJ7TBQYODTBA2CXNIBOFPOTJGJR3PQ/DSL_SemanticAdaptation/be.uantwerpen.ansymo.semanticadaptation.cg.cpp.tests/target/c-gen-tests/generated/powerwindow/hcf/semantic-adaptation/src/SemanticAdaptation.h:124:23: note: 	void* adaptation::SemanticAdaptation<T>::getInternalFMUState() [with T = adaptation::WindowSA; fmi2FMUstate = void*]
  virtual fmi2FMUstate getInternalFMUState()=0;
                       ^
/var/lib/jenkins/workspace/ridCosimulation_development-7CHFDKZ477AWP5WGVIV7ZEYJ7TBQYODTBA2CXNIBOFPOTJGJR3PQ/DSL_SemanticAdaptation/be.uantwerpen.ansymo.semanticadaptation.cg.cpp.tests/target/c-gen-tests/generated/powerwindow/hcf/semantic-adaptation/src/SemanticAdaptation.h:125:15: note: 	void adaptation::SemanticAdaptation<T>::setInternalFMUState(fmi2FMUstate) [with T = adaptation::WindowSA; fmi2FMUstate = void*]
  virtual void setInternalFMUState(fmi2FMUstate)=0;
               ^
/var/lib/jenkins/workspace/ridCosimulation_development-7CHFDKZ477AWP5WGVIV7ZEYJ7TBQYODTBA2CXNIBOFPOTJGJR3PQ/DSL_SemanticAdaptation/be.uantwerpen.ansymo.semanticadaptation.cg.cpp.tests/target/c-gen-tests/generated/powerwindow/hcf/semantic-adaptation/src/SemanticAdaptation.h:126:15: note: 	void adaptation::SemanticAdaptation<T>::freeInternalFMUState(fmi2FMUstate) [with T = adaptation::WindowSA; fmi2FMUstate = void*]
  virtual void freeInternalFMUState(fmi2FMUstate)=0;
               ^
make[2]: *** [CMakeFiles/powerwindow.dir/sources/Fmu.cpp.o] Error 1
make[2]: *** Waiting for unfinished jobs....
CMakeFiles/powerwindow.dir/build.make:62: recipe for target 'CMakeFiles/powerwindow.dir/sources/Fmu.cpp.o' failed
CMakeFiles/powerwindow.dir/build.make:86: recipe for target 'CMakeFiles/powerwindow.dir/sources/WindowSA.cpp.o' failed
CMakeFiles/Makefile2:108: recipe for target 'CMakeFiles/powerwindow.dir/all' failed
make[2]: *** [CMakeFiles/powerwindow.dir/sources/WindowSA.cpp.o] Error 1
make[1]: *** [CMakeFiles/powerwindow.dir/all] Error 2
make[1]: *** Waiting for unfinished jobs....
/var/lib/jenkins/workspace/ridCosimulation_development-7CHFDKZ477AWP5WGVIV7ZEYJ7TBQYODTBA2CXNIBOFPOTJGJR3PQ/DSL_SemanticAdaptation/be.uantwerpen.ansymo.semanticadaptation.cg.cpp.tests/target/c-gen-tests/generated/powerwindow/sources/WindowSA.cpp: In member function ‘std::shared_ptr<std::__cxx11::list<Rule<adaptation::WindowSA>, std::allocator<Rule<adaptation::WindowSA> > > > adaptation::WindowSA::createInputRules()’:
/var/lib/jenkins/workspace/ridCosimulation_development-7CHFDKZ477AWP5WGVIV7ZEYJ7TBQYODTBA2CXNIBOFPOTJGJR3PQ/DSL_SemanticAdaptation/be.uantwerpen.ansymo.semanticadaptation.cg.cpp.tests/target/c-gen-tests/generated/powerwindow/sources/WindowSA.cpp:140:4: error: cannot convert ‘bool (adaptation::WindowSA::*)()’ to ‘bool (adaptation::WindowSA::*)(double, double)’ in initialization
    });
    ^
/var/lib/jenkins/workspace/ridCosimulation_development-7CHFDKZ477AWP5WGVIV7ZEYJ7TBQYODTBA2CXNIBOFPOTJGJR3PQ/DSL_SemanticAdaptation/be.uantwerpen.ansymo.semanticadaptation.cg.cpp.tests/target/c-gen-tests/generated/powerwindow/sources/WindowSA.cpp:140:4: error: cannot convert ‘void (adaptation::WindowSA::*)()’ to ‘void (adaptation::WindowSA::*)(double, double)’ in initialization
/var/lib/jenkins/workspace/ridCosimulation_development-7CHFDKZ477AWP5WGVIV7ZEYJ7TBQYODTBA2CXNIBOFPOTJGJR3PQ/DSL_SemanticAdaptation/be.uantwerpen.ansymo.semanticadaptation.cg.cpp.tests/target/c-gen-tests/generated/powerwindow/sources/WindowSA.cpp:140:4: error: cannot convert ‘void (adaptation::WindowSA::*)()’ to ‘void (adaptation::WindowSA::*)(double, double)’ in initialization
/var/lib/jenkins/workspace/ridCosimulation_development-7CHFDKZ477AWP5WGVIV7ZEYJ7TBQYODTBA2CXNIBOFPOTJGJR3PQ/DSL_SemanticAdaptation/be.uantwerpen.ansymo.semanticadaptation.cg.cpp.tests/target/c-gen-tests/generated/powerwindow/sources/WindowSA.cpp: In member function ‘std::shared_ptr<std::__cxx11::list<Rule<adaptation::WindowSA>, std::allocator<Rule<adaptation::WindowSA> > > > adaptation::WindowSA::createOutputRules()’:
/var/lib/jenkins/workspace/ridCosimulation_development-7CHFDKZ477AWP5WGVIV7ZEYJ7TBQYODTBA2CXNIBOFPOTJGJR3PQ/DSL_SemanticAdaptation/be.uantwerpen.ansymo.semanticadaptation.cg.cpp.tests/target/c-gen-tests/generated/powerwindow/sources/WindowSA.cpp:181:4: error: cannot convert ‘bool (adaptation::WindowSA::*)()’ to ‘bool (adaptation::WindowSA::*)(double, double)’ in initialization
    });
    ^
/var/lib/jenkins/workspace/ridCosimulation_development-7CHFDKZ477AWP5WGVIV7ZEYJ7TBQYODTBA2CXNIBOFPOTJGJR3PQ/DSL_SemanticAdaptation/be.uantwerpen.ansymo.semanticadaptation.cg.cpp.tests/target/c-gen-tests/generated/powerwindow/sources/WindowSA.cpp:181:4: error: cannot convert ‘void (adaptation::WindowSA::*)()’ to ‘void (adaptation::WindowSA::*)(double, double)’ in initialization
/var/lib/jenkins/workspace/ridCosimulation_development-7CHFDKZ477AWP5WGVIV7ZEYJ7TBQYODTBA2CXNIBOFPOTJGJR3PQ/DSL_SemanticAdaptation/be.uantwerpen.ansymo.semanticadaptation.cg.cpp.tests/target/c-gen-tests/generated/powerwindow/sources/WindowSA.cpp:181:4: error: cannot convert ‘void (adaptation::WindowSA::*)()’ to ‘void (adaptation::WindowSA::*)(double, double)’ in initialization
/var/lib/jenkins/workspace/ridCosimulation_development-7CHFDKZ477AWP5WGVIV7ZEYJ7TBQYODTBA2CXNIBOFPOTJGJR3PQ/DSL_SemanticAdaptation/be.uantwerpen.ansymo.semanticadaptation.cg.cpp.tests/target/c-gen-tests/generated/powerwindow/sources/WindowSA.cpp:189:4: error: cannot convert ‘bool (adaptation::WindowSA::*)()’ to ‘bool (adaptation::WindowSA::*)(double, double)’ in initialization
    });
    ^
/var/lib/jenkins/workspace/ridCosimulation_development-7CHFDKZ477AWP5WGVIV7ZEYJ7TBQYODTBA2CXNIBOFPOTJGJR3PQ/DSL_SemanticAdaptation/be.uantwerpen.ansymo.semanticadaptation.cg.cpp.tests/target/c-gen-tests/generated/powerwindow/sources/WindowSA.cpp:189:4: error: cannot convert ‘void (adaptation::WindowSA::*)()’ to ‘void (adaptation::WindowSA::*)(double, double)’ in initialization
/var/lib/jenkins/workspace/ridCosimulation_development-7CHFDKZ477AWP5WGVIV7ZEYJ7TBQYODTBA2CXNIBOFPOTJGJR3PQ/DSL_SemanticAdaptation/be.uantwerpen.ansymo.semanticadaptation.cg.cpp.tests/target/c-gen-tests/generated/powerwindow/sources/WindowSA.cpp:189:4: error: cannot convert ‘void (adaptation::WindowSA::*)()’ to ‘void (adaptation::WindowSA::*)(double, double)’ in initialization
CMakeFiles/powerwindow_main.dir/build.make:110: recipe for target 'CMakeFiles/powerwindow_main.dir/sources/WindowSA.cpp.o' failed
CMakeFiles/Makefile2:69: recipe for target 'CMakeFiles/powerwindow_main.dir/all' failed
make[2]: *** [CMakeFiles/powerwindow_main.dir/sources/WindowSA.cpp.o] Error 1
make[1]: *** [CMakeFiles/powerwindow_main.dir/all] Error 2
make: *** [all] Error 2
Makefile:83: recipe for target 'all' failed
Rootdir: /var/lib/jenkins/workspace/ridCosimulation_development-7CHFDKZ477AWP5WGVIV7ZEYJ7TBQYODTBA2CXNIBOFPOTJGJR3PQ/DSL_SemanticAdaptation/be.uantwerpen.ansymo.semanticadaptation.cg.cpp.tests/target/c-gen-tests/generated/powerwindow_generated
2018-01-01 18:31:16,107 [DEBUG] Parsing took: 25 ms
2018-01-01 18:31:16,107 [DEBUG] beforeModelLinked took: 0ms
2018-01-01 18:31:16,113 [DEBUG] doLinkModel took: 6ms
2018-01-01 18:31:16,113 [DEBUG] afterModelLinked took: 0ms
2018-01-01 18:31:16,117 [DEBUG] before getLinkedObjects: node: 'window'
2018-01-01 18:31:16,117 [INFO] >Getting scope for fmu within context class be.uantwerpen.ansymo.semanticadaptation.semanticAdaptation.impl.DoStepFunImpl
2018-01-01 18:31:16,117 [INFO]  Delegating scope discovery to super class...
2018-01-01 18:31:16,117 [DEBUG] No explicit container state set. Falling back to default.
2018-01-01 18:31:16,118 [DEBUG] No explicit container state set. Falling back to default.
2018-01-01 18:31:16,118 [DEBUG] No explicit container state set. Falling back to default.
2018-01-01 18:31:16,123 [INFO] <Scope found:ImportScope[windowSA.H_window.*] imports from org.eclipse.xtext.scoping.impl.MultimapBasedSelectable@67e13bd0 for type FMU
2018-01-01 18:31:16,123 [DEBUG] after getLinkedObjects: node: 'window' result: window
2018-01-01 18:31:16,123 [DEBUG] before getLinkedObjects: node: 'H_window'
2018-01-01 18:31:16,123 [INFO] >Getting scope for ref within context class be.uantwerpen.ansymo.semanticadaptation.semanticAdaptation.impl.VariableImpl
2018-01-01 18:31:16,124 [INFO] <Scope found:SimpleScope[displacement, speed, reaction_force, disp, tau, displacement, speed, reaction_force, height, reaction_torque, INIT_DISPLACEMENT, INIT_SPEED, INIT_REACTION_FORCE, INIT_HEIGHT, INIT_REACTION_TORQUE, H_window, stored__displacement, stored__speed, stored__reaction_force, stored__reaction_torque, stored__height] -> NULLSCOPE
2018-01-01 18:31:16,124 [DEBUG] after getLinkedObjects: node: 'H_window' result: H_window
2018-01-01 18:31:16,124 [DEBUG] before getLinkedObjects: node: 'stored__speed'
2018-01-01 18:31:16,124 [INFO] >Getting scope for ref within context class be.uantwerpen.ansymo.semanticadaptation.semanticAdaptation.impl.VariableImpl
2018-01-01 18:31:16,124 [INFO] <Scope found:SimpleScope[displacement, speed, reaction_force, disp, tau, displacement, speed, reaction_force, height, reaction_torque, INIT_DISPLACEMENT, INIT_SPEED, INIT_REACTION_FORCE, INIT_HEIGHT, INIT_REACTION_TORQUE, H_window, stored__displacement, stored__speed, stored__reaction_force, stored__reaction_torque, stored__height] -> NULLSCOPE
2018-01-01 18:31:16,124 [DEBUG] after getLinkedObjects: node: 'stored__speed' result: stored__speed
2018-01-01 18:31:16,124 [DEBUG] before getLinkedObjects: node: 'windowSA'
2018-01-01 18:31:16,124 [INFO] >Getting scope for owner within context class be.uantwerpen.ansymo.semanticadaptation.semanticAdaptation.impl.VariableImpl
2018-01-01 18:31:16,124 [INFO]  Delegating scope discovery to super class...
2018-01-01 18:31:16,125 [INFO] <Scope found:ImportScope[windowSA.*] imports from org.eclipse.xtext.scoping.impl.MultimapBasedSelectable@67e13bd0 for type FMU
2018-01-01 18:31:16,125 [DEBUG] after getLinkedObjects: node: 'windowSA' result: windowSA
2018-01-01 18:31:16,125 [DEBUG] before getLinkedObjects: node: 'speed'
2018-01-01 18:31:16,125 [INFO] >Getting scope for ref within context class be.uantwerpen.ansymo.semanticadaptation.semanticAdaptation.impl.VariableImpl
2018-01-01 18:31:16,125 [INFO]  Getting scope within FMU: windowSA
2018-01-01 18:31:16,126 [INFO] <Scope found:SimpleScope[displacement, speed, reaction_force, disp, tau, displacement, speed, reaction_force, height, reaction_torque] -> NULLSCOPE
2018-01-01 18:31:16,126 [DEBUG] after getLinkedObjects: node: 'speed' result: speed
2018-01-01 18:31:16,126 [DEBUG] before getLinkedObjects: node: 'stored__reaction_force'
2018-01-01 18:31:16,126 [INFO] >Getting scope for ref within context class be.uantwerpen.ansymo.semanticadaptation.semanticAdaptation.impl.VariableImpl
2018-01-01 18:31:16,126 [INFO] <Scope found:SimpleScope[displacement, speed, reaction_force, disp, tau, displacement, speed, reaction_force, height, reaction_torque, INIT_DISPLACEMENT, INIT_SPEED, INIT_REACTION_FORCE, INIT_HEIGHT, INIT_REACTION_TORQUE, H_window, stored__displacement, stored__speed, stored__reaction_force, stored__reaction_torque, stored__height] -> NULLSCOPE
2018-01-01 18:31:16,126 [DEBUG] after getLinkedObjects: node: 'stored__reaction_force' result: stored__reaction_force
2018-01-01 18:31:16,126 [DEBUG] before getLinkedObjects: node: 'windowSA'
2018-01-01 18:31:16,126 [INFO] >Getting scope for owner within context class be.uantwerpen.ansymo.semanticadaptation.semanticAdaptation.impl.VariableImpl
2018-01-01 18:31:16,126 [INFO]  Delegating scope discovery to super class...
2018-01-01 18:31:16,127 [INFO] <Scope found:ImportScope[windowSA.*] imports from org.eclipse.xtext.scoping.impl.MultimapBasedSelectable@67e13bd0 for type FMU
2018-01-01 18:31:16,127 [DEBUG] after getLinkedObjects: node: 'windowSA' result: windowSA
2018-01-01 18:31:16,127 [DEBUG] before getLinkedObjects: node: 'reaction_force'
2018-01-01 18:31:16,127 [INFO] >Getting scope for ref within context class be.uantwerpen.ansymo.semanticadaptation.semanticAdaptation.impl.VariableImpl
2018-01-01 18:31:16,127 [INFO]  Getting scope within FMU: windowSA
2018-01-01 18:31:16,127 [INFO] <Scope found:SimpleScope[displacement, speed, reaction_force, disp, tau, displacement, speed, reaction_force, height, reaction_torque] -> NULLSCOPE
2018-01-01 18:31:16,127 [DEBUG] after getLinkedObjects: node: 'reaction_force' result: reaction_force
2018-01-01 18:31:16,127 [DEBUG] before getLinkedObjects: node: 'stored__displacement'
2018-01-01 18:31:16,127 [INFO] >Getting scope for ref within context class be.uantwerpen.ansymo.semanticadaptation.semanticAdaptation.impl.VariableImpl
2018-01-01 18:31:16,128 [INFO] <Scope found:SimpleScope[displacement, speed, reaction_force, disp, tau, displacement, speed, reaction_force, height, reaction_torque, INIT_DISPLACEMENT, INIT_SPEED, INIT_REACTION_FORCE, INIT_HEIGHT, INIT_REACTION_TORQUE, H_window, stored__displacement, stored__speed, stored__reaction_force, stored__reaction_torque, stored__height] -> NULLSCOPE
2018-01-01 18:31:16,128 [DEBUG] after getLinkedObjects: node: 'stored__displacement' result: stored__displacement
2018-01-01 18:31:16,128 [DEBUG] before getLinkedObjects: node: 'windowSA'
2018-01-01 18:31:16,128 [INFO] >Getting scope for owner within context class be.uantwerpen.ansymo.semanticadaptation.semanticAdaptation.impl.VariableImpl
2018-01-01 18:31:16,128 [INFO]  Delegating scope discovery to super class...
2018-01-01 18:31:16,129 [INFO] <Scope found:ImportScope[windowSA.*] imports from org.eclipse.xtext.scoping.impl.MultimapBasedSelectable@67e13bd0 for type FMU
2018-01-01 18:31:16,129 [DEBUG] after getLinkedObjects: node: 'windowSA' result: windowSA
2018-01-01 18:31:16,129 [DEBUG] before getLinkedObjects: node: 'displacement'
2018-01-01 18:31:16,129 [INFO] >Getting scope for ref within context class be.uantwerpen.ansymo.semanticadaptation.semanticAdaptation.impl.VariableImpl
2018-01-01 18:31:16,129 [INFO]  Getting scope within FMU: windowSA
2018-01-01 18:31:16,129 [INFO] <Scope found:SimpleScope[displacement, speed, reaction_force, disp, tau, displacement, speed, reaction_force, height, reaction_torque] -> NULLSCOPE
2018-01-01 18:31:16,129 [DEBUG] after getLinkedObjects: node: 'displacement' result: displacement
2018-01-01 18:31:16,129 [DEBUG] before getLinkedObjects: node: 'window'
2018-01-01 18:31:16,129 [INFO] >Getting scope for owner within context class be.uantwerpen.ansymo.semanticadaptation.semanticAdaptation.impl.VariableImpl
2018-01-01 18:31:16,129 [INFO]  Delegating scope discovery to super class...
2018-01-01 18:31:16,130 [INFO] <Scope found:ImportScope[windowSA.*] imports from org.eclipse.xtext.scoping.impl.MultimapBasedSelectable@67e13bd0 for type FMU
2018-01-01 18:31:16,130 [DEBUG] after getLinkedObjects: node: 'window' result: window
2018-01-01 18:31:16,130 [DEBUG] before getLinkedObjects: node: 'speed'
2018-01-01 18:31:16,130 [INFO] >Getting scope for ref within context class be.uantwerpen.ansymo.semanticadaptation.semanticAdaptation.impl.VariableImpl
2018-01-01 18:31:16,130 [INFO]  Getting scope within FMU: window
2018-01-01 18:31:16,131 [INFO] <Scope found:SimpleScope[displacement, speed, reaction_force, height, reaction_torque] -> NULLSCOPE
2018-01-01 18:31:16,131 [DEBUG] after getLinkedObjects: node: 'speed' result: speed
2018-01-01 18:31:16,131 [DEBUG] before getLinkedObjects: node: 'stored__speed'
2018-01-01 18:31:16,131 [INFO] >Getting scope for ref within context class be.uantwerpen.ansymo.semanticadaptation.semanticAdaptation.impl.VariableImpl
2018-01-01 18:31:16,131 [INFO] <Scope found:SimpleScope[displacement, speed, reaction_force, disp, tau, displacement, speed, reaction_force, height, reaction_torque, INIT_DISPLACEMENT, INIT_SPEED, INIT_REACTION_FORCE, INIT_HEIGHT, INIT_REACTION_TORQUE, H_window, stored__displacement, stored__speed, stored__reaction_force, stored__reaction_torque, stored__height] -> NULLSCOPE
2018-01-01 18:31:16,131 [DEBUG] after getLinkedObjects: node: 'stored__speed' result: stored__speed
2018-01-01 18:31:16,131 [DEBUG] before getLinkedObjects: node: 'window'
2018-01-01 18:31:16,131 [INFO] >Getting scope for owner within context class be.uantwerpen.ansymo.semanticadaptation.semanticAdaptation.impl.VariableImpl
2018-01-01 18:31:16,131 [INFO]  Delegating scope discovery to super class...
2018-01-01 18:31:16,132 [INFO] <Scope found:ImportScope[windowSA.*] imports from org.eclipse.xtext.scoping.impl.MultimapBasedSelectable@67e13bd0 for type FMU
2018-01-01 18:31:16,132 [DEBUG] after getLinkedObjects: node: 'window' result: window
2018-01-01 18:31:16,132 [DEBUG] before getLinkedObjects: node: 'displacement'
2018-01-01 18:31:16,132 [INFO] >Getting scope for ref within context class be.uantwerpen.ansymo.semanticadaptation.semanticAdaptation.impl.VariableImpl
2018-01-01 18:31:16,132 [INFO]  Getting scope within FMU: window
2018-01-01 18:31:16,132 [INFO] <Scope found:SimpleScope[displacement, speed, reaction_force, height, reaction_torque] -> NULLSCOPE
2018-01-01 18:31:16,132 [DEBUG] after getLinkedObjects: node: 'displacement' result: displacement
2018-01-01 18:31:16,132 [DEBUG] before getLinkedObjects: node: 'stored__displacement'
2018-01-01 18:31:16,132 [INFO] >Getting scope for ref within context class be.uantwerpen.ansymo.semanticadaptation.semanticAdaptation.impl.VariableImpl
2018-01-01 18:31:16,133 [INFO] <Scope found:SimpleScope[displacement, speed, reaction_force, disp, tau, displacement, speed, reaction_force, height, reaction_torque, INIT_DISPLACEMENT, INIT_SPEED, INIT_REACTION_FORCE, INIT_HEIGHT, INIT_REACTION_TORQUE, H_window, stored__displacement, stored__speed, stored__reaction_force, stored__reaction_torque, stored__height] -> NULLSCOPE
2018-01-01 18:31:16,133 [DEBUG] after getLinkedObjects: node: 'stored__displacement' result: stored__displacement
2018-01-01 18:31:16,133 [DEBUG] before getLinkedObjects: node: 'window'
2018-01-01 18:31:16,133 [INFO] >Getting scope for owner within context class be.uantwerpen.ansymo.semanticadaptation.semanticAdaptation.impl.VariableImpl
2018-01-01 18:31:16,133 [INFO]  Delegating scope discovery to super class...
2018-01-01 18:31:16,133 [INFO] <Scope found:ImportScope[windowSA.*] imports from org.eclipse.xtext.scoping.impl.MultimapBasedSelectable@67e13bd0 for type FMU
2018-01-01 18:31:16,133 [DEBUG] after getLinkedObjects: node: 'window' result: window
2018-01-01 18:31:16,133 [DEBUG] before getLinkedObjects: node: 'reaction_force'
2018-01-01 18:31:16,134 [INFO] >Getting scope for ref within context class be.uantwerpen.ansymo.semanticadaptation.semanticAdaptation.impl.VariableImpl
2018-01-01 18:31:16,134 [INFO]  Getting scope within FMU: window
2018-01-01 18:31:16,134 [INFO] <Scope found:SimpleScope[displacement, speed, reaction_force, height, reaction_torque] -> NULLSCOPE
2018-01-01 18:31:16,134 [DEBUG] after getLinkedObjects: node: 'reaction_force' result: reaction_force
2018-01-01 18:31:16,134 [DEBUG] before getLinkedObjects: node: 'stored__reaction_force'
2018-01-01 18:31:16,134 [INFO] >Getting scope for ref within context class be.uantwerpen.ansymo.semanticadaptation.semanticAdaptation.impl.VariableImpl
2018-01-01 18:31:16,134 [INFO] <Scope found:SimpleScope[displacement, speed, reaction_force, disp, tau, displacement, speed, reaction_force, height, reaction_torque, INIT_DISPLACEMENT, INIT_SPEED, INIT_REACTION_FORCE, INIT_HEIGHT, INIT_REACTION_TORQUE, H_window, stored__displacement, stored__speed, stored__reaction_force, stored__reaction_torque, stored__height] -> NULLSCOPE
2018-01-01 18:31:16,134 [DEBUG] after getLinkedObjects: node: 'stored__reaction_force' result: stored__reaction_force
2018-01-01 18:31:16,134 [DEBUG] before getLinkedObjects: node: 'INIT_DISPLACEMENT'
2018-01-01 18:31:16,134 [INFO] >Getting scope for ref within context class be.uantwerpen.ansymo.semanticadaptation.semanticAdaptation.impl.VariableImpl
2018-01-01 18:31:16,134 [INFO] <Scope found:SimpleScope[displacement, speed, reaction_force, disp, tau, displacement, speed, reaction_force, height, reaction_torque, INIT_DISPLACEMENT, INIT_SPEED, INIT_REACTION_FORCE, INIT_HEIGHT, INIT_REACTION_TORQUE, H_window, stored__displacement, stored__speed, stored__reaction_force, stored__reaction_torque, stored__height] -> NULLSCOPE
2018-01-01 18:31:16,135 [DEBUG] after getLinkedObjects: node: 'INIT_DISPLACEMENT' result: INIT_DISPLACEMENT
2018-01-01 18:31:16,135 [DEBUG] before getLinkedObjects: node: 'INIT_SPEED'
2018-01-01 18:31:16,135 [INFO] >Getting scope for ref within context class be.uantwerpen.ansymo.semanticadaptation.semanticAdaptation.impl.VariableImpl
2018-01-01 18:31:16,135 [INFO] <Scope found:SimpleScope[displacement, speed, reaction_force, disp, tau, displacement, speed, reaction_force, height, reaction_torque, INIT_DISPLACEMENT, INIT_SPEED, INIT_REACTION_FORCE, INIT_HEIGHT, INIT_REACTION_TORQUE, H_window, stored__displacement, stored__speed, stored__reaction_force, stored__reaction_torque, stored__height] -> NULLSCOPE
2018-01-01 18:31:16,135 [DEBUG] after getLinkedObjects: node: 'INIT_SPEED' result: INIT_SPEED
2018-01-01 18:31:16,135 [DEBUG] before getLinkedObjects: node: 'INIT_REACTION_FORCE'
2018-01-01 18:31:16,135 [INFO] >Getting scope for ref within context class be.uantwerpen.ansymo.semanticadaptation.semanticAdaptation.impl.VariableImpl
2018-01-01 18:31:16,135 [INFO] <Scope found:SimpleScope[displacement, speed, reaction_force, disp, tau, displacement, speed, reaction_force, height, reaction_torque, INIT_DISPLACEMENT, INIT_SPEED, INIT_REACTION_FORCE, INIT_HEIGHT, INIT_REACTION_TORQUE, H_window, stored__displacement, stored__speed, stored__reaction_force, stored__reaction_torque, stored__height] -> NULLSCOPE
2018-01-01 18:31:16,135 [DEBUG] after getLinkedObjects: node: 'INIT_REACTION_FORCE' result: INIT_REACTION_FORCE
2018-01-01 18:31:16,136 [DEBUG] before getLinkedObjects: node: 'stored__reaction_torque'
2018-01-01 18:31:16,136 [INFO] >Getting scope for ref within context class be.uantwerpen.ansymo.semanticadaptation.semanticAdaptation.impl.VariableImpl
2018-01-01 18:31:16,136 [INFO] <Scope found:SimpleScope[displacement, speed, reaction_force, disp, tau, displacement, speed, reaction_force, height, reaction_torque, INIT_DISPLACEMENT, INIT_SPEED, INIT_REACTION_FORCE, INIT_HEIGHT, INIT_REACTION_TORQUE, H_window, stored__displacement, stored__speed, stored__reaction_force, stored__reaction_torque, stored__height] -> NULLSCOPE
2018-01-01 18:31:16,136 [DEBUG] after getLinkedObjects: node: 'stored__reaction_torque' result: stored__reaction_torque
2018-01-01 18:31:16,136 [DEBUG] before getLinkedObjects: node: 'window'
2018-01-01 18:31:16,136 [INFO] >Getting scope for owner within context class be.uantwerpen.ansymo.semanticadaptation.semanticAdaptation.impl.VariableImpl
2018-01-01 18:31:16,136 [INFO]  Delegating scope discovery to super class...
2018-01-01 18:31:16,137 [INFO] <Scope found:ImportScope[windowSA.*] imports from org.eclipse.xtext.scoping.impl.MultimapBasedSelectable@67e13bd0 for type FMU
2018-01-01 18:31:16,137 [DEBUG] after getLinkedObjects: node: 'window' result: window
2018-01-01 18:31:16,137 [DEBUG] before getLinkedObjects: node: 'reaction_torque'
2018-01-01 18:31:16,137 [INFO] >Getting scope for ref within context class be.uantwerpen.ansymo.semanticadaptation.semanticAdaptation.impl.VariableImpl
2018-01-01 18:31:16,137 [INFO]  Getting scope within FMU: window
2018-01-01 18:31:16,137 [INFO] <Scope found:SimpleScope[displacement, speed, reaction_force, height, reaction_torque] -> NULLSCOPE
2018-01-01 18:31:16,137 [DEBUG] after getLinkedObjects: node: 'reaction_torque' result: reaction_torque
2018-01-01 18:31:16,137 [DEBUG] before getLinkedObjects: node: 'stored__height'
2018-01-01 18:31:16,137 [INFO] >Getting scope for ref within context class be.uantwerpen.ansymo.semanticadaptation.semanticAdaptation.impl.VariableImpl
2018-01-01 18:31:16,137 [INFO] <Scope found:SimpleScope[displacement, speed, reaction_force, disp, tau, displacement, speed, reaction_force, height, reaction_torque, INIT_DISPLACEMENT, INIT_SPEED, INIT_REACTION_FORCE, INIT_HEIGHT, INIT_REACTION_TORQUE, H_window, stored__displacement, stored__speed, stored__reaction_force, stored__reaction_torque, stored__height] -> NULLSCOPE
2018-01-01 18:31:16,138 [DEBUG] after getLinkedObjects: node: 'stored__height' result: stored__height
2018-01-01 18:31:16,138 [DEBUG] before getLinkedObjects: node: 'window'
2018-01-01 18:31:16,138 [INFO] >Getting scope for owner within context class be.uantwerpen.ansymo.semanticadaptation.semanticAdaptation.impl.VariableImpl
2018-01-01 18:31:16,138 [INFO]  Delegating scope discovery to super class...
2018-01-01 18:31:16,138 [INFO] <Scope found:ImportScope[windowSA.*] imports from org.eclipse.xtext.scoping.impl.MultimapBasedSelectable@67e13bd0 for type FMU
2018-01-01 18:31:16,138 [DEBUG] after getLinkedObjects: node: 'window' result: window
2018-01-01 18:31:16,138 [DEBUG] before getLinkedObjects: node: 'height'
2018-01-01 18:31:16,138 [INFO] >Getting scope for ref within context class be.uantwerpen.ansymo.semanticadaptation.semanticAdaptation.impl.VariableImpl
2018-01-01 18:31:16,138 [INFO]  Getting scope within FMU: window
2018-01-01 18:31:16,139 [INFO] <Scope found:SimpleScope[displacement, speed, reaction_force, height, reaction_torque] -> NULLSCOPE
2018-01-01 18:31:16,139 [DEBUG] after getLinkedObjects: node: 'height' result: height
2018-01-01 18:31:16,139 [DEBUG] before getLinkedObjects: node: 'windowSA'
2018-01-01 18:31:16,139 [INFO] >Getting scope for owner within context class be.uantwerpen.ansymo.semanticadaptation.semanticAdaptation.impl.VariableImpl
2018-01-01 18:31:16,139 [INFO]  Delegating scope discovery to super class...
2018-01-01 18:31:16,139 [INFO] <Scope found:ImportScope[windowSA.*] imports from org.eclipse.xtext.scoping.impl.MultimapBasedSelectable@67e13bd0 for type FMU
2018-01-01 18:31:16,139 [DEBUG] after getLinkedObjects: node: 'windowSA' result: windowSA
2018-01-01 18:31:16,139 [DEBUG] before getLinkedObjects: node: 'disp'
2018-01-01 18:31:16,139 [INFO] >Getting scope for ref within context class be.uantwerpen.ansymo.semanticadaptation.semanticAdaptation.impl.VariableImpl
2018-01-01 18:31:16,139 [INFO]  Getting scope within FMU: windowSA
2018-01-01 18:31:16,140 [INFO] <Scope found:SimpleScope[displacement, speed, reaction_force, disp, tau, displacement, speed, reaction_force, height, reaction_torque] -> NULLSCOPE
2018-01-01 18:31:16,140 [DEBUG] after getLinkedObjects: node: 'disp' result: disp
2018-01-01 18:31:16,140 [DEBUG] before getLinkedObjects: node: 'stored__height'
2018-01-01 18:31:16,140 [INFO] >Getting scope for ref within context class be.uantwerpen.ansymo.semanticadaptation.semanticAdaptation.impl.VariableImpl
2018-01-01 18:31:16,140 [INFO] <Scope found:SimpleScope[displacement, speed, reaction_force, disp, tau, displacement, speed, reaction_force, height, reaction_torque, INIT_DISPLACEMENT, INIT_SPEED, INIT_REACTION_FORCE, INIT_HEIGHT, INIT_REACTION_TORQUE, H_window, stored__displacement, stored__speed, stored__reaction_force, stored__reaction_torque, stored__height] -> NULLSCOPE
2018-01-01 18:31:16,140 [DEBUG] after getLinkedObjects: node: 'stored__height' result: stored__height
2018-01-01 18:31:16,140 [DEBUG] before getLinkedObjects: node: 'windowSA'
2018-01-01 18:31:16,140 [INFO] >Getting scope for owner within context class be.uantwerpen.ansymo.semanticadaptation.semanticAdaptation.impl.VariableImpl
2018-01-01 18:31:16,140 [INFO]  Delegating scope discovery to super class...
2018-01-01 18:31:16,141 [INFO] <Scope found:ImportScope[windowSA.*] imports from org.eclipse.xtext.scoping.impl.MultimapBasedSelectable@67e13bd0 for type FMU
2018-01-01 18:31:16,141 [DEBUG] after getLinkedObjects: node: 'windowSA' result: windowSA
2018-01-01 18:31:16,141 [DEBUG] before getLinkedObjects: node: 'tau'
2018-01-01 18:31:16,141 [INFO] >Getting scope for ref within context class be.uantwerpen.ansymo.semanticadaptation.semanticAdaptation.impl.VariableImpl
2018-01-01 18:31:16,141 [INFO]  Getting scope within FMU: windowSA
2018-01-01 18:31:16,141 [INFO] <Scope found:SimpleScope[displacement, speed, reaction_force, disp, tau, displacement, speed, reaction_force, height, reaction_torque] -> NULLSCOPE
2018-01-01 18:31:16,141 [DEBUG] after getLinkedObjects: node: 'tau' result: tau
2018-01-01 18:31:16,141 [DEBUG] before getLinkedObjects: node: 'stored__reaction_torque'
2018-01-01 18:31:16,141 [INFO] >Getting scope for ref within context class be.uantwerpen.ansymo.semanticadaptation.semanticAdaptation.impl.VariableImpl
2018-01-01 18:31:16,142 [INFO] <Scope found:SimpleScope[displacement, speed, reaction_force, disp, tau, displacement, speed, reaction_force, height, reaction_torque, INIT_DISPLACEMENT, INIT_SPEED, INIT_REACTION_FORCE, INIT_HEIGHT, INIT_REACTION_TORQUE, H_window, stored__displacement, stored__speed, stored__reaction_force, stored__reaction_torque, stored__height] -> NULLSCOPE
2018-01-01 18:31:16,142 [DEBUG] after getLinkedObjects: node: 'stored__reaction_torque' result: stored__reaction_torque
2018-01-01 18:31:16,142 [DEBUG] before getLinkedObjects: node: 'INIT_REACTION_TORQUE'
2018-01-01 18:31:16,142 [INFO] >Getting scope for ref within context class be.uantwerpen.ansymo.semanticadaptation.semanticAdaptation.impl.VariableImpl
2018-01-01 18:31:16,142 [INFO] <Scope found:SimpleScope[displacement, speed, reaction_force, disp, tau, displacement, speed, reaction_force, height, reaction_torque, INIT_DISPLACEMENT, INIT_SPEED, INIT_REACTION_FORCE, INIT_HEIGHT, INIT_REACTION_TORQUE, H_window, stored__displacement, stored__speed, stored__reaction_force, stored__reaction_torque, stored__height] -> NULLSCOPE
2018-01-01 18:31:16,142 [DEBUG] after getLinkedObjects: node: 'INIT_REACTION_TORQUE' result: INIT_REACTION_TORQUE
2018-01-01 18:31:16,142 [DEBUG] before getLinkedObjects: node: 'INIT_HEIGHT'
2018-01-01 18:31:16,142 [INFO] >Getting scope for ref within context class be.uantwerpen.ansymo.semanticadaptation.semanticAdaptation.impl.VariableImpl
2018-01-01 18:31:16,142 [INFO] <Scope found:SimpleScope[displacement, speed, reaction_force, disp, tau, displacement, speed, reaction_force, height, reaction_torque, INIT_DISPLACEMENT, INIT_SPEED, INIT_REACTION_FORCE, INIT_HEIGHT, INIT_REACTION_TORQUE, H_window, stored__displacement, stored__speed, stored__reaction_force, stored__reaction_torque, stored__height] -> NULLSCOPE
2018-01-01 18:31:16,142 [DEBUG] after getLinkedObjects: node: 'INIT_HEIGHT' result: INIT_HEIGHT
2018-01-01 18:31:16,142 [DEBUG] Syntax check OK! Resource: __synthetic0.sa
2018-01-01 18:31:16,147 [INFO] >CppGenerator.doGenerate .
2018-01-01 18:31:16,147 [INFO]  >CppGenerator.compile
2018-01-01 18:31:16,148 [INFO]   >Loading fmu "test_input/single_folder_spec/window/Window.fmu"
2018-01-01 18:31:16,148 [INFO]    Resolved fmu path: ./test_input/single_folder_spec/window/Window.fmu
2018-01-01 18:31:16,148 [INFO]    >Loading model description for fmu window
2018-01-01 18:31:16,148 [INFO]     Source fmu absolute path: /var/lib/jenkins/workspace/ridCosimulation_development-7CHFDKZ477AWP5WGVIV7ZEYJ7TBQYODTBA2CXNIBOFPOTJGJR3PQ/DSL_SemanticAdaptation/be.uantwerpen.ansymo.semanticadaptation.cg.cpp.tests/./test_input/single_folder_spec/window/Window.fmu
2018-01-01 18:31:16,157 [INFO]    <Loading model description for fmu window
2018-01-01 18:31:16,157 [INFO]   <Loading fmu "test_input/single_folder_spec/window/Window.fmu"
2018-01-01 18:31:16,163 [INFO]  <CppGenerator.compile
2018-01-01 18:31:16,163 [INFO] <CppGenerator.doGenerate.
2018-01-01 18:31:16,164 [INFO] Stored file: target/c-gen-tests/generated/powerwindow_generated/sources/Fmu.cpp
2018-01-01 18:31:16,164 [INFO] Stored file: target/c-gen-tests/generated/powerwindow_generated/sources/WindowSA.cpp
2018-01-01 18:31:16,164 [INFO] Stored file: target/c-gen-tests/generated/powerwindow_generated/sources/WindowSA.h
2018-01-01 18:31:16,164 [INFO] Stored file: target/c-gen-tests/generated/powerwindow_generated/modelDescription.xml
2018-01-01 18:31:16,165 [INFO] Stored file: target/c-gen-tests/generated/powerwindow_generated/sources/main.cpp
Copied file to: target/c-gen-tests/generated/powerwindow_generated/resources/Window.fmu
2018-01-01 18:31:16,192 [INFO] Stored file: target/c-gen-tests/generated/powerwindow_generated/CMakeLists.txt
2018-01-01 18:31:16,192 [INFO] Stored file: target/c-gen-tests/generated/powerwindow_generated/msys-toolchain.cmake
/var/lib/jenkins/workspace/ridCosimulation_development-7CHFDKZ477AWP5WGVIV7ZEYJ7TBQYODTBA2CXNIBOFPOTJGJR3PQ/DSL_SemanticAdaptation/be.uantwerpen.ansymo.semanticadaptation.cg.cpp.tests/target/c-gen-tests/generated/powerwindow_generated
-- The C compiler identification is GNU 5.4.0
-- The CXX compiler identification is GNU 5.4.0
-- Check for working C compiler: /usr/bin/cc
-- Check for working C compiler: /usr/bin/cc -- works
-- Detecting C compiler ABI info
-- Detecting C compiler ABI info - done
-- Detecting C compile features
-- Detecting C compile features - done
-- Check for working CXX compiler: /usr/bin/c++
-- Check for working CXX compiler: /usr/bin/c++ -- works
-- Detecting CXX compiler ABI info
-- Detecting CXX compiler ABI info - done
-- Detecting CXX compile features
-- Detecting CXX compile features - done
Cloning into 'hcf'...
Submodule 'semantic-adaptation/third_party/into-cpp-fmi' (https://github.com/into-cps/into-cpp-fmi.git) registered for path 'semantic-adaptation/third_party/into-cpp-fmi'
Submodule 'third_party/googletest' (https://github.com/google/googletest.git) registered for path 'third_party/googletest'
Cloning into 'semantic-adaptation/third_party/into-cpp-fmi'...
Submodule path 'semantic-adaptation/third_party/into-cpp-fmi': checked out '799e4f1f6d4bce1fa291181a2f5de070ab025de9'
Submodule 'include/fmi' (https://github.com/into-cps/fmi.git) registered for path 'include/fmi'
Submodule 'thrird_party/zlib' (https://github.com/madler/zlib.git) registered for path 'thrird_party/zlib'
Cloning into 'include/fmi'...
Submodule path 'semantic-adaptation/third_party/into-cpp-fmi/include/fmi': checked out '45586e20877bfd97e47c1eeb19bfe227b4a46d58'
Cloning into 'thrird_party/zlib'...
Submodule path 'semantic-adaptation/third_party/into-cpp-fmi/thrird_party/zlib': checked out 'cacf7f1d4e3d44d871b605da3b647f07d718623f'
Cloning into 'third_party/googletest'...
Submodule path 'third_party/googletest': checked out 'aa148eb2b7f70ede0eb10de34b6254826bfb34f4'
-- Performing Test COMPILER_SUPPORTS_CXX11
-- Performing Test COMPILER_SUPPORTS_CXX11 - Success
-- Performing Test COMPILER_SUPPORTS_CXX0X
-- Performing Test COMPILER_SUPPORTS_CXX0X - Success
-- Found ZLIB: /usr/lib/x86_64-linux-gnu/libz.so (found version "1.2.8") 
CMake Warning (dev) at hcf/semantic-adaptation/CMakeLists.txt:57 (target_link_libraries):
  Policy CMP0023 is not set: Plain and keyword target_link_libraries
  signatures cannot be mixed.  Run "cmake --help-policy CMP0023" for policy
  details.  Use the cmake_policy command to set the policy and suppress this
  warning.

  The keyword signature for target_link_libraries has already been used with
  the target "hcf".  All uses of target_link_libraries with a target should
  be either all-keyword or all-plain.

  The uses of the keyword signature are here:

   * hcf/semantic-adaptation/CMakeLists.txt:50 (target_link_libraries)

This warning is for project developers.  Use -Wno-dev to suppress it.

FMI output is /var/lib/jenkins/workspace/ridCosimulation_development-7CHFDKZ477AWP5WGVIV7ZEYJ7TBQYODTBA2CXNIBOFPOTJGJR3PQ/DSL_SemanticAdaptation/be.uantwerpen.ansymo.semanticadaptation.cg.cpp.tests/target/c-gen-tests/generated/powerwindow_generated/binaries/linux64
-- Configuring done
-- Generating done
-- Build files have been written to: /var/lib/jenkins/workspace/ridCosimulation_development-7CHFDKZ477AWP5WGVIV7ZEYJ7TBQYODTBA2CXNIBOFPOTJGJR3PQ/DSL_SemanticAdaptation/be.uantwerpen.ansymo.semanticadaptation.cg.cpp.tests/target/c-gen-tests/generated/powerwindow_generated
Scanning dependencies of target minizip
[  4%] Building C object hcf/semantic-adaptation/third_party/into-cpp-fmi/thrird_party/projects/minizip/CMakeFiles/minizip.dir/__/__/zlib/contrib/minizip/unzip.c.o
[  9%] Building C object hcf/semantic-adaptation/third_party/into-cpp-fmi/thrird_party/projects/minizip/CMakeFiles/minizip.dir/__/__/zlib/contrib/minizip/ioapi.c.o
[ 14%] Building C object hcf/semantic-adaptation/third_party/into-cpp-fmi/thrird_party/projects/minizip/CMakeFiles/minizip.dir/__/__/zlib/contrib/minizip/mztools.c.o
[ 19%] Building C object hcf/semantic-adaptation/third_party/into-cpp-fmi/thrird_party/projects/minizip/CMakeFiles/minizip.dir/miniunz.c.o
/var/lib/jenkins/workspace/ridCosimulation_development-7CHFDKZ477AWP5WGVIV7ZEYJ7TBQYODTBA2CXNIBOFPOTJGJR3PQ/DSL_SemanticAdaptation/be.uantwerpen.ansymo.semanticadaptation.cg.cpp.tests/target/c-gen-tests/generated/powerwindow_generated/hcf/semantic-adaptation/third_party/into-cpp-fmi/thrird_party/projects/minizip/miniunz.c: In function ‘change_file_date’:
/var/lib/jenkins/workspace/ridCosimulation_development-7CHFDKZ477AWP5WGVIV7ZEYJ7TBQYODTBA2CXNIBOFPOTJGJR3PQ/DSL_SemanticAdaptation/be.uantwerpen.ansymo.semanticadaptation.cg.cpp.tests/target/c-gen-tests/generated/powerwindow_generated/hcf/semantic-adaptation/third_party/into-cpp-fmi/thrird_party/projects/minizip/miniunz.c:102:13: warning: extra tokens at end of #ifdef directive
 #ifdef unix || __APPLE__
             ^
/var/lib/jenkins/workspace/ridCosimulation_development-7CHFDKZ477AWP5WGVIV7ZEYJ7TBQYODTBA2CXNIBOFPOTJGJR3PQ/DSL_SemanticAdaptation/be.uantwerpen.ansymo.semanticadaptation.cg.cpp.tests/target/c-gen-tests/generated/powerwindow_generated/hcf/semantic-adaptation/third_party/into-cpp-fmi/thrird_party/projects/minizip/miniunz.c: In function ‘mymkdir’:
/var/lib/jenkins/workspace/ridCosimulation_development-7CHFDKZ477AWP5WGVIV7ZEYJ7TBQYODTBA2CXNIBOFPOTJGJR3PQ/DSL_SemanticAdaptation/be.uantwerpen.ansymo.semanticadaptation.cg.cpp.tests/target/c-gen-tests/generated/powerwindow_generated/hcf/semantic-adaptation/third_party/into-cpp-fmi/thrird_party/projects/minizip/miniunz.c:133:11: warning: implicit declaration of function ‘mkdir’ [-Wimplicit-function-declaration]
     ret = mkdir (dirname,0775);
           ^
[ 23%] Building C object hcf/semantic-adaptation/third_party/into-cpp-fmi/thrird_party/projects/minizip/CMakeFiles/minizip.dir/__/__/zlib/contrib/minizip/zip.c.o
[ 28%] Linking C static library libminizip.a
/usr/bin/ar qc libminizip.a  CMakeFiles/minizip.dir/__/__/zlib/contrib/minizip/ioapi.c.o CMakeFiles/minizip.dir/miniunz.c.o CMakeFiles/minizip.dir/__/__/zlib/contrib/minizip/mztools.c.o CMakeFiles/minizip.dir/__/__/zlib/contrib/minizip/unzip.c.o CMakeFiles/minizip.dir/__/__/zlib/contrib/minizip/zip.c.o
/usr/bin/ranlib libminizip.a
[ 28%] Built target minizip
Scanning dependencies of target intocppfmi
[ 33%] Building CXX object hcf/semantic-adaptation/third_party/into-cpp-fmi/CMakeFiles/intocppfmi.dir/src/Fmu.cpp.o
[ 38%] Building C object hcf/semantic-adaptation/third_party/into-cpp-fmi/CMakeFiles/intocppfmi.dir/src/FmuLoader.c.o
[ 42%] Building CXX object hcf/semantic-adaptation/third_party/into-cpp-fmi/CMakeFiles/intocppfmi.dir/src/FilesystemUtil.cpp.o
[ 47%] Building C object hcf/semantic-adaptation/third_party/into-cpp-fmi/CMakeFiles/intocppfmi.dir/src/uri.c.o
[ 52%] Linking CXX static library libintocppfmi.a
/usr/bin/ar qc libintocppfmi.a  CMakeFiles/intocppfmi.dir/src/FmuLoader.c.o CMakeFiles/intocppfmi.dir/src/uri.c.o CMakeFiles/intocppfmi.dir/src/FilesystemUtil.cpp.o CMakeFiles/intocppfmi.dir/src/Fmu.cpp.o
/usr/bin/ranlib libintocppfmi.a
[ 52%] Built target intocppfmi
Scanning dependencies of target hcf
[ 57%] Building CXX object hcf/semantic-adaptation/CMakeFiles/hcf.dir/src/Empty.cpp.o
[ 61%] Building CXX object hcf/semantic-adaptation/CMakeFiles/hcf.dir/src/HyfMath.cpp.o
[ 66%] Linking CXX static library libhcf.a
/usr/bin/ar qc libhcf.a  CMakeFiles/hcf.dir/src/Empty.cpp.o CMakeFiles/hcf.dir/src/HyfMath.cpp.o
/usr/bin/ranlib libhcf.a
[ 66%] Built target hcf
Scanning dependencies of target powerwindow_generated
Scanning dependencies of target powerwindow_generated_main
[ 71%] Building CXX object CMakeFiles/powerwindow_generated.dir/sources/Fmu.cpp.o
[ 76%] Building CXX object CMakeFiles/powerwindow_generated.dir/sources/WindowSA.cpp.o
[ 80%] Building CXX object CMakeFiles/powerwindow_generated_main.dir/sources/main.cpp.o
[ 85%] Building CXX object CMakeFiles/powerwindow_generated_main.dir/sources/Fmu.cpp.o
[ 90%] Building CXX object CMakeFiles/powerwindow_generated_main.dir/sources/WindowSA.cpp.o
/var/lib/jenkins/workspace/ridCosimulation_development-7CHFDKZ477AWP5WGVIV7ZEYJ7TBQYODTBA2CXNIBOFPOTJGJR3PQ/DSL_SemanticAdaptation/be.uantwerpen.ansymo.semanticadaptation.cg.cpp.tests/target/c-gen-tests/generated/powerwindow_generated/sources/WindowSA.cpp: In member function ‘std::shared_ptr<std::__cxx11::list<Rule<adaptation::WindowSA>, std::allocator<Rule<adaptation::WindowSA> > > > adaptation::WindowSA::createInputRules()’:
/var/lib/jenkins/workspace/ridCosimulation_development-7CHFDKZ477AWP5WGVIV7ZEYJ7TBQYODTBA2CXNIBOFPOTJGJR3PQ/DSL_SemanticAdaptation/be.uantwerpen.ansymo.semanticadaptation.cg.cpp.tests/target/c-gen-tests/generated/powerwindow_generated/sources/WindowSA.cpp:140:4: error: cannot convert ‘bool (adaptation::WindowSA::*)()’ to ‘bool (adaptation::WindowSA::*)(double, double)’ in initialization
    });
    ^
/var/lib/jenkins/workspace/ridCosimulation_development-7CHFDKZ477AWP5WGVIV7ZEYJ7TBQYODTBA2CXNIBOFPOTJGJR3PQ/DSL_SemanticAdaptation/be.uantwerpen.ansymo.semanticadaptation.cg.cpp.tests/target/c-gen-tests/generated/powerwindow_generated/sources/WindowSA.cpp:140:4: error: cannot convert ‘void (adaptation::WindowSA::*)()’ to ‘void (adaptation::WindowSA::*)(double, double)’ in initialization
/var/lib/jenkins/workspace/ridCosimulation_development-7CHFDKZ477AWP5WGVIV7ZEYJ7TBQYODTBA2CXNIBOFPOTJGJR3PQ/DSL_SemanticAdaptation/be.uantwerpen.ansymo.semanticadaptation.cg.cpp.tests/target/c-gen-tests/generated/powerwindow_generated/sources/WindowSA.cpp:140:4: error: cannot convert ‘void (adaptation::WindowSA::*)()’ to ‘void (adaptation::WindowSA::*)(double, double)’ in initialization
/var/lib/jenkins/workspace/ridCosimulation_development-7CHFDKZ477AWP5WGVIV7ZEYJ7TBQYODTBA2CXNIBOFPOTJGJR3PQ/DSL_SemanticAdaptation/be.uantwerpen.ansymo.semanticadaptation.cg.cpp.tests/target/c-gen-tests/generated/powerwindow_generated/sources/WindowSA.cpp: In member function ‘std::shared_ptr<std::__cxx11::list<Rule<adaptation::WindowSA>, std::allocator<Rule<adaptation::WindowSA> > > > adaptation::WindowSA::createOutputRules()’:
/var/lib/jenkins/workspace/ridCosimulation_development-7CHFDKZ477AWP5WGVIV7ZEYJ7TBQYODTBA2CXNIBOFPOTJGJR3PQ/DSL_SemanticAdaptation/be.uantwerpen.ansymo.semanticadaptation.cg.cpp.tests/target/c-gen-tests/generated/powerwindow_generated/sources/WindowSA.cpp:175:4: error: cannot convert ‘bool (adaptation::WindowSA::*)()’ to ‘bool (adaptation::WindowSA::*)(double, double)’ in initialization
    });
    ^
/var/lib/jenkins/workspace/ridCosimulation_development-7CHFDKZ477AWP5WGVIV7ZEYJ7TBQYODTBA2CXNIBOFPOTJGJR3PQ/DSL_SemanticAdaptation/be.uantwerpen.ansymo.semanticadaptation.cg.cpp.tests/target/c-gen-tests/generated/powerwindow_generated/sources/WindowSA.cpp:175:4: error: cannot convert ‘void (adaptation::WindowSA::*)()’ to ‘void (adaptation::WindowSA::*)(double, double)’ in initialization
/var/lib/jenkins/workspace/ridCosimulation_development-7CHFDKZ477AWP5WGVIV7ZEYJ7TBQYODTBA2CXNIBOFPOTJGJR3PQ/DSL_SemanticAdaptation/be.uantwerpen.ansymo.semanticadaptation.cg.cpp.tests/target/c-gen-tests/generated/powerwindow_generated/sources/WindowSA.cpp:175:4: error: cannot convert ‘void (adaptation::WindowSA::*)()’ to ‘void (adaptation::WindowSA::*)(double, double)’ in initialization
In file included from /usr/include/x86_64-linux-gnu/c++/5/bits/c++allocator.h:33:0,
                 from /usr/include/c++/5/bits/allocator.h:46,
                 from /usr/include/c++/5/string:41,
                 from /var/lib/jenkins/workspace/ridCosimulation_development-7CHFDKZ477AWP5WGVIV7ZEYJ7TBQYODTBA2CXNIBOFPOTJGJR3PQ/DSL_SemanticAdaptation/be.uantwerpen.ansymo.semanticadaptation.cg.cpp.tests/target/c-gen-tests/generated/powerwindow_generated/sources/Fmu.cpp:3:
/usr/include/c++/5/ext/new_allocator.h: In instantiation of ‘void __gnu_cxx::new_allocator<_Tp>::construct(_Up*, _Args&& ...) [with _Up = adaptation::WindowSA; _Args = {std::shared_ptr<std::__cxx11::basic_string<char, std::char_traits<char>, std::allocator<char> > >&, std::shared_ptr<std::__cxx11::basic_string<char, std::char_traits<char>, std::allocator<char> > >&, const fmi2CallbackFunctions*&}; _Tp = adaptation::WindowSA]’:
/usr/include/c++/5/bits/alloc_traits.h:530:4:   required from ‘static void std::allocator_traits<std::allocator<_CharT> >::construct(std::allocator_traits<std::allocator<_CharT> >::allocator_type&, _Up*, _Args&& ...) [with _Up = adaptation::WindowSA; _Args = {std::shared_ptr<std::__cxx11::basic_string<char, std::char_traits<char>, std::allocator<char> > >&, std::shared_ptr<std::__cxx11::basic_string<char, std::char_traits<char>, std::allocator<char> > >&, const fmi2CallbackFunctions*&}; _Tp = adaptation::WindowSA; std::allocator_traits<std::allocator<_CharT> >::allocator_type = std::allocator<adaptation::WindowSA>]’
/usr/include/c++/5/bits/shared_ptr_base.h:522:39:   required from ‘std::_Sp_counted_ptr_inplace<_Tp, _Alloc, _Lp>::_Sp_counted_ptr_inplace(_Alloc, _Args&& ...) [with _Args = {std::shared_ptr<std::__cxx11::basic_string<char, std::char_traits<char>, std::allocator<char> > >&, std::shared_ptr<std::__cxx11::basic_string<char, std::char_traits<char>, std::allocator<char> > >&, const fmi2CallbackFunctions*&}; _Tp = adaptation::WindowSA; _Alloc = std::allocator<adaptation::WindowSA>; __gnu_cxx::_Lock_policy _Lp = (__gnu_cxx::_Lock_policy)2u]’
/usr/include/c++/5/bits/shared_ptr_base.h:617:4:   required from ‘std::__shared_count<_Lp>::__shared_count(std::_Sp_make_shared_tag, _Tp*, const _Alloc&, _Args&& ...) [with _Tp = adaptation::WindowSA; _Alloc = std::allocator<adaptation::WindowSA>; _Args = {std::shared_ptr<std::__cxx11::basic_string<char, std::char_traits<char>, std::allocator<char> > >&, std::shared_ptr<std::__cxx11::basic_string<char, std::char_traits<char>, std::allocator<char> > >&, const fmi2CallbackFunctions*&}; __gnu_cxx::_Lock_policy _Lp = (__gnu_cxx::_Lock_policy)2u]’
/usr/include/c++/5/bits/shared_ptr_base.h:1097:35:   required from ‘std::__shared_ptr<_Tp, _Lp>::__shared_ptr(std::_Sp_make_shared_tag, const _Alloc&, _Args&& ...) [with _Alloc = std::allocator<adaptation::WindowSA>; _Args = {std::shared_ptr<std::__cxx11::basic_string<char, std::char_traits<char>, std::allocator<char> > >&, std::shared_ptr<std::__cxx11::basic_string<char, std::char_traits<char>, std::allocator<char> > >&, const fmi2CallbackFunctions*&}; _Tp = adaptation::WindowSA; __gnu_cxx::_Lock_policy _Lp = (__gnu_cxx::_Lock_policy)2u]’
/usr/include/c++/5/bits/shared_ptr.h:319:64:   required from ‘std::shared_ptr<_Tp>::shared_ptr(std::_Sp_make_shared_tag, const _Alloc&, _Args&& ...) [with _Alloc = std::allocator<adaptation::WindowSA>; _Args = {std::shared_ptr<std::__cxx11::basic_string<char, std::char_traits<char>, std::allocator<char> > >&, std::shared_ptr<std::__cxx11::basic_string<char, std::char_traits<char>, std::allocator<char> > >&, const fmi2CallbackFunctions*&}; _Tp = adaptation::WindowSA]’
/usr/include/c++/5/bits/shared_ptr.h:620:39:   required from ‘std::shared_ptr<_Tp1> std::allocate_shared(const _Alloc&, _Args&& ...) [with _Tp = adaptation::WindowSA; _Alloc = std::allocator<adaptation::WindowSA>; _Args = {std::shared_ptr<std::__cxx11::basic_string<char, std::char_traits<char>, std::allocator<char> > >&, std::shared_ptr<std::__cxx11::basic_string<char, std::char_traits<char>, std::allocator<char> > >&, const fmi2CallbackFunctions*&}]’
/usr/include/c++/5/bits/shared_ptr.h:635:39:   required from ‘std::shared_ptr<_Tp1> std::make_shared(_Args&& ...) [with _Tp = adaptation::WindowSA; _Args = {std::shared_ptr<std::__cxx11::basic_string<char, std::char_traits<char>, std::allocator<char> > >&, std::shared_ptr<std::__cxx11::basic_string<char, std::char_traits<char>, std::allocator<char> > >&, const fmi2CallbackFunctions*&}]’
/var/lib/jenkins/workspace/ridCosimulation_development-7CHFDKZ477AWP5WGVIV7ZEYJ7TBQYODTBA2CXNIBOFPOTJGJR3PQ/DSL_SemanticAdaptation/be.uantwerpen.ansymo.semanticadaptation.cg.cpp.tests/target/c-gen-tests/generated/powerwindow_generated/sources/Fmu.cpp:57:79:   required from here
/usr/include/c++/5/ext/new_allocator.h:120:4: error: invalid new-expression of abstract class type ‘adaptation::WindowSA’
  { ::new((void *)__p) _Up(std::forward<_Args>(__args)...); }
    ^
In file included from /var/lib/jenkins/workspace/ridCosimulation_development-7CHFDKZ477AWP5WGVIV7ZEYJ7TBQYODTBA2CXNIBOFPOTJGJR3PQ/DSL_SemanticAdaptation/be.uantwerpen.ansymo.semanticadaptation.cg.cpp.tests/target/c-gen-tests/generated/powerwindow_generated/sources/Fmu.cpp:5:0:
/var/lib/jenkins/workspace/ridCosimulation_development-7CHFDKZ477AWP5WGVIV7ZEYJ7TBQYODTBA2CXNIBOFPOTJGJR3PQ/DSL_SemanticAdaptation/be.uantwerpen.ansymo.semanticadaptation.cg.cpp.tests/target/c-gen-tests/generated/powerwindow_generated/sources/WindowSA.h:31:9: note:   because the following virtual functions are pure within ‘adaptation::WindowSA’:
   class WindowSA : public SemanticAdaptation<WindowSA>, public enable_shared_from_this<WindowSA>
         ^
In file included from /var/lib/jenkins/workspace/ridCosimulation_development-7CHFDKZ477AWP5WGVIV7ZEYJ7TBQYODTBA2CXNIBOFPOTJGJR3PQ/DSL_SemanticAdaptation/be.uantwerpen.ansymo.semanticadaptation.cg.cpp.tests/target/c-gen-tests/generated/powerwindow_generated/sources/WindowSA.h:5:0,
                 from /var/lib/jenkins/workspace/ridCosimulation_development-7CHFDKZ477AWP5WGVIV7ZEYJ7TBQYODTBA2CXNIBOFPOTJGJR3PQ/DSL_SemanticAdaptation/be.uantwerpen.ansymo.semanticadaptation.cg.cpp.tests/target/c-gen-tests/generated/powerwindow_generated/sources/Fmu.cpp:5:
/var/lib/jenkins/workspace/ridCosimulation_development-7CHFDKZ477AWP5WGVIV7ZEYJ7TBQYODTBA2CXNIBOFPOTJGJR3PQ/DSL_SemanticAdaptation/be.uantwerpen.ansymo.semanticadaptation.cg.cpp.tests/target/c-gen-tests/generated/powerwindow_generated/hcf/semantic-adaptation/src/SemanticAdaptation.h:124:23: note: 	void* adaptation::SemanticAdaptation<T>::getInternalFMUState() [with T = adaptation::WindowSA; fmi2FMUstate = void*]
  virtual fmi2FMUstate getInternalFMUState()=0;
                       ^
/var/lib/jenkins/workspace/ridCosimulation_development-7CHFDKZ477AWP5WGVIV7ZEYJ7TBQYODTBA2CXNIBOFPOTJGJR3PQ/DSL_SemanticAdaptation/be.uantwerpen.ansymo.semanticadaptation.cg.cpp.tests/target/c-gen-tests/generated/powerwindow_generated/hcf/semantic-adaptation/src/SemanticAdaptation.h:125:15: note: 	void adaptation::SemanticAdaptation<T>::setInternalFMUState(fmi2FMUstate) [with T = adaptation::WindowSA; fmi2FMUstate = void*]
  virtual void setInternalFMUState(fmi2FMUstate)=0;
               ^
/var/lib/jenkins/workspace/ridCosimulation_development-7CHFDKZ477AWP5WGVIV7ZEYJ7TBQYODTBA2CXNIBOFPOTJGJR3PQ/DSL_SemanticAdaptation/be.uantwerpen.ansymo.semanticadaptation.cg.cpp.tests/target/c-gen-tests/generated/powerwindow_generated/hcf/semantic-adaptation/src/SemanticAdaptation.h:126:15: note: 	void adaptation::SemanticAdaptation<T>::freeInternalFMUState(fmi2FMUstate) [with T = adaptation::WindowSA; fmi2FMUstate = void*]
  virtual void freeInternalFMUState(fmi2FMUstate)=0;
               ^
In file included from /usr/include/x86_64-linux-gnu/c++/5/bits/c++allocator.h:33:0,
                 from /usr/include/c++/5/bits/allocator.h:46,
                 from /usr/include/c++/5/string:41,
                 from /var/lib/jenkins/workspace/ridCosimulation_development-7CHFDKZ477AWP5WGVIV7ZEYJ7TBQYODTBA2CXNIBOFPOTJGJR3PQ/DSL_SemanticAdaptation/be.uantwerpen.ansymo.semanticadaptation.cg.cpp.tests/target/c-gen-tests/generated/powerwindow_generated/sources/Fmu.cpp:3:
/usr/include/c++/5/ext/new_allocator.h: In instantiation of ‘void __gnu_cxx::new_allocator<_Tp>::construct(_Up*, _Args&& ...) [with _Up = adaptation::WindowSA; _Args = {std::shared_ptr<std::__cxx11::basic_string<char, std::char_traits<char>, std::allocator<char> > >&, std::shared_ptr<std::__cxx11::basic_string<char, std::char_traits<char>, std::allocator<char> > >&, const fmi2CallbackFunctions*&}; _Tp = adaptation::WindowSA]’:
/usr/include/c++/5/bits/alloc_traits.h:530:4:   required from ‘static void std::allocator_traits<std::allocator<_CharT> >::construct(std::allocator_traits<std::allocator<_CharT> >::allocator_type&, _Up*, _Args&& ...) [with _Up = adaptation::WindowSA; _Args = {std::shared_ptr<std::__cxx11::basic_string<char, std::char_traits<char>, std::allocator<char> > >&, std::shared_ptr<std::__cxx11::basic_string<char, std::char_traits<char>, std::allocator<char> > >&, const fmi2CallbackFunctions*&}; _Tp = adaptation::WindowSA; std::allocator_traits<std::allocator<_CharT> >::allocator_type = std::allocator<adaptation::WindowSA>]’
/usr/include/c++/5/bits/shared_ptr_base.h:522:39:   required from ‘std::_Sp_counted_ptr_inplace<_Tp, _Alloc, _Lp>::_Sp_counted_ptr_inplace(_Alloc, _Args&& ...) [with _Args = {std::shared_ptr<std::__cxx11::basic_string<char, std::char_traits<char>, std::allocator<char> > >&, std::shared_ptr<std::__cxx11::basic_string<char, std::char_traits<char>, std::allocator<char> > >&, const fmi2CallbackFunctions*&}; _Tp = adaptation::WindowSA; _Alloc = std::allocator<adaptation::WindowSA>; __gnu_cxx::_Lock_policy _Lp = (__gnu_cxx::_Lock_policy)2u]’
/usr/include/c++/5/bits/shared_ptr_base.h:617:4:   required from ‘std::__shared_count<_Lp>::__shared_count(std::_Sp_make_shared_tag, _Tp*, const _Alloc&, _Args&& ...) [with _Tp = adaptation::WindowSA; _Alloc = std::allocator<adaptation::WindowSA>; _Args = {std::shared_ptr<std::__cxx11::basic_string<char, std::char_traits<char>, std::allocator<char> > >&, std::shared_ptr<std::__cxx11::basic_string<char, std::char_traits<char>, std::allocator<char> > >&, const fmi2CallbackFunctions*&}; __gnu_cxx::_Lock_policy _Lp = (__gnu_cxx::_Lock_policy)2u]’
/usr/include/c++/5/bits/shared_ptr_base.h:1097:35:   required from ‘std::__shared_ptr<_Tp, _Lp>::__shared_ptr(std::_Sp_make_shared_tag, const _Alloc&, _Args&& ...) [with _Alloc = std::allocator<adaptation::WindowSA>; _Args = {std::shared_ptr<std::__cxx11::basic_string<char, std::char_traits<char>, std::allocator<char> > >&, std::shared_ptr<std::__cxx11::basic_string<char, std::char_traits<char>, std::allocator<char> > >&, const fmi2CallbackFunctions*&}; _Tp = adaptation::WindowSA; __gnu_cxx::_Lock_policy _Lp = (__gnu_cxx::_Lock_policy)2u]’
/usr/include/c++/5/bits/shared_ptr.h:319:64:   required from ‘std::shared_ptr<_Tp>::shared_ptr(std::_Sp_make_shared_tag, const _Alloc&, _Args&& ...) [with _Alloc = std::allocator<adaptation::WindowSA>; _Args = {std::shared_ptr<std::__cxx11::basic_string<char, std::char_traits<char>, std::allocator<char> > >&, std::shared_ptr<std::__cxx11::basic_string<char, std::char_traits<char>, std::allocator<char> > >&, const fmi2CallbackFunctions*&}; _Tp = adaptation::WindowSA]’
/usr/include/c++/5/bits/shared_ptr.h:620:39:   required from ‘std::shared_ptr<_Tp1> std::allocate_shared(const _Alloc&, _Args&& ...) [with _Tp = adaptation::WindowSA; _Alloc = std::allocator<adaptation::WindowSA>; _Args = {std::shared_ptr<std::__cxx11::basic_string<char, std::char_traits<char>, std::allocator<char> > >&, std::shared_ptr<std::__cxx11::basic_string<char, std::char_traits<char>, std::allocator<char> > >&, const fmi2CallbackFunctions*&}]’
/usr/include/c++/5/bits/shared_ptr.h:635:39:   required from ‘std::shared_ptr<_Tp1> std::make_shared(_Args&& ...) [with _Tp = adaptation::WindowSA; _Args = {std::shared_ptr<std::__cxx11::basic_string<char, std::char_traits<char>, std::allocator<char> > >&, std::shared_ptr<std::__cxx11::basic_string<char, std::char_traits<char>, std::allocator<char> > >&, const fmi2CallbackFunctions*&}]’
/var/lib/jenkins/workspace/ridCosimulation_development-7CHFDKZ477AWP5WGVIV7ZEYJ7TBQYODTBA2CXNIBOFPOTJGJR3PQ/DSL_SemanticAdaptation/be.uantwerpen.ansymo.semanticadaptation.cg.cpp.tests/target/c-gen-tests/generated/powerwindow_generated/sources/Fmu.cpp:57:79:   required from here
/usr/include/c++/5/ext/new_allocator.h:120:4: error: invalid new-expression of abstract class type ‘adaptation::WindowSA’
  { ::new((void *)__p) _Up(std::forward<_Args>(__args)...); }
    ^
In file included from /var/lib/jenkins/workspace/ridCosimulation_development-7CHFDKZ477AWP5WGVIV7ZEYJ7TBQYODTBA2CXNIBOFPOTJGJR3PQ/DSL_SemanticAdaptation/be.uantwerpen.ansymo.semanticadaptation.cg.cpp.tests/target/c-gen-tests/generated/powerwindow_generated/sources/Fmu.cpp:5:0:
/var/lib/jenkins/workspace/ridCosimulation_development-7CHFDKZ477AWP5WGVIV7ZEYJ7TBQYODTBA2CXNIBOFPOTJGJR3PQ/DSL_SemanticAdaptation/be.uantwerpen.ansymo.semanticadaptation.cg.cpp.tests/target/c-gen-tests/generated/powerwindow_generated/sources/WindowSA.h:31:9: note:   because the following virtual functions are pure within ‘adaptation::WindowSA’:
   class WindowSA : public SemanticAdaptation<WindowSA>, public enable_shared_from_this<WindowSA>
         ^
In file included from /var/lib/jenkins/workspace/ridCosimulation_development-7CHFDKZ477AWP5WGVIV7ZEYJ7TBQYODTBA2CXNIBOFPOTJGJR3PQ/DSL_SemanticAdaptation/be.uantwerpen.ansymo.semanticadaptation.cg.cpp.tests/target/c-gen-tests/generated/powerwindow_generated/sources/WindowSA.h:5:0,
                 from /var/lib/jenkins/workspace/ridCosimulation_development-7CHFDKZ477AWP5WGVIV7ZEYJ7TBQYODTBA2CXNIBOFPOTJGJR3PQ/DSL_SemanticAdaptation/be.uantwerpen.ansymo.semanticadaptation.cg.cpp.tests/target/c-gen-tests/generated/powerwindow_generated/sources/Fmu.cpp:5:
/var/lib/jenkins/workspace/ridCosimulation_development-7CHFDKZ477AWP5WGVIV7ZEYJ7TBQYODTBA2CXNIBOFPOTJGJR3PQ/DSL_SemanticAdaptation/be.uantwerpen.ansymo.semanticadaptation.cg.cpp.tests/target/c-gen-tests/generated/powerwindow_generated/hcf/semantic-adaptation/src/SemanticAdaptation.h:124:23: note: 	void* adaptation::SemanticAdaptation<T>::getInternalFMUState() [with T = adaptation::WindowSA; fmi2FMUstate = void*]
  virtual fmi2FMUstate getInternalFMUState()=0;
                       ^
/var/lib/jenkins/workspace/ridCosimulation_development-7CHFDKZ477AWP5WGVIV7ZEYJ7TBQYODTBA2CXNIBOFPOTJGJR3PQ/DSL_SemanticAdaptation/be.uantwerpen.ansymo.semanticadaptation.cg.cpp.tests/target/c-gen-tests/generated/powerwindow_generated/hcf/semantic-adaptation/src/SemanticAdaptation.h:125:15: note: 	void adaptation::SemanticAdaptation<T>::setInternalFMUState(fmi2FMUstate) [with T = adaptation::WindowSA; fmi2FMUstate = void*]
  virtual void setInternalFMUState(fmi2FMUstate)=0;
               ^
/var/lib/jenkins/workspace/ridCosimulation_development-7CHFDKZ477AWP5WGVIV7ZEYJ7TBQYODTBA2CXNIBOFPOTJGJR3PQ/DSL_SemanticAdaptation/be.uantwerpen.ansymo.semanticadaptation.cg.cpp.tests/target/c-gen-tests/generated/powerwindow_generated/hcf/semantic-adaptation/src/SemanticAdaptation.h:126:15: note: 	void adaptation::SemanticAdaptation<T>::freeInternalFMUState(fmi2FMUstate) [with T = adaptation::WindowSA; fmi2FMUstate = void*]
  virtual void freeInternalFMUState(fmi2FMUstate)=0;
               ^
CMakeFiles/powerwindow_generated_main.dir/build.make:86: recipe for target 'CMakeFiles/powerwindow_generated_main.dir/sources/Fmu.cpp.o' failed
make[2]: *** [CMakeFiles/powerwindow_generated_main.dir/sources/Fmu.cpp.o] Error 1
make[2]: *** Waiting for unfinished jobs....
make[2]: *** [CMakeFiles/powerwindow_generated.dir/sources/WindowSA.cpp.o] Error 1
CMakeFiles/powerwindow_generated.dir/build.make:86: recipe for target 'CMakeFiles/powerwindow_generated.dir/sources/WindowSA.cpp.o' failed
make[2]: *** Waiting for unfinished jobs....
CMakeFiles/powerwindow_generated.dir/build.make:62: recipe for target 'CMakeFiles/powerwindow_generated.dir/sources/Fmu.cpp.o' failed
make[2]: *** [CMakeFiles/powerwindow_generated.dir/sources/Fmu.cpp.o] Error 1
make[1]: *** [CMakeFiles/powerwindow_generated.dir/all] Error 2
make[1]: *** Waiting for unfinished jobs....
CMakeFiles/Makefile2:108: recipe for target 'CMakeFiles/powerwindow_generated.dir/all' failed
/var/lib/jenkins/workspace/ridCosimulation_development-7CHFDKZ477AWP5WGVIV7ZEYJ7TBQYODTBA2CXNIBOFPOTJGJR3PQ/DSL_SemanticAdaptation/be.uantwerpen.ansymo.semanticadaptation.cg.cpp.tests/target/c-gen-tests/generated/powerwindow_generated/sources/WindowSA.cpp: In member function ‘std::shared_ptr<std::__cxx11::list<Rule<adaptation::WindowSA>, std::allocator<Rule<adaptation::WindowSA> > > > adaptation::WindowSA::createInputRules()’:
/var/lib/jenkins/workspace/ridCosimulation_development-7CHFDKZ477AWP5WGVIV7ZEYJ7TBQYODTBA2CXNIBOFPOTJGJR3PQ/DSL_SemanticAdaptation/be.uantwerpen.ansymo.semanticadaptation.cg.cpp.tests/target/c-gen-tests/generated/powerwindow_generated/sources/WindowSA.cpp:140:4: error: cannot convert ‘bool (adaptation::WindowSA::*)()’ to ‘bool (adaptation::WindowSA::*)(double, double)’ in initialization
    });
    ^
/var/lib/jenkins/workspace/ridCosimulation_development-7CHFDKZ477AWP5WGVIV7ZEYJ7TBQYODTBA2CXNIBOFPOTJGJR3PQ/DSL_SemanticAdaptation/be.uantwerpen.ansymo.semanticadaptation.cg.cpp.tests/target/c-gen-tests/generated/powerwindow_generated/sources/WindowSA.cpp:140:4: error: cannot convert ‘void (adaptation::WindowSA::*)()’ to ‘void (adaptation::WindowSA::*)(double, double)’ in initialization
/var/lib/jenkins/workspace/ridCosimulation_development-7CHFDKZ477AWP5WGVIV7ZEYJ7TBQYODTBA2CXNIBOFPOTJGJR3PQ/DSL_SemanticAdaptation/be.uantwerpen.ansymo.semanticadaptation.cg.cpp.tests/target/c-gen-tests/generated/powerwindow_generated/sources/WindowSA.cpp:140:4: error: cannot convert ‘void (adaptation::WindowSA::*)()’ to ‘void (adaptation::WindowSA::*)(double, double)’ in initialization
/var/lib/jenkins/workspace/ridCosimulation_development-7CHFDKZ477AWP5WGVIV7ZEYJ7TBQYODTBA2CXNIBOFPOTJGJR3PQ/DSL_SemanticAdaptation/be.uantwerpen.ansymo.semanticadaptation.cg.cpp.tests/target/c-gen-tests/generated/powerwindow_generated/sources/WindowSA.cpp: In member function ‘std::shared_ptr<std::__cxx11::list<Rule<adaptation::WindowSA>, std::allocator<Rule<adaptation::WindowSA> > > > adaptation::WindowSA::createOutputRules()’:
/var/lib/jenkins/workspace/ridCosimulation_development-7CHFDKZ477AWP5WGVIV7ZEYJ7TBQYODTBA2CXNIBOFPOTJGJR3PQ/DSL_SemanticAdaptation/be.uantwerpen.ansymo.semanticadaptation.cg.cpp.tests/target/c-gen-tests/generated/powerwindow_generated/sources/WindowSA.cpp:175:4: error: cannot convert ‘bool (adaptation::WindowSA::*)()’ to ‘bool (adaptation::WindowSA::*)(double, double)’ in initialization
    });
    ^
/var/lib/jenkins/workspace/ridCosimulation_development-7CHFDKZ477AWP5WGVIV7ZEYJ7TBQYODTBA2CXNIBOFPOTJGJR3PQ/DSL_SemanticAdaptation/be.uantwerpen.ansymo.semanticadaptation.cg.cpp.tests/target/c-gen-tests/generated/powerwindow_generated/sources/WindowSA.cpp:175:4: error: cannot convert ‘void (adaptation::WindowSA::*)()’ to ‘void (adaptation::WindowSA::*)(double, double)’ in initialization
/var/lib/jenkins/workspace/ridCosimulation_development-7CHFDKZ477AWP5WGVIV7ZEYJ7TBQYODTBA2CXNIBOFPOTJGJR3PQ/DSL_SemanticAdaptation/be.uantwerpen.ansymo.semanticadaptation.cg.cpp.tests/target/c-gen-tests/generated/powerwindow_generated/sources/WindowSA.cpp:175:4: error: cannot convert ‘void (adaptation::WindowSA::*)()’ to ‘void (adaptation::WindowSA::*)(double, double)’ in initialization
make[2]: *** [CMakeFiles/powerwindow_generated_main.dir/sources/WindowSA.cpp.o] Error 1
CMakeFiles/powerwindow_generated_main.dir/build.make:110: recipe for target 'CMakeFiles/powerwindow_generated_main.dir/sources/WindowSA.cpp.o' failed
make[1]: *** [CMakeFiles/powerwindow_generated_main.dir/all] Error 2
CMakeFiles/Makefile2:69: recipe for target 'CMakeFiles/powerwindow_generated_main.dir/all' failed
Makefile:83: recipe for target 'all' failed
make: *** [all] Error 2
Tests run: 4, Failures: 2, Errors: 0, Skipped: 2, Time elapsed: 45.142 sec <<< FAILURE! - in be.uantwerpen.ansymo.semanticadaptation.cg.cpp.tests.CgCppBasicTest
window_sa_canonical_new(be.uantwerpen.ansymo.semanticadaptation.cg.cpp.tests.CgCppBasicTest)  Time elapsed: 23.038 sec  <<< FAILURE!
java.lang.AssertionError: Could not compile FMU.
	at org.junit.Assert.fail(Assert.java:88)
	at org.junit.Assert.assertTrue(Assert.java:41)
	at be.uantwerpen.ansymo.semanticadaptation.cg.cpp.tests.CgCppBasicTest.__parseNoErrors(CgCppBasicTest.xtend:168)
	at be.uantwerpen.ansymo.semanticadaptation.cg.cpp.tests.CgCppBasicTest.window_sa_canonical_new(CgCppBasicTest.xtend:54)

window_sa_canonical_generated(be.uantwerpen.ansymo.semanticadaptation.cg.cpp.tests.CgCppBasicTest)  Time elapsed: 21.326 sec  <<< FAILURE!
java.lang.AssertionError: Could not compile FMU.
	at org.junit.Assert.fail(Assert.java:88)
	at org.junit.Assert.assertTrue(Assert.java:41)
	at be.uantwerpen.ansymo.semanticadaptation.cg.cpp.tests.CgCppBasicTest.__parseNoErrors(CgCppBasicTest.xtend:168)
	at be.uantwerpen.ansymo.semanticadaptation.cg.cpp.tests.CgCppBasicTest.window_sa_canonical_generated(CgCppBasicTest.xtend:59)

window_sa_canonical(be.uantwerpen.ansymo.semanticadaptation.cg.cpp.tests.CgCppBasicTest) skipped
lazy_sa_canonical(be.uantwerpen.ansymo.semanticadaptation.cg.cpp.tests.CgCppBasicTest) skipped
Running be.uantwerpen.ansymo.semanticadaptation.cg.cpp.tests.CgCppAutoTest
Tests run: 1, Failures: 0, Errors: 0, Skipped: 1, Time elapsed: 0.006 sec - in be.uantwerpen.ansymo.semanticadaptation.cg.cpp.tests.CgCppAutoTest
allSemanticAdaptations[0](be.uantwerpen.ansymo.semanticadaptation.cg.cpp.tests.CgCppAutoTest) skipped

Results :

Failed tests: 
  CgCppBasicTest.window_sa_canonical_new:54->__parseNoErrors:168 Could not compile FMU.
  CgCppBasicTest.window_sa_canonical_generated:59->__parseNoErrors:168 Could not compile FMU.

Tests run: 5, Failures: 2, Errors: 0, Skipped: 3

[INFO] ------------------------------------------------------------------------
[INFO] Reactor Summary:
[INFO] 
[INFO] Semantics Adaptation Root .......................... SUCCESS [  5.137 s]
[INFO] be.uantwerpen.ansymo.semanticadaptation Testframework SUCCESS [ 15.537 s]
[INFO] be.uantwerpen.ansymo.semanticadaptation Logger ..... SUCCESS [  1.275 s]
[INFO] be.uantwerpen.ansymo.semanticadaptation Language Core SUCCESS [ 30.625 s]
[INFO] be.uantwerpen.ansymo.semanticadaptation Canonical Generator SUCCESS [  3.984 s]
[INFO] be.uantwerpen.ansymo.semanticadaptation Code Generation to C++ SUCCESS [  3.116 s]
[INFO] be.uantwerpen.ansymo.semanticadaptation Code Generator SUCCESS [  1.064 s]
[INFO] be.uantwerpen.ansymo.semanticadaptation Language Tests SUCCESS [  6.727 s]
[INFO] be.uantwerpen.ansymo.semanticadaptation.ide ........ SUCCESS [  0.969 s]
[INFO] be.uantwerpen.ansymo.semanticadaptation.ui Language UI SUCCESS [  3.018 s]
[INFO] be.uantwerpen.ansymo.semanticadaptation Code Generation to C++ Tests FAILURE [ 51.234 s]
[INFO] be.uantwerpen.ansymo.semanticadaptation Canonical Tests SKIPPED
[INFO] Feature ............................................ SKIPPED
[INFO] Core ............................................... SKIPPED
[INFO] Semantics Adaptation IDE Eclipse repository ........ SKIPPED
[INFO] ------------------------------------------------------------------------
[INFO] BUILD FAILURE
[INFO] ------------------------------------------------------------------------
[INFO] Total time: 05:13 min
[INFO] Finished at: 2018-01-01T18:31:37+01:00
[INFO] Final Memory: 253M/951M
[INFO] ------------------------------------------------------------------------
[jenkins-maven-event-spy] INFO generated /var/lib/jenkins/workspace/ridCosimulation_development-7CHFDKZ477AWP5WGVIV7ZEYJ7TBQYODTBA2CXNIBOFPOTJGJR3PQ@tmp/withMavenfaf20857/maven-spy-20180101-182624-3455018670684236233743.log
[ERROR] Failed to execute goal org.eclipse.tycho:tycho-surefire-plugin:1.0.0:test (default-test) on project be.uantwerpen.ansymo.semanticadaptation.cg.cpp.tests: There are test failures.
[ERROR] 
[ERROR] Please refer to /var/lib/jenkins/workspace/ridCosimulation_development-7CHFDKZ477AWP5WGVIV7ZEYJ7TBQYODTBA2CXNIBOFPOTJGJR3PQ/DSL_SemanticAdaptation/be.uantwerpen.ansymo.semanticadaptation.cg.cpp.tests/target/surefire-reports for the individual test results.
[ERROR] -> [Help 1]
[ERROR] 
[ERROR] To see the full stack trace of the errors, re-run Maven with the -e switch.
[ERROR] Re-run Maven using the -X switch to enable full debug logging.
[ERROR] 
[ERROR] For more information about the errors and possible solutions, please read the following articles:
[ERROR] [Help 1] http://cwiki.apache.org/confluence/display/MAVEN/MojoFailureException
[ERROR] 
[ERROR] After correcting the problems, you can resume the build with the command
[ERROR]   mvn <goals> -rf :be.uantwerpen.ansymo.semanticadaptation.cg.cpp.tests
[Pipeline] }
[withMaven] artifactsPublisher - Archive artifact DSL_SemanticAdaptation/pom.xml under be/uantwerpen/ansymo/semanticadaptation/parent/1.0.0-SNAPSHOT/parent-1.0.0-SNAPSHOT.pom
[withMaven] artifactsPublisher - Archive artifact DSL_SemanticAdaptation/be.uantwerpen.ansymo.semanticadaptation.testframework/pom.xml under be/uantwerpen/ansymo/semanticadaptation/be.uantwerpen.ansymo.semanticadaptation.testframework/1.0.0-SNAPSHOT/be.uantwerpen.ansymo.semanticadaptation.testframework-1.0.0-SNAPSHOT.pom
[withMaven] artifactsPublisher - Archive artifact DSL_SemanticAdaptation/be.uantwerpen.ansymo.semanticadaptation.testframework/target/be.uantwerpen.ansymo.semanticadaptation.testframework-1.0.0-SNAPSHOT.jar under be/uantwerpen/ansymo/semanticadaptation/be.uantwerpen.ansymo.semanticadaptation.testframework/1.0.0-SNAPSHOT/be.uantwerpen.ansymo.semanticadaptation.testframework-1.0.0-SNAPSHOT.jar
[withMaven] artifactsPublisher - Archive artifact DSL_SemanticAdaptation/be.uantwerpen.ansymo.semanticadaptation.log/pom.xml under be/uantwerpen/ansymo/semanticadaptation/be.uantwerpen.ansymo.semanticadaptation.log/1.0.0-SNAPSHOT/be.uantwerpen.ansymo.semanticadaptation.log-1.0.0-SNAPSHOT.pom
[withMaven] artifactsPublisher - Archive artifact DSL_SemanticAdaptation/be.uantwerpen.ansymo.semanticadaptation.log/target/be.uantwerpen.ansymo.semanticadaptation.log-1.0.0-SNAPSHOT.jar under be/uantwerpen/ansymo/semanticadaptation/be.uantwerpen.ansymo.semanticadaptation.log/1.0.0-SNAPSHOT/be.uantwerpen.ansymo.semanticadaptation.log-1.0.0-SNAPSHOT.jar
[withMaven] artifactsPublisher - Archive artifact DSL_SemanticAdaptation/be.uantwerpen.ansymo.semanticadaptation/pom.xml under be/uantwerpen/ansymo/semanticadaptation/be.uantwerpen.ansymo.semanticadaptation/1.0.0-SNAPSHOT/be.uantwerpen.ansymo.semanticadaptation-1.0.0-SNAPSHOT.pom
[withMaven] artifactsPublisher - Archive artifact DSL_SemanticAdaptation/be.uantwerpen.ansymo.semanticadaptation/target/be.uantwerpen.ansymo.semanticadaptation-1.0.0-SNAPSHOT.jar under be/uantwerpen/ansymo/semanticadaptation/be.uantwerpen.ansymo.semanticadaptation/1.0.0-SNAPSHOT/be.uantwerpen.ansymo.semanticadaptation-1.0.0-SNAPSHOT.jar
[withMaven] artifactsPublisher - Archive artifact DSL_SemanticAdaptation/be.uantwerpen.ansymo.semanticadaptation.cg.canonical/pom.xml under be/uantwerpen/ansymo/semanticadaptation/be.uantwerpen.ansymo.semanticadaptation.cg.canonical/1.0.0-SNAPSHOT/be.uantwerpen.ansymo.semanticadaptation.cg.canonical-1.0.0-SNAPSHOT.pom
[withMaven] artifactsPublisher - Archive artifact DSL_SemanticAdaptation/be.uantwerpen.ansymo.semanticadaptation.cg.canonical/target/be.uantwerpen.ansymo.semanticadaptation.cg.canonical-1.0.0-SNAPSHOT.jar under be/uantwerpen/ansymo/semanticadaptation/be.uantwerpen.ansymo.semanticadaptation.cg.canonical/1.0.0-SNAPSHOT/be.uantwerpen.ansymo.semanticadaptation.cg.canonical-1.0.0-SNAPSHOT.jar
[withMaven] artifactsPublisher - Archive artifact DSL_SemanticAdaptation/be.uantwerpen.ansymo.semanticadaptation.cg.cpp/pom.xml under be/uantwerpen/ansymo/semanticadaptation/be.uantwerpen.ansymo.semanticadaptation.cg.cpp/1.0.0-SNAPSHOT/be.uantwerpen.ansymo.semanticadaptation.cg.cpp-1.0.0-SNAPSHOT.pom
[withMaven] artifactsPublisher - Archive artifact DSL_SemanticAdaptation/be.uantwerpen.ansymo.semanticadaptation.cg.cpp/target/be.uantwerpen.ansymo.semanticadaptation.cg.cpp-1.0.0-SNAPSHOT.jar under be/uantwerpen/ansymo/semanticadaptation/be.uantwerpen.ansymo.semanticadaptation.cg.cpp/1.0.0-SNAPSHOT/be.uantwerpen.ansymo.semanticadaptation.cg.cpp-1.0.0-SNAPSHOT.jar
[withMaven] artifactsPublisher - Archive artifact DSL_SemanticAdaptation/be.uantwerpen.ansymo.semanticadaptation.cg.chain/pom.xml under be/uantwerpen/ansymo/semanticadaptation/be.uantwerpen.ansymo.semanticadaptation.cg.chain/1.0.0-SNAPSHOT/be.uantwerpen.ansymo.semanticadaptation.cg.chain-1.0.0-SNAPSHOT.pom
[withMaven] artifactsPublisher - Archive artifact DSL_SemanticAdaptation/be.uantwerpen.ansymo.semanticadaptation.cg.chain/target/be.uantwerpen.ansymo.semanticadaptation.cg.chain-1.0.0-SNAPSHOT.jar under be/uantwerpen/ansymo/semanticadaptation/be.uantwerpen.ansymo.semanticadaptation.cg.chain/1.0.0-SNAPSHOT/be.uantwerpen.ansymo.semanticadaptation.cg.chain-1.0.0-SNAPSHOT.jar
[withMaven] artifactsPublisher - Archive artifact DSL_SemanticAdaptation/be.uantwerpen.ansymo.semanticadaptation.tests/pom.xml under be/uantwerpen/ansymo/semanticadaptation/be.uantwerpen.ansymo.semanticadaptation.tests/1.0.0-SNAPSHOT/be.uantwerpen.ansymo.semanticadaptation.tests-1.0.0-SNAPSHOT.pom
[withMaven] artifactsPublisher - Archive artifact DSL_SemanticAdaptation/be.uantwerpen.ansymo.semanticadaptation.tests/target/be.uantwerpen.ansymo.semanticadaptation.tests-1.0.0-SNAPSHOT.jar under be/uantwerpen/ansymo/semanticadaptation/be.uantwerpen.ansymo.semanticadaptation.tests/1.0.0-SNAPSHOT/be.uantwerpen.ansymo.semanticadaptation.tests-1.0.0-SNAPSHOT.jar
[withMaven] artifactsPublisher - Archive artifact DSL_SemanticAdaptation/be.uantwerpen.ansymo.semanticadaptation.ide/pom.xml under be/uantwerpen/ansymo/semanticadaptation/be.uantwerpen.ansymo.semanticadaptation.ide/1.0.0-SNAPSHOT/be.uantwerpen.ansymo.semanticadaptation.ide-1.0.0-SNAPSHOT.pom
[withMaven] artifactsPublisher - Archive artifact DSL_SemanticAdaptation/be.uantwerpen.ansymo.semanticadaptation.ide/target/be.uantwerpen.ansymo.semanticadaptation.ide-1.0.0-SNAPSHOT.jar under be/uantwerpen/ansymo/semanticadaptation/be.uantwerpen.ansymo.semanticadaptation.ide/1.0.0-SNAPSHOT/be.uantwerpen.ansymo.semanticadaptation.ide-1.0.0-SNAPSHOT.jar
[withMaven] artifactsPublisher - Archive artifact DSL_SemanticAdaptation/be.uantwerpen.ansymo.semanticadaptation.ui/pom.xml under be/uantwerpen/ansymo/semanticadaptation/be.uantwerpen.ansymo.semanticadaptation.ui/1.0.0-SNAPSHOT/be.uantwerpen.ansymo.semanticadaptation.ui-1.0.0-SNAPSHOT.pom
[withMaven] artifactsPublisher - Archive artifact DSL_SemanticAdaptation/be.uantwerpen.ansymo.semanticadaptation.ui/target/be.uantwerpen.ansymo.semanticadaptation.ui-1.0.0-SNAPSHOT.jar under be/uantwerpen/ansymo/semanticadaptation/be.uantwerpen.ansymo.semanticadaptation.ui/1.0.0-SNAPSHOT/be.uantwerpen.ansymo.semanticadaptation.ui-1.0.0-SNAPSHOT.jar
[withMaven] artifactsPublisher - Archive artifact DSL_SemanticAdaptation/be.uantwerpen.ansymo.semanticadaptation.testframework/target/p2content.xml under be/uantwerpen/ansymo/semanticadaptation/be.uantwerpen.ansymo.semanticadaptation.testframework/1.0.0-SNAPSHOT/be.uantwerpen.ansymo.semanticadaptation.testframework-1.0.0-SNAPSHOT-p2metadata.xml
[withMaven] artifactsPublisher - Archive artifact DSL_SemanticAdaptation/be.uantwerpen.ansymo.semanticadaptation.testframework/target/p2artifacts.xml under be/uantwerpen/ansymo/semanticadaptation/be.uantwerpen.ansymo.semanticadaptation.testframework/1.0.0-SNAPSHOT/be.uantwerpen.ansymo.semanticadaptation.testframework-1.0.0-SNAPSHOT-p2artifacts.xml
[withMaven] artifactsPublisher - Archive artifact DSL_SemanticAdaptation/be.uantwerpen.ansymo.semanticadaptation.log/target/p2content.xml under be/uantwerpen/ansymo/semanticadaptation/be.uantwerpen.ansymo.semanticadaptation.log/1.0.0-SNAPSHOT/be.uantwerpen.ansymo.semanticadaptation.log-1.0.0-SNAPSHOT-p2metadata.xml
[withMaven] artifactsPublisher - Archive artifact DSL_SemanticAdaptation/be.uantwerpen.ansymo.semanticadaptation.log/target/p2artifacts.xml under be/uantwerpen/ansymo/semanticadaptation/be.uantwerpen.ansymo.semanticadaptation.log/1.0.0-SNAPSHOT/be.uantwerpen.ansymo.semanticadaptation.log-1.0.0-SNAPSHOT-p2artifacts.xml
[withMaven] artifactsPublisher - Archive artifact DSL_SemanticAdaptation/be.uantwerpen.ansymo.semanticadaptation/target/p2content.xml under be/uantwerpen/ansymo/semanticadaptation/be.uantwerpen.ansymo.semanticadaptation/1.0.0-SNAPSHOT/be.uantwerpen.ansymo.semanticadaptation-1.0.0-SNAPSHOT-p2metadata.xml
[withMaven] artifactsPublisher - Archive artifact DSL_SemanticAdaptation/be.uantwerpen.ansymo.semanticadaptation/target/p2artifacts.xml under be/uantwerpen/ansymo/semanticadaptation/be.uantwerpen.ansymo.semanticadaptation/1.0.0-SNAPSHOT/be.uantwerpen.ansymo.semanticadaptation-1.0.0-SNAPSHOT-p2artifacts.xml
[withMaven] artifactsPublisher - Archive artifact DSL_SemanticAdaptation/be.uantwerpen.ansymo.semanticadaptation.cg.canonical/target/p2content.xml under be/uantwerpen/ansymo/semanticadaptation/be.uantwerpen.ansymo.semanticadaptation.cg.canonical/1.0.0-SNAPSHOT/be.uantwerpen.ansymo.semanticadaptation.cg.canonical-1.0.0-SNAPSHOT-p2metadata.xml
[withMaven] artifactsPublisher - Archive artifact DSL_SemanticAdaptation/be.uantwerpen.ansymo.semanticadaptation.cg.canonical/target/p2artifacts.xml under be/uantwerpen/ansymo/semanticadaptation/be.uantwerpen.ansymo.semanticadaptation.cg.canonical/1.0.0-SNAPSHOT/be.uantwerpen.ansymo.semanticadaptation.cg.canonical-1.0.0-SNAPSHOT-p2artifacts.xml
[withMaven] artifactsPublisher - Archive artifact DSL_SemanticAdaptation/be.uantwerpen.ansymo.semanticadaptation.cg.cpp/target/p2content.xml under be/uantwerpen/ansymo/semanticadaptation/be.uantwerpen.ansymo.semanticadaptation.cg.cpp/1.0.0-SNAPSHOT/be.uantwerpen.ansymo.semanticadaptation.cg.cpp-1.0.0-SNAPSHOT-p2metadata.xml
[withMaven] artifactsPublisher - Archive artifact DSL_SemanticAdaptation/be.uantwerpen.ansymo.semanticadaptation.cg.cpp/target/p2artifacts.xml under be/uantwerpen/ansymo/semanticadaptation/be.uantwerpen.ansymo.semanticadaptation.cg.cpp/1.0.0-SNAPSHOT/be.uantwerpen.ansymo.semanticadaptation.cg.cpp-1.0.0-SNAPSHOT-p2artifacts.xml
[withMaven] artifactsPublisher - Archive artifact DSL_SemanticAdaptation/be.uantwerpen.ansymo.semanticadaptation.cg.chain/target/p2content.xml under be/uantwerpen/ansymo/semanticadaptation/be.uantwerpen.ansymo.semanticadaptation.cg.chain/1.0.0-SNAPSHOT/be.uantwerpen.ansymo.semanticadaptation.cg.chain-1.0.0-SNAPSHOT-p2metadata.xml
[withMaven] artifactsPublisher - Archive artifact DSL_SemanticAdaptation/be.uantwerpen.ansymo.semanticadaptation.cg.chain/target/p2artifacts.xml under be/uantwerpen/ansymo/semanticadaptation/be.uantwerpen.ansymo.semanticadaptation.cg.chain/1.0.0-SNAPSHOT/be.uantwerpen.ansymo.semanticadaptation.cg.chain-1.0.0-SNAPSHOT-p2artifacts.xml
[withMaven] artifactsPublisher - Archive artifact DSL_SemanticAdaptation/be.uantwerpen.ansymo.semanticadaptation.tests/target/p2content.xml under be/uantwerpen/ansymo/semanticadaptation/be.uantwerpen.ansymo.semanticadaptation.tests/1.0.0-SNAPSHOT/be.uantwerpen.ansymo.semanticadaptation.tests-1.0.0-SNAPSHOT-p2metadata.xml
[withMaven] artifactsPublisher - Archive artifact DSL_SemanticAdaptation/be.uantwerpen.ansymo.semanticadaptation.tests/target/p2artifacts.xml under be/uantwerpen/ansymo/semanticadaptation/be.uantwerpen.ansymo.semanticadaptation.tests/1.0.0-SNAPSHOT/be.uantwerpen.ansymo.semanticadaptation.tests-1.0.0-SNAPSHOT-p2artifacts.xml
[withMaven] artifactsPublisher - Archive artifact DSL_SemanticAdaptation/be.uantwerpen.ansymo.semanticadaptation.ide/target/p2content.xml under be/uantwerpen/ansymo/semanticadaptation/be.uantwerpen.ansymo.semanticadaptation.ide/1.0.0-SNAPSHOT/be.uantwerpen.ansymo.semanticadaptation.ide-1.0.0-SNAPSHOT-p2metadata.xml
[withMaven] artifactsPublisher - Archive artifact DSL_SemanticAdaptation/be.uantwerpen.ansymo.semanticadaptation.ide/target/p2artifacts.xml under be/uantwerpen/ansymo/semanticadaptation/be.uantwerpen.ansymo.semanticadaptation.ide/1.0.0-SNAPSHOT/be.uantwerpen.ansymo.semanticadaptation.ide-1.0.0-SNAPSHOT-p2artifacts.xml
[withMaven] artifactsPublisher - Archive artifact DSL_SemanticAdaptation/be.uantwerpen.ansymo.semanticadaptation.ui/target/p2content.xml under be/uantwerpen/ansymo/semanticadaptation/be.uantwerpen.ansymo.semanticadaptation.ui/1.0.0-SNAPSHOT/be.uantwerpen.ansymo.semanticadaptation.ui-1.0.0-SNAPSHOT-p2metadata.xml
[withMaven] artifactsPublisher - Archive artifact DSL_SemanticAdaptation/be.uantwerpen.ansymo.semanticadaptation.ui/target/p2artifacts.xml under be/uantwerpen/ansymo/semanticadaptation/be.uantwerpen.ansymo.semanticadaptation.ui/1.0.0-SNAPSHOT/be.uantwerpen.ansymo.semanticadaptation.ui-1.0.0-SNAPSHOT-p2artifacts.xml
[TASKS] Scanning folder '/var/lib/jenkins/workspace/ridCosimulation_development-7CHFDKZ477AWP5WGVIV7ZEYJ7TBQYODTBA2CXNIBOFPOTJGJR3PQ' for files matching the pattern '**/*.java' - excludes: null
[TASKS] Found 416 files to scan for tasks
[TASKS] Found 27 open tasks.
Skipping warnings blame since pipelines do not have an SCM link.%n
[TASKS] Computing warning deltas based on reference build #18
[Pipeline] // withMaven
[Pipeline] }
[Pipeline] // stage
[Pipeline] stage
[Pipeline] { (Reporting)
[Pipeline] emailextrecipients
Not sending mail to user cla.gms@gmail.com with no permission to view HybridCosimulation » development #19[Pipeline] emailext
An attempt to send an e-mail to empty list of recipients, ignored.
[Pipeline] }
[Pipeline] // stage
[Pipeline] }
[Pipeline] // node
[Pipeline] End of Pipeline
ERROR: script returned exit code 1
Finished: FAILURE