FailedConsole Output

Skipping 5,678 KB.. Full Log
B56LP46DTRNYHQSCKMS3FR4JD6RBBK6S2LPONMGDZRBJQH3A/DSL_SemanticAdaptation/be.uantwerpen.ansymo.semanticadaptation.ui/src/test/java]' does not exists.
[INFO] 
[INFO] --- maven-resources-plugin:2.4.3:testResources (default-testResources) @ be.uantwerpen.ansymo.semanticadaptation.ui ---
[INFO] Using 'UTF-8' encoding to copy filtered resources.
[INFO] skip non existing resourceDirectory /var/lib/jenkins/workspace/HybridCosimulation_master-LDEVB56LP46DTRNYHQSCKMS3FR4JD6RBBK6S2LPONMGDZRBJQH3A/DSL_SemanticAdaptation/be.uantwerpen.ansymo.semanticadaptation.ui/src/test/resources
[INFO] 
[INFO] --- xtend-maven-plugin:2.11.0:xtend-test-install-debug-info (default) @ be.uantwerpen.ansymo.semanticadaptation.ui ---
[WARNING] Directory /var/lib/jenkins/workspace/HybridCosimulation_master-LDEVB56LP46DTRNYHQSCKMS3FR4JD6RBBK6S2LPONMGDZRBJQH3A/DSL_SemanticAdaptation/be.uantwerpen.ansymo.semanticadaptation.ui/src/test/java is empty. Can't process.
[WARNING] Directory /var/lib/jenkins/workspace/HybridCosimulation_master-LDEVB56LP46DTRNYHQSCKMS3FR4JD6RBBK6S2LPONMGDZRBJQH3A/DSL_SemanticAdaptation/be.uantwerpen.ansymo.semanticadaptation.ui/target/xtend-gen/test is empty. Can't process.
[INFO] Installing Xtend files into 0 class files as primary debug sources in: /var/lib/jenkins/workspace/HybridCosimulation_master-LDEVB56LP46DTRNYHQSCKMS3FR4JD6RBBK6S2LPONMGDZRBJQH3A/DSL_SemanticAdaptation/be.uantwerpen.ansymo.semanticadaptation.ui/target/test-classes
[INFO] 
[INFO] --- target-platform-configuration:1.0.0:target-platform (default-target-platform) @ be.uantwerpen.ansymo.semanticadaptation.ui ---
[INFO] 
[INFO] --- tycho-packaging-plugin:1.0.0:package-plugin (default-package-plugin) @ be.uantwerpen.ansymo.semanticadaptation.ui ---
[INFO] Building jar: /var/lib/jenkins/workspace/HybridCosimulation_master-LDEVB56LP46DTRNYHQSCKMS3FR4JD6RBBK6S2LPONMGDZRBJQH3A/DSL_SemanticAdaptation/be.uantwerpen.ansymo.semanticadaptation.ui/target/be.uantwerpen.ansymo.semanticadaptation.ui-1.0.0-SNAPSHOT.jar
[INFO] 
[INFO] --- tycho-p2-plugin:1.0.0:p2-metadata-default (default-p2-metadata-default) @ be.uantwerpen.ansymo.semanticadaptation.ui ---
[INFO] 
[INFO] --- maven-install-plugin:2.3.1:install (default-install) @ be.uantwerpen.ansymo.semanticadaptation.ui ---
[INFO] Installing /var/lib/jenkins/workspace/HybridCosimulation_master-LDEVB56LP46DTRNYHQSCKMS3FR4JD6RBBK6S2LPONMGDZRBJQH3A/DSL_SemanticAdaptation/be.uantwerpen.ansymo.semanticadaptation.ui/target/be.uantwerpen.ansymo.semanticadaptation.ui-1.0.0-SNAPSHOT.jar to /var/lib/jenkins/workspace/HybridCosimulation_master-LDEVB56LP46DTRNYHQSCKMS3FR4JD6RBBK6S2LPONMGDZRBJQH3A/.repository/be/uantwerpen/ansymo/semanticadaptation/be.uantwerpen.ansymo.semanticadaptation.ui/1.0.0-SNAPSHOT/be.uantwerpen.ansymo.semanticadaptation.ui-1.0.0-SNAPSHOT.jar
[INFO] Installing /var/lib/jenkins/workspace/HybridCosimulation_master-LDEVB56LP46DTRNYHQSCKMS3FR4JD6RBBK6S2LPONMGDZRBJQH3A/DSL_SemanticAdaptation/be.uantwerpen.ansymo.semanticadaptation.ui/pom.xml to /var/lib/jenkins/workspace/HybridCosimulation_master-LDEVB56LP46DTRNYHQSCKMS3FR4JD6RBBK6S2LPONMGDZRBJQH3A/.repository/be/uantwerpen/ansymo/semanticadaptation/be.uantwerpen.ansymo.semanticadaptation.ui/1.0.0-SNAPSHOT/be.uantwerpen.ansymo.semanticadaptation.ui-1.0.0-SNAPSHOT.pom
[INFO] Installing /var/lib/jenkins/workspace/HybridCosimulation_master-LDEVB56LP46DTRNYHQSCKMS3FR4JD6RBBK6S2LPONMGDZRBJQH3A/DSL_SemanticAdaptation/be.uantwerpen.ansymo.semanticadaptation.ui/target/p2content.xml to /var/lib/jenkins/workspace/HybridCosimulation_master-LDEVB56LP46DTRNYHQSCKMS3FR4JD6RBBK6S2LPONMGDZRBJQH3A/.repository/be/uantwerpen/ansymo/semanticadaptation/be.uantwerpen.ansymo.semanticadaptation.ui/1.0.0-SNAPSHOT/be.uantwerpen.ansymo.semanticadaptation.ui-1.0.0-SNAPSHOT-p2metadata.xml
[INFO] Installing /var/lib/jenkins/workspace/HybridCosimulation_master-LDEVB56LP46DTRNYHQSCKMS3FR4JD6RBBK6S2LPONMGDZRBJQH3A/DSL_SemanticAdaptation/be.uantwerpen.ansymo.semanticadaptation.ui/target/p2artifacts.xml to /var/lib/jenkins/workspace/HybridCosimulation_master-LDEVB56LP46DTRNYHQSCKMS3FR4JD6RBBK6S2LPONMGDZRBJQH3A/.repository/be/uantwerpen/ansymo/semanticadaptation/be.uantwerpen.ansymo.semanticadaptation.ui/1.0.0-SNAPSHOT/be.uantwerpen.ansymo.semanticadaptation.ui-1.0.0-SNAPSHOT-p2artifacts.xml
[INFO] 
[INFO] --- tycho-p2-plugin:1.0.0:update-local-index (default-update-local-index) @ be.uantwerpen.ansymo.semanticadaptation.ui ---
[INFO]                                                                         
[INFO] ------------------------------------------------------------------------
[INFO] Building be.uantwerpen.ansymo.semanticadaptation Code Generation to C++ 1.0.0-SNAPSHOT
[INFO] ------------------------------------------------------------------------
[INFO] 
[INFO] --- tycho-packaging-plugin:1.0.0:build-qualifier (default-build-qualifier) @ be.uantwerpen.ansymo.semanticadaptation.cg.cpp ---
[INFO] The project's OSGi version is 1.0.0.201706280753
[INFO] 
[INFO] --- tycho-packaging-plugin:1.0.0:validate-id (default-validate-id) @ be.uantwerpen.ansymo.semanticadaptation.cg.cpp ---
[INFO] 
[INFO] --- tycho-packaging-plugin:1.0.0:validate-version (default-validate-version) @ be.uantwerpen.ansymo.semanticadaptation.cg.cpp ---
[INFO] 
[INFO] --- xtend-maven-plugin:2.11.0:compile (default) @ be.uantwerpen.ansymo.semanticadaptation.cg.cpp ---
[WARNING] 
WARNING: 	RulesConditionSwitch.xtend - /var/lib/jenkins/workspace/HybridCosimulation_master-LDEVB56LP46DTRNYHQSCKMS3FR4JD6RBBK6S2LPONMGDZRBJQH3A/DSL_SemanticAdaptation/be.uantwerpen.ansymo.semanticadaptation.cg.cpp/src/be/uantwerpen/ansymo/semanticadaptation/cg/cpp/generation/RulesConditionSwitch.xtend
35: The import 'be.uantwerpen.ansymo.semanticadaptation.cg.cpp.exceptions.TypeException' is never used.
[WARNING] 
WARNING: 	CppGenerator.xtend - /var/lib/jenkins/workspace/HybridCosimulation_master-LDEVB56LP46DTRNYHQSCKMS3FR4JD6RBBK6S2LPONMGDZRBJQH3A/DSL_SemanticAdaptation/be.uantwerpen.ansymo.semanticadaptation.cg.cpp/src/be/uantwerpen/ansymo/semanticadaptation/cg/cpp/generation/CppGenerator.xtend
27: The import 'be.uantwerpen.ansymo.semanticadaptation.cg.cpp.data.RulesBlockResult' is never used.
[INFO] 
[INFO] --- maven-resources-plugin:2.4.3:resources (default-resources) @ be.uantwerpen.ansymo.semanticadaptation.cg.cpp ---
[INFO] Using 'UTF-8' encoding to copy filtered resources.
[INFO] skip non existing resourceDirectory /var/lib/jenkins/workspace/HybridCosimulation_master-LDEVB56LP46DTRNYHQSCKMS3FR4JD6RBBK6S2LPONMGDZRBJQH3A/DSL_SemanticAdaptation/be.uantwerpen.ansymo.semanticadaptation.cg.cpp/src/main/resources
[INFO] 
[INFO] --- tycho-compiler-plugin:1.0.0:compile (default-compile) @ be.uantwerpen.ansymo.semanticadaptation.cg.cpp ---
[WARNING] Parameter 'useProjectSettings' is set to true, but preferences file '/var/lib/jenkins/workspace/HybridCosimulation_master-LDEVB56LP46DTRNYHQSCKMS3FR4JD6RBBK6S2LPONMGDZRBJQH3A/DSL_SemanticAdaptation/be.uantwerpen.ansymo.semanticadaptation.cg.cpp/.settings/org.eclipse.jdt.core.prefs' could not be found!
[INFO] Compiling 28 source files to /var/lib/jenkins/workspace/HybridCosimulation_master-LDEVB56LP46DTRNYHQSCKMS3FR4JD6RBBK6S2LPONMGDZRBJQH3A/DSL_SemanticAdaptation/be.uantwerpen.ansymo.semanticadaptation.cg.cpp/target/classes
[WARNING] Source directory /var/lib/jenkins/workspace/HybridCosimulation_master-LDEVB56LP46DTRNYHQSCKMS3FR4JD6RBBK6S2LPONMGDZRBJQH3A/DSL_SemanticAdaptation/be.uantwerpen.ansymo.semanticadaptation.cg.cpp/src-gen does not exist
[INFO] 
[INFO] --- xtend-maven-plugin:2.11.0:xtend-install-debug-info (default) @ be.uantwerpen.ansymo.semanticadaptation.cg.cpp ---
[WARNING] Directory /var/lib/jenkins/workspace/HybridCosimulation_master-LDEVB56LP46DTRNYHQSCKMS3FR4JD6RBBK6S2LPONMGDZRBJQH3A/DSL_SemanticAdaptation/be.uantwerpen.ansymo.semanticadaptation.cg.cpp/src/main/java is empty. Can't process.
[WARNING] Directory /var/lib/jenkins/workspace/HybridCosimulation_master-LDEVB56LP46DTRNYHQSCKMS3FR4JD6RBBK6S2LPONMGDZRBJQH3A/DSL_SemanticAdaptation/be.uantwerpen.ansymo.semanticadaptation.cg.cpp/src-gen is empty. Can't process.
[INFO] Installing Xtend files into 21 class files as primary debug sources in: /var/lib/jenkins/workspace/HybridCosimulation_master-LDEVB56LP46DTRNYHQSCKMS3FR4JD6RBBK6S2LPONMGDZRBJQH3A/DSL_SemanticAdaptation/be.uantwerpen.ansymo.semanticadaptation.cg.cpp/target/classes
[INFO] 
[INFO] --- xtend-maven-plugin:2.11.0:testCompile (default) @ be.uantwerpen.ansymo.semanticadaptation.cg.cpp ---
[INFO] skip compiling sources because the configured directory '[/var/lib/jenkins/workspace/HybridCosimulation_master-LDEVB56LP46DTRNYHQSCKMS3FR4JD6RBBK6S2LPONMGDZRBJQH3A/DSL_SemanticAdaptation/be.uantwerpen.ansymo.semanticadaptation.cg.cpp/src/test/java]' does not exists.
[INFO] 
[INFO] --- maven-resources-plugin:2.4.3:testResources (default-testResources) @ be.uantwerpen.ansymo.semanticadaptation.cg.cpp ---
[INFO] Using 'UTF-8' encoding to copy filtered resources.
[INFO] skip non existing resourceDirectory /var/lib/jenkins/workspace/HybridCosimulation_master-LDEVB56LP46DTRNYHQSCKMS3FR4JD6RBBK6S2LPONMGDZRBJQH3A/DSL_SemanticAdaptation/be.uantwerpen.ansymo.semanticadaptation.cg.cpp/src/test/resources
[INFO] 
[INFO] --- xtend-maven-plugin:2.11.0:xtend-test-install-debug-info (default) @ be.uantwerpen.ansymo.semanticadaptation.cg.cpp ---
[WARNING] Directory /var/lib/jenkins/workspace/HybridCosimulation_master-LDEVB56LP46DTRNYHQSCKMS3FR4JD6RBBK6S2LPONMGDZRBJQH3A/DSL_SemanticAdaptation/be.uantwerpen.ansymo.semanticadaptation.cg.cpp/src/test/java is empty. Can't process.
[WARNING] Directory /var/lib/jenkins/workspace/HybridCosimulation_master-LDEVB56LP46DTRNYHQSCKMS3FR4JD6RBBK6S2LPONMGDZRBJQH3A/DSL_SemanticAdaptation/be.uantwerpen.ansymo.semanticadaptation.cg.cpp/target/xtend-gen/test is empty. Can't process.
[INFO] Installing Xtend files into 0 class files as primary debug sources in: /var/lib/jenkins/workspace/HybridCosimulation_master-LDEVB56LP46DTRNYHQSCKMS3FR4JD6RBBK6S2LPONMGDZRBJQH3A/DSL_SemanticAdaptation/be.uantwerpen.ansymo.semanticadaptation.cg.cpp/target/test-classes
[INFO] 
[INFO] --- target-platform-configuration:1.0.0:target-platform (default-target-platform) @ be.uantwerpen.ansymo.semanticadaptation.cg.cpp ---
[INFO] 
[INFO] --- tycho-packaging-plugin:1.0.0:package-plugin (default-package-plugin) @ be.uantwerpen.ansymo.semanticadaptation.cg.cpp ---
[INFO] Building jar: /var/lib/jenkins/workspace/HybridCosimulation_master-LDEVB56LP46DTRNYHQSCKMS3FR4JD6RBBK6S2LPONMGDZRBJQH3A/DSL_SemanticAdaptation/be.uantwerpen.ansymo.semanticadaptation.cg.cpp/target/be.uantwerpen.ansymo.semanticadaptation.cg.cpp-1.0.0-SNAPSHOT.jar
[INFO] 
[INFO] --- tycho-p2-plugin:1.0.0:p2-metadata-default (default-p2-metadata-default) @ be.uantwerpen.ansymo.semanticadaptation.cg.cpp ---
[INFO] 
[INFO] --- maven-install-plugin:2.3.1:install (default-install) @ be.uantwerpen.ansymo.semanticadaptation.cg.cpp ---
[INFO] Installing /var/lib/jenkins/workspace/HybridCosimulation_master-LDEVB56LP46DTRNYHQSCKMS3FR4JD6RBBK6S2LPONMGDZRBJQH3A/DSL_SemanticAdaptation/be.uantwerpen.ansymo.semanticadaptation.cg.cpp/target/be.uantwerpen.ansymo.semanticadaptation.cg.cpp-1.0.0-SNAPSHOT.jar to /var/lib/jenkins/workspace/HybridCosimulation_master-LDEVB56LP46DTRNYHQSCKMS3FR4JD6RBBK6S2LPONMGDZRBJQH3A/.repository/be/uantwerpen/ansymo/semanticadaptation/be.uantwerpen.ansymo.semanticadaptation.cg.cpp/1.0.0-SNAPSHOT/be.uantwerpen.ansymo.semanticadaptation.cg.cpp-1.0.0-SNAPSHOT.jar
[INFO] Installing /var/lib/jenkins/workspace/HybridCosimulation_master-LDEVB56LP46DTRNYHQSCKMS3FR4JD6RBBK6S2LPONMGDZRBJQH3A/DSL_SemanticAdaptation/be.uantwerpen.ansymo.semanticadaptation.cg.cpp/pom.xml to /var/lib/jenkins/workspace/HybridCosimulation_master-LDEVB56LP46DTRNYHQSCKMS3FR4JD6RBBK6S2LPONMGDZRBJQH3A/.repository/be/uantwerpen/ansymo/semanticadaptation/be.uantwerpen.ansymo.semanticadaptation.cg.cpp/1.0.0-SNAPSHOT/be.uantwerpen.ansymo.semanticadaptation.cg.cpp-1.0.0-SNAPSHOT.pom
[INFO] Installing /var/lib/jenkins/workspace/HybridCosimulation_master-LDEVB56LP46DTRNYHQSCKMS3FR4JD6RBBK6S2LPONMGDZRBJQH3A/DSL_SemanticAdaptation/be.uantwerpen.ansymo.semanticadaptation.cg.cpp/target/p2content.xml to /var/lib/jenkins/workspace/HybridCosimulation_master-LDEVB56LP46DTRNYHQSCKMS3FR4JD6RBBK6S2LPONMGDZRBJQH3A/.repository/be/uantwerpen/ansymo/semanticadaptation/be.uantwerpen.ansymo.semanticadaptation.cg.cpp/1.0.0-SNAPSHOT/be.uantwerpen.ansymo.semanticadaptation.cg.cpp-1.0.0-SNAPSHOT-p2metadata.xml
[INFO] Installing /var/lib/jenkins/workspace/HybridCosimulation_master-LDEVB56LP46DTRNYHQSCKMS3FR4JD6RBBK6S2LPONMGDZRBJQH3A/DSL_SemanticAdaptation/be.uantwerpen.ansymo.semanticadaptation.cg.cpp/target/p2artifacts.xml to /var/lib/jenkins/workspace/HybridCosimulation_master-LDEVB56LP46DTRNYHQSCKMS3FR4JD6RBBK6S2LPONMGDZRBJQH3A/.repository/be/uantwerpen/ansymo/semanticadaptation/be.uantwerpen.ansymo.semanticadaptation.cg.cpp/1.0.0-SNAPSHOT/be.uantwerpen.ansymo.semanticadaptation.cg.cpp-1.0.0-SNAPSHOT-p2artifacts.xml
[INFO] 
[INFO] --- tycho-p2-plugin:1.0.0:update-local-index (default-update-local-index) @ be.uantwerpen.ansymo.semanticadaptation.cg.cpp ---
[INFO]                                                                         
[INFO] ------------------------------------------------------------------------
[INFO] Building be.uantwerpen.ansymo.semanticadaptation Code Generation to C++ Tests 1.0.0-SNAPSHOT
[INFO] ------------------------------------------------------------------------
[INFO] 
[INFO] --- tycho-packaging-plugin:1.0.0:build-qualifier (default-build-qualifier) @ be.uantwerpen.ansymo.semanticadaptation.cg.cpp.tests ---
[INFO] The project's OSGi version is 1.0.0.201706280753
[INFO] 
[INFO] --- tycho-packaging-plugin:1.0.0:validate-id (default-validate-id) @ be.uantwerpen.ansymo.semanticadaptation.cg.cpp.tests ---
[INFO] 
[INFO] --- tycho-packaging-plugin:1.0.0:validate-version (default-validate-version) @ be.uantwerpen.ansymo.semanticadaptation.cg.cpp.tests ---
[INFO] 
[INFO] --- xtend-maven-plugin:2.11.0:compile (default) @ be.uantwerpen.ansymo.semanticadaptation.cg.cpp.tests ---
[WARNING] 
WARNING: 	CgCppBasicTest.xtend - /var/lib/jenkins/workspace/HybridCosimulation_master-LDEVB56LP46DTRNYHQSCKMS3FR4JD6RBBK6S2LPONMGDZRBJQH3A/DSL_SemanticAdaptation/be.uantwerpen.ansymo.semanticadaptation.cg.cpp.tests/src/be/uantwerpen/ansymo/semanticadaptation/cg/cpp/tests/CgCppBasicTest.xtend
85: The value of the local variable error is not used
[INFO] 
[INFO] --- maven-resources-plugin:2.4.3:resources (default-resources) @ be.uantwerpen.ansymo.semanticadaptation.cg.cpp.tests ---
[INFO] Using 'UTF-8' encoding to copy filtered resources.
[INFO] skip non existing resourceDirectory /var/lib/jenkins/workspace/HybridCosimulation_master-LDEVB56LP46DTRNYHQSCKMS3FR4JD6RBBK6S2LPONMGDZRBJQH3A/DSL_SemanticAdaptation/be.uantwerpen.ansymo.semanticadaptation.cg.cpp.tests/src/main/resources
[INFO] 
[INFO] --- tycho-compiler-plugin:1.0.0:compile (default-compile) @ be.uantwerpen.ansymo.semanticadaptation.cg.cpp.tests ---
[WARNING] Parameter 'useProjectSettings' is set to true, but preferences file '/var/lib/jenkins/workspace/HybridCosimulation_master-LDEVB56LP46DTRNYHQSCKMS3FR4JD6RBBK6S2LPONMGDZRBJQH3A/DSL_SemanticAdaptation/be.uantwerpen.ansymo.semanticadaptation.cg.cpp.tests/.settings/org.eclipse.jdt.core.prefs' could not be found!
[INFO] Compiling 2 source files to /var/lib/jenkins/workspace/HybridCosimulation_master-LDEVB56LP46DTRNYHQSCKMS3FR4JD6RBBK6S2LPONMGDZRBJQH3A/DSL_SemanticAdaptation/be.uantwerpen.ansymo.semanticadaptation.cg.cpp.tests/target/classes
[WARNING] Source directory /var/lib/jenkins/workspace/HybridCosimulation_master-LDEVB56LP46DTRNYHQSCKMS3FR4JD6RBBK6S2LPONMGDZRBJQH3A/DSL_SemanticAdaptation/be.uantwerpen.ansymo.semanticadaptation.cg.cpp.tests/src-gen does not exist
[INFO] 
[INFO] --- xtend-maven-plugin:2.11.0:xtend-install-debug-info (default) @ be.uantwerpen.ansymo.semanticadaptation.cg.cpp.tests ---
[WARNING] Directory /var/lib/jenkins/workspace/HybridCosimulation_master-LDEVB56LP46DTRNYHQSCKMS3FR4JD6RBBK6S2LPONMGDZRBJQH3A/DSL_SemanticAdaptation/be.uantwerpen.ansymo.semanticadaptation.cg.cpp.tests/src/main/java is empty. Can't process.
[WARNING] Directory /var/lib/jenkins/workspace/HybridCosimulation_master-LDEVB56LP46DTRNYHQSCKMS3FR4JD6RBBK6S2LPONMGDZRBJQH3A/DSL_SemanticAdaptation/be.uantwerpen.ansymo.semanticadaptation.cg.cpp.tests/src-gen is empty. Can't process.
[INFO] Installing Xtend files into 2 class files as primary debug sources in: /var/lib/jenkins/workspace/HybridCosimulation_master-LDEVB56LP46DTRNYHQSCKMS3FR4JD6RBBK6S2LPONMGDZRBJQH3A/DSL_SemanticAdaptation/be.uantwerpen.ansymo.semanticadaptation.cg.cpp.tests/target/classes
[INFO] 
[INFO] --- xtend-maven-plugin:2.11.0:testCompile (default) @ be.uantwerpen.ansymo.semanticadaptation.cg.cpp.tests ---
[INFO] skip compiling sources because the configured directory '[/var/lib/jenkins/workspace/HybridCosimulation_master-LDEVB56LP46DTRNYHQSCKMS3FR4JD6RBBK6S2LPONMGDZRBJQH3A/DSL_SemanticAdaptation/be.uantwerpen.ansymo.semanticadaptation.cg.cpp.tests/src/test/java]' does not exists.
[INFO] 
[INFO] --- maven-resources-plugin:2.4.3:testResources (default-testResources) @ be.uantwerpen.ansymo.semanticadaptation.cg.cpp.tests ---
[INFO] Using 'UTF-8' encoding to copy filtered resources.
[INFO] skip non existing resourceDirectory /var/lib/jenkins/workspace/HybridCosimulation_master-LDEVB56LP46DTRNYHQSCKMS3FR4JD6RBBK6S2LPONMGDZRBJQH3A/DSL_SemanticAdaptation/be.uantwerpen.ansymo.semanticadaptation.cg.cpp.tests/src/test/resources
[INFO] 
[INFO] --- xtend-maven-plugin:2.11.0:xtend-test-install-debug-info (default) @ be.uantwerpen.ansymo.semanticadaptation.cg.cpp.tests ---
[WARNING] Directory /var/lib/jenkins/workspace/HybridCosimulation_master-LDEVB56LP46DTRNYHQSCKMS3FR4JD6RBBK6S2LPONMGDZRBJQH3A/DSL_SemanticAdaptation/be.uantwerpen.ansymo.semanticadaptation.cg.cpp.tests/src/test/java is empty. Can't process.
[WARNING] Directory /var/lib/jenkins/workspace/HybridCosimulation_master-LDEVB56LP46DTRNYHQSCKMS3FR4JD6RBBK6S2LPONMGDZRBJQH3A/DSL_SemanticAdaptation/be.uantwerpen.ansymo.semanticadaptation.cg.cpp.tests/target/xtend-gen/test is empty. Can't process.
[INFO] Installing Xtend files into 0 class files as primary debug sources in: /var/lib/jenkins/workspace/HybridCosimulation_master-LDEVB56LP46DTRNYHQSCKMS3FR4JD6RBBK6S2LPONMGDZRBJQH3A/DSL_SemanticAdaptation/be.uantwerpen.ansymo.semanticadaptation.cg.cpp.tests/target/test-classes
[INFO] 
[INFO] --- target-platform-configuration:1.0.0:target-platform (default-target-platform) @ be.uantwerpen.ansymo.semanticadaptation.cg.cpp.tests ---
[INFO] 
[INFO] --- tycho-packaging-plugin:1.0.0:package-plugin (default-package-plugin) @ be.uantwerpen.ansymo.semanticadaptation.cg.cpp.tests ---
[INFO] Building jar: /var/lib/jenkins/workspace/HybridCosimulation_master-LDEVB56LP46DTRNYHQSCKMS3FR4JD6RBBK6S2LPONMGDZRBJQH3A/DSL_SemanticAdaptation/be.uantwerpen.ansymo.semanticadaptation.cg.cpp.tests/target/be.uantwerpen.ansymo.semanticadaptation.cg.cpp.tests-1.0.0-SNAPSHOT.jar
[INFO] 
[INFO] --- tycho-p2-plugin:1.0.0:p2-metadata-default (default-p2-metadata-default) @ be.uantwerpen.ansymo.semanticadaptation.cg.cpp.tests ---
[INFO] 
[INFO] --- tycho-surefire-plugin:1.0.0:test (default-test) @ be.uantwerpen.ansymo.semanticadaptation.cg.cpp.tests ---
[INFO] Expected eclipse log file: /var/lib/jenkins/workspace/HybridCosimulation_master-LDEVB56LP46DTRNYHQSCKMS3FR4JD6RBBK6S2LPONMGDZRBJQH3A/DSL_SemanticAdaptation/be.uantwerpen.ansymo.semanticadaptation.cg.cpp.tests/target/work/data/.metadata/.log
[INFO] Command line:
	[/usr/lib/jvm/java-8-oracle/jre/bin/java, -Dosgi.noShutdown=false, -Dosgi.os=linux, -Dosgi.ws=gtk, -Dosgi.arch=x86_64, -Dosgi.clean=true, -jar, /var/lib/jenkins/workspace/HybridCosimulation_master-LDEVB56LP46DTRNYHQSCKMS3FR4JD6RBBK6S2LPONMGDZRBJQH3A/.repository/p2/osgi/bundle/org.eclipse.equinox.launcher/1.3.201.v20161025-1711/org.eclipse.equinox.launcher-1.3.201.v20161025-1711.jar, -data, /var/lib/jenkins/workspace/HybridCosimulation_master-LDEVB56LP46DTRNYHQSCKMS3FR4JD6RBBK6S2LPONMGDZRBJQH3A/DSL_SemanticAdaptation/be.uantwerpen.ansymo.semanticadaptation.cg.cpp.tests/target/work/data, -install, /var/lib/jenkins/workspace/HybridCosimulation_master-LDEVB56LP46DTRNYHQSCKMS3FR4JD6RBBK6S2LPONMGDZRBJQH3A/DSL_SemanticAdaptation/be.uantwerpen.ansymo.semanticadaptation.cg.cpp.tests/target/work, -configuration, /var/lib/jenkins/workspace/HybridCosimulation_master-LDEVB56LP46DTRNYHQSCKMS3FR4JD6RBBK6S2LPONMGDZRBJQH3A/DSL_SemanticAdaptation/be.uantwerpen.ansymo.semanticadaptation.cg.cpp.tests/target/work/configuration, -application, org.eclipse.tycho.surefire.osgibooter.headlesstest, -testproperties, /var/lib/jenkins/workspace/HybridCosimulation_master-LDEVB56LP46DTRNYHQSCKMS3FR4JD6RBBK6S2LPONMGDZRBJQH3A/DSL_SemanticAdaptation/be.uantwerpen.ansymo.semanticadaptation.cg.cpp.tests/target/surefire.properties]
Picked up JAVA_TOOL_OPTIONS: -Dmaven.ext.class.path="/var/lib/jenkins/workspace/HybridCosimulation_master-LDEVB56LP46DTRNYHQSCKMS3FR4JD6RBBK6S2LPONMGDZRBJQH3A@tmp/withMavenbc84f9d1/pipeline-maven-spy.jar" -Dorg.jenkinsci.plugins.pipeline.maven.reportsFolder="/var/lib/jenkins/workspace/HybridCosimulation_master-LDEVB56LP46DTRNYHQSCKMS3FR4JD6RBBK6S2LPONMGDZRBJQH3A@tmp/withMavenbc84f9d1" 

-------------------------------------------------------
 T E S T S
-------------------------------------------------------
Running be.uantwerpen.ansymo.semanticadaptation.cg.cpp.tests.CgCppBasicTest
Rootdir: /var/lib/jenkins/workspace/HybridCosimulation_master-LDEVB56LP46DTRNYHQSCKMS3FR4JD6RBBK6S2LPONMGDZRBJQH3A/DSL_SemanticAdaptation/be.uantwerpen.ansymo.semanticadaptation.cg.cpp.tests/generated/powerwindow
log4j:WARN No appenders could be found for logger (org.eclipse.xtext.parser.antlr.AbstractInternalAntlrParser).
log4j:WARN Please initialize the log4j system properly.
>Getting scope for fmu within context class be.uantwerpen.ansymo.semanticadaptation.semanticAdaptation.impl.DoStepFunImpl
 Delegating scope discovery to super class...
<Scope found:ImportScope[windowSA.H_window.*] imports from org.eclipse.xtext.scoping.impl.MultimapBasedSelectable@7cea0110 for type FMU
>Getting scope for ref within context class be.uantwerpen.ansymo.semanticadaptation.semanticAdaptation.impl.VariableImpl
<Scope found:SimpleScope[reaction_force, displacement, speed, disp, tau, displacement, speed, reaction_force, height, reaction_torque, INIT_WINDOWSA_REACTION_FORCE, INIT_WINDOWSA_DISPLACEMENT, INIT_WINDOWSA_SPEED, INIT_WINDOW_REACTION_TORQUE, INIT_WINDOW_REACTION_HEIGHT, H_window, stored_windowsa_reaction_force, stored_windowsa_displacement, stored_windowsa_speed, stored_window_reaction_torque, stored_window_height] -> NULLSCOPE
>Getting scope for ref within context class be.uantwerpen.ansymo.semanticadaptation.semanticAdaptation.impl.VariableImpl
<Scope found:SimpleScope[reaction_force, displacement, speed, disp, tau, displacement, speed, reaction_force, height, reaction_torque, INIT_WINDOWSA_REACTION_FORCE, INIT_WINDOWSA_DISPLACEMENT, INIT_WINDOWSA_SPEED, INIT_WINDOW_REACTION_TORQUE, INIT_WINDOW_REACTION_HEIGHT, H_window, stored_windowsa_reaction_force, stored_windowsa_displacement, stored_windowsa_speed, stored_window_reaction_torque, stored_window_height] -> NULLSCOPE
>Getting scope for owner within context class be.uantwerpen.ansymo.semanticadaptation.semanticAdaptation.impl.VariableImpl
 Delegating scope discovery to super class...
<Scope found:ImportScope[windowSA.*] imports from org.eclipse.xtext.scoping.impl.MultimapBasedSelectable@7cea0110 for type FMU
>Getting scope for ref within context class be.uantwerpen.ansymo.semanticadaptation.semanticAdaptation.impl.VariableImpl
 Getting scope within FMU: windowSA
<Scope found:SimpleScope[reaction_force, displacement, speed, disp, tau, displacement, speed, reaction_force, height, reaction_torque] -> NULLSCOPE
>Getting scope for ref within context class be.uantwerpen.ansymo.semanticadaptation.semanticAdaptation.impl.VariableImpl
<Scope found:SimpleScope[reaction_force, displacement, speed, disp, tau, displacement, speed, reaction_force, height, reaction_torque, INIT_WINDOWSA_REACTION_FORCE, INIT_WINDOWSA_DISPLACEMENT, INIT_WINDOWSA_SPEED, INIT_WINDOW_REACTION_TORQUE, INIT_WINDOW_REACTION_HEIGHT, H_window, stored_windowsa_reaction_force, stored_windowsa_displacement, stored_windowsa_speed, stored_window_reaction_torque, stored_window_height] -> NULLSCOPE
>Getting scope for owner within context class be.uantwerpen.ansymo.semanticadaptation.semanticAdaptation.impl.VariableImpl
 Delegating scope discovery to super class...
<Scope found:ImportScope[windowSA.*] imports from org.eclipse.xtext.scoping.impl.MultimapBasedSelectable@7cea0110 for type FMU
>Getting scope for ref within context class be.uantwerpen.ansymo.semanticadaptation.semanticAdaptation.impl.VariableImpl
 Getting scope within FMU: windowSA
<Scope found:SimpleScope[reaction_force, displacement, speed, disp, tau, displacement, speed, reaction_force, height, reaction_torque] -> NULLSCOPE
>Getting scope for ref within context class be.uantwerpen.ansymo.semanticadaptation.semanticAdaptation.impl.VariableImpl
<Scope found:SimpleScope[reaction_force, displacement, speed, disp, tau, displacement, speed, reaction_force, height, reaction_torque, INIT_WINDOWSA_REACTION_FORCE, INIT_WINDOWSA_DISPLACEMENT, INIT_WINDOWSA_SPEED, INIT_WINDOW_REACTION_TORQUE, INIT_WINDOW_REACTION_HEIGHT, H_window, stored_windowsa_reaction_force, stored_windowsa_displacement, stored_windowsa_speed, stored_window_reaction_torque, stored_window_height] -> NULLSCOPE
>Getting scope for owner within context class be.uantwerpen.ansymo.semanticadaptation.semanticAdaptation.impl.VariableImpl
 Delegating scope discovery to super class...
<Scope found:ImportScope[windowSA.*] imports from org.eclipse.xtext.scoping.impl.MultimapBasedSelectable@7cea0110 for type FMU
>Getting scope for ref within context class be.uantwerpen.ansymo.semanticadaptation.semanticAdaptation.impl.VariableImpl
 Getting scope within FMU: windowSA
<Scope found:SimpleScope[reaction_force, displacement, speed, disp, tau, displacement, speed, reaction_force, height, reaction_torque] -> NULLSCOPE
>Getting scope for owner within context class be.uantwerpen.ansymo.semanticadaptation.semanticAdaptation.impl.VariableImpl
 Delegating scope discovery to super class...
<Scope found:ImportScope[windowSA.*] imports from org.eclipse.xtext.scoping.impl.MultimapBasedSelectable@7cea0110 for type FMU
>Getting scope for ref within context class be.uantwerpen.ansymo.semanticadaptation.semanticAdaptation.impl.VariableImpl
 Getting scope within FMU: window
<Scope found:SimpleScope[displacement, speed, reaction_force, height, reaction_torque] -> NULLSCOPE
>Getting scope for ref within context class be.uantwerpen.ansymo.semanticadaptation.semanticAdaptation.impl.VariableImpl
<Scope found:SimpleScope[reaction_force, displacement, speed, disp, tau, displacement, speed, reaction_force, height, reaction_torque, INIT_WINDOWSA_REACTION_FORCE, INIT_WINDOWSA_DISPLACEMENT, INIT_WINDOWSA_SPEED, INIT_WINDOW_REACTION_TORQUE, INIT_WINDOW_REACTION_HEIGHT, H_window, stored_windowsa_reaction_force, stored_windowsa_displacement, stored_windowsa_speed, stored_window_reaction_torque, stored_window_height] -> NULLSCOPE
>Getting scope for owner within context class be.uantwerpen.ansymo.semanticadaptation.semanticAdaptation.impl.VariableImpl
 Delegating scope discovery to super class...
<Scope found:ImportScope[windowSA.*] imports from org.eclipse.xtext.scoping.impl.MultimapBasedSelectable@7cea0110 for type FMU
>Getting scope for ref within context class be.uantwerpen.ansymo.semanticadaptation.semanticAdaptation.impl.VariableImpl
 Getting scope within FMU: window
<Scope found:SimpleScope[displacement, speed, reaction_force, height, reaction_torque] -> NULLSCOPE
>Getting scope for ref within context class be.uantwerpen.ansymo.semanticadaptation.semanticAdaptation.impl.VariableImpl
<Scope found:SimpleScope[reaction_force, displacement, speed, disp, tau, displacement, speed, reaction_force, height, reaction_torque, INIT_WINDOWSA_REACTION_FORCE, INIT_WINDOWSA_DISPLACEMENT, INIT_WINDOWSA_SPEED, INIT_WINDOW_REACTION_TORQUE, INIT_WINDOW_REACTION_HEIGHT, H_window, stored_windowsa_reaction_force, stored_windowsa_displacement, stored_windowsa_speed, stored_window_reaction_torque, stored_window_height] -> NULLSCOPE
>Getting scope for owner within context class be.uantwerpen.ansymo.semanticadaptation.semanticAdaptation.impl.VariableImpl
 Delegating scope discovery to super class...
<Scope found:ImportScope[windowSA.*] imports from org.eclipse.xtext.scoping.impl.MultimapBasedSelectable@7cea0110 for type FMU
>Getting scope for ref within context class be.uantwerpen.ansymo.semanticadaptation.semanticAdaptation.impl.VariableImpl
 Getting scope within FMU: window
<Scope found:SimpleScope[displacement, speed, reaction_force, height, reaction_torque] -> NULLSCOPE
>Getting scope for ref within context class be.uantwerpen.ansymo.semanticadaptation.semanticAdaptation.impl.VariableImpl
<Scope found:SimpleScope[reaction_force, displacement, speed, disp, tau, displacement, speed, reaction_force, height, reaction_torque, INIT_WINDOWSA_REACTION_FORCE, INIT_WINDOWSA_DISPLACEMENT, INIT_WINDOWSA_SPEED, INIT_WINDOW_REACTION_TORQUE, INIT_WINDOW_REACTION_HEIGHT, H_window, stored_windowsa_reaction_force, stored_windowsa_displacement, stored_windowsa_speed, stored_window_reaction_torque, stored_window_height] -> NULLSCOPE
>Getting scope for ref within context class be.uantwerpen.ansymo.semanticadaptation.semanticAdaptation.impl.VariableImpl
<Scope found:SimpleScope[reaction_force, displacement, speed, disp, tau, displacement, speed, reaction_force, height, reaction_torque, INIT_WINDOWSA_REACTION_FORCE, INIT_WINDOWSA_DISPLACEMENT, INIT_WINDOWSA_SPEED, INIT_WINDOW_REACTION_TORQUE, INIT_WINDOW_REACTION_HEIGHT, H_window, stored_windowsa_reaction_force, stored_windowsa_displacement, stored_windowsa_speed, stored_window_reaction_torque, stored_window_height] -> NULLSCOPE
>Getting scope for ref within context class be.uantwerpen.ansymo.semanticadaptation.semanticAdaptation.impl.VariableImpl
<Scope found:SimpleScope[reaction_force, displacement, speed, disp, tau, displacement, speed, reaction_force, height, reaction_torque, INIT_WINDOWSA_REACTION_FORCE, INIT_WINDOWSA_DISPLACEMENT, INIT_WINDOWSA_SPEED, INIT_WINDOW_REACTION_TORQUE, INIT_WINDOW_REACTION_HEIGHT, H_window, stored_windowsa_reaction_force, stored_windowsa_displacement, stored_windowsa_speed, stored_window_reaction_torque, stored_window_height] -> NULLSCOPE
>Getting scope for ref within context class be.uantwerpen.ansymo.semanticadaptation.semanticAdaptation.impl.VariableImpl
<Scope found:SimpleScope[reaction_force, displacement, speed, disp, tau, displacement, speed, reaction_force, height, reaction_torque, INIT_WINDOWSA_REACTION_FORCE, INIT_WINDOWSA_DISPLACEMENT, INIT_WINDOWSA_SPEED, INIT_WINDOW_REACTION_TORQUE, INIT_WINDOW_REACTION_HEIGHT, H_window, stored_windowsa_reaction_force, stored_windowsa_displacement, stored_windowsa_speed, stored_window_reaction_torque, stored_window_height] -> NULLSCOPE
>Getting scope for ref within context class be.uantwerpen.ansymo.semanticadaptation.semanticAdaptation.impl.VariableImpl
<Scope found:SimpleScope[reaction_force, displacement, speed, disp, tau, displacement, speed, reaction_force, height, reaction_torque, INIT_WINDOWSA_REACTION_FORCE, INIT_WINDOWSA_DISPLACEMENT, INIT_WINDOWSA_SPEED, INIT_WINDOW_REACTION_TORQUE, INIT_WINDOW_REACTION_HEIGHT, H_window, stored_windowsa_reaction_force, stored_windowsa_displacement, stored_windowsa_speed, stored_window_reaction_torque, stored_window_height] -> NULLSCOPE
>Getting scope for owner within context class be.uantwerpen.ansymo.semanticadaptation.semanticAdaptation.impl.VariableImpl
 Delegating scope discovery to super class...
<Scope found:ImportScope[windowSA.*] imports from org.eclipse.xtext.scoping.impl.MultimapBasedSelectable@7cea0110 for type FMU
>Getting scope for ref within context class be.uantwerpen.ansymo.semanticadaptation.semanticAdaptation.impl.VariableImpl
 Getting scope within FMU: window
<Scope found:SimpleScope[displacement, speed, reaction_force, height, reaction_torque] -> NULLSCOPE
>Getting scope for ref within context class be.uantwerpen.ansymo.semanticadaptation.semanticAdaptation.impl.VariableImpl
<Scope found:SimpleScope[reaction_force, displacement, speed, disp, tau, displacement, speed, reaction_force, height, reaction_torque, INIT_WINDOWSA_REACTION_FORCE, INIT_WINDOWSA_DISPLACEMENT, INIT_WINDOWSA_SPEED, INIT_WINDOW_REACTION_TORQUE, INIT_WINDOW_REACTION_HEIGHT, H_window, stored_windowsa_reaction_force, stored_windowsa_displacement, stored_windowsa_speed, stored_window_reaction_torque, stored_window_height] -> NULLSCOPE
>Getting scope for owner within context class be.uantwerpen.ansymo.semanticadaptation.semanticAdaptation.impl.VariableImpl
 Delegating scope discovery to super class...
<Scope found:ImportScope[windowSA.*] imports from org.eclipse.xtext.scoping.impl.MultimapBasedSelectable@7cea0110 for type FMU
>Getting scope for ref within context class be.uantwerpen.ansymo.semanticadaptation.semanticAdaptation.impl.VariableImpl
 Getting scope within FMU: window
<Scope found:SimpleScope[displacement, speed, reaction_force, height, reaction_torque] -> NULLSCOPE
>Getting scope for owner within context class be.uantwerpen.ansymo.semanticadaptation.semanticAdaptation.impl.VariableImpl
 Delegating scope discovery to super class...
<Scope found:ImportScope[windowSA.*] imports from org.eclipse.xtext.scoping.impl.MultimapBasedSelectable@7cea0110 for type FMU
>Getting scope for ref within context class be.uantwerpen.ansymo.semanticadaptation.semanticAdaptation.impl.VariableImpl
 Getting scope within FMU: windowSA
<Scope found:SimpleScope[reaction_force, displacement, speed, disp, tau, displacement, speed, reaction_force, height, reaction_torque] -> NULLSCOPE
>Getting scope for ref within context class be.uantwerpen.ansymo.semanticadaptation.semanticAdaptation.impl.VariableImpl
<Scope found:SimpleScope[reaction_force, displacement, speed, disp, tau, displacement, speed, reaction_force, height, reaction_torque, INIT_WINDOWSA_REACTION_FORCE, INIT_WINDOWSA_DISPLACEMENT, INIT_WINDOWSA_SPEED, INIT_WINDOW_REACTION_TORQUE, INIT_WINDOW_REACTION_HEIGHT, H_window, stored_windowsa_reaction_force, stored_windowsa_displacement, stored_windowsa_speed, stored_window_reaction_torque, stored_window_height] -> NULLSCOPE
>Getting scope for owner within context class be.uantwerpen.ansymo.semanticadaptation.semanticAdaptation.impl.VariableImpl
 Delegating scope discovery to super class...
<Scope found:ImportScope[windowSA.*] imports from org.eclipse.xtext.scoping.impl.MultimapBasedSelectable@7cea0110 for type FMU
>Getting scope for ref within context class be.uantwerpen.ansymo.semanticadaptation.semanticAdaptation.impl.VariableImpl
 Getting scope within FMU: windowSA
<Scope found:SimpleScope[reaction_force, displacement, speed, disp, tau, displacement, speed, reaction_force, height, reaction_torque] -> NULLSCOPE
>Getting scope for ref within context class be.uantwerpen.ansymo.semanticadaptation.semanticAdaptation.impl.VariableImpl
<Scope found:SimpleScope[reaction_force, displacement, speed, disp, tau, displacement, speed, reaction_force, height, reaction_torque, INIT_WINDOWSA_REACTION_FORCE, INIT_WINDOWSA_DISPLACEMENT, INIT_WINDOWSA_SPEED, INIT_WINDOW_REACTION_TORQUE, INIT_WINDOW_REACTION_HEIGHT, H_window, stored_windowsa_reaction_force, stored_windowsa_displacement, stored_windowsa_speed, stored_window_reaction_torque, stored_window_height] -> NULLSCOPE
>Getting scope for ref within context class be.uantwerpen.ansymo.semanticadaptation.semanticAdaptation.impl.VariableImpl
<Scope found:SimpleScope[reaction_force, displacement, speed, disp, tau, displacement, speed, reaction_force, height, reaction_torque, INIT_WINDOWSA_REACTION_FORCE, INIT_WINDOWSA_DISPLACEMENT, INIT_WINDOWSA_SPEED, INIT_WINDOW_REACTION_TORQUE, INIT_WINDOW_REACTION_HEIGHT, H_window, stored_windowsa_reaction_force, stored_windowsa_displacement, stored_windowsa_speed, stored_window_reaction_torque, stored_window_height] -> NULLSCOPE
>Getting scope for ref within context class be.uantwerpen.ansymo.semanticadaptation.semanticAdaptation.impl.VariableImpl
<Scope found:SimpleScope[reaction_force, displacement, speed, disp, tau, displacement, speed, reaction_force, height, reaction_torque, INIT_WINDOWSA_REACTION_FORCE, INIT_WINDOWSA_DISPLACEMENT, INIT_WINDOWSA_SPEED, INIT_WINDOW_REACTION_TORQUE, INIT_WINDOW_REACTION_HEIGHT, H_window, stored_windowsa_reaction_force, stored_windowsa_displacement, stored_windowsa_speed, stored_window_reaction_torque, stored_window_height] -> NULLSCOPE
Stored file: generated/powerwindow/sources/Fmu.cpp
Stored file: generated/powerwindow/sources/WindowSA.cpp
Stored file: generated/powerwindow/sources/WindowSA.h
Stored file: generated/powerwindow/modelDescription.xml
Stored file: generated/powerwindow/sources/main.cpp
Copied file to: generated/powerwindow/resources/Window.fmu
Stored file: generated/powerwindow/CMakeLists.txt
Stored file: generated/powerwindow/msys-toolchain.cmake
Rootdir: /var/lib/jenkins/workspace/HybridCosimulation_master-LDEVB56LP46DTRNYHQSCKMS3FR4JD6RBBK6S2LPONMGDZRBJQH3A/DSL_SemanticAdaptation/be.uantwerpen.ansymo.semanticadaptation.cg.cpp.tests/generated/lazy
>Getting scope for ref within context class be.uantwerpen.ansymo.semanticadaptation.semanticAdaptation.impl.VariableImpl
<Scope found:SimpleScope[obj_detected, passenger_up, passenger_down, passenger_stop, driver_up, driver_down, driver_stop, up, down, stop, obj_detected, passenger_up, passenger_down, passenger_stop, driver_up, driver_down, driver_stop, up, down, stop, INIT_OBJ_DETECTED, INIT_PASSENGER_UP, INIT_PASSENGER_DOWN, INIT_PASSENGER_STOP, INIT_DRIVER_UP, INIT_DRIVER_DOWN, INIT_DRIVER_STOP, INIT_UP, INIT_DOWN, INIT_STOP, tn, tl, prev_obj_detected, prev_passenger_up, prev_passenger_down, prev_passenger_stop, prev_driver_up, prev_driver_down, prev_driver_stop, step_size, step_to_be_done, step_done, stored_sa_obj_detected, stored_sa_passenger_up, stored_sa_passenger_down, stored_sa_passenger_stop, stored_sa_driver_up, stored_sa_driver_down, stored_sa_driver_stop, stored_sa_up, stored_sa_down, stored_sa_stop] -> NULLSCOPE
>Getting scope for ref within context class be.uantwerpen.ansymo.semanticadaptation.semanticAdaptation.impl.VariableImpl
<Scope found:SimpleScope[obj_detected, passenger_up, passenger_down, passenger_stop, driver_up, driver_down, driver_stop, up, down, stop, obj_detected, passenger_up, passenger_down, passenger_stop, driver_up, driver_down, driver_stop, up, down, stop, INIT_OBJ_DETECTED, INIT_PASSENGER_UP, INIT_PASSENGER_DOWN, INIT_PASSENGER_STOP, INIT_DRIVER_UP, INIT_DRIVER_DOWN, INIT_DRIVER_STOP, INIT_UP, INIT_DOWN, INIT_STOP, tn, tl, prev_obj_detected, prev_passenger_up, prev_passenger_down, prev_passenger_stop, prev_driver_up, prev_driver_down, prev_driver_stop, step_size, step_to_be_done, step_done, stored_sa_obj_detected, stored_sa_passenger_up, stored_sa_passenger_down, stored_sa_passenger_stop, stored_sa_driver_up, stored_sa_driver_down, stored_sa_driver_stop, stored_sa_up, stored_sa_down, stored_sa_stop] -> NULLSCOPE
>Getting scope for ref within context class be.uantwerpen.ansymo.semanticadaptation.semanticAdaptation.impl.VariableImpl
<Scope found:SimpleScope[obj_detected, passenger_up, passenger_down, passenger_stop, driver_up, driver_down, driver_stop, up, down, stop, obj_detected, passenger_up, passenger_down, passenger_stop, driver_up, driver_down, driver_stop, up, down, stop, INIT_OBJ_DETECTED, INIT_PASSENGER_UP, INIT_PASSENGER_DOWN, INIT_PASSENGER_STOP, INIT_DRIVER_UP, INIT_DRIVER_DOWN, INIT_DRIVER_STOP, INIT_UP, INIT_DOWN, INIT_STOP, tn, tl, prev_obj_detected, prev_passenger_up, prev_passenger_down, prev_passenger_stop, prev_driver_up, prev_driver_down, prev_driver_stop, step_size, step_to_be_done, step_done, stored_sa_obj_detected, stored_sa_passenger_up, stored_sa_passenger_down, stored_sa_passenger_stop, stored_sa_driver_up, stored_sa_driver_down, stored_sa_driver_stop, stored_sa_up, stored_sa_down, stored_sa_stop] -> NULLSCOPE
>Getting scope for ref within context class be.uantwerpen.ansymo.semanticadaptation.semanticAdaptation.impl.VariableImpl
<Scope found:SimpleScope[obj_detected, passenger_up, passenger_down, passenger_stop, driver_up, driver_down, driver_stop, up, down, stop, obj_detected, passenger_up, passenger_down, passenger_stop, driver_up, driver_down, driver_stop, up, down, stop, INIT_OBJ_DETECTED, INIT_PASSENGER_UP, INIT_PASSENGER_DOWN, INIT_PASSENGER_STOP, INIT_DRIVER_UP, INIT_DRIVER_DOWN, INIT_DRIVER_STOP, INIT_UP, INIT_DOWN, INIT_STOP, tn, tl, prev_obj_detected, prev_passenger_up, prev_passenger_down, prev_passenger_stop, prev_driver_up, prev_driver_down, prev_driver_stop, step_size, step_to_be_done, step_done, stored_sa_obj_detected, stored_sa_passenger_up, stored_sa_passenger_down, stored_sa_passenger_stop, stored_sa_driver_up, stored_sa_driver_down, stored_sa_driver_stop, stored_sa_up, stored_sa_down, stored_sa_stop] -> NULLSCOPE
>Getting scope for ref within context class be.uantwerpen.ansymo.semanticadaptation.semanticAdaptation.impl.VariableImpl
<Scope found:SimpleScope[obj_detected, passenger_up, passenger_down, passenger_stop, driver_up, driver_down, driver_stop, up, down, stop, obj_detected, passenger_up, passenger_down, passenger_stop, driver_up, driver_down, driver_stop, up, down, stop, INIT_OBJ_DETECTED, INIT_PASSENGER_UP, INIT_PASSENGER_DOWN, INIT_PASSENGER_STOP, INIT_DRIVER_UP, INIT_DRIVER_DOWN, INIT_DRIVER_STOP, INIT_UP, INIT_DOWN, INIT_STOP, tn, tl, prev_obj_detected, prev_passenger_up, prev_passenger_down, prev_passenger_stop, prev_driver_up, prev_driver_down, prev_driver_stop, step_size, step_to_be_done, step_done, stored_sa_obj_detected, stored_sa_passenger_up, stored_sa_passenger_down, stored_sa_passenger_stop, stored_sa_driver_up, stored_sa_driver_down, stored_sa_driver_stop, stored_sa_up, stored_sa_down, stored_sa_stop] -> NULLSCOPE
>Getting scope for ref within context class be.uantwerpen.ansymo.semanticadaptation.semanticAdaptation.impl.VariableImpl
<Scope found:SimpleScope[obj_detected, passenger_up, passenger_down, passenger_stop, driver_up, driver_down, driver_stop, up, down, stop, obj_detected, passenger_up, passenger_down, passenger_stop, driver_up, driver_down, driver_stop, up, down, stop, INIT_OBJ_DETECTED, INIT_PASSENGER_UP, INIT_PASSENGER_DOWN, INIT_PASSENGER_STOP, INIT_DRIVER_UP, INIT_DRIVER_DOWN, INIT_DRIVER_STOP, INIT_UP, INIT_DOWN, INIT_STOP, tn, tl, prev_obj_detected, prev_passenger_up, prev_passenger_down, prev_passenger_stop, prev_driver_up, prev_driver_down, prev_driver_stop, step_size, step_to_be_done, step_done, stored_sa_obj_detected, stored_sa_passenger_up, stored_sa_passenger_down, stored_sa_passenger_stop, stored_sa_driver_up, stored_sa_driver_down, stored_sa_driver_stop, stored_sa_up, stored_sa_down, stored_sa_stop] -> NULLSCOPE
>Getting scope for ref within context class be.uantwerpen.ansymo.semanticadaptation.semanticAdaptation.impl.VariableImpl
<Scope found:SimpleScope[obj_detected, passenger_up, passenger_down, passenger_stop, driver_up, driver_down, driver_stop, up, down, stop, obj_detected, passenger_up, passenger_down, passenger_stop, driver_up, driver_down, driver_stop, up, down, stop, INIT_OBJ_DETECTED, INIT_PASSENGER_UP, INIT_PASSENGER_DOWN, INIT_PASSENGER_STOP, INIT_DRIVER_UP, INIT_DRIVER_DOWN, INIT_DRIVER_STOP, INIT_UP, INIT_DOWN, INIT_STOP, tn, tl, prev_obj_detected, prev_passenger_up, prev_passenger_down, prev_passenger_stop, prev_driver_up, prev_driver_down, prev_driver_stop, step_size, step_to_be_done, step_done, stored_sa_obj_detected, stored_sa_passenger_up, stored_sa_passenger_down, stored_sa_passenger_stop, stored_sa_driver_up, stored_sa_driver_down, stored_sa_driver_stop, stored_sa_up, stored_sa_down, stored_sa_stop] -> NULLSCOPE
>Getting scope for ref within context class be.uantwerpen.ansymo.semanticadaptation.semanticAdaptation.impl.VariableImpl
<Scope found:SimpleScope[obj_detected, passenger_up, passenger_down, passenger_stop, driver_up, driver_down, driver_stop, up, down, stop, obj_detected, passenger_up, passenger_down, passenger_stop, driver_up, driver_down, driver_stop, up, down, stop, INIT_OBJ_DETECTED, INIT_PASSENGER_UP, INIT_PASSENGER_DOWN, INIT_PASSENGER_STOP, INIT_DRIVER_UP, INIT_DRIVER_DOWN, INIT_DRIVER_STOP, INIT_UP, INIT_DOWN, INIT_STOP, tn, tl, prev_obj_detected, prev_passenger_up, prev_passenger_down, prev_passenger_stop, prev_driver_up, prev_driver_down, prev_driver_stop, step_size, step_to_be_done, step_done, stored_sa_obj_detected, stored_sa_passenger_up, stored_sa_passenger_down, stored_sa_passenger_stop, stored_sa_driver_up, stored_sa_driver_down, stored_sa_driver_stop, stored_sa_up, stored_sa_down, stored_sa_stop] -> NULLSCOPE
>Getting scope for ref within context class be.uantwerpen.ansymo.semanticadaptation.semanticAdaptation.impl.VariableImpl
<Scope found:SimpleScope[obj_detected, passenger_up, passenger_down, passenger_stop, driver_up, driver_down, driver_stop, up, down, stop, obj_detected, passenger_up, passenger_down, passenger_stop, driver_up, driver_down, driver_stop, up, down, stop, INIT_OBJ_DETECTED, INIT_PASSENGER_UP, INIT_PASSENGER_DOWN, INIT_PASSENGER_STOP, INIT_DRIVER_UP, INIT_DRIVER_DOWN, INIT_DRIVER_STOP, INIT_UP, INIT_DOWN, INIT_STOP, tn, tl, prev_obj_detected, prev_passenger_up, prev_passenger_down, prev_passenger_stop, prev_driver_up, prev_driver_down, prev_driver_stop, step_size, step_to_be_done, step_done, stored_sa_obj_detected, stored_sa_passenger_up, stored_sa_passenger_down, stored_sa_passenger_stop, stored_sa_driver_up, stored_sa_driver_down, stored_sa_driver_stop, stored_sa_up, stored_sa_down, stored_sa_stop] -> NULLSCOPE
>Getting scope for ref within context class be.uantwerpen.ansymo.semanticadaptation.semanticAdaptation.impl.VariableImpl
<Scope found:SimpleScope[obj_detected, passenger_up, passenger_down, passenger_stop, driver_up, driver_down, driver_stop, up, down, stop, obj_detected, passenger_up, passenger_down, passenger_stop, driver_up, driver_down, driver_stop, up, down, stop, INIT_OBJ_DETECTED, INIT_PASSENGER_UP, INIT_PASSENGER_DOWN, INIT_PASSENGER_STOP, INIT_DRIVER_UP, INIT_DRIVER_DOWN, INIT_DRIVER_STOP, INIT_UP, INIT_DOWN, INIT_STOP, tn, tl, prev_obj_detected, prev_passenger_up, prev_passenger_down, prev_passenger_stop, prev_driver_up, prev_driver_down, prev_driver_stop, step_size, step_to_be_done, step_done, stored_sa_obj_detected, stored_sa_passenger_up, stored_sa_passenger_down, stored_sa_passenger_stop, stored_sa_driver_up, stored_sa_driver_down, stored_sa_driver_stop, stored_sa_up, stored_sa_down, stored_sa_stop] -> NULLSCOPE
>Getting scope for owner within context class be.uantwerpen.ansymo.semanticadaptation.semanticAdaptation.impl.VariableImpl
 Delegating scope discovery to super class...
<Scope found:ImportScope[lazy_sa.*] imports from org.eclipse.xtext.scoping.impl.MultimapBasedSelectable@17fa1336 for type FMU
>Getting scope for ref within context class be.uantwerpen.ansymo.semanticadaptation.semanticAdaptation.impl.VariableImpl
 Getting scope within FMU: lazy_sa
<Scope found:SimpleScope[obj_detected, passenger_up, passenger_down, passenger_stop, driver_up, driver_down, driver_stop, up, down, stop, obj_detected, passenger_up, passenger_down, passenger_stop, driver_up, driver_down, driver_stop, up, down, stop] -> NULLSCOPE
>Getting scope for ref within context class be.uantwerpen.ansymo.semanticadaptation.semanticAdaptation.impl.VariableImpl
<Scope found:SimpleScope[obj_detected, passenger_up, passenger_down, passenger_stop, driver_up, driver_down, driver_stop, up, down, stop, obj_detected, passenger_up, passenger_down, passenger_stop, driver_up, driver_down, driver_stop, up, down, stop, INIT_OBJ_DETECTED, INIT_PASSENGER_UP, INIT_PASSENGER_DOWN, INIT_PASSENGER_STOP, INIT_DRIVER_UP, INIT_DRIVER_DOWN, INIT_DRIVER_STOP, INIT_UP, INIT_DOWN, INIT_STOP, tn, tl, prev_obj_detected, prev_passenger_up, prev_passenger_down, prev_passenger_stop, prev_driver_up, prev_driver_down, prev_driver_stop, step_size, step_to_be_done, step_done, stored_sa_obj_detected, stored_sa_passenger_up, stored_sa_passenger_down, stored_sa_passenger_stop, stored_sa_driver_up, stored_sa_driver_down, stored_sa_driver_stop, stored_sa_up, stored_sa_down, stored_sa_stop] -> NULLSCOPE
>Getting scope for owner within context class be.uantwerpen.ansymo.semanticadaptation.semanticAdaptation.impl.VariableImpl
 Delegating scope discovery to super class...
<Scope found:ImportScope[lazy_sa.*] imports from org.eclipse.xtext.scoping.impl.MultimapBasedSelectable@17fa1336 for type FMU
>Getting scope for ref within context class be.uantwerpen.ansymo.semanticadaptation.semanticAdaptation.impl.VariableImpl
 Getting scope within FMU: lazy_sa
<Scope found:SimpleScope[obj_detected, passenger_up, passenger_down, passenger_stop, driver_up, driver_down, driver_stop, up, down, stop, obj_detected, passenger_up, passenger_down, passenger_stop, driver_up, driver_down, driver_stop, up, down, stop] -> NULLSCOPE
>Getting scope for ref within context class be.uantwerpen.ansymo.semanticadaptation.semanticAdaptation.impl.VariableImpl
<Scope found:SimpleScope[obj_detected, passenger_up, passenger_down, passenger_stop, driver_up, driver_down, driver_stop, up, down, stop, obj_detected, passenger_up, passenger_down, passenger_stop, driver_up, driver_down, driver_stop, up, down, stop, INIT_OBJ_DETECTED, INIT_PASSENGER_UP, INIT_PASSENGER_DOWN, INIT_PASSENGER_STOP, INIT_DRIVER_UP, INIT_DRIVER_DOWN, INIT_DRIVER_STOP, INIT_UP, INIT_DOWN, INIT_STOP, tn, tl, prev_obj_detected, prev_passenger_up, prev_passenger_down, prev_passenger_stop, prev_driver_up, prev_driver_down, prev_driver_stop, step_size, step_to_be_done, step_done, stored_sa_obj_detected, stored_sa_passenger_up, stored_sa_passenger_down, stored_sa_passenger_stop, stored_sa_driver_up, stored_sa_driver_down, stored_sa_driver_stop, stored_sa_up, stored_sa_down, stored_sa_stop] -> NULLSCOPE
>Getting scope for owner within context class be.uantwerpen.ansymo.semanticadaptation.semanticAdaptation.impl.VariableImpl
 Delegating scope discovery to super class...
<Scope found:ImportScope[lazy_sa.*] imports from org.eclipse.xtext.scoping.impl.MultimapBasedSelectable@17fa1336 for type FMU
>Getting scope for ref within context class be.uantwerpen.ansymo.semanticadaptation.semanticAdaptation.impl.VariableImpl
 Getting scope within FMU: lazy_sa
<Scope found:SimpleScope[obj_detected, passenger_up, passenger_down, passenger_stop, driver_up, driver_down, driver_stop, up, down, stop, obj_detected, passenger_up, passenger_down, passenger_stop, driver_up, driver_down, driver_stop, up, down, stop] -> NULLSCOPE
>Getting scope for ref within context class be.uantwerpen.ansymo.semanticadaptation.semanticAdaptation.impl.VariableImpl
<Scope found:SimpleScope[obj_detected, passenger_up, passenger_down, passenger_stop, driver_up, driver_down, driver_stop, up, down, stop, obj_detected, passenger_up, passenger_down, passenger_stop, driver_up, driver_down, driver_stop, up, down, stop, INIT_OBJ_DETECTED, INIT_PASSENGER_UP, INIT_PASSENGER_DOWN, INIT_PASSENGER_STOP, INIT_DRIVER_UP, INIT_DRIVER_DOWN, INIT_DRIVER_STOP, INIT_UP, INIT_DOWN, INIT_STOP, tn, tl, prev_obj_detected, prev_passenger_up, prev_passenger_down, prev_passenger_stop, prev_driver_up, prev_driver_down, prev_driver_stop, step_size, step_to_be_done, step_done, stored_sa_obj_detected, stored_sa_passenger_up, stored_sa_passenger_down, stored_sa_passenger_stop, stored_sa_driver_up, stored_sa_driver_down, stored_sa_driver_stop, stored_sa_up, stored_sa_down, stored_sa_stop] -> NULLSCOPE
>Getting scope for owner within context class be.uantwerpen.ansymo.semanticadaptation.semanticAdaptation.impl.VariableImpl
 Delegating scope discovery to super class...
<Scope found:ImportScope[lazy_sa.*] imports from org.eclipse.xtext.scoping.impl.MultimapBasedSelectable@17fa1336 for type FMU
>Getting scope for ref within context class be.uantwerpen.ansymo.semanticadaptation.semanticAdaptation.impl.VariableImpl
 Getting scope within FMU: lazy_sa
<Scope found:SimpleScope[obj_detected, passenger_up, passenger_down, passenger_stop, driver_up, driver_down, driver_stop, up, down, stop, obj_detected, passenger_up, passenger_down, passenger_stop, driver_up, driver_down, driver_stop, up, down, stop] -> NULLSCOPE
>Getting scope for ref within context class be.uantwerpen.ansymo.semanticadaptation.semanticAdaptation.impl.VariableImpl
<Scope found:SimpleScope[obj_detected, passenger_up, passenger_down, passenger_stop, driver_up, driver_down, driver_stop, up, down, stop, obj_detected, passenger_up, passenger_down, passenger_stop, driver_up, driver_down, driver_stop, up, down, stop, INIT_OBJ_DETECTED, INIT_PASSENGER_UP, INIT_PASSENGER_DOWN, INIT_PASSENGER_STOP, INIT_DRIVER_UP, INIT_DRIVER_DOWN, INIT_DRIVER_STOP, INIT_UP, INIT_DOWN, INIT_STOP, tn, tl, prev_obj_detected, prev_passenger_up, prev_passenger_down, prev_passenger_stop, prev_driver_up, prev_driver_down, prev_driver_stop, step_size, step_to_be_done, step_done, stored_sa_obj_detected, stored_sa_passenger_up, stored_sa_passenger_down, stored_sa_passenger_stop, stored_sa_driver_up, stored_sa_driver_down, stored_sa_driver_stop, stored_sa_up, stored_sa_down, stored_sa_stop] -> NULLSCOPE
>Getting scope for owner within context class be.uantwerpen.ansymo.semanticadaptation.semanticAdaptation.impl.VariableImpl
 Delegating scope discovery to super class...
<Scope found:ImportScope[lazy_sa.*] imports from org.eclipse.xtext.scoping.impl.MultimapBasedSelectable@17fa1336 for type FMU
>Getting scope for ref within context class be.uantwerpen.ansymo.semanticadaptation.semanticAdaptation.impl.VariableImpl
 Getting scope within FMU: lazy_sa
<Scope found:SimpleScope[obj_detected, passenger_up, passenger_down, passenger_stop, driver_up, driver_down, driver_stop, up, down, stop, obj_detected, passenger_up, passenger_down, passenger_stop, driver_up, driver_down, driver_stop, up, down, stop] -> NULLSCOPE
>Getting scope for ref within context class be.uantwerpen.ansymo.semanticadaptation.semanticAdaptation.impl.VariableImpl
<Scope found:SimpleScope[obj_detected, passenger_up, passenger_down, passenger_stop, driver_up, driver_down, driver_stop, up, down, stop, obj_detected, passenger_up, passenger_down, passenger_stop, driver_up, driver_down, driver_stop, up, down, stop, INIT_OBJ_DETECTED, INIT_PASSENGER_UP, INIT_PASSENGER_DOWN, INIT_PASSENGER_STOP, INIT_DRIVER_UP, INIT_DRIVER_DOWN, INIT_DRIVER_STOP, INIT_UP, INIT_DOWN, INIT_STOP, tn, tl, prev_obj_detected, prev_passenger_up, prev_passenger_down, prev_passenger_stop, prev_driver_up, prev_driver_down, prev_driver_stop, step_size, step_to_be_done, step_done, stored_sa_obj_detected, stored_sa_passenger_up, stored_sa_passenger_down, stored_sa_passenger_stop, stored_sa_driver_up, stored_sa_driver_down, stored_sa_driver_stop, stored_sa_up, stored_sa_down, stored_sa_stop] -> NULLSCOPE
>Getting scope for owner within context class be.uantwerpen.ansymo.semanticadaptation.semanticAdaptation.impl.VariableImpl
 Delegating scope discovery to super class...
<Scope found:ImportScope[lazy_sa.*] imports from org.eclipse.xtext.scoping.impl.MultimapBasedSelectable@17fa1336 for type FMU
>Getting scope for ref within context class be.uantwerpen.ansymo.semanticadaptation.semanticAdaptation.impl.VariableImpl
 Getting scope within FMU: lazy_sa
<Scope found:SimpleScope[obj_detected, passenger_up, passenger_down, passenger_stop, driver_up, driver_down, driver_stop, up, down, stop, obj_detected, passenger_up, passenger_down, passenger_stop, driver_up, driver_down, driver_stop, up, down, stop] -> NULLSCOPE
>Getting scope for ref within context class be.uantwerpen.ansymo.semanticadaptation.semanticAdaptation.impl.VariableImpl
<Scope found:SimpleScope[obj_detected, passenger_up, passenger_down, passenger_stop, driver_up, driver_down, driver_stop, up, down, stop, obj_detected, passenger_up, passenger_down, passenger_stop, driver_up, driver_down, driver_stop, up, down, stop, INIT_OBJ_DETECTED, INIT_PASSENGER_UP, INIT_PASSENGER_DOWN, INIT_PASSENGER_STOP, INIT_DRIVER_UP, INIT_DRIVER_DOWN, INIT_DRIVER_STOP, INIT_UP, INIT_DOWN, INIT_STOP, tn, tl, prev_obj_detected, prev_passenger_up, prev_passenger_down, prev_passenger_stop, prev_driver_up, prev_driver_down, prev_driver_stop, step_size, step_to_be_done, step_done, stored_sa_obj_detected, stored_sa_passenger_up, stored_sa_passenger_down, stored_sa_passenger_stop, stored_sa_driver_up, stored_sa_driver_down, stored_sa_driver_stop, stored_sa_up, stored_sa_down, stored_sa_stop] -> NULLSCOPE
>Getting scope for owner within context class be.uantwerpen.ansymo.semanticadaptation.semanticAdaptation.impl.VariableImpl
 Delegating scope discovery to super class...
<Scope found:ImportScope[lazy_sa.*] imports from org.eclipse.xtext.scoping.impl.MultimapBasedSelectable@17fa1336 for type FMU
>Getting scope for ref within context class be.uantwerpen.ansymo.semanticadaptation.semanticAdaptation.impl.VariableImpl
 Getting scope within FMU: lazy_sa
<Scope found:SimpleScope[obj_detected, passenger_up, passenger_down, passenger_stop, driver_up, driver_down, driver_stop, up, down, stop, obj_detected, passenger_up, passenger_down, passenger_stop, driver_up, driver_down, driver_stop, up, down, stop] -> NULLSCOPE
>Getting scope for ref within context class be.uantwerpen.ansymo.semanticadaptation.semanticAdaptation.impl.VariableImpl
<Scope found:SimpleScope[obj_detected, passenger_up, passenger_down, passenger_stop, driver_up, driver_down, driver_stop, up, down, stop, obj_detected, passenger_up, passenger_down, passenger_stop, driver_up, driver_down, driver_stop, up, down, stop, INIT_OBJ_DETECTED, INIT_PASSENGER_UP, INIT_PASSENGER_DOWN, INIT_PASSENGER_STOP, INIT_DRIVER_UP, INIT_DRIVER_DOWN, INIT_DRIVER_STOP, INIT_UP, INIT_DOWN, INIT_STOP, tn, tl, prev_obj_detected, prev_passenger_up, prev_passenger_down, prev_passenger_stop, prev_driver_up, prev_driver_down, prev_driver_stop, step_size, step_to_be_done, step_done, stored_sa_obj_detected, stored_sa_passenger_up, stored_sa_passenger_down, stored_sa_passenger_stop, stored_sa_driver_up, stored_sa_driver_down, stored_sa_driver_stop, stored_sa_up, stored_sa_down, stored_sa_stop] -> NULLSCOPE
>Getting scope for ref within context class be.uantwerpen.ansymo.semanticadaptation.semanticAdaptation.impl.VariableImpl
<Scope found:SimpleScope[obj_detected, passenger_up, passenger_down, passenger_stop, driver_up, driver_down, driver_stop, up, down, stop, obj_detected, passenger_up, passenger_down, passenger_stop, driver_up, driver_down, driver_stop, up, down, stop, INIT_OBJ_DETECTED, INIT_PASSENGER_UP, INIT_PASSENGER_DOWN, INIT_PASSENGER_STOP, INIT_DRIVER_UP, INIT_DRIVER_DOWN, INIT_DRIVER_STOP, INIT_UP, INIT_DOWN, INIT_STOP, tn, tl, prev_obj_detected, prev_passenger_up, prev_passenger_down, prev_passenger_stop, prev_driver_up, prev_driver_down, prev_driver_stop, step_size, step_to_be_done, step_done, stored_sa_obj_detected, stored_sa_passenger_up, stored_sa_passenger_down, stored_sa_passenger_stop, stored_sa_driver_up, stored_sa_driver_down, stored_sa_driver_stop, stored_sa_up, stored_sa_down, stored_sa_stop] -> NULLSCOPE
>Getting scope for ref within context class be.uantwerpen.ansymo.semanticadaptation.semanticAdaptation.impl.VariableImpl
<Scope found:SimpleScope[obj_detected, passenger_up, passenger_down, passenger_stop, driver_up, driver_down, driver_stop, up, down, stop, obj_detected, passenger_up, passenger_down, passenger_stop, driver_up, driver_down, driver_stop, up, down, stop, INIT_OBJ_DETECTED, INIT_PASSENGER_UP, INIT_PASSENGER_DOWN, INIT_PASSENGER_STOP, INIT_DRIVER_UP, INIT_DRIVER_DOWN, INIT_DRIVER_STOP, INIT_UP, INIT_DOWN, INIT_STOP, tn, tl, prev_obj_detected, prev_passenger_up, prev_passenger_down, prev_passenger_stop, prev_driver_up, prev_driver_down, prev_driver_stop, step_size, step_to_be_done, step_done, stored_sa_obj_detected, stored_sa_passenger_up, stored_sa_passenger_down, stored_sa_passenger_stop, stored_sa_driver_up, stored_sa_driver_down, stored_sa_driver_stop, stored_sa_up, stored_sa_down, stored_sa_stop] -> NULLSCOPE
>Getting scope for fmu within context class be.uantwerpen.ansymo.semanticadaptation.semanticAdaptation.impl.DoStepFunImpl
 Delegating scope discovery to super class...
<Scope found:ImportScope[lazy_sa.step_done.*] imports from org.eclipse.xtext.scoping.impl.MultimapBasedSelectable@17fa1336 for type FMU
>Getting scope for ref within context class be.uantwerpen.ansymo.semanticadaptation.semanticAdaptation.impl.VariableImpl
<Scope found:SimpleScope[obj_detected, passenger_up, passenger_down, passenger_stop, driver_up, driver_down, driver_stop, up, down, stop, obj_detected, passenger_up, passenger_down, passenger_stop, driver_up, driver_down, driver_stop, up, down, stop, INIT_OBJ_DETECTED, INIT_PASSENGER_UP, INIT_PASSENGER_DOWN, INIT_PASSENGER_STOP, INIT_DRIVER_UP, INIT_DRIVER_DOWN, INIT_DRIVER_STOP, INIT_UP, INIT_DOWN, INIT_STOP, tn, tl, prev_obj_detected, prev_passenger_up, prev_passenger_down, prev_passenger_stop, prev_driver_up, prev_driver_down, prev_driver_stop, step_size, step_to_be_done, step_done, stored_sa_obj_detected, stored_sa_passenger_up, stored_sa_passenger_down, stored_sa_passenger_stop, stored_sa_driver_up, stored_sa_driver_down, stored_sa_driver_stop, stored_sa_up, stored_sa_down, stored_sa_stop] -> NULLSCOPE
>Getting scope for ref within context class be.uantwerpen.ansymo.semanticadaptation.semanticAdaptation.impl.VariableImpl
<Scope found:SimpleScope[obj_detected, passenger_up, passenger_down, passenger_stop, driver_up, driver_down, driver_stop, up, down, stop, obj_detected, passenger_up, passenger_down, passenger_stop, driver_up, driver_down, driver_stop, up, down, stop, INIT_OBJ_DETECTED, INIT_PASSENGER_UP, INIT_PASSENGER_DOWN, INIT_PASSENGER_STOP, INIT_DRIVER_UP, INIT_DRIVER_DOWN, INIT_DRIVER_STOP, INIT_UP, INIT_DOWN, INIT_STOP, tn, tl, prev_obj_detected, prev_passenger_up, prev_passenger_down, prev_passenger_stop, prev_driver_up, prev_driver_down, prev_driver_stop, step_size, step_to_be_done, step_done, stored_sa_obj_detected, stored_sa_passenger_up, stored_sa_passenger_down, stored_sa_passenger_stop, stored_sa_driver_up, stored_sa_driver_down, stored_sa_driver_stop, stored_sa_up, stored_sa_down, stored_sa_stop] -> NULLSCOPE
>Getting scope for ref within context class be.uantwerpen.ansymo.semanticadaptation.semanticAdaptation.impl.VariableImpl
<Scope found:SimpleScope[obj_detected, passenger_up, passenger_down, passenger_stop, driver_up, driver_down, driver_stop, up, down, stop, obj_detected, passenger_up, passenger_down, passenger_stop, driver_up, driver_down, driver_stop, up, down, stop, INIT_OBJ_DETECTED, INIT_PASSENGER_UP, INIT_PASSENGER_DOWN, INIT_PASSENGER_STOP, INIT_DRIVER_UP, INIT_DRIVER_DOWN, INIT_DRIVER_STOP, INIT_UP, INIT_DOWN, INIT_STOP, tn, tl, prev_obj_detected, prev_passenger_up, prev_passenger_down, prev_passenger_stop, prev_driver_up, prev_driver_down, prev_driver_stop, step_size, step_to_be_done, step_done, stored_sa_obj_detected, stored_sa_passenger_up, stored_sa_passenger_down, stored_sa_passenger_stop, stored_sa_driver_up, stored_sa_driver_down, stored_sa_driver_stop, stored_sa_up, stored_sa_down, stored_sa_stop] -> NULLSCOPE
>Getting scope for ref within context class be.uantwerpen.ansymo.semanticadaptation.semanticAdaptation.impl.VariableImpl
<Scope found:SimpleScope[obj_detected, passenger_up, passenger_down, passenger_stop, driver_up, driver_down, driver_stop, up, down, stop, obj_detected, passenger_up, passenger_down, passenger_stop, driver_up, driver_down, driver_stop, up, down, stop, INIT_OBJ_DETECTED, INIT_PASSENGER_UP, INIT_PASSENGER_DOWN, INIT_PASSENGER_STOP, INIT_DRIVER_UP, INIT_DRIVER_DOWN, INIT_DRIVER_STOP, INIT_UP, INIT_DOWN, INIT_STOP, tn, tl, prev_obj_detected, prev_passenger_up, prev_passenger_down, prev_passenger_stop, prev_driver_up, prev_driver_down, prev_driver_stop, step_size, step_to_be_done, step_done, stored_sa_obj_detected, stored_sa_passenger_up, stored_sa_passenger_down, stored_sa_passenger_stop, stored_sa_driver_up, stored_sa_driver_down, stored_sa_driver_stop, stored_sa_up, stored_sa_down, stored_sa_stop] -> NULLSCOPE
>Getting scope for fmu within context class be.uantwerpen.ansymo.semanticadaptation.semanticAdaptation.impl.GetNextInternalTimeStepImpl
 Delegating scope discovery to super class...
<Scope found:ImportScope[lazy_sa.*] imports from org.eclipse.xtext.scoping.impl.MultimapBasedSelectable@17fa1336 for type FMU
>Getting scope for ref within context class be.uantwerpen.ansymo.semanticadaptation.semanticAdaptation.impl.VariableImpl
<Scope found:SimpleScope[obj_detected, passenger_up, passenger_down, passenger_stop, driver_up, driver_down, driver_stop, up, down, stop, obj_detected, passenger_up, passenger_down, passenger_stop, driver_up, driver_down, driver_stop, up, down, stop, INIT_OBJ_DETECTED, INIT_PASSENGER_UP, INIT_PASSENGER_DOWN, INIT_PASSENGER_STOP, INIT_DRIVER_UP, INIT_DRIVER_DOWN, INIT_DRIVER_STOP, INIT_UP, INIT_DOWN, INIT_STOP, tn, tl, prev_obj_detected, prev_passenger_up, prev_passenger_down, prev_passenger_stop, prev_driver_up, prev_driver_down, prev_driver_stop, step_size, step_to_be_done, step_done, stored_sa_obj_detected, stored_sa_passenger_up, stored_sa_passenger_down, stored_sa_passenger_stop, stored_sa_driver_up, stored_sa_driver_down, stored_sa_driver_stop, stored_sa_up, stored_sa_down, stored_sa_stop] -> NULLSCOPE
>Getting scope for ref within context class be.uantwerpen.ansymo.semanticadaptation.semanticAdaptation.impl.VariableImpl
<Scope found:SimpleScope[obj_detected, passenger_up, passenger_down, passenger_stop, driver_up, driver_down, driver_stop, up, down, stop, obj_detected, passenger_up, passenger_down, passenger_stop, driver_up, driver_down, driver_stop, up, down, stop, INIT_OBJ_DETECTED, INIT_PASSENGER_UP, INIT_PASSENGER_DOWN, INIT_PASSENGER_STOP, INIT_DRIVER_UP, INIT_DRIVER_DOWN, INIT_DRIVER_STOP, INIT_UP, INIT_DOWN, INIT_STOP, tn, tl, prev_obj_detected, prev_passenger_up, prev_passenger_down, prev_passenger_stop, prev_driver_up, prev_driver_down, prev_driver_stop, step_size, step_to_be_done, step_done, stored_sa_obj_detected, stored_sa_passenger_up, stored_sa_passenger_down, stored_sa_passenger_stop, stored_sa_driver_up, stored_sa_driver_down, stored_sa_driver_stop, stored_sa_up, stored_sa_down, stored_sa_stop] -> NULLSCOPE
>Getting scope for ref within context class be.uantwerpen.ansymo.semanticadaptation.semanticAdaptation.impl.VariableImpl
<Scope found:SimpleScope[obj_detected, passenger_up, passenger_down, passenger_stop, driver_up, driver_down, driver_stop, up, down, stop, obj_detected, passenger_up, passenger_down, passenger_stop, driver_up, driver_down, driver_stop, up, down, stop, INIT_OBJ_DETECTED, INIT_PASSENGER_UP, INIT_PASSENGER_DOWN, INIT_PASSENGER_STOP, INIT_DRIVER_UP, INIT_DRIVER_DOWN, INIT_DRIVER_STOP, INIT_UP, INIT_DOWN, INIT_STOP, tn, tl, prev_obj_detected, prev_passenger_up, prev_passenger_down, prev_passenger_stop, prev_driver_up, prev_driver_down, prev_driver_stop, step_size, step_to_be_done, step_done, stored_sa_obj_detected, stored_sa_passenger_up, stored_sa_passenger_down, stored_sa_passenger_stop, stored_sa_driver_up, stored_sa_driver_down, stored_sa_driver_stop, stored_sa_up, stored_sa_down, stored_sa_stop] -> NULLSCOPE
>Getting scope for ref within context class be.uantwerpen.ansymo.semanticadaptation.semanticAdaptation.impl.VariableImpl
<Scope found:SimpleScope[obj_detected, passenger_up, passenger_down, passenger_stop, driver_up, driver_down, driver_stop, up, down, stop, obj_detected, passenger_up, passenger_down, passenger_stop, driver_up, driver_down, driver_stop, up, down, stop, INIT_OBJ_DETECTED, INIT_PASSENGER_UP, INIT_PASSENGER_DOWN, INIT_PASSENGER_STOP, INIT_DRIVER_UP, INIT_DRIVER_DOWN, INIT_DRIVER_STOP, INIT_UP, INIT_DOWN, INIT_STOP, tn, tl, prev_obj_detected, prev_passenger_up, prev_passenger_down, prev_passenger_stop, prev_driver_up, prev_driver_down, prev_driver_stop, step_size, step_to_be_done, step_done, stored_sa_obj_detected, stored_sa_passenger_up, stored_sa_passenger_down, stored_sa_passenger_stop, stored_sa_driver_up, stored_sa_driver_down, stored_sa_driver_stop, stored_sa_up, stored_sa_down, stored_sa_stop] -> NULLSCOPE
>Getting scope for ref within context class be.uantwerpen.ansymo.semanticadaptation.semanticAdaptation.impl.VariableImpl
<Scope found:SimpleScope[obj_detected, passenger_up, passenger_down, passenger_stop, driver_up, driver_down, driver_stop, up, down, stop, obj_detected, passenger_up, passenger_down, passenger_stop, driver_up, driver_down, driver_stop, up, down, stop, INIT_OBJ_DETECTED, INIT_PASSENGER_UP, INIT_PASSENGER_DOWN, INIT_PASSENGER_STOP, INIT_DRIVER_UP, INIT_DRIVER_DOWN, INIT_DRIVER_STOP, INIT_UP, INIT_DOWN, INIT_STOP, tn, tl, prev_obj_detected, prev_passenger_up, prev_passenger_down, prev_passenger_stop, prev_driver_up, prev_driver_down, prev_driver_stop, step_size, step_to_be_done, step_done, stored_sa_obj_detected, stored_sa_passenger_up, stored_sa_passenger_down, stored_sa_passenger_stop, stored_sa_driver_up, stored_sa_driver_down, stored_sa_driver_stop, stored_sa_up, stored_sa_down, stored_sa_stop] -> NULLSCOPE
>Getting scope for ref within context class be.uantwerpen.ansymo.semanticadaptation.semanticAdaptation.impl.VariableImpl
<Scope found:SimpleScope[obj_detected, passenger_up, passenger_down, passenger_stop, driver_up, driver_down, driver_stop, up, down, stop, obj_detected, passenger_up, passenger_down, passenger_stop, driver_up, driver_down, driver_stop, up, down, stop, INIT_OBJ_DETECTED, INIT_PASSENGER_UP, INIT_PASSENGER_DOWN, INIT_PASSENGER_STOP, INIT_DRIVER_UP, INIT_DRIVER_DOWN, INIT_DRIVER_STOP, INIT_UP, INIT_DOWN, INIT_STOP, tn, tl, prev_obj_detected, prev_passenger_up, prev_passenger_down, prev_passenger_stop, prev_driver_up, prev_driver_down, prev_driver_stop, step_size, step_to_be_done, step_done, stored_sa_obj_detected, stored_sa_passenger_up, stored_sa_passenger_down, stored_sa_passenger_stop, stored_sa_driver_up, stored_sa_driver_down, stored_sa_driver_stop, stored_sa_up, stored_sa_down, stored_sa_stop] -> NULLSCOPE
>Getting scope for ref within context class be.uantwerpen.ansymo.semanticadaptation.semanticAdaptation.impl.VariableImpl
<Scope found:SimpleScope[obj_detected, passenger_up, passenger_down, passenger_stop, driver_up, driver_down, driver_stop, up, down, stop, obj_detected, passenger_up, passenger_down, passenger_stop, driver_up, driver_down, driver_stop, up, down, stop, INIT_OBJ_DETECTED, INIT_PASSENGER_UP, INIT_PASSENGER_DOWN, INIT_PASSENGER_STOP, INIT_DRIVER_UP, INIT_DRIVER_DOWN, INIT_DRIVER_STOP, INIT_UP, INIT_DOWN, INIT_STOP, tn, tl, prev_obj_detected, prev_passenger_up, prev_passenger_down, prev_passenger_stop, prev_driver_up, prev_driver_down, prev_driver_stop, step_size, step_to_be_done, step_done, stored_sa_obj_detected, stored_sa_passenger_up, stored_sa_passenger_down, stored_sa_passenger_stop, stored_sa_driver_up, stored_sa_driver_down, stored_sa_driver_stop, stored_sa_up, stored_sa_down, stored_sa_stop] -> NULLSCOPE
>Getting scope for owner within context class be.uantwerpen.ansymo.semanticadaptation.semanticAdaptation.impl.VariableImpl
 Delegating scope discovery to super class...
<Scope found:ImportScope[lazy_sa.*] imports from org.eclipse.xtext.scoping.impl.MultimapBasedSelectable@17fa1336 for type FMU
>Getting scope for ref within context class be.uantwerpen.ansymo.semanticadaptation.semanticAdaptation.impl.VariableImpl
 Getting scope within FMU: lazy_sa
<Scope found:SimpleScope[obj_detected, passenger_up, passenger_down, passenger_stop, driver_up, driver_down, driver_stop, up, down, stop, obj_detected, passenger_up, passenger_down, passenger_stop, driver_up, driver_down, driver_stop, up, down, stop] -> NULLSCOPE
>Getting scope for ref within context class be.uantwerpen.ansymo.semanticadaptation.semanticAdaptation.impl.VariableImpl
<Scope found:SimpleScope[obj_detected, passenger_up, passenger_down, passenger_stop, driver_up, driver_down, driver_stop, up, down, stop, obj_detected, passenger_up, passenger_down, passenger_stop, driver_up, driver_down, driver_stop, up, down, stop, INIT_OBJ_DETECTED, INIT_PASSENGER_UP, INIT_PASSENGER_DOWN, INIT_PASSENGER_STOP, INIT_DRIVER_UP, INIT_DRIVER_DOWN, INIT_DRIVER_STOP, INIT_UP, INIT_DOWN, INIT_STOP, tn, tl, prev_obj_detected, prev_passenger_up, prev_passenger_down, prev_passenger_stop, prev_driver_up, prev_driver_down, prev_driver_stop, step_size, step_to_be_done, step_done, stored_sa_obj_detected, stored_sa_passenger_up, stored_sa_passenger_down, stored_sa_passenger_stop, stored_sa_driver_up, stored_sa_driver_down, stored_sa_driver_stop, stored_sa_up, stored_sa_down, stored_sa_stop] -> NULLSCOPE
>Getting scope for owner within context class be.uantwerpen.ansymo.semanticadaptation.semanticAdaptation.impl.VariableImpl
 Delegating scope discovery to super class...
<Scope found:ImportScope[lazy_sa.*] imports from org.eclipse.xtext.scoping.impl.MultimapBasedSelectable@17fa1336 for type FMU
>Getting scope for ref within context class be.uantwerpen.ansymo.semanticadaptation.semanticAdaptation.impl.VariableImpl
 Getting scope within FMU: lazy_sa
<Scope found:SimpleScope[obj_detected, passenger_up, passenger_down, passenger_stop, driver_up, driver_down, driver_stop, up, down, stop, obj_detected, passenger_up, passenger_down, passenger_stop, driver_up, driver_down, driver_stop, up, down, stop] -> NULLSCOPE
>Getting scope for ref within context class be.uantwerpen.ansymo.semanticadaptation.semanticAdaptation.impl.VariableImpl
<Scope found:SimpleScope[obj_detected, passenger_up, passenger_down, passenger_stop, driver_up, driver_down, driver_stop, up, down, stop, obj_detected, passenger_up, passenger_down, passenger_stop, driver_up, driver_down, driver_stop, up, down, stop, INIT_OBJ_DETECTED, INIT_PASSENGER_UP, INIT_PASSENGER_DOWN, INIT_PASSENGER_STOP, INIT_DRIVER_UP, INIT_DRIVER_DOWN, INIT_DRIVER_STOP, INIT_UP, INIT_DOWN, INIT_STOP, tn, tl, prev_obj_detected, prev_passenger_up, prev_passenger_down, prev_passenger_stop, prev_driver_up, prev_driver_down, prev_driver_stop, step_size, step_to_be_done, step_done, stored_sa_obj_detected, stored_sa_passenger_up, stored_sa_passenger_down, stored_sa_passenger_stop, stored_sa_driver_up, stored_sa_driver_down, stored_sa_driver_stop, stored_sa_up, stored_sa_down, stored_sa_stop] -> NULLSCOPE
>Getting scope for owner within context class be.uantwerpen.ansymo.semanticadaptation.semanticAdaptation.impl.VariableImpl
 Delegating scope discovery to super class...
<Scope found:ImportScope[lazy_sa.*] imports from org.eclipse.xtext.scoping.impl.MultimapBasedSelectable@17fa1336 for type FMU
>Getting scope for ref within context class be.uantwerpen.ansymo.semanticadaptation.semanticAdaptation.impl.VariableImpl
 Getting scope within FMU: lazy_sa
<Scope found:SimpleScope[obj_detected, passenger_up, passenger_down, passenger_stop, driver_up, driver_down, driver_stop, up, down, stop, obj_detected, passenger_up, passenger_down, passenger_stop, driver_up, driver_down, driver_stop, up, down, stop] -> NULLSCOPE
>Getting scope for ref within context class be.uantwerpen.ansymo.semanticadaptation.semanticAdaptation.impl.VariableImpl
<Scope found:SimpleScope[obj_detected, passenger_up, passenger_down, passenger_stop, driver_up, driver_down, driver_stop, up, down, stop, obj_detected, passenger_up, passenger_down, passenger_stop, driver_up, driver_down, driver_stop, up, down, stop, INIT_OBJ_DETECTED, INIT_PASSENGER_UP, INIT_PASSENGER_DOWN, INIT_PASSENGER_STOP, INIT_DRIVER_UP, INIT_DRIVER_DOWN, INIT_DRIVER_STOP, INIT_UP, INIT_DOWN, INIT_STOP, tn, tl, prev_obj_detected, prev_passenger_up, prev_passenger_down, prev_passenger_stop, prev_driver_up, prev_driver_down, prev_driver_stop, step_size, step_to_be_done, step_done, stored_sa_obj_detected, stored_sa_passenger_up, stored_sa_passenger_down, stored_sa_passenger_stop, stored_sa_driver_up, stored_sa_driver_down, stored_sa_driver_stop, stored_sa_up, stored_sa_down, stored_sa_stop] -> NULLSCOPE
>Getting scope for owner within context class be.uantwerpen.ansymo.semanticadaptation.semanticAdaptation.impl.VariableImpl
 Delegating scope discovery to super class...
<Scope found:ImportScope[lazy_sa.*] imports from org.eclipse.xtext.scoping.impl.MultimapBasedSelectable@17fa1336 for type FMU
>Getting scope for ref within context class be.uantwerpen.ansymo.semanticadaptation.semanticAdaptation.impl.VariableImpl
 Getting scope within FMU: lazy_sa
<Scope found:SimpleScope[obj_detected, passenger_up, passenger_down, passenger_stop, driver_up, driver_down, driver_stop, up, down, stop, obj_detected, passenger_up, passenger_down, passenger_stop, driver_up, driver_down, driver_stop, up, down, stop] -> NULLSCOPE
>Getting scope for ref within context class be.uantwerpen.ansymo.semanticadaptation.semanticAdaptation.impl.VariableImpl
<Scope found:SimpleScope[obj_detected, passenger_up, passenger_down, passenger_stop, driver_up, driver_down, driver_stop, up, down, stop, obj_detected, passenger_up, passenger_down, passenger_stop, driver_up, driver_down, driver_stop, up, down, stop, INIT_OBJ_DETECTED, INIT_PASSENGER_UP, INIT_PASSENGER_DOWN, INIT_PASSENGER_STOP, INIT_DRIVER_UP, INIT_DRIVER_DOWN, INIT_DRIVER_STOP, INIT_UP, INIT_DOWN, INIT_STOP, tn, tl, prev_obj_detected, prev_passenger_up, prev_passenger_down, prev_passenger_stop, prev_driver_up, prev_driver_down, prev_driver_stop, step_size, step_to_be_done, step_done, stored_sa_obj_detected, stored_sa_passenger_up, stored_sa_passenger_down, stored_sa_passenger_stop, stored_sa_driver_up, stored_sa_driver_down, stored_sa_driver_stop, stored_sa_up, stored_sa_down, stored_sa_stop] -> NULLSCOPE
>Getting scope for owner within context class be.uantwerpen.ansymo.semanticadaptation.semanticAdaptation.impl.VariableImpl
 Delegating scope discovery to super class...
<Scope found:ImportScope[lazy_sa.*] imports from org.eclipse.xtext.scoping.impl.MultimapBasedSelectable@17fa1336 for type FMU
>Getting scope for ref within context class be.uantwerpen.ansymo.semanticadaptation.semanticAdaptation.impl.VariableImpl
 Getting scope within FMU: lazy_sa
<Scope found:SimpleScope[obj_detected, passenger_up, passenger_down, passenger_stop, driver_up, driver_down, driver_stop, up, down, stop, obj_detected, passenger_up, passenger_down, passenger_stop, driver_up, driver_down, driver_stop, up, down, stop] -> NULLSCOPE
>Getting scope for ref within context class be.uantwerpen.ansymo.semanticadaptation.semanticAdaptation.impl.VariableImpl
<Scope found:SimpleScope[obj_detected, passenger_up, passenger_down, passenger_stop, driver_up, driver_down, driver_stop, up, down, stop, obj_detected, passenger_up, passenger_down, passenger_stop, driver_up, driver_down, driver_stop, up, down, stop, INIT_OBJ_DETECTED, INIT_PASSENGER_UP, INIT_PASSENGER_DOWN, INIT_PASSENGER_STOP, INIT_DRIVER_UP, INIT_DRIVER_DOWN, INIT_DRIVER_STOP, INIT_UP, INIT_DOWN, INIT_STOP, tn, tl, prev_obj_detected, prev_passenger_up, prev_passenger_down, prev_passenger_stop, prev_driver_up, prev_driver_down, prev_driver_stop, step_size, step_to_be_done, step_done, stored_sa_obj_detected, stored_sa_passenger_up, stored_sa_passenger_down, stored_sa_passenger_stop, stored_sa_driver_up, stored_sa_driver_down, stored_sa_driver_stop, stored_sa_up, stored_sa_down, stored_sa_stop] -> NULLSCOPE
>Getting scope for owner within context class be.uantwerpen.ansymo.semanticadaptation.semanticAdaptation.impl.VariableImpl
 Delegating scope discovery to super class...
<Scope found:ImportScope[lazy_sa.*] imports from org.eclipse.xtext.scoping.impl.MultimapBasedSelectable@17fa1336 for type FMU
>Getting scope for ref within context class be.uantwerpen.ansymo.semanticadaptation.semanticAdaptation.impl.VariableImpl
 Getting scope within FMU: lazy_sa
<Scope found:SimpleScope[obj_detected, passenger_up, passenger_down, passenger_stop, driver_up, driver_down, driver_stop, up, down, stop, obj_detected, passenger_up, passenger_down, passenger_stop, driver_up, driver_down, driver_stop, up, down, stop] -> NULLSCOPE
>Getting scope for ref within context class be.uantwerpen.ansymo.semanticadaptation.semanticAdaptation.impl.VariableImpl
<Scope found:SimpleScope[obj_detected, passenger_up, passenger_down, passenger_stop, driver_up, driver_down, driver_stop, up, down, stop, obj_detected, passenger_up, passenger_down, passenger_stop, driver_up, driver_down, driver_stop, up, down, stop, INIT_OBJ_DETECTED, INIT_PASSENGER_UP, INIT_PASSENGER_DOWN, INIT_PASSENGER_STOP, INIT_DRIVER_UP, INIT_DRIVER_DOWN, INIT_DRIVER_STOP, INIT_UP, INIT_DOWN, INIT_STOP, tn, tl, prev_obj_detected, prev_passenger_up, prev_passenger_down, prev_passenger_stop, prev_driver_up, prev_driver_down, prev_driver_stop, step_size, step_to_be_done, step_done, stored_sa_obj_detected, stored_sa_passenger_up, stored_sa_passenger_down, stored_sa_passenger_stop, stored_sa_driver_up, stored_sa_driver_down, stored_sa_driver_stop, stored_sa_up, stored_sa_down, stored_sa_stop] -> NULLSCOPE
>Getting scope for owner within context class be.uantwerpen.ansymo.semanticadaptation.semanticAdaptation.impl.VariableImpl
 Delegating scope discovery to super class...
<Scope found:ImportScope[lazy_sa.*] imports from org.eclipse.xtext.scoping.impl.MultimapBasedSelectable@17fa1336 for type FMU
>Getting scope for ref within context class be.uantwerpen.ansymo.semanticadaptation.semanticAdaptation.impl.VariableImpl
 Getting scope within FMU: lazy_sa
<Scope found:SimpleScope[obj_detected, passenger_up, passenger_down, passenger_stop, driver_up, driver_down, driver_stop, up, down, stop, obj_detected, passenger_up, passenger_down, passenger_stop, driver_up, driver_down, driver_stop, up, down, stop] -> NULLSCOPE
>Getting scope for ref within context class be.uantwerpen.ansymo.semanticadaptation.semanticAdaptation.impl.VariableImpl
<Scope found:SimpleScope[obj_detected, passenger_up, passenger_down, passenger_stop, driver_up, driver_down, driver_stop, up, down, stop, obj_detected, passenger_up, passenger_down, passenger_stop, driver_up, driver_down, driver_stop, up, down, stop, INIT_OBJ_DETECTED, INIT_PASSENGER_UP, INIT_PASSENGER_DOWN, INIT_PASSENGER_STOP, INIT_DRIVER_UP, INIT_DRIVER_DOWN, INIT_DRIVER_STOP, INIT_UP, INIT_DOWN, INIT_STOP, tn, tl, prev_obj_detected, prev_passenger_up, prev_passenger_down, prev_passenger_stop, prev_driver_up, prev_driver_down, prev_driver_stop, step_size, step_to_be_done, step_done, stored_sa_obj_detected, stored_sa_passenger_up, stored_sa_passenger_down, stored_sa_passenger_stop, stored_sa_driver_up, stored_sa_driver_down, stored_sa_driver_stop, stored_sa_up, stored_sa_down, stored_sa_stop] -> NULLSCOPE
>Getting scope for ref within context class be.uantwerpen.ansymo.semanticadaptation.semanticAdaptation.impl.VariableImpl
<Scope found:SimpleScope[obj_detected, passenger_up, passenger_down, passenger_stop, driver_up, driver_down, driver_stop, up, down, stop, obj_detected, passenger_up, passenger_down, passenger_stop, driver_up, driver_down, driver_stop, up, down, stop, INIT_OBJ_DETECTED, INIT_PASSENGER_UP, INIT_PASSENGER_DOWN, INIT_PASSENGER_STOP, INIT_DRIVER_UP, INIT_DRIVER_DOWN, INIT_DRIVER_STOP, INIT_UP, INIT_DOWN, INIT_STOP, tn, tl, prev_obj_detected, prev_passenger_up, prev_passenger_down, prev_passenger_stop, prev_driver_up, prev_driver_down, prev_driver_stop, step_size, step_to_be_done, step_done, stored_sa_obj_detected, stored_sa_passenger_up, stored_sa_passenger_down, stored_sa_passenger_stop, stored_sa_driver_up, stored_sa_driver_down, stored_sa_driver_stop, stored_sa_up, stored_sa_down, stored_sa_stop] -> NULLSCOPE
>Getting scope for owner within context class be.uantwerpen.ansymo.semanticadaptation.semanticAdaptation.impl.VariableImpl
 Delegating scope discovery to super class...
<Scope found:ImportScope[lazy_sa.*] imports from org.eclipse.xtext.scoping.impl.MultimapBasedSelectable@17fa1336 for type FMU
>Getting scope for ref within context class be.uantwerpen.ansymo.semanticadaptation.semanticAdaptation.impl.VariableImpl
 Getting scope within FMU: lazy_sa
<Scope found:SimpleScope[obj_detected, passenger_up, passenger_down, passenger_stop, driver_up, driver_down, driver_stop, up, down, stop, obj_detected, passenger_up, passenger_down, passenger_stop, driver_up, driver_down, driver_stop, up, down, stop] -> NULLSCOPE
>Getting scope for ref within context class be.uantwerpen.ansymo.semanticadaptation.semanticAdaptation.impl.VariableImpl
<Scope found:SimpleScope[obj_detected, passenger_up, passenger_down, passenger_stop, driver_up, driver_down, driver_stop, up, down, stop, obj_detected, passenger_up, passenger_down, passenger_stop, driver_up, driver_down, driver_stop, up, down, stop, INIT_OBJ_DETECTED, INIT_PASSENGER_UP, INIT_PASSENGER_DOWN, INIT_PASSENGER_STOP, INIT_DRIVER_UP, INIT_DRIVER_DOWN, INIT_DRIVER_STOP, INIT_UP, INIT_DOWN, INIT_STOP, tn, tl, prev_obj_detected, prev_passenger_up, prev_passenger_down, prev_passenger_stop, prev_driver_up, prev_driver_down, prev_driver_stop, step_size, step_to_be_done, step_done, stored_sa_obj_detected, stored_sa_passenger_up, stored_sa_passenger_down, stored_sa_passenger_stop, stored_sa_driver_up, stored_sa_driver_down, stored_sa_driver_stop, stored_sa_up, stored_sa_down, stored_sa_stop] -> NULLSCOPE
>Getting scope for owner within context class be.uantwerpen.ansymo.semanticadaptation.semanticAdaptation.impl.VariableImpl
 Delegating scope discovery to super class...
<Scope found:ImportScope[lazy_sa.*] imports from org.eclipse.xtext.scoping.impl.MultimapBasedSelectable@17fa1336 for type FMU
>Getting scope for ref within context class be.uantwerpen.ansymo.semanticadaptation.semanticAdaptation.impl.VariableImpl
 Getting scope within FMU: lazy_sa
<Scope found:SimpleScope[obj_detected, passenger_up, passenger_down, passenger_stop, driver_up, driver_down, driver_stop, up, down, stop, obj_detected, passenger_up, passenger_down, passenger_stop, driver_up, driver_down, driver_stop, up, down, stop] -> NULLSCOPE
>Getting scope for ref within context class be.uantwerpen.ansymo.semanticadaptation.semanticAdaptation.impl.VariableImpl
<Scope found:SimpleScope[obj_detected, passenger_up, passenger_down, passenger_stop, driver_up, driver_down, driver_stop, up, down, stop, obj_detected, passenger_up, passenger_down, passenger_stop, driver_up, driver_down, driver_stop, up, down, stop, INIT_OBJ_DETECTED, INIT_PASSENGER_UP, INIT_PASSENGER_DOWN, INIT_PASSENGER_STOP, INIT_DRIVER_UP, INIT_DRIVER_DOWN, INIT_DRIVER_STOP, INIT_UP, INIT_DOWN, INIT_STOP, tn, tl, prev_obj_detected, prev_passenger_up, prev_passenger_down, prev_passenger_stop, prev_driver_up, prev_driver_down, prev_driver_stop, step_size, step_to_be_done, step_done, stored_sa_obj_detected, stored_sa_passenger_up, stored_sa_passenger_down, stored_sa_passenger_stop, stored_sa_driver_up, stored_sa_driver_down, stored_sa_driver_stop, stored_sa_up, stored_sa_down, stored_sa_stop] -> NULLSCOPE
>Getting scope for owner within context class be.uantwerpen.ansymo.semanticadaptation.semanticAdaptation.impl.VariableImpl
 Delegating scope discovery to super class...
<Scope found:ImportScope[lazy_sa.*] imports from org.eclipse.xtext.scoping.impl.MultimapBasedSelectable@17fa1336 for type FMU
>Getting scope for ref within context class be.uantwerpen.ansymo.semanticadaptation.semanticAdaptation.impl.VariableImpl
 Getting scope within FMU: lazy_sa
<Scope found:SimpleScope[obj_detected, passenger_up, passenger_down, passenger_stop, driver_up, driver_down, driver_stop, up, down, stop, obj_detected, passenger_up, passenger_down, passenger_stop, driver_up, driver_down, driver_stop, up, down, stop] -> NULLSCOPE
>Getting scope for ref within context class be.uantwerpen.ansymo.semanticadaptation.semanticAdaptation.impl.VariableImpl
<Scope found:SimpleScope[obj_detected, passenger_up, passenger_down, passenger_stop, driver_up, driver_down, driver_stop, up, down, stop, obj_detected, passenger_up, passenger_down, passenger_stop, driver_up, driver_down, driver_stop, up, down, stop, INIT_OBJ_DETECTED, INIT_PASSENGER_UP, INIT_PASSENGER_DOWN, INIT_PASSENGER_STOP, INIT_DRIVER_UP, INIT_DRIVER_DOWN, INIT_DRIVER_STOP, INIT_UP, INIT_DOWN, INIT_STOP, tn, tl, prev_obj_detected, prev_passenger_up, prev_passenger_down, prev_passenger_stop, prev_driver_up, prev_driver_down, prev_driver_stop, step_size, step_to_be_done, step_done, stored_sa_obj_detected, stored_sa_passenger_up, stored_sa_passenger_down, stored_sa_passenger_stop, stored_sa_driver_up, stored_sa_driver_down, stored_sa_driver_stop, stored_sa_up, stored_sa_down, stored_sa_stop] -> NULLSCOPE
>Getting scope for owner within context class be.uantwerpen.ansymo.semanticadaptation.semanticAdaptation.impl.VariableImpl
 Delegating scope discovery to super class...
<Scope found:ImportScope[lazy_sa.*] imports from org.eclipse.xtext.scoping.impl.MultimapBasedSelectable@17fa1336 for type FMU
>Getting scope for ref within context class be.uantwerpen.ansymo.semanticadaptation.semanticAdaptation.impl.VariableImpl
 Getting scope within FMU: lazy_sa
<Scope found:SimpleScope[obj_detected, passenger_up, passenger_down, passenger_stop, driver_up, driver_down, driver_stop, up, down, stop, obj_detected, passenger_up, passenger_down, passenger_stop, driver_up, driver_down, driver_stop, up, down, stop] -> NULLSCOPE
>Getting scope for ref within context class be.uantwerpen.ansymo.semanticadaptation.semanticAdaptation.impl.VariableImpl
<Scope found:SimpleScope[obj_detected, passenger_up, passenger_down, passenger_stop, driver_up, driver_down, driver_stop, up, down, stop, obj_detected, passenger_up, passenger_down, passenger_stop, driver_up, driver_down, driver_stop, up, down, stop, INIT_OBJ_DETECTED, INIT_PASSENGER_UP, INIT_PASSENGER_DOWN, INIT_PASSENGER_STOP, INIT_DRIVER_UP, INIT_DRIVER_DOWN, INIT_DRIVER_STOP, INIT_UP, INIT_DOWN, INIT_STOP, tn, tl, prev_obj_detected, prev_passenger_up, prev_passenger_down, prev_passenger_stop, prev_driver_up, prev_driver_down, prev_driver_stop, step_size, step_to_be_done, step_done, stored_sa_obj_detected, stored_sa_passenger_up, stored_sa_passenger_down, stored_sa_passenger_stop, stored_sa_driver_up, stored_sa_driver_down, stored_sa_driver_stop, stored_sa_up, stored_sa_down, stored_sa_stop] -> NULLSCOPE
>Getting scope for owner within context class be.uantwerpen.ansymo.semanticadaptation.semanticAdaptation.impl.VariableImpl
 Delegating scope discovery to super class...
<Scope found:ImportScope[lazy_sa.*] imports from org.eclipse.xtext.scoping.impl.MultimapBasedSelectable@17fa1336 for type FMU
>Getting scope for ref within context class be.uantwerpen.ansymo.semanticadaptation.semanticAdaptation.impl.VariableImpl
 Getting scope within FMU: lazy_sa
<Scope found:SimpleScope[obj_detected, passenger_up, passenger_down, passenger_stop, driver_up, driver_down, driver_stop, up, down, stop, obj_detected, passenger_up, passenger_down, passenger_stop, driver_up, driver_down, driver_stop, up, down, stop] -> NULLSCOPE
>Getting scope for ref within context class be.uantwerpen.ansymo.semanticadaptation.semanticAdaptation.impl.VariableImpl
<Scope found:SimpleScope[obj_detected, passenger_up, passenger_down, passenger_stop, driver_up, driver_down, driver_stop, up, down, stop, obj_detected, passenger_up, passenger_down, passenger_stop, driver_up, driver_down, driver_stop, up, down, stop, INIT_OBJ_DETECTED, INIT_PASSENGER_UP, INIT_PASSENGER_DOWN, INIT_PASSENGER_STOP, INIT_DRIVER_UP, INIT_DRIVER_DOWN, INIT_DRIVER_STOP, INIT_UP, INIT_DOWN, INIT_STOP, tn, tl, prev_obj_detected, prev_passenger_up, prev_passenger_down, prev_passenger_stop, prev_driver_up, prev_driver_down, prev_driver_stop, step_size, step_to_be_done, step_done, stored_sa_obj_detected, stored_sa_passenger_up, stored_sa_passenger_down, stored_sa_passenger_stop, stored_sa_driver_up, stored_sa_driver_down, stored_sa_driver_stop, stored_sa_up, stored_sa_down, stored_sa_stop] -> NULLSCOPE
>Getting scope for owner within context class be.uantwerpen.ansymo.semanticadaptation.semanticAdaptation.impl.VariableImpl
 Delegating scope discovery to super class...
<Scope found:ImportScope[lazy_sa.*] imports from org.eclipse.xtext.scoping.impl.MultimapBasedSelectable@17fa1336 for type FMU
>Getting scope for ref within context class be.uantwerpen.ansymo.semanticadaptation.semanticAdaptation.impl.VariableImpl
 Getting scope within FMU: lazy_sa
<Scope found:SimpleScope[obj_detected, passenger_up, passenger_down, passenger_stop, driver_up, driver_down, driver_stop, up, down, stop, obj_detected, passenger_up, passenger_down, passenger_stop, driver_up, driver_down, driver_stop, up, down, stop] -> NULLSCOPE
>Getting scope for ref within context class be.uantwerpen.ansymo.semanticadaptation.semanticAdaptation.impl.VariableImpl
<Scope found:SimpleScope[obj_detected, passenger_up, passenger_down, passenger_stop, driver_up, driver_down, driver_stop, up, down, stop, obj_detected, passenger_up, passenger_down, passenger_stop, driver_up, driver_down, driver_stop, up, down, stop, INIT_OBJ_DETECTED, INIT_PASSENGER_UP, INIT_PASSENGER_DOWN, INIT_PASSENGER_STOP, INIT_DRIVER_UP, INIT_DRIVER_DOWN, INIT_DRIVER_STOP, INIT_UP, INIT_DOWN, INIT_STOP, tn, tl, prev_obj_detected, prev_passenger_up, prev_passenger_down, prev_passenger_stop, prev_driver_up, prev_driver_down, prev_driver_stop, step_size, step_to_be_done, step_done, stored_sa_obj_detected, stored_sa_passenger_up, stored_sa_passenger_down, stored_sa_passenger_stop, stored_sa_driver_up, stored_sa_driver_down, stored_sa_driver_stop, stored_sa_up, stored_sa_down, stored_sa_stop] -> NULLSCOPE
>Getting scope for owner within context class be.uantwerpen.ansymo.semanticadaptation.semanticAdaptation.impl.VariableImpl
 Delegating scope discovery to super class...
<Scope found:ImportScope[lazy_sa.*] imports from org.eclipse.xtext.scoping.impl.MultimapBasedSelectable@17fa1336 for type FMU
>Getting scope for ref within context class be.uantwerpen.ansymo.semanticadaptation.semanticAdaptation.impl.VariableImpl
 Getting scope within FMU: lazy_sa
<Scope found:SimpleScope[obj_detected, passenger_up, passenger_down, passenger_stop, driver_up, driver_down, driver_stop, up, down, stop, obj_detected, passenger_up, passenger_down, passenger_stop, driver_up, driver_down, driver_stop, up, down, stop] -> NULLSCOPE
>Getting scope for owner within context class be.uantwerpen.ansymo.semanticadaptation.semanticAdaptation.impl.VariableImpl
 Delegating scope discovery to super class...
<Scope found:ImportScope[lazy_sa.*] imports from org.eclipse.xtext.scoping.impl.MultimapBasedSelectable@17fa1336 for type FMU
>Getting scope for ref within context class be.uantwerpen.ansymo.semanticadaptation.semanticAdaptation.impl.VariableImpl
 Getting scope within FMU: controller
<Scope found:SimpleScope[obj_detected, passenger_up, passenger_down, passenger_stop, driver_up, driver_down, driver_stop, up, down, stop] -> NULLSCOPE
>Getting scope for ref within context class be.uantwerpen.ansymo.semanticadaptation.semanticAdaptation.impl.VariableImpl
<Scope found:SimpleScope[obj_detected, passenger_up, passenger_down, passenger_stop, driver_up, driver_down, driver_stop, up, down, stop, obj_detected, passenger_up, passenger_down, passenger_stop, driver_up, driver_down, driver_stop, up, down, stop, INIT_OBJ_DETECTED, INIT_PASSENGER_UP, INIT_PASSENGER_DOWN, INIT_PASSENGER_STOP, INIT_DRIVER_UP, INIT_DRIVER_DOWN, INIT_DRIVER_STOP, INIT_UP, INIT_DOWN, INIT_STOP, tn, tl, prev_obj_detected, prev_passenger_up, prev_passenger_down, prev_passenger_stop, prev_driver_up, prev_driver_down, prev_driver_stop, step_size, step_to_be_done, step_done, stored_sa_obj_detected, stored_sa_passenger_up, stored_sa_passenger_down, stored_sa_passenger_stop, stored_sa_driver_up, stored_sa_driver_down, stored_sa_driver_stop, stored_sa_up, stored_sa_down, stored_sa_stop] -> NULLSCOPE
>Getting scope for owner within context class be.uantwerpen.ansymo.semanticadaptation.semanticAdaptation.impl.VariableImpl
 Delegating scope discovery to super class...
<Scope found:ImportScope[lazy_sa.*] imports from org.eclipse.xtext.scoping.impl.MultimapBasedSelectable@17fa1336 for type FMU
>Getting scope for ref within context class be.uantwerpen.ansymo.semanticadaptation.semanticAdaptation.impl.VariableImpl
 Getting scope within FMU: controller
<Scope found:SimpleScope[obj_detected, passenger_up, passenger_down, passenger_stop, driver_up, driver_down, driver_stop, up, down, stop] -> NULLSCOPE
>Getting scope for ref within context class be.uantwerpen.ansymo.semanticadaptation.semanticAdaptation.impl.VariableImpl
<Scope found:SimpleScope[obj_detected, passenger_up, passenger_down, passenger_stop, driver_up, driver_down, driver_stop, up, down, stop, obj_detected, passenger_up, passenger_down, passenger_stop, driver_up, driver_down, driver_stop, up, down, stop, INIT_OBJ_DETECTED, INIT_PASSENGER_UP, INIT_PASSENGER_DOWN, INIT_PASSENGER_STOP, INIT_DRIVER_UP, INIT_DRIVER_DOWN, INIT_DRIVER_STOP, INIT_UP, INIT_DOWN, INIT_STOP, tn, tl, prev_obj_detected, prev_passenger_up, prev_passenger_down, prev_passenger_stop, prev_driver_up, prev_driver_down, prev_driver_stop, step_size, step_to_be_done, step_done, stored_sa_obj_detected, stored_sa_passenger_up, stored_sa_passenger_down, stored_sa_passenger_stop, stored_sa_driver_up, stored_sa_driver_down, stored_sa_driver_stop, stored_sa_up, stored_sa_down, stored_sa_stop] -> NULLSCOPE
>Getting scope for owner within context class be.uantwerpen.ansymo.semanticadaptation.semanticAdaptation.impl.VariableImpl
 Delegating scope discovery to super class...
<Scope found:ImportScope[lazy_sa.*] imports from org.eclipse.xtext.scoping.impl.MultimapBasedSelectable@17fa1336 for type FMU
>Getting scope for ref within context class be.uantwerpen.ansymo.semanticadaptation.semanticAdaptation.impl.VariableImpl
 Getting scope within FMU: controller
<Scope found:SimpleScope[obj_detected, passenger_up, passenger_down, passenger_stop, driver_up, driver_down, driver_stop, up, down, stop] -> NULLSCOPE
>Getting scope for ref within context class be.uantwerpen.ansymo.semanticadaptation.semanticAdaptation.impl.VariableImpl
<Scope found:SimpleScope[obj_detected, passenger_up, passenger_down, passenger_stop, driver_up, driver_down, driver_stop, up, down, stop, obj_detected, passenger_up, passenger_down, passenger_stop, driver_up, driver_down, driver_stop, up, down, stop, INIT_OBJ_DETECTED, INIT_PASSENGER_UP, INIT_PASSENGER_DOWN, INIT_PASSENGER_STOP, INIT_DRIVER_UP, INIT_DRIVER_DOWN, INIT_DRIVER_STOP, INIT_UP, INIT_DOWN, INIT_STOP, tn, tl, prev_obj_detected, prev_passenger_up, prev_passenger_down, prev_passenger_stop, prev_driver_up, prev_driver_down, prev_driver_stop, step_size, step_to_be_done, step_done, stored_sa_obj_detected, stored_sa_passenger_up, stored_sa_passenger_down, stored_sa_passenger_stop, stored_sa_driver_up, stored_sa_driver_down, stored_sa_driver_stop, stored_sa_up, stored_sa_down, stored_sa_stop] -> NULLSCOPE
>Getting scope for owner within context class be.uantwerpen.ansymo.semanticadaptation.semanticAdaptation.impl.VariableImpl
 Delegating scope discovery to super class...
<Scope found:ImportScope[lazy_sa.*] imports from org.eclipse.xtext.scoping.impl.MultimapBasedSelectable@17fa1336 for type FMU
>Getting scope for ref within context class be.uantwerpen.ansymo.semanticadaptation.semanticAdaptation.impl.VariableImpl
 Getting scope within FMU: controller
<Scope found:SimpleScope[obj_detected, passenger_up, passenger_down, passenger_stop, driver_up, driver_down, driver_stop, up, down, stop] -> NULLSCOPE
>Getting scope for ref within context class be.uantwerpen.ansymo.semanticadaptation.semanticAdaptation.impl.VariableImpl
<Scope found:SimpleScope[obj_detected, passenger_up, passenger_down, passenger_stop, driver_up, driver_down, driver_stop, up, down, stop, obj_detected, passenger_up, passenger_down, passenger_stop, driver_up, driver_down, driver_stop, up, down, stop, INIT_OBJ_DETECTED, INIT_PASSENGER_UP, INIT_PASSENGER_DOWN, INIT_PASSENGER_STOP, INIT_DRIVER_UP, INIT_DRIVER_DOWN, INIT_DRIVER_STOP, INIT_UP, INIT_DOWN, INIT_STOP, tn, tl, prev_obj_detected, prev_passenger_up, prev_passenger_down, prev_passenger_stop, prev_driver_up, prev_driver_down, prev_driver_stop, step_size, step_to_be_done, step_done, stored_sa_obj_detected, stored_sa_passenger_up, stored_sa_passenger_down, stored_sa_passenger_stop, stored_sa_driver_up, stored_sa_driver_down, stored_sa_driver_stop, stored_sa_up, stored_sa_down, stored_sa_stop] -> NULLSCOPE
>Getting scope for owner within context class be.uantwerpen.ansymo.semanticadaptation.semanticAdaptation.impl.VariableImpl
 Delegating scope discovery to super class...
<Scope found:ImportScope[lazy_sa.*] imports from org.eclipse.xtext.scoping.impl.MultimapBasedSelectable@17fa1336 for type FMU
>Getting scope for ref within context class be.uantwerpen.ansymo.semanticadaptation.semanticAdaptation.impl.VariableImpl
 Getting scope within FMU: controller
<Scope found:SimpleScope[obj_detected, passenger_up, passenger_down, passenger_stop, driver_up, driver_down, driver_stop, up, down, stop] -> NULLSCOPE
>Getting scope for ref within context class be.uantwerpen.ansymo.semanticadaptation.semanticAdaptation.impl.VariableImpl
<Scope found:SimpleScope[obj_detected, passenger_up, passenger_down, passenger_stop, driver_up, driver_down, driver_stop, up, down, stop, obj_detected, passenger_up, passenger_down, passenger_stop, driver_up, driver_down, driver_stop, up, down, stop, INIT_OBJ_DETECTED, INIT_PASSENGER_UP, INIT_PASSENGER_DOWN, INIT_PASSENGER_STOP, INIT_DRIVER_UP, INIT_DRIVER_DOWN, INIT_DRIVER_STOP, INIT_UP, INIT_DOWN, INIT_STOP, tn, tl, prev_obj_detected, prev_passenger_up, prev_passenger_down, prev_passenger_stop, prev_driver_up, prev_driver_down, prev_driver_stop, step_size, step_to_be_done, step_done, stored_sa_obj_detected, stored_sa_passenger_up, stored_sa_passenger_down, stored_sa_passenger_stop, stored_sa_driver_up, stored_sa_driver_down, stored_sa_driver_stop, stored_sa_up, stored_sa_down, stored_sa_stop] -> NULLSCOPE
>Getting scope for owner within context class be.uantwerpen.ansymo.semanticadaptation.semanticAdaptation.impl.VariableImpl
 Delegating scope discovery to super class...
<Scope found:ImportScope[lazy_sa.*] imports from org.eclipse.xtext.scoping.impl.MultimapBasedSelectable@17fa1336 for type FMU
>Getting scope for ref within context class be.uantwerpen.ansymo.semanticadaptation.semanticAdaptation.impl.VariableImpl
 Getting scope within FMU: controller
<Scope found:SimpleScope[obj_detected, passenger_up, passenger_down, passenger_stop, driver_up, driver_down, driver_stop, up, down, stop] -> NULLSCOPE
>Getting scope for ref within context class be.uantwerpen.ansymo.semanticadaptation.semanticAdaptation.impl.VariableImpl
<Scope found:SimpleScope[obj_detected, passenger_up, passenger_down, passenger_stop, driver_up, driver_down, driver_stop, up, down, stop, obj_detected, passenger_up, passenger_down, passenger_stop, driver_up, driver_down, driver_stop, up, down, stop, INIT_OBJ_DETECTED, INIT_PASSENGER_UP, INIT_PASSENGER_DOWN, INIT_PASSENGER_STOP, INIT_DRIVER_UP, INIT_DRIVER_DOWN, INIT_DRIVER_STOP, INIT_UP, INIT_DOWN, INIT_STOP, tn, tl, prev_obj_detected, prev_passenger_up, prev_passenger_down, prev_passenger_stop, prev_driver_up, prev_driver_down, prev_driver_stop, step_size, step_to_be_done, step_done, stored_sa_obj_detected, stored_sa_passenger_up, stored_sa_passenger_down, stored_sa_passenger_stop, stored_sa_driver_up, stored_sa_driver_down, stored_sa_driver_stop, stored_sa_up, stored_sa_down, stored_sa_stop] -> NULLSCOPE
>Getting scope for owner within context class be.uantwerpen.ansymo.semanticadaptation.semanticAdaptation.impl.VariableImpl
 Delegating scope discovery to super class...
<Scope found:ImportScope[lazy_sa.*] imports from org.eclipse.xtext.scoping.impl.MultimapBasedSelectable@17fa1336 for type FMU
>Getting scope for ref within context class be.uantwerpen.ansymo.semanticadaptation.semanticAdaptation.impl.VariableImpl
 Getting scope within FMU: controller
<Scope found:SimpleScope[obj_detected, passenger_up, passenger_down, passenger_stop, driver_up, driver_down, driver_stop, up, down, stop] -> NULLSCOPE
>Getting scope for ref within context class be.uantwerpen.ansymo.semanticadaptation.semanticAdaptation.impl.VariableImpl
<Scope found:SimpleScope[obj_detected, passenger_up, passenger_down, passenger_stop, driver_up, driver_down, driver_stop, up, down, stop, obj_detected, passenger_up, passenger_down, passenger_stop, driver_up, driver_down, driver_stop, up, down, stop, INIT_OBJ_DETECTED, INIT_PASSENGER_UP, INIT_PASSENGER_DOWN, INIT_PASSENGER_STOP, INIT_DRIVER_UP, INIT_DRIVER_DOWN, INIT_DRIVER_STOP, INIT_UP, INIT_DOWN, INIT_STOP, tn, tl, prev_obj_detected, prev_passenger_up, prev_passenger_down, prev_passenger_stop, prev_driver_up, prev_driver_down, prev_driver_stop, step_size, step_to_be_done, step_done, stored_sa_obj_detected, stored_sa_passenger_up, stored_sa_passenger_down, stored_sa_passenger_stop, stored_sa_driver_up, stored_sa_driver_down, stored_sa_driver_stop, stored_sa_up, stored_sa_down, stored_sa_stop] -> NULLSCOPE
>Getting scope for ref within context class be.uantwerpen.ansymo.semanticadaptation.semanticAdaptation.impl.VariableImpl
<Scope found:SimpleScope[obj_detected, passenger_up, passenger_down, passenger_stop, driver_up, driver_down, driver_stop, up, down, stop, obj_detected, passenger_up, passenger_down, passenger_stop, driver_up, driver_down, driver_stop, up, down, stop, INIT_OBJ_DETECTED, INIT_PASSENGER_UP, INIT_PASSENGER_DOWN, INIT_PASSENGER_STOP, INIT_DRIVER_UP, INIT_DRIVER_DOWN, INIT_DRIVER_STOP, INIT_UP, INIT_DOWN, INIT_STOP, tn, tl, prev_obj_detected, prev_passenger_up, prev_passenger_down, prev_passenger_stop, prev_driver_up, prev_driver_down, prev_driver_stop, step_size, step_to_be_done, step_done, stored_sa_obj_detected, stored_sa_passenger_up, stored_sa_passenger_down, stored_sa_passenger_stop, stored_sa_driver_up, stored_sa_driver_down, stored_sa_driver_stop, stored_sa_up, stored_sa_down, stored_sa_stop] -> NULLSCOPE
>Getting scope for ref within context class be.uantwerpen.ansymo.semanticadaptation.semanticAdaptation.impl.VariableImpl
<Scope found:SimpleScope[obj_detected, passenger_up, passenger_down, passenger_stop, driver_up, driver_down, driver_stop, up, down, stop, obj_detected, passenger_up, passenger_down, passenger_stop, driver_up, driver_down, driver_stop, up, down, stop, INIT_OBJ_DETECTED, INIT_PASSENGER_UP, INIT_PASSENGER_DOWN, INIT_PASSENGER_STOP, INIT_DRIVER_UP, INIT_DRIVER_DOWN, INIT_DRIVER_STOP, INIT_UP, INIT_DOWN, INIT_STOP, tn, tl, prev_obj_detected, prev_passenger_up, prev_passenger_down, prev_passenger_stop, prev_driver_up, prev_driver_down, prev_driver_stop, step_size, step_to_be_done, step_done, stored_sa_obj_detected, stored_sa_passenger_up, stored_sa_passenger_down, stored_sa_passenger_stop, stored_sa_driver_up, stored_sa_driver_down, stored_sa_driver_stop, stored_sa_up, stored_sa_down, stored_sa_stop] -> NULLSCOPE
>Getting scope for ref within context class be.uantwerpen.ansymo.semanticadaptation.semanticAdaptation.impl.VariableImpl
<Scope found:SimpleScope[obj_detected, passenger_up, passenger_down, passenger_stop, driver_up, driver_down, driver_stop, up, down, stop, obj_detected, passenger_up, passenger_down, passenger_stop, driver_up, driver_down, driver_stop, up, down, stop, INIT_OBJ_DETECTED, INIT_PASSENGER_UP, INIT_PASSENGER_DOWN, INIT_PASSENGER_STOP, INIT_DRIVER_UP, INIT_DRIVER_DOWN, INIT_DRIVER_STOP, INIT_UP, INIT_DOWN, INIT_STOP, tn, tl, prev_obj_detected, prev_passenger_up, prev_passenger_down, prev_passenger_stop, prev_driver_up, prev_driver_down, prev_driver_stop, step_size, step_to_be_done, step_done, stored_sa_obj_detected, stored_sa_passenger_up, stored_sa_passenger_down, stored_sa_passenger_stop, stored_sa_driver_up, stored_sa_driver_down, stored_sa_driver_stop, stored_sa_up, stored_sa_down, stored_sa_stop] -> NULLSCOPE
>Getting scope for ref within context class be.uantwerpen.ansymo.semanticadaptation.semanticAdaptation.impl.VariableImpl
<Scope found:SimpleScope[obj_detected, passenger_up, passenger_down, passenger_stop, driver_up, driver_down, driver_stop, up, down, stop, obj_detected, passenger_up, passenger_down, passenger_stop, driver_up, driver_down, driver_stop, up, down, stop, INIT_OBJ_DETECTED, INIT_PASSENGER_UP, INIT_PASSENGER_DOWN, INIT_PASSENGER_STOP, INIT_DRIVER_UP, INIT_DRIVER_DOWN, INIT_DRIVER_STOP, INIT_UP, INIT_DOWN, INIT_STOP, tn, tl, prev_obj_detected, prev_passenger_up, prev_passenger_down, prev_passenger_stop, prev_driver_up, prev_driver_down, prev_driver_stop, step_size, step_to_be_done, step_done, stored_sa_obj_detected, stored_sa_passenger_up, stored_sa_passenger_down, stored_sa_passenger_stop, stored_sa_driver_up, stored_sa_driver_down, stored_sa_driver_stop, stored_sa_up, stored_sa_down, stored_sa_stop] -> NULLSCOPE
>Getting scope for ref within context class be.uantwerpen.ansymo.semanticadaptation.semanticAdaptation.impl.VariableImpl
<Scope found:SimpleScope[obj_detected, passenger_up, passenger_down, passenger_stop, driver_up, driver_down, driver_stop, up, down, stop, obj_detected, passenger_up, passenger_down, passenger_stop, driver_up, driver_down, driver_stop, up, down, stop, INIT_OBJ_DETECTED, INIT_PASSENGER_UP, INIT_PASSENGER_DOWN, INIT_PASSENGER_STOP, INIT_DRIVER_UP, INIT_DRIVER_DOWN, INIT_DRIVER_STOP, INIT_UP, INIT_DOWN, INIT_STOP, tn, tl, prev_obj_detected, prev_passenger_up, prev_passenger_down, prev_passenger_stop, prev_driver_up, prev_driver_down, prev_driver_stop, step_size, step_to_be_done, step_done, stored_sa_obj_detected, stored_sa_passenger_up, stored_sa_passenger_down, stored_sa_passenger_stop, stored_sa_driver_up, stored_sa_driver_down, stored_sa_driver_stop, stored_sa_up, stored_sa_down, stored_sa_stop] -> NULLSCOPE
>Getting scope for ref within context class be.uantwerpen.ansymo.semanticadaptation.semanticAdaptation.impl.VariableImpl
<Scope found:SimpleScope[obj_detected, passenger_up, passenger_down, passenger_stop, driver_up, driver_down, driver_stop, up, down, stop, obj_detected, passenger_up, passenger_down, passenger_stop, driver_up, driver_down, driver_stop, up, down, stop, INIT_OBJ_DETECTED, INIT_PASSENGER_UP, INIT_PASSENGER_DOWN, INIT_PASSENGER_STOP, INIT_DRIVER_UP, INIT_DRIVER_DOWN, INIT_DRIVER_STOP, INIT_UP, INIT_DOWN, INIT_STOP, tn, tl, prev_obj_detected, prev_passenger_up, prev_passenger_down, prev_passenger_stop, prev_driver_up, prev_driver_down, prev_driver_stop, step_size, step_to_be_done, step_done, stored_sa_obj_detected, stored_sa_passenger_up, stored_sa_passenger_down, stored_sa_passenger_stop, stored_sa_driver_up, stored_sa_driver_down, stored_sa_driver_stop, stored_sa_up, stored_sa_down, stored_sa_stop] -> NULLSCOPE
>Getting scope for ref within context class be.uantwerpen.ansymo.semanticadaptation.semanticAdaptation.impl.VariableImpl
<Scope found:SimpleScope[obj_detected, passenger_up, passenger_down, passenger_stop, driver_up, driver_down, driver_stop, up, down, stop, obj_detected, passenger_up, passenger_down, passenger_stop, driver_up, driver_down, driver_stop, up, down, stop, INIT_OBJ_DETECTED, INIT_PASSENGER_UP, INIT_PASSENGER_DOWN, INIT_PASSENGER_STOP, INIT_DRIVER_UP, INIT_DRIVER_DOWN, INIT_DRIVER_STOP, INIT_UP, INIT_DOWN, INIT_STOP, tn, tl, prev_obj_detected, prev_passenger_up, prev_passenger_down, prev_passenger_stop, prev_driver_up, prev_driver_down, prev_driver_stop, step_size, step_to_be_done, step_done, stored_sa_obj_detected, stored_sa_passenger_up, stored_sa_passenger_down, stored_sa_passenger_stop, stored_sa_driver_up, stored_sa_driver_down, stored_sa_driver_stop, stored_sa_up, stored_sa_down, stored_sa_stop] -> NULLSCOPE
>Getting scope for ref within context class be.uantwerpen.ansymo.semanticadaptation.semanticAdaptation.impl.VariableImpl
<Scope found:SimpleScope[obj_detected, passenger_up, passenger_down, passenger_stop, driver_up, driver_down, driver_stop, up, down, stop, obj_detected, passenger_up, passenger_down, passenger_stop, driver_up, driver_down, driver_stop, up, down, stop, INIT_OBJ_DETECTED, INIT_PASSENGER_UP, INIT_PASSENGER_DOWN, INIT_PASSENGER_STOP, INIT_DRIVER_UP, INIT_DRIVER_DOWN, INIT_DRIVER_STOP, INIT_UP, INIT_DOWN, INIT_STOP, tn, tl, prev_obj_detected, prev_passenger_up, prev_passenger_down, prev_passenger_stop, prev_driver_up, prev_driver_down, prev_driver_stop, step_size, step_to_be_done, step_done, stored_sa_obj_detected, stored_sa_passenger_up, stored_sa_passenger_down, stored_sa_passenger_stop, stored_sa_driver_up, stored_sa_driver_down, stored_sa_driver_stop, stored_sa_up, stored_sa_down, stored_sa_stop] -> NULLSCOPE
>Getting scope for owner within context class be.uantwerpen.ansymo.semanticadaptation.semanticAdaptation.impl.VariableImpl
 Delegating scope discovery to super class...
<Scope found:ImportScope[lazy_sa.*] imports from org.eclipse.xtext.scoping.impl.MultimapBasedSelectable@17fa1336 for type FMU
>Getting scope for ref within context class be.uantwerpen.ansymo.semanticadaptation.semanticAdaptation.impl.VariableImpl
 Getting scope within FMU: controller
<Scope found:SimpleScope[obj_detected, passenger_up, passenger_down, passenger_stop, driver_up, driver_down, driver_stop, up, down, stop] -> NULLSCOPE
>Getting scope for ref within context class be.uantwerpen.ansymo.semanticadaptation.semanticAdaptation.impl.VariableImpl
<Scope found:SimpleScope[obj_detected, passenger_up, passenger_down, passenger_stop, driver_up, driver_down, driver_stop, up, down, stop, obj_detected, passenger_up, passenger_down, passenger_stop, driver_up, driver_down, driver_stop, up, down, stop, INIT_OBJ_DETECTED, INIT_PASSENGER_UP, INIT_PASSENGER_DOWN, INIT_PASSENGER_STOP, INIT_DRIVER_UP, INIT_DRIVER_DOWN, INIT_DRIVER_STOP, INIT_UP, INIT_DOWN, INIT_STOP, tn, tl, prev_obj_detected, prev_passenger_up, prev_passenger_down, prev_passenger_stop, prev_driver_up, prev_driver_down, prev_driver_stop, step_size, step_to_be_done, step_done, stored_sa_obj_detected, stored_sa_passenger_up, stored_sa_passenger_down, stored_sa_passenger_stop, stored_sa_driver_up, stored_sa_driver_down, stored_sa_driver_stop, stored_sa_up, stored_sa_down, stored_sa_stop] -> NULLSCOPE
>Getting scope for owner within context class be.uantwerpen.ansymo.semanticadaptation.semanticAdaptation.impl.VariableImpl
 Delegating scope discovery to super class...
<Scope found:ImportScope[lazy_sa.*] imports from org.eclipse.xtext.scoping.impl.MultimapBasedSelectable@17fa1336 for type FMU
>Getting scope for ref within context class be.uantwerpen.ansymo.semanticadaptation.semanticAdaptation.impl.VariableImpl
 Getting scope within FMU: controller
<Scope found:SimpleScope[obj_detected, passenger_up, passenger_down, passenger_stop, driver_up, driver_down, driver_stop, up, down, stop] -> NULLSCOPE
>Getting scope for ref within context class be.uantwerpen.ansymo.semanticadaptation.semanticAdaptation.impl.VariableImpl
<Scope found:SimpleScope[obj_detected, passenger_up, passenger_down, passenger_stop, driver_up, driver_down, driver_stop, up, down, stop, obj_detected, passenger_up, passenger_down, passenger_stop, driver_up, driver_down, driver_stop, up, down, stop, INIT_OBJ_DETECTED, INIT_PASSENGER_UP, INIT_PASSENGER_DOWN, INIT_PASSENGER_STOP, INIT_DRIVER_UP, INIT_DRIVER_DOWN, INIT_DRIVER_STOP, INIT_UP, INIT_DOWN, INIT_STOP, tn, tl, prev_obj_detected, prev_passenger_up, prev_passenger_down, prev_passenger_stop, prev_driver_up, prev_driver_down, prev_driver_stop, step_size, step_to_be_done, step_done, stored_sa_obj_detected, stored_sa_passenger_up, stored_sa_passenger_down, stored_sa_passenger_stop, stored_sa_driver_up, stored_sa_driver_down, stored_sa_driver_stop, stored_sa_up, stored_sa_down, stored_sa_stop] -> NULLSCOPE
>Getting scope for owner within context class be.uantwerpen.ansymo.semanticadaptation.semanticAdaptation.impl.VariableImpl
 Delegating scope discovery to super class...
<Scope found:ImportScope[lazy_sa.*] imports from org.eclipse.xtext.scoping.impl.MultimapBasedSelectable@17fa1336 for type FMU
>Getting scope for ref within context class be.uantwerpen.ansymo.semanticadaptation.semanticAdaptation.impl.VariableImpl
 Getting scope within FMU: controller
<Scope found:SimpleScope[obj_detected, passenger_up, passenger_down, passenger_stop, driver_up, driver_down, driver_stop, up, down, stop] -> NULLSCOPE
>Getting scope for ref within context class be.uantwerpen.ansymo.semanticadaptation.semanticAdaptation.impl.VariableImpl
<Scope found:SimpleScope[obj_detected, passenger_up, passenger_down, passenger_stop, driver_up, driver_down, driver_stop, up, down, stop, obj_detected, passenger_up, passenger_down, passenger_stop, driver_up, driver_down, driver_stop, up, down, stop, INIT_OBJ_DETECTED, INIT_PASSENGER_UP, INIT_PASSENGER_DOWN, INIT_PASSENGER_STOP, INIT_DRIVER_UP, INIT_DRIVER_DOWN, INIT_DRIVER_STOP, INIT_UP, INIT_DOWN, INIT_STOP, tn, tl, prev_obj_detected, prev_passenger_up, prev_passenger_down, prev_passenger_stop, prev_driver_up, prev_driver_down, prev_driver_stop, step_size, step_to_be_done, step_done, stored_sa_obj_detected, stored_sa_passenger_up, stored_sa_passenger_down, stored_sa_passenger_stop, stored_sa_driver_up, stored_sa_driver_down, stored_sa_driver_stop, stored_sa_up, stored_sa_down, stored_sa_stop] -> NULLSCOPE
>Getting scope for ref within context class be.uantwerpen.ansymo.semanticadaptation.semanticAdaptation.impl.VariableImpl
<Scope found:SimpleScope[obj_detected, passenger_up, passenger_down, passenger_stop, driver_up, driver_down, driver_stop, up, down, stop, obj_detected, passenger_up, passenger_down, passenger_stop, driver_up, driver_down, driver_stop, up, down, stop, INIT_OBJ_DETECTED, INIT_PASSENGER_UP, INIT_PASSENGER_DOWN, INIT_PASSENGER_STOP, INIT_DRIVER_UP, INIT_DRIVER_DOWN, INIT_DRIVER_STOP, INIT_UP, INIT_DOWN, INIT_STOP, tn, tl, prev_obj_detected, prev_passenger_up, prev_passenger_down, prev_passenger_stop, prev_driver_up, prev_driver_down, prev_driver_stop, step_size, step_to_be_done, step_done, stored_sa_obj_detected, stored_sa_passenger_up, stored_sa_passenger_down, stored_sa_passenger_stop, stored_sa_driver_up, stored_sa_driver_down, stored_sa_driver_stop, stored_sa_up, stored_sa_down, stored_sa_stop] -> NULLSCOPE
>Getting scope for ref within context class be.uantwerpen.ansymo.semanticadaptation.semanticAdaptation.impl.VariableImpl
<Scope found:SimpleScope[obj_detected, passenger_up, passenger_down, passenger_stop, driver_up, driver_down, driver_stop, up, down, stop, obj_detected, passenger_up, passenger_down, passenger_stop, driver_up, driver_down, driver_stop, up, down, stop, INIT_OBJ_DETECTED, INIT_PASSENGER_UP, INIT_PASSENGER_DOWN, INIT_PASSENGER_STOP, INIT_DRIVER_UP, INIT_DRIVER_DOWN, INIT_DRIVER_STOP, INIT_UP, INIT_DOWN, INIT_STOP, tn, tl, prev_obj_detected, prev_passenger_up, prev_passenger_down, prev_passenger_stop, prev_driver_up, prev_driver_down, prev_driver_stop, step_size, step_to_be_done, step_done, stored_sa_obj_detected, stored_sa_passenger_up, stored_sa_passenger_down, stored_sa_passenger_stop, stored_sa_driver_up, stored_sa_driver_down, stored_sa_driver_stop, stored_sa_up, stored_sa_down, stored_sa_stop] -> NULLSCOPE
>Getting scope for ref within context class be.uantwerpen.ansymo.semanticadaptation.semanticAdaptation.impl.VariableImpl
<Scope found:SimpleScope[obj_detected, passenger_up, passenger_down, passenger_stop, driver_up, driver_down, driver_stop, up, down, stop, obj_detected, passenger_up, passenger_down, passenger_stop, driver_up, driver_down, driver_stop, up, down, stop, INIT_OBJ_DETECTED, INIT_PASSENGER_UP, INIT_PASSENGER_DOWN, INIT_PASSENGER_STOP, INIT_DRIVER_UP, INIT_DRIVER_DOWN, INIT_DRIVER_STOP, INIT_UP, INIT_DOWN, INIT_STOP, tn, tl, prev_obj_detected, prev_passenger_up, prev_passenger_down, prev_passenger_stop, prev_driver_up, prev_driver_down, prev_driver_stop, step_size, step_to_be_done, step_done, stored_sa_obj_detected, stored_sa_passenger_up, stored_sa_passenger_down, stored_sa_passenger_stop, stored_sa_driver_up, stored_sa_driver_down, stored_sa_driver_stop, stored_sa_up, stored_sa_down, stored_sa_stop] -> NULLSCOPE
>Getting scope for ref within context class be.uantwerpen.ansymo.semanticadaptation.semanticAdaptation.impl.VariableImpl
<Scope found:SimpleScope[obj_detected, passenger_up, passenger_down, passenger_stop, driver_up, driver_down, driver_stop, up, down, stop, obj_detected, passenger_up, passenger_down, passenger_stop, driver_up, driver_down, driver_stop, up, down, stop, INIT_OBJ_DETECTED, INIT_PASSENGER_UP, INIT_PASSENGER_DOWN, INIT_PASSENGER_STOP, INIT_DRIVER_UP, INIT_DRIVER_DOWN, INIT_DRIVER_STOP, INIT_UP, INIT_DOWN, INIT_STOP, tn, tl, prev_obj_detected, prev_passenger_up, prev_passenger_down, prev_passenger_stop, prev_driver_up, prev_driver_down, prev_driver_stop, step_size, step_to_be_done, step_done, stored_sa_obj_detected, stored_sa_passenger_up, stored_sa_passenger_down, stored_sa_passenger_stop, stored_sa_driver_up, stored_sa_driver_down, stored_sa_driver_stop, stored_sa_up, stored_sa_down, stored_sa_stop] -> NULLSCOPE
>Getting scope for ref within context class be.uantwerpen.ansymo.semanticadaptation.semanticAdaptation.impl.VariableImpl
<Scope found:SimpleScope[obj_detected, passenger_up, passenger_down, passenger_stop, driver_up, driver_down, driver_stop, up, down, stop, obj_detected, passenger_up, passenger_down, passenger_stop, driver_up, driver_down, driver_stop, up, down, stop, INIT_OBJ_DETECTED, INIT_PASSENGER_UP, INIT_PASSENGER_DOWN, INIT_PASSENGER_STOP, INIT_DRIVER_UP, INIT_DRIVER_DOWN, INIT_DRIVER_STOP, INIT_UP, INIT_DOWN, INIT_STOP, tn, tl, prev_obj_detected, prev_passenger_up, prev_passenger_down, prev_passenger_stop, prev_driver_up, prev_driver_down, prev_driver_stop, step_size, step_to_be_done, step_done, stored_sa_obj_detected, stored_sa_passenger_up, stored_sa_passenger_down, stored_sa_passenger_stop, stored_sa_driver_up, stored_sa_driver_down, stored_sa_driver_stop, stored_sa_up, stored_sa_down, stored_sa_stop] -> NULLSCOPE
>Getting scope for ref within context class be.uantwerpen.ansymo.semanticadaptation.semanticAdaptation.impl.VariableImpl
<Scope found:SimpleScope[obj_detected, passenger_up, passenger_down, passenger_stop, driver_up, driver_down, driver_stop, up, down, stop, obj_detected, passenger_up, passenger_down, passenger_stop, driver_up, driver_down, driver_stop, up, down, stop, INIT_OBJ_DETECTED, INIT_PASSENGER_UP, INIT_PASSENGER_DOWN, INIT_PASSENGER_STOP, INIT_DRIVER_UP, INIT_DRIVER_DOWN, INIT_DRIVER_STOP, INIT_UP, INIT_DOWN, INIT_STOP, tn, tl, prev_obj_detected, prev_passenger_up, prev_passenger_down, prev_passenger_stop, prev_driver_up, prev_driver_down, prev_driver_stop, step_size, step_to_be_done, step_done, stored_sa_obj_detected, stored_sa_passenger_up, stored_sa_passenger_down, stored_sa_passenger_stop, stored_sa_driver_up, stored_sa_driver_down, stored_sa_driver_stop, stored_sa_up, stored_sa_down, stored_sa_stop] -> NULLSCOPE
>Getting scope for ref within context class be.uantwerpen.ansymo.semanticadaptation.semanticAdaptation.impl.VariableImpl
<Scope found:SimpleScope[obj_detected, passenger_up, passenger_down, passenger_stop, driver_up, driver_down, driver_stop, up, down, stop, obj_detected, passenger_up, passenger_down, passenger_stop, driver_up, driver_down, driver_stop, up, down, stop, INIT_OBJ_DETECTED, INIT_PASSENGER_UP, INIT_PASSENGER_DOWN, INIT_PASSENGER_STOP, INIT_DRIVER_UP, INIT_DRIVER_DOWN, INIT_DRIVER_STOP, INIT_UP, INIT_DOWN, INIT_STOP, tn, tl, prev_obj_detected, prev_passenger_up, prev_passenger_down, prev_passenger_stop, prev_driver_up, prev_driver_down, prev_driver_stop, step_size, step_to_be_done, step_done, stored_sa_obj_detected, stored_sa_passenger_up, stored_sa_passenger_down, stored_sa_passenger_stop, stored_sa_driver_up, stored_sa_driver_down, stored_sa_driver_stop, stored_sa_up, stored_sa_down, stored_sa_stop] -> NULLSCOPE
>Getting scope for ref within context class be.uantwerpen.ansymo.semanticadaptation.semanticAdaptation.impl.VariableImpl
<Scope found:SimpleScope[obj_detected, passenger_up, passenger_down, passenger_stop, driver_up, driver_down, driver_stop, up, down, stop, obj_detected, passenger_up, passenger_down, passenger_stop, driver_up, driver_down, driver_stop, up, down, stop, INIT_OBJ_DETECTED, INIT_PASSENGER_UP, INIT_PASSENGER_DOWN, INIT_PASSENGER_STOP, INIT_DRIVER_UP, INIT_DRIVER_DOWN, INIT_DRIVER_STOP, INIT_UP, INIT_DOWN, INIT_STOP, tn, tl, prev_obj_detected, prev_passenger_up, prev_passenger_down, prev_passenger_stop, prev_driver_up, prev_driver_down, prev_driver_stop, step_size, step_to_be_done, step_done, stored_sa_obj_detected, stored_sa_passenger_up, stored_sa_passenger_down, stored_sa_passenger_stop, stored_sa_driver_up, stored_sa_driver_down, stored_sa_driver_stop, stored_sa_up, stored_sa_down, stored_sa_stop] -> NULLSCOPE
Stored file: generated/lazy/sources/Fmu.cpp
Stored file: generated/lazy/sources/Lazy_sa.cpp
Stored file: generated/lazy/sources/Lazy_sa.h
Stored file: generated/lazy/modelDescription.xml
Stored file: generated/lazy/sources/main.cpp
Copied file to: generated/lazy/resources/Controller.fmu
Stored file: generated/lazy/CMakeLists.txt
Stored file: generated/lazy/msys-toolchain.cmake
Tests run: 3, Failures: 0, Errors: 2, Skipped: 1, Time elapsed: 1.107 sec <<< FAILURE! - in be.uantwerpen.ansymo.semanticadaptation.cg.cpp.tests.CgCppBasicTest
window_sa_canonical_new(be.uantwerpen.ansymo.semanticadaptation.cg.cpp.tests.CgCppBasicTest)  Time elapsed: 0.473 sec  <<< ERROR!
java.lang.NullPointerException: in is null
	at java.util.zip.ZipInputStream.<init>(ZipInputStream.java:101)
	at java.util.zip.ZipInputStream.<init>(ZipInputStream.java:80)
	at java.util.jar.JarInputStream.<init>(JarInputStream.java:76)
	at java.util.jar.JarInputStream.<init>(JarInputStream.java:62)
	at be.uantwerpen.ansymo.semanticadaptation.cg.cpp.generation.BuildUtilities.copyNativeLibFiles(BuildUtilities.java:32)
	at be.uantwerpen.ansymo.semanticadaptation.cg.cpp.tests.CgCppBasicTest.__parseNoErrors(CgCppBasicTest.xtend:160)
	at be.uantwerpen.ansymo.semanticadaptation.cg.cpp.tests.CgCppBasicTest.window_sa_canonical_new(CgCppBasicTest.xtend:45)

window_sa_canonical(be.uantwerpen.ansymo.semanticadaptation.cg.cpp.tests.CgCppBasicTest) skipped
lazy_sa_canonical(be.uantwerpen.ansymo.semanticadaptation.cg.cpp.tests.CgCppBasicTest)  Time elapsed: 0.094 sec  <<< ERROR!
java.lang.NullPointerException: in is null
	at java.util.zip.ZipInputStream.<init>(ZipInputStream.java:101)
	at java.util.zip.ZipInputStream.<init>(ZipInputStream.java:80)
	at java.util.jar.JarInputStream.<init>(JarInputStream.java:76)
	at java.util.jar.JarInputStream.<init>(JarInputStream.java:62)
	at be.uantwerpen.ansymo.semanticadaptation.cg.cpp.generation.BuildUtilities.copyNativeLibFiles(BuildUtilities.java:32)
	at be.uantwerpen.ansymo.semanticadaptation.cg.cpp.tests.CgCppBasicTest.__parseNoErrors(CgCppBasicTest.xtend:160)
	at be.uantwerpen.ansymo.semanticadaptation.cg.cpp.tests.CgCppBasicTest.lazy_sa_canonical(CgCppBasicTest.xtend:49)

Running be.uantwerpen.ansymo.semanticadaptation.cg.cpp.tests.CgCppAutoTest
Tests run: 1, Failures: 0, Errors: 0, Skipped: 1, Time elapsed: 0.004 sec - in be.uantwerpen.ansymo.semanticadaptation.cg.cpp.tests.CgCppAutoTest
allSemanticAdaptations[0](be.uantwerpen.ansymo.semanticadaptation.cg.cpp.tests.CgCppAutoTest) skipped

Results :

Tests in error: 
  CgCppBasicTest.window_sa_canonical_new:45->__parseNoErrors:160 » NullPointer i...
  CgCppBasicTest.lazy_sa_canonical:49->__parseNoErrors:160 » NullPointer in is n...

Tests run: 4, Failures: 0, Errors: 2, Skipped: 2

[INFO] ------------------------------------------------------------------------
[INFO] Reactor Summary:
[INFO] 
[INFO] parent ............................................. SUCCESS [  0.166 s]
[INFO] be.uantwerpen.ansymo.semanticadaptation Testframework SUCCESS [  7.586 s]
[INFO] be.uantwerpen.ansymo.semanticadaptation Language Core SUCCESS [ 26.672 s]
[INFO] be.uantwerpen.ansymo.semanticadaptation Language Tests SUCCESS [ 13.412 s]
[INFO] be.uantwerpen.ansymo.semanticadaptation.ide ........ SUCCESS [  1.089 s]
[INFO] be.uantwerpen.ansymo.semanticadaptation.ui Language UI SUCCESS [  3.298 s]
[INFO] be.uantwerpen.ansymo.semanticadaptation Code Generation to C++ SUCCESS [  2.772 s]
[INFO] be.uantwerpen.ansymo.semanticadaptation Code Generation to C++ Tests FAILURE [  6.048 s]
[INFO] ------------------------------------------------------------------------
[INFO] BUILD FAILURE
[INFO] ------------------------------------------------------------------------
[INFO] Total time: 01:27 min
[INFO] Finished at: 2017-06-28T09:55:16+02:00
[INFO] Final Memory: 148M/844M
[INFO] ------------------------------------------------------------------------
[jenkins-maven-event-spy] INFO generated /var/lib/jenkins/workspace/HybridCosimulation_master-LDEVB56LP46DTRNYHQSCKMS3FR4JD6RBBK6S2LPONMGDZRBJQH3A@tmp/withMavenbc84f9d1/maven-spy-20170628-095348-985.log
[ERROR] Failed to execute goal org.eclipse.tycho:tycho-surefire-plugin:1.0.0:test (default-test) on project be.uantwerpen.ansymo.semanticadaptation.cg.cpp.tests: There are test failures.
[ERROR] 
[ERROR] Please refer to /var/lib/jenkins/workspace/HybridCosimulation_master-LDEVB56LP46DTRNYHQSCKMS3FR4JD6RBBK6S2LPONMGDZRBJQH3A/DSL_SemanticAdaptation/be.uantwerpen.ansymo.semanticadaptation.cg.cpp.tests/target/surefire-reports for the individual test results.
[ERROR] -> [Help 1]
[ERROR] 
[ERROR] To see the full stack trace of the errors, re-run Maven with the -e switch.
[ERROR] Re-run Maven using the -X switch to enable full debug logging.
[ERROR] 
[ERROR] For more information about the errors and possible solutions, please read the following articles:
[ERROR] [Help 1] http://cwiki.apache.org/confluence/display/MAVEN/MojoFailureException
[ERROR] 
[ERROR] After correcting the problems, you can resume the build with the command
[ERROR]   mvn <goals> -rf :be.uantwerpen.ansymo.semanticadaptation.cg.cpp.tests
[Pipeline] }
[withMaven] Archive artifact DSL_SemanticAdaptation/pom.xml under be/uantwerpen/ansymo/semanticadaptation/parent/1.0.0-SNAPSHOT/parent-1.0.0-SNAPSHOT.pom
[withMaven] Archive artifact DSL_SemanticAdaptation/be.uantwerpen.ansymo.semanticadaptation.testframework/pom.xml under be/uantwerpen/ansymo/semanticadaptation/be.uantwerpen.ansymo.semanticadaptation.testframework/1.0.0-SNAPSHOT/be.uantwerpen.ansymo.semanticadaptation.testframework-1.0.0-SNAPSHOT.pom
[withMaven] Archive artifact DSL_SemanticAdaptation/be.uantwerpen.ansymo.semanticadaptation.testframework/target/be.uantwerpen.ansymo.semanticadaptation.testframework-1.0.0-SNAPSHOT.jar under be/uantwerpen/ansymo/semanticadaptation/be.uantwerpen.ansymo.semanticadaptation.testframework/1.0.0-SNAPSHOT/be.uantwerpen.ansymo.semanticadaptation.testframework-1.0.0-SNAPSHOT.jar
[withMaven] Archive artifact DSL_SemanticAdaptation/be.uantwerpen.ansymo.semanticadaptation/pom.xml under be/uantwerpen/ansymo/semanticadaptation/be.uantwerpen.ansymo.semanticadaptation/1.0.0-SNAPSHOT/be.uantwerpen.ansymo.semanticadaptation-1.0.0-SNAPSHOT.pom
[withMaven] Archive artifact DSL_SemanticAdaptation/be.uantwerpen.ansymo.semanticadaptation/target/be.uantwerpen.ansymo.semanticadaptation-1.0.0-SNAPSHOT.jar under be/uantwerpen/ansymo/semanticadaptation/be.uantwerpen.ansymo.semanticadaptation/1.0.0-SNAPSHOT/be.uantwerpen.ansymo.semanticadaptation-1.0.0-SNAPSHOT.jar
[withMaven] Archive artifact DSL_SemanticAdaptation/be.uantwerpen.ansymo.semanticadaptation.tests/pom.xml under be/uantwerpen/ansymo/semanticadaptation/be.uantwerpen.ansymo.semanticadaptation.tests/1.0.0-SNAPSHOT/be.uantwerpen.ansymo.semanticadaptation.tests-1.0.0-SNAPSHOT.pom
[withMaven] Archive artifact DSL_SemanticAdaptation/be.uantwerpen.ansymo.semanticadaptation.tests/target/be.uantwerpen.ansymo.semanticadaptation.tests-1.0.0-SNAPSHOT.jar under be/uantwerpen/ansymo/semanticadaptation/be.uantwerpen.ansymo.semanticadaptation.tests/1.0.0-SNAPSHOT/be.uantwerpen.ansymo.semanticadaptation.tests-1.0.0-SNAPSHOT.jar
[withMaven] Archive artifact DSL_SemanticAdaptation/be.uantwerpen.ansymo.semanticadaptation.ide/pom.xml under be/uantwerpen/ansymo/semanticadaptation/be.uantwerpen.ansymo.semanticadaptation.ide/1.0.0-SNAPSHOT/be.uantwerpen.ansymo.semanticadaptation.ide-1.0.0-SNAPSHOT.pom
[withMaven] Archive artifact DSL_SemanticAdaptation/be.uantwerpen.ansymo.semanticadaptation.ide/target/be.uantwerpen.ansymo.semanticadaptation.ide-1.0.0-SNAPSHOT.jar under be/uantwerpen/ansymo/semanticadaptation/be.uantwerpen.ansymo.semanticadaptation.ide/1.0.0-SNAPSHOT/be.uantwerpen.ansymo.semanticadaptation.ide-1.0.0-SNAPSHOT.jar
[withMaven] Archive artifact DSL_SemanticAdaptation/be.uantwerpen.ansymo.semanticadaptation.ui/pom.xml under be/uantwerpen/ansymo/semanticadaptation/be.uantwerpen.ansymo.semanticadaptation.ui/1.0.0-SNAPSHOT/be.uantwerpen.ansymo.semanticadaptation.ui-1.0.0-SNAPSHOT.pom
[withMaven] Archive artifact DSL_SemanticAdaptation/be.uantwerpen.ansymo.semanticadaptation.ui/target/be.uantwerpen.ansymo.semanticadaptation.ui-1.0.0-SNAPSHOT.jar under be/uantwerpen/ansymo/semanticadaptation/be.uantwerpen.ansymo.semanticadaptation.ui/1.0.0-SNAPSHOT/be.uantwerpen.ansymo.semanticadaptation.ui-1.0.0-SNAPSHOT.jar
[withMaven] Archive artifact DSL_SemanticAdaptation/be.uantwerpen.ansymo.semanticadaptation.cg.cpp/pom.xml under be/uantwerpen/ansymo/semanticadaptation/be.uantwerpen.ansymo.semanticadaptation.cg.cpp/1.0.0-SNAPSHOT/be.uantwerpen.ansymo.semanticadaptation.cg.cpp-1.0.0-SNAPSHOT.pom
[withMaven] Archive artifact DSL_SemanticAdaptation/be.uantwerpen.ansymo.semanticadaptation.cg.cpp/target/be.uantwerpen.ansymo.semanticadaptation.cg.cpp-1.0.0-SNAPSHOT.jar under be/uantwerpen/ansymo/semanticadaptation/be.uantwerpen.ansymo.semanticadaptation.cg.cpp/1.0.0-SNAPSHOT/be.uantwerpen.ansymo.semanticadaptation.cg.cpp-1.0.0-SNAPSHOT.jar
[withMaven] Archive artifact DSL_SemanticAdaptation/be.uantwerpen.ansymo.semanticadaptation.testframework/target/p2content.xml under be/uantwerpen/ansymo/semanticadaptation/be.uantwerpen.ansymo.semanticadaptation.testframework/1.0.0-SNAPSHOT/be.uantwerpen.ansymo.semanticadaptation.testframework-1.0.0-SNAPSHOT-p2metadata.xml
[withMaven] Archive artifact DSL_SemanticAdaptation/be.uantwerpen.ansymo.semanticadaptation.testframework/target/p2artifacts.xml under be/uantwerpen/ansymo/semanticadaptation/be.uantwerpen.ansymo.semanticadaptation.testframework/1.0.0-SNAPSHOT/be.uantwerpen.ansymo.semanticadaptation.testframework-1.0.0-SNAPSHOT-p2artifacts.xml
[withMaven] Archive artifact DSL_SemanticAdaptation/be.uantwerpen.ansymo.semanticadaptation/target/p2content.xml under be/uantwerpen/ansymo/semanticadaptation/be.uantwerpen.ansymo.semanticadaptation/1.0.0-SNAPSHOT/be.uantwerpen.ansymo.semanticadaptation-1.0.0-SNAPSHOT-p2metadata.xml
[withMaven] Archive artifact DSL_SemanticAdaptation/be.uantwerpen.ansymo.semanticadaptation/target/p2artifacts.xml under be/uantwerpen/ansymo/semanticadaptation/be.uantwerpen.ansymo.semanticadaptation/1.0.0-SNAPSHOT/be.uantwerpen.ansymo.semanticadaptation-1.0.0-SNAPSHOT-p2artifacts.xml
[withMaven] Archive artifact DSL_SemanticAdaptation/be.uantwerpen.ansymo.semanticadaptation.tests/target/p2content.xml under be/uantwerpen/ansymo/semanticadaptation/be.uantwerpen.ansymo.semanticadaptation.tests/1.0.0-SNAPSHOT/be.uantwerpen.ansymo.semanticadaptation.tests-1.0.0-SNAPSHOT-p2metadata.xml
[withMaven] Archive artifact DSL_SemanticAdaptation/be.uantwerpen.ansymo.semanticadaptation.tests/target/p2artifacts.xml under be/uantwerpen/ansymo/semanticadaptation/be.uantwerpen.ansymo.semanticadaptation.tests/1.0.0-SNAPSHOT/be.uantwerpen.ansymo.semanticadaptation.tests-1.0.0-SNAPSHOT-p2artifacts.xml
[withMaven] Archive artifact DSL_SemanticAdaptation/be.uantwerpen.ansymo.semanticadaptation.ide/target/p2content.xml under be/uantwerpen/ansymo/semanticadaptation/be.uantwerpen.ansymo.semanticadaptation.ide/1.0.0-SNAPSHOT/be.uantwerpen.ansymo.semanticadaptation.ide-1.0.0-SNAPSHOT-p2metadata.xml
[withMaven] Archive artifact DSL_SemanticAdaptation/be.uantwerpen.ansymo.semanticadaptation.ide/target/p2artifacts.xml under be/uantwerpen/ansymo/semanticadaptation/be.uantwerpen.ansymo.semanticadaptation.ide/1.0.0-SNAPSHOT/be.uantwerpen.ansymo.semanticadaptation.ide-1.0.0-SNAPSHOT-p2artifacts.xml
[withMaven] Archive artifact DSL_SemanticAdaptation/be.uantwerpen.ansymo.semanticadaptation.ui/target/p2content.xml under be/uantwerpen/ansymo/semanticadaptation/be.uantwerpen.ansymo.semanticadaptation.ui/1.0.0-SNAPSHOT/be.uantwerpen.ansymo.semanticadaptation.ui-1.0.0-SNAPSHOT-p2metadata.xml
[withMaven] Archive artifact DSL_SemanticAdaptation/be.uantwerpen.ansymo.semanticadaptation.ui/target/p2artifacts.xml under be/uantwerpen/ansymo/semanticadaptation/be.uantwerpen.ansymo.semanticadaptation.ui/1.0.0-SNAPSHOT/be.uantwerpen.ansymo.semanticadaptation.ui-1.0.0-SNAPSHOT-p2artifacts.xml
[withMaven] Archive artifact DSL_SemanticAdaptation/be.uantwerpen.ansymo.semanticadaptation.cg.cpp/target/p2content.xml under be/uantwerpen/ansymo/semanticadaptation/be.uantwerpen.ansymo.semanticadaptation.cg.cpp/1.0.0-SNAPSHOT/be.uantwerpen.ansymo.semanticadaptation.cg.cpp-1.0.0-SNAPSHOT-p2metadata.xml
[withMaven] Archive artifact DSL_SemanticAdaptation/be.uantwerpen.ansymo.semanticadaptation.cg.cpp/target/p2artifacts.xml under be/uantwerpen/ansymo/semanticadaptation/be.uantwerpen.ansymo.semanticadaptation.cg.cpp/1.0.0-SNAPSHOT/be.uantwerpen.ansymo.semanticadaptation.cg.cpp-1.0.0-SNAPSHOT-p2artifacts.xml
[TASKS] Scanning folder '/var/lib/jenkins/workspace/HybridCosimulation_master-LDEVB56LP46DTRNYHQSCKMS3FR4JD6RBBK6S2LPONMGDZRBJQH3A' for files matching the pattern '**/*.java' - excludes: null
[TASKS] Found 417 files to scan for tasks
[TASKS] Found 26 open tasks.
[TASKS] Computing warning deltas based on reference build #84
[Pipeline] // withMaven
[Pipeline] }
[Pipeline] // stage
[Pipeline] stage
[Pipeline] { (Reporting)
[Pipeline] emailextrecipients
Not sending mail to user cla.gms@gmail.com with no permission to view HybridCosimulation » master #107Not sending mail to user casper.thule@eng.au.dk with no permission to view HybridCosimulation » master #107[Pipeline] emailext
Sending email to: lausdahl@eng.au.dk
[Pipeline] }
[Pipeline] // stage
[Pipeline] }
[Pipeline] // node
[Pipeline] End of Pipeline
ERROR: script returned exit code 1
Finished: FAILURE