FailedConsole Output

Skipping 417 KB.. Full Log
>Getting scope for ref within context class be.uantwerpen.ansymo.semanticadaptation.semanticAdaptation.impl.VariableImpl
2017-11-09 10:58:02,000 [INFO] <Scope found:SimpleScope[armature_current, passenger_up, passenger_down, passenger_stop, driver_up, driver_down, driver_stop, u, d, obj_detected, passenger_up, passenger_down, passenger_stop, driver_up, driver_down, driver_stop, up, down, stop, RTOL, ATOL, T, INIT_V, c, p_v, step_size, aux_obj_detected, crossedTooFar, negative_value, positive_value, f_v] -> NULLSCOPE
2017-11-09 10:58:02,000 [DEBUG] after getLinkedObjects: node: 'T' result: T
2017-11-09 10:58:02,000 [DEBUG] before getLinkedObjects: node: 'step_size'
2017-11-09 10:58:02,000 [INFO] >Getting scope for ref within context class be.uantwerpen.ansymo.semanticadaptation.semanticAdaptation.impl.VariableImpl
2017-11-09 10:58:02,001 [INFO] <Scope found:SimpleScope[armature_current, passenger_up, passenger_down, passenger_stop, driver_up, driver_down, driver_stop, u, d, obj_detected, passenger_up, passenger_down, passenger_stop, driver_up, driver_down, driver_stop, up, down, stop, RTOL, ATOL, T, INIT_V, c, p_v, step_size, aux_obj_detected, crossedTooFar, negative_value, positive_value, f_v] -> NULLSCOPE
2017-11-09 10:58:02,001 [DEBUG] after getLinkedObjects: node: 'step_size' result: step_size
2017-11-09 10:58:02,001 [DEBUG] before getLinkedObjects: node: 'negative_value'
2017-11-09 10:58:02,001 [INFO] >Getting scope for ref within context class be.uantwerpen.ansymo.semanticadaptation.semanticAdaptation.impl.VariableImpl
2017-11-09 10:58:02,001 [INFO] <Scope found:SimpleScope[armature_current, passenger_up, passenger_down, passenger_stop, driver_up, driver_down, driver_stop, u, d, obj_detected, passenger_up, passenger_down, passenger_stop, driver_up, driver_down, driver_stop, up, down, stop, RTOL, ATOL, T, INIT_V, c, p_v, step_size, aux_obj_detected, crossedTooFar, negative_value, positive_value, f_v] -> NULLSCOPE
2017-11-09 10:58:02,001 [DEBUG] after getLinkedObjects: node: 'negative_value' result: negative_value
2017-11-09 10:58:02,001 [DEBUG] before getLinkedObjects: node: 'positive_value'
2017-11-09 10:58:02,001 [INFO] >Getting scope for ref within context class be.uantwerpen.ansymo.semanticadaptation.semanticAdaptation.impl.VariableImpl
2017-11-09 10:58:02,001 [INFO] <Scope found:SimpleScope[armature_current, passenger_up, passenger_down, passenger_stop, driver_up, driver_down, driver_stop, u, d, obj_detected, passenger_up, passenger_down, passenger_stop, driver_up, driver_down, driver_stop, up, down, stop, RTOL, ATOL, T, INIT_V, c, p_v, step_size, aux_obj_detected, crossedTooFar, negative_value, positive_value, f_v] -> NULLSCOPE
2017-11-09 10:58:02,001 [DEBUG] after getLinkedObjects: node: 'positive_value' result: positive_value
2017-11-09 10:58:02,001 [DEBUG] before getLinkedObjects: node: 'negative_value'
2017-11-09 10:58:02,001 [INFO] >Getting scope for ref within context class be.uantwerpen.ansymo.semanticadaptation.semanticAdaptation.impl.VariableImpl
2017-11-09 10:58:02,001 [INFO] <Scope found:SimpleScope[armature_current, passenger_up, passenger_down, passenger_stop, driver_up, driver_down, driver_stop, u, d, obj_detected, passenger_up, passenger_down, passenger_stop, driver_up, driver_down, driver_stop, up, down, stop, RTOL, ATOL, T, INIT_V, c, p_v, step_size, aux_obj_detected, crossedTooFar, negative_value, positive_value, f_v] -> NULLSCOPE
2017-11-09 10:58:02,001 [DEBUG] after getLinkedObjects: node: 'negative_value' result: negative_value
2017-11-09 10:58:02,002 [DEBUG] before getLinkedObjects: node: 'p_v'
2017-11-09 10:58:02,002 [INFO] >Getting scope for ref within context class be.uantwerpen.ansymo.semanticadaptation.semanticAdaptation.impl.VariableImpl
2017-11-09 10:58:02,002 [INFO] <Scope found:SimpleScope[armature_current, passenger_up, passenger_down, passenger_stop, driver_up, driver_down, driver_stop, u, d, obj_detected, passenger_up, passenger_down, passenger_stop, driver_up, driver_down, driver_stop, up, down, stop, RTOL, ATOL, T, INIT_V, c, p_v, step_size, aux_obj_detected, crossedTooFar, negative_value, positive_value, f_v] -> NULLSCOPE
2017-11-09 10:58:02,002 [DEBUG] after getLinkedObjects: node: 'p_v' result: p_v
2017-11-09 10:58:02,002 [DEBUG] before getLinkedObjects: node: 'T'
2017-11-09 10:58:02,002 [INFO] >Getting scope for ref within context class be.uantwerpen.ansymo.semanticadaptation.semanticAdaptation.impl.VariableImpl
2017-11-09 10:58:02,002 [INFO] <Scope found:SimpleScope[armature_current, passenger_up, passenger_down, passenger_stop, driver_up, driver_down, driver_stop, u, d, obj_detected, passenger_up, passenger_down, passenger_stop, driver_up, driver_down, driver_stop, up, down, stop, RTOL, ATOL, T, INIT_V, c, p_v, step_size, aux_obj_detected, crossedTooFar, negative_value, positive_value, f_v] -> NULLSCOPE
2017-11-09 10:58:02,002 [DEBUG] after getLinkedObjects: node: 'T' result: T
2017-11-09 10:58:02,002 [DEBUG] before getLinkedObjects: node: 'RTOL'
2017-11-09 10:58:02,002 [INFO] >Getting scope for ref within context class be.uantwerpen.ansymo.semanticadaptation.semanticAdaptation.impl.VariableImpl
2017-11-09 10:58:02,002 [INFO] <Scope found:SimpleScope[armature_current, passenger_up, passenger_down, passenger_stop, driver_up, driver_down, driver_stop, u, d, obj_detected, passenger_up, passenger_down, passenger_stop, driver_up, driver_down, driver_stop, up, down, stop, RTOL, ATOL, T, INIT_V, c, p_v, step_size, aux_obj_detected, crossedTooFar, negative_value, positive_value, f_v] -> NULLSCOPE
2017-11-09 10:58:02,002 [DEBUG] after getLinkedObjects: node: 'RTOL' result: RTOL
2017-11-09 10:58:02,002 [DEBUG] before getLinkedObjects: node: 'ATOL'
2017-11-09 10:58:02,002 [INFO] >Getting scope for ref within context class be.uantwerpen.ansymo.semanticadaptation.semanticAdaptation.impl.VariableImpl
2017-11-09 10:58:02,002 [INFO] <Scope found:SimpleScope[armature_current, passenger_up, passenger_down, passenger_stop, driver_up, driver_down, driver_stop, u, d, obj_detected, passenger_up, passenger_down, passenger_stop, driver_up, driver_down, driver_stop, up, down, stop, RTOL, ATOL, T, INIT_V, c, p_v, step_size, aux_obj_detected, crossedTooFar, negative_value, positive_value, f_v] -> NULLSCOPE
2017-11-09 10:58:02,002 [DEBUG] after getLinkedObjects: node: 'ATOL' result: ATOL
2017-11-09 10:58:02,002 [DEBUG] before getLinkedObjects: node: 'p_v'
2017-11-09 10:58:02,002 [INFO] >Getting scope for ref within context class be.uantwerpen.ansymo.semanticadaptation.semanticAdaptation.impl.VariableImpl
2017-11-09 10:58:02,003 [INFO] <Scope found:SimpleScope[armature_current, passenger_up, passenger_down, passenger_stop, driver_up, driver_down, driver_stop, u, d, obj_detected, passenger_up, passenger_down, passenger_stop, driver_up, driver_down, driver_stop, up, down, stop, RTOL, ATOL, T, INIT_V, c, p_v, step_size, aux_obj_detected, crossedTooFar, negative_value, positive_value, f_v] -> NULLSCOPE
2017-11-09 10:58:02,003 [DEBUG] after getLinkedObjects: node: 'p_v' result: p_v
2017-11-09 10:58:02,003 [DEBUG] before getLinkedObjects: node: 'T'
2017-11-09 10:58:02,003 [INFO] >Getting scope for ref within context class be.uantwerpen.ansymo.semanticadaptation.semanticAdaptation.impl.VariableImpl
2017-11-09 10:58:02,003 [INFO] <Scope found:SimpleScope[armature_current, passenger_up, passenger_down, passenger_stop, driver_up, driver_down, driver_stop, u, d, obj_detected, passenger_up, passenger_down, passenger_stop, driver_up, driver_down, driver_stop, up, down, stop, RTOL, ATOL, T, INIT_V, c, p_v, step_size, aux_obj_detected, crossedTooFar, negative_value, positive_value, f_v] -> NULLSCOPE
2017-11-09 10:58:02,003 [DEBUG] after getLinkedObjects: node: 'T' result: T
2017-11-09 10:58:02,003 [DEBUG] before getLinkedObjects: node: 'f_v'
2017-11-09 10:58:02,003 [INFO] >Getting scope for ref within context class be.uantwerpen.ansymo.semanticadaptation.semanticAdaptation.impl.VariableImpl
2017-11-09 10:58:02,003 [INFO] <Scope found:SimpleScope[armature_current, passenger_up, passenger_down, passenger_stop, driver_up, driver_down, driver_stop, u, d, obj_detected, passenger_up, passenger_down, passenger_stop, driver_up, driver_down, driver_stop, up, down, stop, RTOL, ATOL, T, INIT_V, c, p_v, step_size, aux_obj_detected, crossedTooFar, negative_value, positive_value, f_v] -> NULLSCOPE
2017-11-09 10:58:02,003 [DEBUG] after getLinkedObjects: node: 'f_v' result: f_v
2017-11-09 10:58:02,003 [DEBUG] before getLinkedObjects: node: 'T'
2017-11-09 10:58:02,003 [INFO] >Getting scope for ref within context class be.uantwerpen.ansymo.semanticadaptation.semanticAdaptation.impl.VariableImpl
2017-11-09 10:58:02,003 [INFO] <Scope found:SimpleScope[armature_current, passenger_up, passenger_down, passenger_stop, driver_up, driver_down, driver_stop, u, d, obj_detected, passenger_up, passenger_down, passenger_stop, driver_up, driver_down, driver_stop, up, down, stop, RTOL, ATOL, T, INIT_V, c, p_v, step_size, aux_obj_detected, crossedTooFar, negative_value, positive_value, f_v] -> NULLSCOPE
2017-11-09 10:58:02,003 [DEBUG] after getLinkedObjects: node: 'T' result: T
2017-11-09 10:58:02,003 [DEBUG] before getLinkedObjects: node: 'RTOL'
2017-11-09 10:58:02,003 [INFO] >Getting scope for ref within context class be.uantwerpen.ansymo.semanticadaptation.semanticAdaptation.impl.VariableImpl
2017-11-09 10:58:02,004 [INFO] <Scope found:SimpleScope[armature_current, passenger_up, passenger_down, passenger_stop, driver_up, driver_down, driver_stop, u, d, obj_detected, passenger_up, passenger_down, passenger_stop, driver_up, driver_down, driver_stop, up, down, stop, RTOL, ATOL, T, INIT_V, c, p_v, step_size, aux_obj_detected, crossedTooFar, negative_value, positive_value, f_v] -> NULLSCOPE
2017-11-09 10:58:02,004 [DEBUG] after getLinkedObjects: node: 'RTOL' result: RTOL
2017-11-09 10:58:02,004 [DEBUG] before getLinkedObjects: node: 'ATOL'
2017-11-09 10:58:02,004 [INFO] >Getting scope for ref within context class be.uantwerpen.ansymo.semanticadaptation.semanticAdaptation.impl.VariableImpl
2017-11-09 10:58:02,004 [INFO] <Scope found:SimpleScope[armature_current, passenger_up, passenger_down, passenger_stop, driver_up, driver_down, driver_stop, u, d, obj_detected, passenger_up, passenger_down, passenger_stop, driver_up, driver_down, driver_stop, up, down, stop, RTOL, ATOL, T, INIT_V, c, p_v, step_size, aux_obj_detected, crossedTooFar, negative_value, positive_value, f_v] -> NULLSCOPE
2017-11-09 10:58:02,004 [DEBUG] after getLinkedObjects: node: 'ATOL' result: ATOL
2017-11-09 10:58:02,004 [DEBUG] before getLinkedObjects: node: 'c'
2017-11-09 10:58:02,004 [INFO] >Getting scope for ref within context class be.uantwerpen.ansymo.semanticadaptation.semanticAdaptation.impl.VariableImpl
2017-11-09 10:58:02,004 [INFO] <Scope found:SimpleScope[armature_current, passenger_up, passenger_down, passenger_stop, driver_up, driver_down, driver_stop, u, d, obj_detected, passenger_up, passenger_down, passenger_stop, driver_up, driver_down, driver_stop, up, down, stop, RTOL, ATOL, T, INIT_V, c, p_v, step_size, aux_obj_detected, crossedTooFar, negative_value, positive_value, f_v] -> NULLSCOPE
2017-11-09 10:58:02,004 [DEBUG] after getLinkedObjects: node: 'c' result: c
2017-11-09 10:58:02,004 [DEBUG] before getLinkedObjects: node: 'crossedTooFar'
2017-11-09 10:58:02,004 [INFO] >Getting scope for ref within context class be.uantwerpen.ansymo.semanticadaptation.semanticAdaptation.impl.VariableImpl
2017-11-09 10:58:02,004 [INFO] <Scope found:SimpleScope[armature_current, passenger_up, passenger_down, passenger_stop, driver_up, driver_down, driver_stop, u, d, obj_detected, passenger_up, passenger_down, passenger_stop, driver_up, driver_down, driver_stop, up, down, stop, RTOL, ATOL, T, INIT_V, c, p_v, step_size, aux_obj_detected, crossedTooFar, negative_value, positive_value, f_v] -> NULLSCOPE
2017-11-09 10:58:02,004 [DEBUG] after getLinkedObjects: node: 'crossedTooFar' result: crossedTooFar
2017-11-09 10:58:02,004 [DEBUG] before getLinkedObjects: node: 'step_size'
2017-11-09 10:58:02,004 [INFO] >Getting scope for ref within context class be.uantwerpen.ansymo.semanticadaptation.semanticAdaptation.impl.VariableImpl
2017-11-09 10:58:02,005 [INFO] <Scope found:SimpleScope[armature_current, passenger_up, passenger_down, passenger_stop, driver_up, driver_down, driver_stop, u, d, obj_detected, passenger_up, passenger_down, passenger_stop, driver_up, driver_down, driver_stop, up, down, stop, RTOL, ATOL, T, INIT_V, c, p_v, step_size, aux_obj_detected, crossedTooFar, negative_value, positive_value, f_v] -> NULLSCOPE
2017-11-09 10:58:02,005 [DEBUG] after getLinkedObjects: node: 'step_size' result: step_size
2017-11-09 10:58:02,005 [DEBUG] before getLinkedObjects: node: 'lazy'
2017-11-09 10:58:02,005 [INFO] >Getting scope for fmu within context class be.uantwerpen.ansymo.semanticadaptation.semanticAdaptation.impl.DoStepFunImpl
2017-11-09 10:58:02,005 [INFO]  Delegating scope discovery to super class...
2017-11-09 10:58:02,005 [INFO] <Scope found:ImportScope[controller_sa.*] imports from org.eclipse.xtext.scoping.impl.MultimapBasedSelectable@4bd5849e for type FMU
2017-11-09 10:58:02,005 [DEBUG] after getLinkedObjects: node: 'lazy' result: lazy
2017-11-09 10:58:02,005 [DEBUG] before getLinkedObjects: node: 'step_size'
2017-11-09 10:58:02,005 [INFO] >Getting scope for ref within context class be.uantwerpen.ansymo.semanticadaptation.semanticAdaptation.impl.VariableImpl
2017-11-09 10:58:02,005 [INFO] <Scope found:SimpleScope[armature_current, passenger_up, passenger_down, passenger_stop, driver_up, driver_down, driver_stop, u, d, obj_detected, passenger_up, passenger_down, passenger_stop, driver_up, driver_down, driver_stop, up, down, stop, RTOL, ATOL, T, INIT_V, c, p_v, step_size, aux_obj_detected, crossedTooFar, negative_value, positive_value, f_v] -> NULLSCOPE
2017-11-09 10:58:02,005 [DEBUG] after getLinkedObjects: node: 'step_size' result: step_size
2017-11-09 10:58:02,005 [DEBUG] before getLinkedObjects: node: 'RTOL'
2017-11-09 10:58:02,005 [INFO] >Getting scope for ref within context class be.uantwerpen.ansymo.semanticadaptation.semanticAdaptation.impl.VariableImpl
2017-11-09 10:58:02,005 [INFO] <Scope found:SimpleScope[armature_current, passenger_up, passenger_down, passenger_stop, driver_up, driver_down, driver_stop, u, d, obj_detected, passenger_up, passenger_down, passenger_stop, driver_up, driver_down, driver_stop, up, down, stop, RTOL, ATOL, T, INIT_V, c, p_v, step_size, aux_obj_detected, crossedTooFar, negative_value, positive_value, f_v] -> NULLSCOPE
2017-11-09 10:58:02,005 [DEBUG] after getLinkedObjects: node: 'RTOL' result: RTOL
2017-11-09 10:58:02,005 [DEBUG] before getLinkedObjects: node: 'ATOL'
2017-11-09 10:58:02,006 [INFO] >Getting scope for ref within context class be.uantwerpen.ansymo.semanticadaptation.semanticAdaptation.impl.VariableImpl
2017-11-09 10:58:02,006 [INFO] <Scope found:SimpleScope[armature_current, passenger_up, passenger_down, passenger_stop, driver_up, driver_down, driver_stop, u, d, obj_detected, passenger_up, passenger_down, passenger_stop, driver_up, driver_down, driver_stop, up, down, stop, RTOL, ATOL, T, INIT_V, c, p_v, step_size, aux_obj_detected, crossedTooFar, negative_value, positive_value, f_v] -> NULLSCOPE
2017-11-09 10:58:02,006 [DEBUG] after getLinkedObjects: node: 'ATOL' result: ATOL
2017-11-09 10:58:02,006 [DEBUG] before getLinkedObjects: node: 'p_v'
2017-11-09 10:58:02,006 [INFO] >Getting scope for ref within context class be.uantwerpen.ansymo.semanticadaptation.semanticAdaptation.impl.VariableImpl
2017-11-09 10:58:02,006 [INFO] <Scope found:SimpleScope[armature_current, passenger_up, passenger_down, passenger_stop, driver_up, driver_down, driver_stop, u, d, obj_detected, passenger_up, passenger_down, passenger_stop, driver_up, driver_down, driver_stop, up, down, stop, RTOL, ATOL, T, INIT_V, c, p_v, step_size, aux_obj_detected, crossedTooFar, negative_value, positive_value, f_v] -> NULLSCOPE
2017-11-09 10:58:02,006 [DEBUG] after getLinkedObjects: node: 'p_v' result: p_v
2017-11-09 10:58:02,006 [DEBUG] before getLinkedObjects: node: 'f_v'
2017-11-09 10:58:02,006 [INFO] >Getting scope for ref within context class be.uantwerpen.ansymo.semanticadaptation.semanticAdaptation.impl.VariableImpl
2017-11-09 10:58:02,006 [INFO] <Scope found:SimpleScope[armature_current, passenger_up, passenger_down, passenger_stop, driver_up, driver_down, driver_stop, u, d, obj_detected, passenger_up, passenger_down, passenger_stop, driver_up, driver_down, driver_stop, up, down, stop, RTOL, ATOL, T, INIT_V, c, p_v, step_size, aux_obj_detected, crossedTooFar, negative_value, positive_value, f_v] -> NULLSCOPE
2017-11-09 10:58:02,006 [DEBUG] after getLinkedObjects: node: 'f_v' result: f_v
2017-11-09 10:58:02,006 [DEBUG] before getLinkedObjects: node: 'step_size'
2017-11-09 10:58:02,006 [INFO] >Getting scope for ref within context class be.uantwerpen.ansymo.semanticadaptation.semanticAdaptation.impl.VariableImpl
2017-11-09 10:58:02,006 [INFO] <Scope found:SimpleScope[armature_current, passenger_up, passenger_down, passenger_stop, driver_up, driver_down, driver_stop, u, d, obj_detected, passenger_up, passenger_down, passenger_stop, driver_up, driver_down, driver_stop, up, down, stop, RTOL, ATOL, T, INIT_V, c, p_v, step_size, aux_obj_detected, crossedTooFar, negative_value, positive_value, f_v] -> NULLSCOPE
2017-11-09 10:58:02,006 [DEBUG] after getLinkedObjects: node: 'step_size' result: step_size
2017-11-09 10:58:02,007 [DEBUG] before getLinkedObjects: node: 'f_v'
2017-11-09 10:58:02,007 [INFO] >Getting scope for ref within context class be.uantwerpen.ansymo.semanticadaptation.semanticAdaptation.impl.VariableImpl
2017-11-09 10:58:02,007 [INFO] <Scope found:SimpleScope[armature_current, passenger_up, passenger_down, passenger_stop, driver_up, driver_down, driver_stop, u, d, obj_detected, passenger_up, passenger_down, passenger_stop, driver_up, driver_down, driver_stop, up, down, stop, RTOL, ATOL, T, INIT_V, c, p_v, step_size, aux_obj_detected, crossedTooFar, negative_value, positive_value, f_v] -> NULLSCOPE
2017-11-09 10:58:02,007 [DEBUG] after getLinkedObjects: node: 'f_v' result: f_v
2017-11-09 10:58:02,007 [DEBUG] before getLinkedObjects: node: 'controller_sa'
2017-11-09 10:58:02,007 [INFO] >Getting scope for owner within context class be.uantwerpen.ansymo.semanticadaptation.semanticAdaptation.impl.VariableImpl
2017-11-09 10:58:02,007 [INFO]  Delegating scope discovery to super class...
2017-11-09 10:58:02,007 [INFO] <Scope found:ImportScope[controller_sa.*] imports from org.eclipse.xtext.scoping.impl.MultimapBasedSelectable@4bd5849e for type FMU
2017-11-09 10:58:02,007 [DEBUG] after getLinkedObjects: node: 'controller_sa' result: controller_sa
2017-11-09 10:58:02,007 [DEBUG] before getLinkedObjects: node: 'armature_current'
2017-11-09 10:58:02,007 [INFO] >Getting scope for ref within context class be.uantwerpen.ansymo.semanticadaptation.semanticAdaptation.impl.VariableImpl
2017-11-09 10:58:02,007 [INFO]  Getting scope within FMU: controller_sa
2017-11-09 10:58:02,007 [INFO] <Scope found:SimpleScope[armature_current, passenger_up, passenger_down, passenger_stop, driver_up, driver_down, driver_stop, u, d, obj_detected, passenger_up, passenger_down, passenger_stop, driver_up, driver_down, driver_stop, up, down, stop] -> NULLSCOPE
2017-11-09 10:58:02,007 [DEBUG] after getLinkedObjects: node: 'armature_current' result: armature_current
2017-11-09 10:58:02,007 [DEBUG] before getLinkedObjects: node: 'lazy'
2017-11-09 10:58:02,007 [INFO] >Getting scope for owner within context class be.uantwerpen.ansymo.semanticadaptation.semanticAdaptation.impl.VariableImpl
2017-11-09 10:58:02,007 [INFO]  Delegating scope discovery to super class...
2017-11-09 10:58:02,008 [INFO] <Scope found:ImportScope[controller_sa.*] imports from org.eclipse.xtext.scoping.impl.MultimapBasedSelectable@4bd5849e for type FMU
2017-11-09 10:58:02,008 [DEBUG] after getLinkedObjects: node: 'lazy' result: lazy
2017-11-09 10:58:02,008 [DEBUG] before getLinkedObjects: node: 'obj_detected'
2017-11-09 10:58:02,008 [INFO] >Getting scope for ref within context class be.uantwerpen.ansymo.semanticadaptation.semanticAdaptation.impl.VariableImpl
2017-11-09 10:58:02,008 [INFO]  Getting scope within FMU: lazy
2017-11-09 10:58:02,008 [INFO] <Scope found:SimpleScope[obj_detected, passenger_up, passenger_down, passenger_stop, driver_up, driver_down, driver_stop, up, down, stop] -> NULLSCOPE
2017-11-09 10:58:02,008 [DEBUG] after getLinkedObjects: node: 'obj_detected' result: obj_detected
2017-11-09 10:58:02,008 [DEBUG] before getLinkedObjects: node: 'c'
2017-11-09 10:58:02,008 [INFO] >Getting scope for ref within context class be.uantwerpen.ansymo.semanticadaptation.semanticAdaptation.impl.VariableImpl
2017-11-09 10:58:02,008 [INFO] <Scope found:SimpleScope[armature_current, passenger_up, passenger_down, passenger_stop, driver_up, driver_down, driver_stop, u, d, obj_detected, passenger_up, passenger_down, passenger_stop, driver_up, driver_down, driver_stop, up, down, stop, RTOL, ATOL, T, INIT_V, c, p_v, step_size, aux_obj_detected, crossedTooFar, negative_value, positive_value, f_v] -> NULLSCOPE
2017-11-09 10:58:02,008 [DEBUG] after getLinkedObjects: node: 'c' result: c
2017-11-09 10:58:02,008 [DEBUG] before getLinkedObjects: node: 'INIT_V'
2017-11-09 10:58:02,008 [INFO] >Getting scope for ref within context class be.uantwerpen.ansymo.semanticadaptation.semanticAdaptation.impl.VariableImpl
2017-11-09 10:58:02,008 [INFO] <Scope found:SimpleScope[armature_current, passenger_up, passenger_down, passenger_stop, driver_up, driver_down, driver_stop, u, d, obj_detected, passenger_up, passenger_down, passenger_stop, driver_up, driver_down, driver_stop, up, down, stop, RTOL, ATOL, T, INIT_V, c, p_v, step_size, aux_obj_detected, crossedTooFar, negative_value, positive_value, f_v] -> NULLSCOPE
2017-11-09 10:58:02,008 [DEBUG] after getLinkedObjects: node: 'INIT_V' result: INIT_V
2017-11-09 10:58:02,008 [DEBUG] before getLinkedObjects: node: 'lazy'
2017-11-09 10:58:02,008 [INFO] >Getting scope for owner within context class be.uantwerpen.ansymo.semanticadaptation.semanticAdaptation.impl.VariableImpl
2017-11-09 10:58:02,008 [INFO]  Delegating scope discovery to super class...
2017-11-09 10:58:02,008 [INFO] <Scope found:ImportScope[controller_sa.*] imports from org.eclipse.xtext.scoping.impl.MultimapBasedSelectable@4bd5849e for type FMU
2017-11-09 10:58:02,009 [DEBUG] after getLinkedObjects: node: 'lazy' result: lazy
2017-11-09 10:58:02,009 [DEBUG] before getLinkedObjects: node: 'up'
2017-11-09 10:58:02,009 [INFO] >Getting scope for ref within context class be.uantwerpen.ansymo.semanticadaptation.semanticAdaptation.impl.VariableImpl
2017-11-09 10:58:02,009 [INFO]  Getting scope within FMU: lazy
2017-11-09 10:58:02,009 [INFO] <Scope found:SimpleScope[obj_detected, passenger_up, passenger_down, passenger_stop, driver_up, driver_down, driver_stop, up, down, stop] -> NULLSCOPE
2017-11-09 10:58:02,009 [DEBUG] after getLinkedObjects: node: 'up' result: up
2017-11-09 10:58:02,009 [DEBUG] before getLinkedObjects: node: 'controller_sa'
2017-11-09 10:58:02,009 [INFO] >Getting scope for owner within context class be.uantwerpen.ansymo.semanticadaptation.semanticAdaptation.impl.VariableImpl
2017-11-09 10:58:02,009 [INFO]  Delegating scope discovery to super class...
2017-11-09 10:58:02,009 [INFO] <Scope found:ImportScope[controller_sa.*] imports from org.eclipse.xtext.scoping.impl.MultimapBasedSelectable@4bd5849e for type FMU
2017-11-09 10:58:02,009 [DEBUG] after getLinkedObjects: node: 'controller_sa' result: controller_sa
2017-11-09 10:58:02,009 [DEBUG] before getLinkedObjects: node: 'u'
2017-11-09 10:58:02,009 [INFO] >Getting scope for ref within context class be.uantwerpen.ansymo.semanticadaptation.semanticAdaptation.impl.VariableImpl
2017-11-09 10:58:02,009 [INFO]  Getting scope within FMU: controller_sa
2017-11-09 10:58:02,009 [INFO] <Scope found:SimpleScope[armature_current, passenger_up, passenger_down, passenger_stop, driver_up, driver_down, driver_stop, u, d, obj_detected, passenger_up, passenger_down, passenger_stop, driver_up, driver_down, driver_stop, up, down, stop] -> NULLSCOPE
2017-11-09 10:58:02,009 [DEBUG] after getLinkedObjects: node: 'u' result: u
2017-11-09 10:58:02,009 [DEBUG] before getLinkedObjects: node: 'lazy'
2017-11-09 10:58:02,009 [INFO] >Getting scope for owner within context class be.uantwerpen.ansymo.semanticadaptation.semanticAdaptation.impl.VariableImpl
2017-11-09 10:58:02,009 [INFO]  Delegating scope discovery to super class...
2017-11-09 10:58:02,009 [INFO] <Scope found:ImportScope[controller_sa.*] imports from org.eclipse.xtext.scoping.impl.MultimapBasedSelectable@4bd5849e for type FMU
2017-11-09 10:58:02,010 [DEBUG] after getLinkedObjects: node: 'lazy' result: lazy
2017-11-09 10:58:02,010 [DEBUG] before getLinkedObjects: node: 'up'
2017-11-09 10:58:02,010 [INFO] >Getting scope for ref within context class be.uantwerpen.ansymo.semanticadaptation.semanticAdaptation.impl.VariableImpl
2017-11-09 10:58:02,010 [INFO]  Getting scope within FMU: lazy
2017-11-09 10:58:02,010 [INFO] <Scope found:SimpleScope[obj_detected, passenger_up, passenger_down, passenger_stop, driver_up, driver_down, driver_stop, up, down, stop] -> NULLSCOPE
2017-11-09 10:58:02,010 [DEBUG] after getLinkedObjects: node: 'up' result: up
2017-11-09 10:58:02,010 [DEBUG] before getLinkedObjects: node: 'controller_sa'
2017-11-09 10:58:02,010 [INFO] >Getting scope for owner within context class be.uantwerpen.ansymo.semanticadaptation.semanticAdaptation.impl.VariableImpl
2017-11-09 10:58:02,010 [INFO]  Delegating scope discovery to super class...
2017-11-09 10:58:02,010 [INFO] <Scope found:ImportScope[controller_sa.*] imports from org.eclipse.xtext.scoping.impl.MultimapBasedSelectable@4bd5849e for type FMU
2017-11-09 10:58:02,010 [DEBUG] after getLinkedObjects: node: 'controller_sa' result: controller_sa
2017-11-09 10:58:02,010 [DEBUG] before getLinkedObjects: node: 'u'
2017-11-09 10:58:02,010 [INFO] >Getting scope for ref within context class be.uantwerpen.ansymo.semanticadaptation.semanticAdaptation.impl.VariableImpl
2017-11-09 10:58:02,010 [INFO]  Getting scope within FMU: controller_sa
2017-11-09 10:58:02,010 [INFO] <Scope found:SimpleScope[armature_current, passenger_up, passenger_down, passenger_stop, driver_up, driver_down, driver_stop, u, d, obj_detected, passenger_up, passenger_down, passenger_stop, driver_up, driver_down, driver_stop, up, down, stop] -> NULLSCOPE
2017-11-09 10:58:02,010 [DEBUG] after getLinkedObjects: node: 'u' result: u
2017-11-09 10:58:02,010 [DEBUG] before getLinkedObjects: node: 'lazy'
2017-11-09 10:58:02,010 [INFO] >Getting scope for owner within context class be.uantwerpen.ansymo.semanticadaptation.semanticAdaptation.impl.VariableImpl
2017-11-09 10:58:02,010 [INFO]  Delegating scope discovery to super class...
2017-11-09 10:58:02,011 [INFO] <Scope found:ImportScope[controller_sa.*] imports from org.eclipse.xtext.scoping.impl.MultimapBasedSelectable@4bd5849e for type FMU
2017-11-09 10:58:02,011 [DEBUG] after getLinkedObjects: node: 'lazy' result: lazy
2017-11-09 10:58:02,011 [DEBUG] before getLinkedObjects: node: 'down'
2017-11-09 10:58:02,011 [INFO] >Getting scope for ref within context class be.uantwerpen.ansymo.semanticadaptation.semanticAdaptation.impl.VariableImpl
2017-11-09 10:58:02,011 [INFO]  Getting scope within FMU: lazy
2017-11-09 10:58:02,011 [INFO] <Scope found:SimpleScope[obj_detected, passenger_up, passenger_down, passenger_stop, driver_up, driver_down, driver_stop, up, down, stop] -> NULLSCOPE
2017-11-09 10:58:02,011 [DEBUG] after getLinkedObjects: node: 'down' result: down
2017-11-09 10:58:02,011 [DEBUG] before getLinkedObjects: node: 'controller_sa'
2017-11-09 10:58:02,011 [INFO] >Getting scope for owner within context class be.uantwerpen.ansymo.semanticadaptation.semanticAdaptation.impl.VariableImpl
2017-11-09 10:58:02,012 [INFO]  Delegating scope discovery to super class...
2017-11-09 10:58:02,012 [INFO] <Scope found:ImportScope[controller_sa.*] imports from org.eclipse.xtext.scoping.impl.MultimapBasedSelectable@4bd5849e for type FMU
2017-11-09 10:58:02,012 [DEBUG] after getLinkedObjects: node: 'controller_sa' result: controller_sa
2017-11-09 10:58:02,012 [DEBUG] before getLinkedObjects: node: 'd'
2017-11-09 10:58:02,012 [INFO] >Getting scope for ref within context class be.uantwerpen.ansymo.semanticadaptation.semanticAdaptation.impl.VariableImpl
2017-11-09 10:58:02,012 [INFO]  Getting scope within FMU: controller_sa
2017-11-09 10:58:02,012 [INFO] <Scope found:SimpleScope[armature_current, passenger_up, passenger_down, passenger_stop, driver_up, driver_down, driver_stop, u, d, obj_detected, passenger_up, passenger_down, passenger_stop, driver_up, driver_down, driver_stop, up, down, stop] -> NULLSCOPE
2017-11-09 10:58:02,012 [DEBUG] after getLinkedObjects: node: 'd' result: d
2017-11-09 10:58:02,012 [DEBUG] before getLinkedObjects: node: 'lazy'
2017-11-09 10:58:02,012 [INFO] >Getting scope for owner within context class be.uantwerpen.ansymo.semanticadaptation.semanticAdaptation.impl.VariableImpl
2017-11-09 10:58:02,012 [INFO]  Delegating scope discovery to super class...
2017-11-09 10:58:02,013 [INFO] <Scope found:ImportScope[controller_sa.*] imports from org.eclipse.xtext.scoping.impl.MultimapBasedSelectable@4bd5849e for type FMU
2017-11-09 10:58:02,013 [DEBUG] after getLinkedObjects: node: 'lazy' result: lazy
2017-11-09 10:58:02,013 [DEBUG] before getLinkedObjects: node: 'down'
2017-11-09 10:58:02,013 [INFO] >Getting scope for ref within context class be.uantwerpen.ansymo.semanticadaptation.semanticAdaptation.impl.VariableImpl
2017-11-09 10:58:02,013 [INFO]  Getting scope within FMU: lazy
2017-11-09 10:58:02,013 [INFO] <Scope found:SimpleScope[obj_detected, passenger_up, passenger_down, passenger_stop, driver_up, driver_down, driver_stop, up, down, stop] -> NULLSCOPE
2017-11-09 10:58:02,013 [DEBUG] after getLinkedObjects: node: 'down' result: down
2017-11-09 10:58:02,013 [DEBUG] before getLinkedObjects: node: 'controller_sa'
2017-11-09 10:58:02,013 [INFO] >Getting scope for owner within context class be.uantwerpen.ansymo.semanticadaptation.semanticAdaptation.impl.VariableImpl
2017-11-09 10:58:02,013 [INFO]  Delegating scope discovery to super class...
2017-11-09 10:58:02,013 [INFO] <Scope found:ImportScope[controller_sa.*] imports from org.eclipse.xtext.scoping.impl.MultimapBasedSelectable@4bd5849e for type FMU
2017-11-09 10:58:02,013 [DEBUG] after getLinkedObjects: node: 'controller_sa' result: controller_sa
2017-11-09 10:58:02,013 [DEBUG] before getLinkedObjects: node: 'd'
2017-11-09 10:58:02,013 [INFO] >Getting scope for ref within context class be.uantwerpen.ansymo.semanticadaptation.semanticAdaptation.impl.VariableImpl
2017-11-09 10:58:02,013 [INFO]  Getting scope within FMU: controller_sa
2017-11-09 10:58:02,013 [INFO] <Scope found:SimpleScope[armature_current, passenger_up, passenger_down, passenger_stop, driver_up, driver_down, driver_stop, u, d, obj_detected, passenger_up, passenger_down, passenger_stop, driver_up, driver_down, driver_stop, up, down, stop] -> NULLSCOPE
2017-11-09 10:58:02,013 [DEBUG] after getLinkedObjects: node: 'd' result: d
2017-11-09 10:58:02,013 [DEBUG] before getLinkedObjects: node: 'lazy'
2017-11-09 10:58:02,013 [INFO] >Getting scope for owner within context class be.uantwerpen.ansymo.semanticadaptation.semanticAdaptation.impl.VariableImpl
2017-11-09 10:58:02,013 [INFO]  Delegating scope discovery to super class...
2017-11-09 10:58:02,014 [INFO] <Scope found:ImportScope[controller_sa.*] imports from org.eclipse.xtext.scoping.impl.MultimapBasedSelectable@4bd5849e for type FMU
2017-11-09 10:58:02,014 [DEBUG] after getLinkedObjects: node: 'lazy' result: lazy
2017-11-09 10:58:02,014 [DEBUG] before getLinkedObjects: node: 'stop'
2017-11-09 10:58:02,014 [INFO] >Getting scope for ref within context class be.uantwerpen.ansymo.semanticadaptation.semanticAdaptation.impl.VariableImpl
2017-11-09 10:58:02,014 [INFO]  Getting scope within FMU: lazy
2017-11-09 10:58:02,014 [INFO] <Scope found:SimpleScope[obj_detected, passenger_up, passenger_down, passenger_stop, driver_up, driver_down, driver_stop, up, down, stop] -> NULLSCOPE
2017-11-09 10:58:02,014 [DEBUG] after getLinkedObjects: node: 'stop' result: stop
2017-11-09 10:58:02,014 [DEBUG] before getLinkedObjects: node: 'controller_sa'
2017-11-09 10:58:02,014 [INFO] >Getting scope for owner within context class be.uantwerpen.ansymo.semanticadaptation.semanticAdaptation.impl.VariableImpl
2017-11-09 10:58:02,014 [INFO]  Delegating scope discovery to super class...
2017-11-09 10:58:02,014 [INFO] <Scope found:ImportScope[controller_sa.*] imports from org.eclipse.xtext.scoping.impl.MultimapBasedSelectable@4bd5849e for type FMU
2017-11-09 10:58:02,014 [DEBUG] after getLinkedObjects: node: 'controller_sa' result: controller_sa
2017-11-09 10:58:02,014 [DEBUG] before getLinkedObjects: node: 'u'
2017-11-09 10:58:02,014 [INFO] >Getting scope for ref within context class be.uantwerpen.ansymo.semanticadaptation.semanticAdaptation.impl.VariableImpl
2017-11-09 10:58:02,014 [INFO]  Getting scope within FMU: controller_sa
2017-11-09 10:58:02,014 [INFO] <Scope found:SimpleScope[armature_current, passenger_up, passenger_down, passenger_stop, driver_up, driver_down, driver_stop, u, d, obj_detected, passenger_up, passenger_down, passenger_stop, driver_up, driver_down, driver_stop, up, down, stop] -> NULLSCOPE
2017-11-09 10:58:02,014 [DEBUG] after getLinkedObjects: node: 'u' result: u
2017-11-09 10:58:02,014 [DEBUG] before getLinkedObjects: node: 'controller_sa'
2017-11-09 10:58:02,014 [INFO] >Getting scope for owner within context class be.uantwerpen.ansymo.semanticadaptation.semanticAdaptation.impl.VariableImpl
2017-11-09 10:58:02,014 [INFO]  Delegating scope discovery to super class...
2017-11-09 10:58:02,015 [INFO] <Scope found:ImportScope[controller_sa.*] imports from org.eclipse.xtext.scoping.impl.MultimapBasedSelectable@4bd5849e for type FMU
2017-11-09 10:58:02,015 [DEBUG] after getLinkedObjects: node: 'controller_sa' result: controller_sa
2017-11-09 10:58:02,015 [DEBUG] before getLinkedObjects: node: 'd'
2017-11-09 10:58:02,015 [INFO] >Getting scope for ref within context class be.uantwerpen.ansymo.semanticadaptation.semanticAdaptation.impl.VariableImpl
2017-11-09 10:58:02,015 [INFO]  Getting scope within FMU: controller_sa
2017-11-09 10:58:02,015 [INFO] <Scope found:SimpleScope[armature_current, passenger_up, passenger_down, passenger_stop, driver_up, driver_down, driver_stop, u, d, obj_detected, passenger_up, passenger_down, passenger_stop, driver_up, driver_down, driver_stop, up, down, stop] -> NULLSCOPE
2017-11-09 10:58:02,015 [DEBUG] after getLinkedObjects: node: 'd' result: d
2017-11-09 10:58:02,015 [DEBUG] Syntax check OK! Resource: __synthetic0.sa
Stored file: target/generated/controller/sources/Controller_sa.cpp
Stored file: target/generated/controller/sources/Controller_sa.h
Stored file: target/generated/controller/sources/Fmu.cpp
Stored file: target/generated/controller/modelDescription.xml
Stored file: target/generated/controller/sources/main.cpp
Copied file to: target/generated/controller/resources/LazySA.fmu
Stored file: target/generated/controller/CMakeLists.txt
Stored file: target/generated/controller/msys-toolchain.cmake
-- The C compiler identification is GNU 5.4.0
-- The CXX compiler identification is GNU 5.4.0
-- Check for working C compiler: /usr/bin/cc
-- Check for working C compiler: /usr/bin/cc -- works
-- Detecting C compiler ABI info
-- Detecting C compiler ABI info - done
-- Detecting C compile features
-- Detecting C compile features - done
-- Check for working CXX compiler: /usr/bin/c++
-- Check for working CXX compiler: /usr/bin/c++ -- works
-- Detecting CXX compiler ABI info
-- Detecting CXX compiler ABI info - done
-- Detecting CXX compile features
-- Detecting CXX compile features - done
Already up-to-date.
-- Performing Test COMPILER_SUPPORTS_CXX11
-- Performing Test COMPILER_SUPPORTS_CXX11 - Success
-- Performing Test COMPILER_SUPPORTS_CXX0X
-- Performing Test COMPILER_SUPPORTS_CXX0X - Success
-- Found ZLIB: /usr/lib/x86_64-linux-gnu/libz.so (found version "1.2.8") 
-- Configuring done
-- Generating done
-- Build files have been written to: /var/lib/jenkins/workspace/HybridCosimulation_master-LDEVB56LP46DTRNYHQSCKMS3FR4JD6RBBK6S2LPONMGDZRBJQH3A/DSL_SemanticAdaptation/be.uantwerpen.ansymo.semanticadaptation.cg.cpp.tests/target/generated/controller
Scanning dependencies of target minizip
[  4%] Building C object hcf/semantic-adaptation/third_party/into-cpp-fmi/thrird_party/projects/minizip/CMakeFiles/minizip.dir/miniunz.c.o
[  9%] Building C object hcf/semantic-adaptation/third_party/into-cpp-fmi/thrird_party/projects/minizip/CMakeFiles/minizip.dir/__/__/zlib/contrib/minizip/mztools.c.o
[ 14%] Building C object hcf/semantic-adaptation/third_party/into-cpp-fmi/thrird_party/projects/minizip/CMakeFiles/minizip.dir/__/__/zlib/contrib/minizip/ioapi.c.o
[ 19%] Building C object hcf/semantic-adaptation/third_party/into-cpp-fmi/thrird_party/projects/minizip/CMakeFiles/minizip.dir/__/__/zlib/contrib/minizip/unzip.c.o
[ 23%] Building C object hcf/semantic-adaptation/third_party/into-cpp-fmi/thrird_party/projects/minizip/CMakeFiles/minizip.dir/__/__/zlib/contrib/minizip/zip.c.o
[ 28%] Linking C static library libminizipd.a
/usr/bin/ar qc libminizipd.a  CMakeFiles/minizip.dir/__/__/zlib/contrib/minizip/ioapi.c.o CMakeFiles/minizip.dir/miniunz.c.o CMakeFiles/minizip.dir/__/__/zlib/contrib/minizip/mztools.c.o CMakeFiles/minizip.dir/__/__/zlib/contrib/minizip/unzip.c.o CMakeFiles/minizip.dir/__/__/zlib/contrib/minizip/zip.c.o
/usr/bin/ranlib libminizipd.a
[ 28%] Built target minizip
Scanning dependencies of target intocppfmi
[ 33%] Building C object hcf/semantic-adaptation/third_party/into-cpp-fmi/CMakeFiles/intocppfmi.dir/src/FmuLoader.c.o
[ 38%] Building C object hcf/semantic-adaptation/third_party/into-cpp-fmi/CMakeFiles/intocppfmi.dir/src/uri.c.o
[ 42%] Building CXX object hcf/semantic-adaptation/third_party/into-cpp-fmi/CMakeFiles/intocppfmi.dir/src/FilesystemUtil.cpp.o
[ 47%] Building CXX object hcf/semantic-adaptation/third_party/into-cpp-fmi/CMakeFiles/intocppfmi.dir/src/Fmu.cpp.o
[ 52%] Linking CXX static library libintocppfmi.a
/usr/bin/ar qc libintocppfmi.a  CMakeFiles/intocppfmi.dir/src/FmuLoader.c.o CMakeFiles/intocppfmi.dir/src/uri.c.o CMakeFiles/intocppfmi.dir/src/FilesystemUtil.cpp.o CMakeFiles/intocppfmi.dir/src/Fmu.cpp.o
/usr/bin/ranlib libintocppfmi.a
[ 52%] Built target intocppfmi
Scanning dependencies of target hcf
[ 57%] Building CXX object hcf/semantic-adaptation/CMakeFiles/hcf.dir/src/HyfMath.cpp.o
[ 61%] Building CXX object hcf/semantic-adaptation/CMakeFiles/hcf.dir/src/Empty.cpp.o
[ 66%] Linking CXX static library libhcf.a
/usr/bin/ar qc libhcf.a  CMakeFiles/hcf.dir/src/Empty.cpp.o CMakeFiles/hcf.dir/src/HyfMath.cpp.o
/usr/bin/ranlib libhcf.a
[ 66%] Built target hcf
Scanning dependencies of target controller_main
Scanning dependencies of target controller
[ 71%] Building CXX object CMakeFiles/controller_main.dir/sources/Controller_sa.cpp.o
[ 76%] Building CXX object CMakeFiles/controller_main.dir/sources/main.cpp.o
[ 80%] Building CXX object CMakeFiles/controller.dir/sources/Controller_sa.cpp.o
[ 85%] Building CXX object CMakeFiles/controller_main.dir/sources/Fmu.cpp.o
[ 90%] Building CXX object CMakeFiles/controller.dir/sources/Fmu.cpp.o
[ 95%] Linking CXX executable controller_main
[ 95%] Built target controller_main
[100%] Linking CXX shared library binaries/linux64/controller.so
[100%] Built target controller
Scanning dependencies of target pack
modelDescription.xml
resources
resources/LazySA.fmu
binaries/linux64
binaries/linux64/controller.so
Built target pack
2017-11-09 10:58:13,228 [DEBUG] Parsing took: 12 ms
2017-11-09 10:58:13,229 [DEBUG] beforeModelLinked took: 0ms
2017-11-09 10:58:13,231 [DEBUG] doLinkModel took: 2ms
2017-11-09 10:58:13,231 [DEBUG] afterModelLinked took: 0ms
2017-11-09 10:58:13,233 [DEBUG] before getLinkedObjects: node: 'window_sa'
2017-11-09 10:58:13,233 [INFO] >Getting scope for owner within context class be.uantwerpen.ansymo.semanticadaptation.semanticAdaptation.impl.SpecifiedPortImpl
2017-11-09 10:58:13,233 [INFO]  Delegating scope discovery to super class...
2017-11-09 10:58:13,233 [DEBUG] No explicit container state set. Falling back to default.
2017-11-09 10:58:13,233 [DEBUG] No explicit container state set. Falling back to default.
2017-11-09 10:58:13,233 [DEBUG] No explicit container state set. Falling back to default.
2017-11-09 10:58:13,235 [INFO] <Scope found:ImportScope[loop_sa.*] imports from org.eclipse.xtext.scoping.impl.MultimapBasedSelectable@77c10a5f for type FMU
2017-11-09 10:58:13,235 [DEBUG] after getLinkedObjects: node: 'window_sa' result: window_sa
2017-11-09 10:58:13,236 [DEBUG] before getLinkedObjects: node: 'disp'
2017-11-09 10:58:13,236 [INFO] >Getting scope for port within context class be.uantwerpen.ansymo.semanticadaptation.semanticAdaptation.impl.SpecifiedPortImpl
2017-11-09 10:58:13,236 [INFO]  Getting scope within FMU: window_sa
2017-11-09 10:58:13,236 [INFO] <Scope found:SimpleScope[displacement, speed, reaction_force, disp, tau] -> NULLSCOPE
2017-11-09 10:58:13,236 [DEBUG] after getLinkedObjects: node: 'disp' result: disp
2017-11-09 10:58:13,236 [DEBUG] before getLinkedObjects: node: 'obstacle'
2017-11-09 10:58:13,236 [INFO] >Getting scope for owner within context class be.uantwerpen.ansymo.semanticadaptation.semanticAdaptation.impl.SpecifiedPortImpl
2017-11-09 10:58:13,236 [INFO]  Delegating scope discovery to super class...
2017-11-09 10:58:13,236 [INFO] <Scope found:ImportScope[loop_sa.*] imports from org.eclipse.xtext.scoping.impl.MultimapBasedSelectable@77c10a5f for type FMU
2017-11-09 10:58:13,236 [DEBUG] after getLinkedObjects: node: 'obstacle' result: obstacle
2017-11-09 10:58:13,236 [DEBUG] before getLinkedObjects: node: 'disp'
2017-11-09 10:58:13,236 [INFO] >Getting scope for port within context class be.uantwerpen.ansymo.semanticadaptation.semanticAdaptation.impl.SpecifiedPortImpl
2017-11-09 10:58:13,236 [INFO]  Getting scope within FMU: obstacle
2017-11-09 10:58:13,236 [INFO] <Scope found:SimpleScope[disp, reaction_force] -> NULLSCOPE
2017-11-09 10:58:13,236 [DEBUG] after getLinkedObjects: node: 'disp' result: disp
2017-11-09 10:58:13,236 [DEBUG] before getLinkedObjects: node: 'obstacle'
2017-11-09 10:58:13,236 [INFO] >Getting scope for owner within context class be.uantwerpen.ansymo.semanticadaptation.semanticAdaptation.impl.SpecifiedPortImpl
2017-11-09 10:58:13,236 [INFO]  Delegating scope discovery to super class...
2017-11-09 10:58:13,236 [INFO] <Scope found:ImportScope[loop_sa.*] imports from org.eclipse.xtext.scoping.impl.MultimapBasedSelectable@77c10a5f for type FMU
2017-11-09 10:58:13,236 [DEBUG] after getLinkedObjects: node: 'obstacle' result: obstacle
2017-11-09 10:58:13,236 [DEBUG] before getLinkedObjects: node: 'reaction_force'
2017-11-09 10:58:13,236 [INFO] >Getting scope for port within context class be.uantwerpen.ansymo.semanticadaptation.semanticAdaptation.impl.SpecifiedPortImpl
2017-11-09 10:58:13,236 [INFO]  Getting scope within FMU: obstacle
2017-11-09 10:58:13,236 [INFO] <Scope found:SimpleScope[disp, reaction_force] -> NULLSCOPE
2017-11-09 10:58:13,236 [DEBUG] after getLinkedObjects: node: 'reaction_force' result: reaction_force
2017-11-09 10:58:13,237 [DEBUG] before getLinkedObjects: node: 'window_sa'
2017-11-09 10:58:13,237 [INFO] >Getting scope for owner within context class be.uantwerpen.ansymo.semanticadaptation.semanticAdaptation.impl.SpecifiedPortImpl
2017-11-09 10:58:13,237 [INFO]  Delegating scope discovery to super class...
2017-11-09 10:58:13,237 [INFO] <Scope found:ImportScope[loop_sa.*] imports from org.eclipse.xtext.scoping.impl.MultimapBasedSelectable@77c10a5f for type FMU
2017-11-09 10:58:13,237 [DEBUG] after getLinkedObjects: node: 'window_sa' result: window_sa
2017-11-09 10:58:13,237 [DEBUG] before getLinkedObjects: node: 'reaction_force'
2017-11-09 10:58:13,237 [INFO] >Getting scope for port within context class be.uantwerpen.ansymo.semanticadaptation.semanticAdaptation.impl.SpecifiedPortImpl
2017-11-09 10:58:13,237 [INFO]  Getting scope within FMU: window_sa
2017-11-09 10:58:13,237 [INFO] <Scope found:SimpleScope[displacement, speed, reaction_force, disp, tau] -> NULLSCOPE
2017-11-09 10:58:13,237 [DEBUG] after getLinkedObjects: node: 'reaction_force' result: reaction_force
2017-11-09 10:58:13,237 [DEBUG] before getLinkedObjects: node: 'MAXITER'
2017-11-09 10:58:13,237 [INFO] >Getting scope for ref within context class be.uantwerpen.ansymo.semanticadaptation.semanticAdaptation.impl.VariableImpl
2017-11-09 10:58:13,237 [INFO] <Scope found:SimpleScope[displacement, speed, tau, displacement, speed, reaction_force, disp, tau, disp, reaction_force, MAXITER, REL_TOL, ABS_TOL, INIT_LOOP_SA_DISPLACEMENT, INIT_LOOP_SA_SPEED, INIT_WINDOW_SA_DISP, INIT_WINDOW_SA_TAU, INIT_OBSTACLE_REACTION_FORCE, prev_disp, repeat, iter, stored_loop_sa_displacement, stored_loop_sa_speed, stored_window_sa_disp, stored_window_sa_tau, stored_obstacle_reaction_force] -> NULLSCOPE
2017-11-09 10:58:13,237 [DEBUG] after getLinkedObjects: node: 'MAXITER' result: MAXITER
2017-11-09 10:58:13,237 [DEBUG] before getLinkedObjects: node: 'obstacle'
2017-11-09 10:58:13,237 [INFO] >Getting scope for fmu within context class be.uantwerpen.ansymo.semanticadaptation.semanticAdaptation.impl.SaveStateImpl
2017-11-09 10:58:13,237 [INFO]  Delegating scope discovery to super class...
2017-11-09 10:58:13,237 [INFO] <Scope found:ImportScope[loop_sa.*] imports from org.eclipse.xtext.scoping.impl.MultimapBasedSelectable@77c10a5f for type FMU
2017-11-09 10:58:13,237 [DEBUG] after getLinkedObjects: node: 'obstacle' result: obstacle
2017-11-09 10:58:13,238 [DEBUG] before getLinkedObjects: node: 'window_sa'
2017-11-09 10:58:13,238 [INFO] >Getting scope for fmu within context class be.uantwerpen.ansymo.semanticadaptation.semanticAdaptation.impl.SaveStateImpl
2017-11-09 10:58:13,238 [INFO]  Delegating scope discovery to super class...
2017-11-09 10:58:13,238 [INFO] <Scope found:ImportScope[loop_sa.*] imports from org.eclipse.xtext.scoping.impl.MultimapBasedSelectable@77c10a5f for type FMU
2017-11-09 10:58:13,238 [DEBUG] after getLinkedObjects: node: 'window_sa' result: window_sa
2017-11-09 10:58:13,238 [DEBUG] before getLinkedObjects: node: 'obstacle'
2017-11-09 10:58:13,238 [INFO] >Getting scope for owner within context class be.uantwerpen.ansymo.semanticadaptation.semanticAdaptation.impl.VariableImpl
2017-11-09 10:58:13,238 [INFO]  Delegating scope discovery to super class...
2017-11-09 10:58:13,238 [INFO] <Scope found:ImportScope[loop_sa.*] imports from org.eclipse.xtext.scoping.impl.MultimapBasedSelectable@77c10a5f for type FMU
2017-11-09 10:58:13,238 [DEBUG] after getLinkedObjects: node: 'obstacle' result: obstacle
2017-11-09 10:58:13,238 [DEBUG] before getLinkedObjects: node: 'disp'
2017-11-09 10:58:13,238 [INFO] >Getting scope for ref within context class be.uantwerpen.ansymo.semanticadaptation.semanticAdaptation.impl.VariableImpl
2017-11-09 10:58:13,238 [INFO]  Getting scope within FMU: obstacle
2017-11-09 10:58:13,238 [INFO] <Scope found:SimpleScope[disp, reaction_force] -> NULLSCOPE
2017-11-09 10:58:13,238 [DEBUG] after getLinkedObjects: node: 'disp' result: disp
2017-11-09 10:58:13,238 [DEBUG] before getLinkedObjects: node: 'prev_disp'
2017-11-09 10:58:13,238 [INFO] >Getting scope for ref within context class be.uantwerpen.ansymo.semanticadaptation.semanticAdaptation.impl.VariableImpl
2017-11-09 10:58:13,238 [INFO] <Scope found:SimpleScope[displacement, speed, tau, displacement, speed, reaction_force, disp, tau, disp, reaction_force, MAXITER, REL_TOL, ABS_TOL, INIT_LOOP_SA_DISPLACEMENT, INIT_LOOP_SA_SPEED, INIT_WINDOW_SA_DISP, INIT_WINDOW_SA_TAU, INIT_OBSTACLE_REACTION_FORCE, prev_disp, repeat, iter, stored_loop_sa_displacement, stored_loop_sa_speed, stored_window_sa_disp, stored_window_sa_tau, stored_obstacle_reaction_force] -> NULLSCOPE
2017-11-09 10:58:13,238 [DEBUG] after getLinkedObjects: node: 'prev_disp' result: prev_disp
2017-11-09 10:58:13,238 [DEBUG] before getLinkedObjects: node: 'obstacle'
2017-11-09 10:58:13,238 [INFO] >Getting scope for fmu within context class be.uantwerpen.ansymo.semanticadaptation.semanticAdaptation.impl.DoStepImpl
2017-11-09 10:58:13,238 [INFO]  Delegating scope discovery to super class...
2017-11-09 10:58:13,239 [INFO] <Scope found:ImportScope[loop_sa.*] imports from org.eclipse.xtext.scoping.impl.MultimapBasedSelectable@77c10a5f for type FMU
2017-11-09 10:58:13,239 [DEBUG] after getLinkedObjects: node: 'obstacle' result: obstacle
2017-11-09 10:58:13,239 [DEBUG] before getLinkedObjects: node: 'window_sa'
2017-11-09 10:58:13,239 [INFO] >Getting scope for owner within context class be.uantwerpen.ansymo.semanticadaptation.semanticAdaptation.impl.VariableImpl
2017-11-09 10:58:13,239 [INFO]  Delegating scope discovery to super class...
2017-11-09 10:58:13,239 [INFO] <Scope found:ImportScope[loop_sa.*] imports from org.eclipse.xtext.scoping.impl.MultimapBasedSelectable@77c10a5f for type FMU
2017-11-09 10:58:13,239 [DEBUG] after getLinkedObjects: node: 'window_sa' result: window_sa
2017-11-09 10:58:13,239 [DEBUG] before getLinkedObjects: node: 'reaction_force'
2017-11-09 10:58:13,239 [INFO] >Getting scope for ref within context class be.uantwerpen.ansymo.semanticadaptation.semanticAdaptation.impl.VariableImpl
2017-11-09 10:58:13,240 [INFO]  Getting scope within FMU: window_sa
2017-11-09 10:58:13,240 [INFO] <Scope found:SimpleScope[displacement, speed, reaction_force, disp, tau] -> NULLSCOPE
2017-11-09 10:58:13,240 [DEBUG] after getLinkedObjects: node: 'reaction_force' result: reaction_force
2017-11-09 10:58:13,240 [DEBUG] before getLinkedObjects: node: 'stored_obstacle_reaction_force'
2017-11-09 10:58:13,240 [INFO] >Getting scope for ref within context class be.uantwerpen.ansymo.semanticadaptation.semanticAdaptation.impl.VariableImpl
2017-11-09 10:58:13,242 [INFO] <Scope found:SimpleScope[displacement, speed, tau, displacement, speed, reaction_force, disp, tau, disp, reaction_force, MAXITER, REL_TOL, ABS_TOL, INIT_LOOP_SA_DISPLACEMENT, INIT_LOOP_SA_SPEED, INIT_WINDOW_SA_DISP, INIT_WINDOW_SA_TAU, INIT_OBSTACLE_REACTION_FORCE, prev_disp, repeat, iter, stored_loop_sa_displacement, stored_loop_sa_speed, stored_window_sa_disp, stored_window_sa_tau, stored_obstacle_reaction_force] -> NULLSCOPE
2017-11-09 10:58:13,242 [DEBUG] after getLinkedObjects: node: 'stored_obstacle_reaction_force' result: stored_obstacle_reaction_force
2017-11-09 10:58:13,242 [DEBUG] before getLinkedObjects: node: 'window_sa'
2017-11-09 10:58:13,242 [INFO] >Getting scope for fmu within context class be.uantwerpen.ansymo.semanticadaptation.semanticAdaptation.impl.DoStepImpl
2017-11-09 10:58:13,242 [INFO]  Delegating scope discovery to super class...
2017-11-09 10:58:13,242 [INFO] <Scope found:ImportScope[loop_sa.*] imports from org.eclipse.xtext.scoping.impl.MultimapBasedSelectable@77c10a5f for type FMU
2017-11-09 10:58:13,242 [DEBUG] after getLinkedObjects: node: 'window_sa' result: window_sa
2017-11-09 10:58:13,242 [DEBUG] before getLinkedObjects: node: 'repeat'
2017-11-09 10:58:13,242 [INFO] >Getting scope for ref within context class be.uantwerpen.ansymo.semanticadaptation.semanticAdaptation.impl.VariableImpl
2017-11-09 10:58:13,242 [INFO] <Scope found:SimpleScope[displacement, speed, tau, displacement, speed, reaction_force, disp, tau, disp, reaction_force, MAXITER, REL_TOL, ABS_TOL, INIT_LOOP_SA_DISPLACEMENT, INIT_LOOP_SA_SPEED, INIT_WINDOW_SA_DISP, INIT_WINDOW_SA_TAU, INIT_OBSTACLE_REACTION_FORCE, prev_disp, repeat, iter, stored_loop_sa_displacement, stored_loop_sa_speed, stored_window_sa_disp, stored_window_sa_tau, stored_obstacle_reaction_force] -> NULLSCOPE
2017-11-09 10:58:13,242 [DEBUG] after getLinkedObjects: node: 'repeat' result: repeat
2017-11-09 10:58:13,242 [DEBUG] before getLinkedObjects: node: 'prev_disp'
2017-11-09 10:58:13,242 [INFO] >Getting scope for ref within context class be.uantwerpen.ansymo.semanticadaptation.semanticAdaptation.impl.VariableImpl
2017-11-09 10:58:13,242 [INFO] <Scope found:SimpleScope[displacement, speed, tau, displacement, speed, reaction_force, disp, tau, disp, reaction_force, MAXITER, REL_TOL, ABS_TOL, INIT_LOOP_SA_DISPLACEMENT, INIT_LOOP_SA_SPEED, INIT_WINDOW_SA_DISP, INIT_WINDOW_SA_TAU, INIT_OBSTACLE_REACTION_FORCE, prev_disp, repeat, iter, stored_loop_sa_displacement, stored_loop_sa_speed, stored_window_sa_disp, stored_window_sa_tau, stored_obstacle_reaction_force] -> NULLSCOPE
2017-11-09 10:58:13,242 [DEBUG] after getLinkedObjects: node: 'prev_disp' result: prev_disp
2017-11-09 10:58:13,242 [DEBUG] before getLinkedObjects: node: 'stored_window_sa_disp'
2017-11-09 10:58:13,242 [INFO] >Getting scope for ref within context class be.uantwerpen.ansymo.semanticadaptation.semanticAdaptation.impl.VariableImpl
2017-11-09 10:58:13,243 [INFO] <Scope found:SimpleScope[displacement, speed, tau, displacement, speed, reaction_force, disp, tau, disp, reaction_force, MAXITER, REL_TOL, ABS_TOL, INIT_LOOP_SA_DISPLACEMENT, INIT_LOOP_SA_SPEED, INIT_WINDOW_SA_DISP, INIT_WINDOW_SA_TAU, INIT_OBSTACLE_REACTION_FORCE, prev_disp, repeat, iter, stored_loop_sa_displacement, stored_loop_sa_speed, stored_window_sa_disp, stored_window_sa_tau, stored_obstacle_reaction_force] -> NULLSCOPE
2017-11-09 10:58:13,243 [DEBUG] after getLinkedObjects: node: 'stored_window_sa_disp' result: stored_window_sa_disp
2017-11-09 10:58:13,243 [DEBUG] before getLinkedObjects: node: 'REL_TOL'
2017-11-09 10:58:13,243 [INFO] >Getting scope for ref within context class be.uantwerpen.ansymo.semanticadaptation.semanticAdaptation.impl.VariableImpl
2017-11-09 10:58:13,243 [INFO] <Scope found:SimpleScope[displacement, speed, tau, displacement, speed, reaction_force, disp, tau, disp, reaction_force, MAXITER, REL_TOL, ABS_TOL, INIT_LOOP_SA_DISPLACEMENT, INIT_LOOP_SA_SPEED, INIT_WINDOW_SA_DISP, INIT_WINDOW_SA_TAU, INIT_OBSTACLE_REACTION_FORCE, prev_disp, repeat, iter, stored_loop_sa_displacement, stored_loop_sa_speed, stored_window_sa_disp, stored_window_sa_tau, stored_obstacle_reaction_force] -> NULLSCOPE
2017-11-09 10:58:13,243 [DEBUG] after getLinkedObjects: node: 'REL_TOL' result: REL_TOL
2017-11-09 10:58:13,243 [DEBUG] before getLinkedObjects: node: 'ABS_TOL'
2017-11-09 10:58:13,243 [INFO] >Getting scope for ref within context class be.uantwerpen.ansymo.semanticadaptation.semanticAdaptation.impl.VariableImpl
2017-11-09 10:58:13,243 [INFO] <Scope found:SimpleScope[displacement, speed, tau, displacement, speed, reaction_force, disp, tau, disp, reaction_force, MAXITER, REL_TOL, ABS_TOL, INIT_LOOP_SA_DISPLACEMENT, INIT_LOOP_SA_SPEED, INIT_WINDOW_SA_DISP, INIT_WINDOW_SA_TAU, INIT_OBSTACLE_REACTION_FORCE, prev_disp, repeat, iter, stored_loop_sa_displacement, stored_loop_sa_speed, stored_window_sa_disp, stored_window_sa_tau, stored_obstacle_reaction_force] -> NULLSCOPE
2017-11-09 10:58:13,243 [DEBUG] after getLinkedObjects: node: 'ABS_TOL' result: ABS_TOL
2017-11-09 10:58:13,243 [DEBUG] before getLinkedObjects: node: 'prev_disp'
2017-11-09 10:58:13,243 [INFO] >Getting scope for ref within context class be.uantwerpen.ansymo.semanticadaptation.semanticAdaptation.impl.VariableImpl
2017-11-09 10:58:13,243 [INFO] <Scope found:SimpleScope[displacement, speed, tau, displacement, speed, reaction_force, disp, tau, disp, reaction_force, MAXITER, REL_TOL, ABS_TOL, INIT_LOOP_SA_DISPLACEMENT, INIT_LOOP_SA_SPEED, INIT_WINDOW_SA_DISP, INIT_WINDOW_SA_TAU, INIT_OBSTACLE_REACTION_FORCE, prev_disp, repeat, iter, stored_loop_sa_displacement, stored_loop_sa_speed, stored_window_sa_disp, stored_window_sa_tau, stored_obstacle_reaction_force] -> NULLSCOPE
2017-11-09 10:58:13,243 [DEBUG] after getLinkedObjects: node: 'prev_disp' result: prev_disp
2017-11-09 10:58:13,243 [DEBUG] before getLinkedObjects: node: 'stored_window_sa_disp'
2017-11-09 10:58:13,243 [INFO] >Getting scope for ref within context class be.uantwerpen.ansymo.semanticadaptation.semanticAdaptation.impl.VariableImpl
2017-11-09 10:58:13,243 [INFO] <Scope found:SimpleScope[displacement, speed, tau, displacement, speed, reaction_force, disp, tau, disp, reaction_force, MAXITER, REL_TOL, ABS_TOL, INIT_LOOP_SA_DISPLACEMENT, INIT_LOOP_SA_SPEED, INIT_WINDOW_SA_DISP, INIT_WINDOW_SA_TAU, INIT_OBSTACLE_REACTION_FORCE, prev_disp, repeat, iter, stored_loop_sa_displacement, stored_loop_sa_speed, stored_window_sa_disp, stored_window_sa_tau, stored_obstacle_reaction_force] -> NULLSCOPE
2017-11-09 10:58:13,243 [DEBUG] after getLinkedObjects: node: 'stored_window_sa_disp' result: stored_window_sa_disp
2017-11-09 10:58:13,243 [DEBUG] before getLinkedObjects: node: 'repeat'
2017-11-09 10:58:13,243 [INFO] >Getting scope for ref within context class be.uantwerpen.ansymo.semanticadaptation.semanticAdaptation.impl.VariableImpl
2017-11-09 10:58:13,243 [INFO] <Scope found:SimpleScope[displacement, speed, tau, displacement, speed, reaction_force, disp, tau, disp, reaction_force, MAXITER, REL_TOL, ABS_TOL, INIT_LOOP_SA_DISPLACEMENT, INIT_LOOP_SA_SPEED, INIT_WINDOW_SA_DISP, INIT_WINDOW_SA_TAU, INIT_OBSTACLE_REACTION_FORCE, prev_disp, repeat, iter, stored_loop_sa_displacement, stored_loop_sa_speed, stored_window_sa_disp, stored_window_sa_tau, stored_obstacle_reaction_force] -> NULLSCOPE
2017-11-09 10:58:13,243 [DEBUG] after getLinkedObjects: node: 'repeat' result: repeat
2017-11-09 10:58:13,244 [DEBUG] before getLinkedObjects: node: 'obstacle'
2017-11-09 10:58:13,244 [INFO] >Getting scope for fmu within context class be.uantwerpen.ansymo.semanticadaptation.semanticAdaptation.impl.RollbackImpl
2017-11-09 10:58:13,244 [INFO]  Delegating scope discovery to super class...
2017-11-09 10:58:13,244 [INFO] <Scope found:ImportScope[loop_sa.*] imports from org.eclipse.xtext.scoping.impl.MultimapBasedSelectable@77c10a5f for type FMU
2017-11-09 10:58:13,244 [DEBUG] after getLinkedObjects: node: 'obstacle' result: obstacle
2017-11-09 10:58:13,244 [DEBUG] before getLinkedObjects: node: 'window_sa'
2017-11-09 10:58:13,244 [INFO] >Getting scope for fmu within context class be.uantwerpen.ansymo.semanticadaptation.semanticAdaptation.impl.RollbackImpl
2017-11-09 10:58:13,244 [INFO]  Delegating scope discovery to super class...
2017-11-09 10:58:13,244 [INFO] <Scope found:ImportScope[loop_sa.*] imports from org.eclipse.xtext.scoping.impl.MultimapBasedSelectable@77c10a5f for type FMU
2017-11-09 10:58:13,244 [DEBUG] after getLinkedObjects: node: 'window_sa' result: window_sa
2017-11-09 10:58:13,244 [DEBUG] before getLinkedObjects: node: 'stored_loop_sa_displacement'
2017-11-09 10:58:13,244 [INFO] >Getting scope for ref within context class be.uantwerpen.ansymo.semanticadaptation.semanticAdaptation.impl.VariableImpl
2017-11-09 10:58:13,244 [INFO] <Scope found:SimpleScope[displacement, speed, tau, displacement, speed, reaction_force, disp, tau, disp, reaction_force, MAXITER, REL_TOL, ABS_TOL, INIT_LOOP_SA_DISPLACEMENT, INIT_LOOP_SA_SPEED, INIT_WINDOW_SA_DISP, INIT_WINDOW_SA_TAU, INIT_OBSTACLE_REACTION_FORCE, prev_disp, repeat, iter, stored_loop_sa_displacement, stored_loop_sa_speed, stored_window_sa_disp, stored_window_sa_tau, stored_obstacle_reaction_force] -> NULLSCOPE
2017-11-09 10:58:13,244 [DEBUG] after getLinkedObjects: node: 'stored_loop_sa_displacement' result: stored_loop_sa_displacement
2017-11-09 10:58:13,244 [DEBUG] before getLinkedObjects: node: 'loop_sa'
2017-11-09 10:58:13,244 [INFO] >Getting scope for owner within context class be.uantwerpen.ansymo.semanticadaptation.semanticAdaptation.impl.VariableImpl
2017-11-09 10:58:13,244 [INFO]  Delegating scope discovery to super class...
2017-11-09 10:58:13,245 [INFO] <Scope found:ImportScope[loop_sa.*] imports from org.eclipse.xtext.scoping.impl.MultimapBasedSelectable@77c10a5f for type FMU
2017-11-09 10:58:13,245 [DEBUG] after getLinkedObjects: node: 'loop_sa' result: loop_sa
2017-11-09 10:58:13,245 [DEBUG] before getLinkedObjects: node: 'displacement'
2017-11-09 10:58:13,245 [INFO] >Getting scope for ref within context class be.uantwerpen.ansymo.semanticadaptation.semanticAdaptation.impl.VariableImpl
2017-11-09 10:58:13,245 [INFO]  Getting scope within FMU: loop_sa
2017-11-09 10:58:13,245 [INFO] <Scope found:SimpleScope[displacement, speed, tau, displacement, speed, reaction_force, disp, tau, disp, reaction_force] -> NULLSCOPE
2017-11-09 10:58:13,245 [DEBUG] after getLinkedObjects: node: 'displacement' result: displacement
2017-11-09 10:58:13,245 [DEBUG] before getLinkedObjects: node: 'stored_loop_sa_speed'
2017-11-09 10:58:13,245 [INFO] >Getting scope for ref within context class be.uantwerpen.ansymo.semanticadaptation.semanticAdaptation.impl.VariableImpl
2017-11-09 10:58:13,245 [INFO] <Scope found:SimpleScope[displacement, speed, tau, displacement, speed, reaction_force, disp, tau, disp, reaction_force, MAXITER, REL_TOL, ABS_TOL, INIT_LOOP_SA_DISPLACEMENT, INIT_LOOP_SA_SPEED, INIT_WINDOW_SA_DISP, INIT_WINDOW_SA_TAU, INIT_OBSTACLE_REACTION_FORCE, prev_disp, repeat, iter, stored_loop_sa_displacement, stored_loop_sa_speed, stored_window_sa_disp, stored_window_sa_tau, stored_obstacle_reaction_force] -> NULLSCOPE
2017-11-09 10:58:13,245 [DEBUG] after getLinkedObjects: node: 'stored_loop_sa_speed' result: stored_loop_sa_speed
2017-11-09 10:58:13,245 [DEBUG] before getLinkedObjects: node: 'loop_sa'
2017-11-09 10:58:13,245 [INFO] >Getting scope for owner within context class be.uantwerpen.ansymo.semanticadaptation.semanticAdaptation.impl.VariableImpl
2017-11-09 10:58:13,245 [INFO]  Delegating scope discovery to super class...
2017-11-09 10:58:13,245 [INFO] <Scope found:ImportScope[loop_sa.*] imports from org.eclipse.xtext.scoping.impl.MultimapBasedSelectable@77c10a5f for type FMU
2017-11-09 10:58:13,245 [DEBUG] after getLinkedObjects: node: 'loop_sa' result: loop_sa
2017-11-09 10:58:13,245 [DEBUG] before getLinkedObjects: node: 'speed'
2017-11-09 10:58:13,245 [INFO] >Getting scope for ref within context class be.uantwerpen.ansymo.semanticadaptation.semanticAdaptation.impl.VariableImpl
2017-11-09 10:58:13,245 [INFO]  Getting scope within FMU: loop_sa
2017-11-09 10:58:13,245 [INFO] <Scope found:SimpleScope[displacement, speed, tau, displacement, speed, reaction_force, disp, tau, disp, reaction_force] -> NULLSCOPE
2017-11-09 10:58:13,246 [DEBUG] after getLinkedObjects: node: 'speed' result: speed
2017-11-09 10:58:13,246 [DEBUG] before getLinkedObjects: node: 'window_sa'
2017-11-09 10:58:13,246 [INFO] >Getting scope for owner within context class be.uantwerpen.ansymo.semanticadaptation.semanticAdaptation.impl.VariableImpl
2017-11-09 10:58:13,246 [INFO]  Delegating scope discovery to super class...
2017-11-09 10:58:13,246 [INFO] <Scope found:ImportScope[loop_sa.*] imports from org.eclipse.xtext.scoping.impl.MultimapBasedSelectable@77c10a5f for type FMU
2017-11-09 10:58:13,246 [DEBUG] after getLinkedObjects: node: 'window_sa' result: window_sa
2017-11-09 10:58:13,246 [DEBUG] before getLinkedObjects: node: 'displacement'
2017-11-09 10:58:13,246 [INFO] >Getting scope for ref within context class be.uantwerpen.ansymo.semanticadaptation.semanticAdaptation.impl.VariableImpl
2017-11-09 10:58:13,246 [INFO]  Getting scope within FMU: window_sa
2017-11-09 10:58:13,246 [INFO] <Scope found:SimpleScope[displacement, speed, reaction_force, disp, tau] -> NULLSCOPE
2017-11-09 10:58:13,246 [DEBUG] after getLinkedObjects: node: 'displacement' result: displacement
2017-11-09 10:58:13,246 [DEBUG] before getLinkedObjects: node: 'stored_loop_sa_displacement'
2017-11-09 10:58:13,246 [INFO] >Getting scope for ref within context class be.uantwerpen.ansymo.semanticadaptation.semanticAdaptation.impl.VariableImpl
2017-11-09 10:58:13,246 [INFO] <Scope found:SimpleScope[displacement, speed, tau, displacement, speed, reaction_force, disp, tau, disp, reaction_force, MAXITER, REL_TOL, ABS_TOL, INIT_LOOP_SA_DISPLACEMENT, INIT_LOOP_SA_SPEED, INIT_WINDOW_SA_DISP, INIT_WINDOW_SA_TAU, INIT_OBSTACLE_REACTION_FORCE, prev_disp, repeat, iter, stored_loop_sa_displacement, stored_loop_sa_speed, stored_window_sa_disp, stored_window_sa_tau, stored_obstacle_reaction_force] -> NULLSCOPE
2017-11-09 10:58:13,246 [DEBUG] after getLinkedObjects: node: 'stored_loop_sa_displacement' result: stored_loop_sa_displacement
2017-11-09 10:58:13,246 [DEBUG] before getLinkedObjects: node: 'window_sa'
2017-11-09 10:58:13,246 [INFO] >Getting scope for owner within context class be.uantwerpen.ansymo.semanticadaptation.semanticAdaptation.impl.VariableImpl
2017-11-09 10:58:13,246 [INFO]  Delegating scope discovery to super class...
2017-11-09 10:58:13,246 [INFO] <Scope found:ImportScope[loop_sa.*] imports from org.eclipse.xtext.scoping.impl.MultimapBasedSelectable@77c10a5f for type FMU
2017-11-09 10:58:13,246 [DEBUG] after getLinkedObjects: node: 'window_sa' result: window_sa
2017-11-09 10:58:13,247 [DEBUG] before getLinkedObjects: node: 'speed'
2017-11-09 10:58:13,247 [INFO] >Getting scope for ref within context class be.uantwerpen.ansymo.semanticadaptation.semanticAdaptation.impl.VariableImpl
2017-11-09 10:58:13,247 [INFO]  Getting scope within FMU: window_sa
2017-11-09 10:58:13,247 [INFO] <Scope found:SimpleScope[displacement, speed, reaction_force, disp, tau] -> NULLSCOPE
2017-11-09 10:58:13,247 [DEBUG] after getLinkedObjects: node: 'speed' result: speed
2017-11-09 10:58:13,247 [DEBUG] before getLinkedObjects: node: 'stored_loop_sa_speed'
2017-11-09 10:58:13,247 [INFO] >Getting scope for ref within context class be.uantwerpen.ansymo.semanticadaptation.semanticAdaptation.impl.VariableImpl
2017-11-09 10:58:13,247 [INFO] <Scope found:SimpleScope[displacement, speed, tau, displacement, speed, reaction_force, disp, tau, disp, reaction_force, MAXITER, REL_TOL, ABS_TOL, INIT_LOOP_SA_DISPLACEMENT, INIT_LOOP_SA_SPEED, INIT_WINDOW_SA_DISP, INIT_WINDOW_SA_TAU, INIT_OBSTACLE_REACTION_FORCE, prev_disp, repeat, iter, stored_loop_sa_displacement, stored_loop_sa_speed, stored_window_sa_disp, stored_window_sa_tau, stored_obstacle_reaction_force] -> NULLSCOPE
2017-11-09 10:58:13,247 [DEBUG] after getLinkedObjects: node: 'stored_loop_sa_speed' result: stored_loop_sa_speed
2017-11-09 10:58:13,247 [DEBUG] before getLinkedObjects: node: 'INIT_LOOP_SA_DISPLACEMENT'
2017-11-09 10:58:13,247 [INFO] >Getting scope for ref within context class be.uantwerpen.ansymo.semanticadaptation.semanticAdaptation.impl.VariableImpl
2017-11-09 10:58:13,247 [INFO] <Scope found:SimpleScope[displacement, speed, tau, displacement, speed, reaction_force, disp, tau, disp, reaction_force, MAXITER, REL_TOL, ABS_TOL, INIT_LOOP_SA_DISPLACEMENT, INIT_LOOP_SA_SPEED, INIT_WINDOW_SA_DISP, INIT_WINDOW_SA_TAU, INIT_OBSTACLE_REACTION_FORCE, prev_disp, repeat, iter, stored_loop_sa_displacement, stored_loop_sa_speed, stored_window_sa_disp, stored_window_sa_tau, stored_obstacle_reaction_force] -> NULLSCOPE
2017-11-09 10:58:13,247 [DEBUG] after getLinkedObjects: node: 'INIT_LOOP_SA_DISPLACEMENT' result: INIT_LOOP_SA_DISPLACEMENT
2017-11-09 10:58:13,247 [DEBUG] before getLinkedObjects: node: 'INIT_LOOP_SA_SPEED'
2017-11-09 10:58:13,247 [INFO] >Getting scope for ref within context class be.uantwerpen.ansymo.semanticadaptation.semanticAdaptation.impl.VariableImpl
2017-11-09 10:58:13,247 [INFO] <Scope found:SimpleScope[displacement, speed, tau, displacement, speed, reaction_force, disp, tau, disp, reaction_force, MAXITER, REL_TOL, ABS_TOL, INIT_LOOP_SA_DISPLACEMENT, INIT_LOOP_SA_SPEED, INIT_WINDOW_SA_DISP, INIT_WINDOW_SA_TAU, INIT_OBSTACLE_REACTION_FORCE, prev_disp, repeat, iter, stored_loop_sa_displacement, stored_loop_sa_speed, stored_window_sa_disp, stored_window_sa_tau, stored_obstacle_reaction_force] -> NULLSCOPE
2017-11-09 10:58:13,247 [DEBUG] after getLinkedObjects: node: 'INIT_LOOP_SA_SPEED' result: INIT_LOOP_SA_SPEED
2017-11-09 10:58:13,247 [DEBUG] before getLinkedObjects: node: 'stored_window_sa_disp'
2017-11-09 10:58:13,247 [INFO] >Getting scope for ref within context class be.uantwerpen.ansymo.semanticadaptation.semanticAdaptation.impl.VariableImpl
2017-11-09 10:58:13,247 [INFO] <Scope found:SimpleScope[displacement, speed, tau, displacement, speed, reaction_force, disp, tau, disp, reaction_force, MAXITER, REL_TOL, ABS_TOL, INIT_LOOP_SA_DISPLACEMENT, INIT_LOOP_SA_SPEED, INIT_WINDOW_SA_DISP, INIT_WINDOW_SA_TAU, INIT_OBSTACLE_REACTION_FORCE, prev_disp, repeat, iter, stored_loop_sa_displacement, stored_loop_sa_speed, stored_window_sa_disp, stored_window_sa_tau, stored_obstacle_reaction_force] -> NULLSCOPE
2017-11-09 10:58:13,247 [DEBUG] after getLinkedObjects: node: 'stored_window_sa_disp' result: stored_window_sa_disp
2017-11-09 10:58:13,248 [DEBUG] before getLinkedObjects: node: 'window_sa'
2017-11-09 10:58:13,248 [INFO] >Getting scope for owner within context class be.uantwerpen.ansymo.semanticadaptation.semanticAdaptation.impl.VariableImpl
2017-11-09 10:58:13,248 [INFO]  Delegating scope discovery to super class...
2017-11-09 10:58:13,248 [INFO] <Scope found:ImportScope[loop_sa.*] imports from org.eclipse.xtext.scoping.impl.MultimapBasedSelectable@77c10a5f for type FMU
2017-11-09 10:58:13,248 [DEBUG] after getLinkedObjects: node: 'window_sa' result: window_sa
2017-11-09 10:58:13,248 [DEBUG] before getLinkedObjects: node: 'disp'
2017-11-09 10:58:13,248 [INFO] >Getting scope for ref within context class be.uantwerpen.ansymo.semanticadaptation.semanticAdaptation.impl.VariableImpl
2017-11-09 10:58:13,248 [INFO]  Getting scope within FMU: window_sa
2017-11-09 10:58:13,248 [INFO] <Scope found:SimpleScope[displacement, speed, reaction_force, disp, tau] -> NULLSCOPE
2017-11-09 10:58:13,248 [DEBUG] after getLinkedObjects: node: 'disp' result: disp
2017-11-09 10:58:13,248 [DEBUG] before getLinkedObjects: node: 'stored_window_sa_tau'
2017-11-09 10:58:13,248 [INFO] >Getting scope for ref within context class be.uantwerpen.ansymo.semanticadaptation.semanticAdaptation.impl.VariableImpl
2017-11-09 10:58:13,248 [INFO] <Scope found:SimpleScope[displacement, speed, tau, displacement, speed, reaction_force, disp, tau, disp, reaction_force, MAXITER, REL_TOL, ABS_TOL, INIT_LOOP_SA_DISPLACEMENT, INIT_LOOP_SA_SPEED, INIT_WINDOW_SA_DISP, INIT_WINDOW_SA_TAU, INIT_OBSTACLE_REACTION_FORCE, prev_disp, repeat, iter, stored_loop_sa_displacement, stored_loop_sa_speed, stored_window_sa_disp, stored_window_sa_tau, stored_obstacle_reaction_force] -> NULLSCOPE
2017-11-09 10:58:13,248 [DEBUG] after getLinkedObjects: node: 'stored_window_sa_tau' result: stored_window_sa_tau
2017-11-09 10:58:13,248 [DEBUG] before getLinkedObjects: node: 'window_sa'
2017-11-09 10:58:13,248 [INFO] >Getting scope for owner within context class be.uantwerpen.ansymo.semanticadaptation.semanticAdaptation.impl.VariableImpl
2017-11-09 10:58:13,248 [INFO]  Delegating scope discovery to super class...
2017-11-09 10:58:13,248 [INFO] <Scope found:ImportScope[loop_sa.*] imports from org.eclipse.xtext.scoping.impl.MultimapBasedSelectable@77c10a5f for type FMU
2017-11-09 10:58:13,248 [DEBUG] after getLinkedObjects: node: 'window_sa' result: window_sa
2017-11-09 10:58:13,248 [DEBUG] before getLinkedObjects: node: 'tau'
2017-11-09 10:58:13,248 [INFO] >Getting scope for ref within context class be.uantwerpen.ansymo.semanticadaptation.semanticAdaptation.impl.VariableImpl
2017-11-09 10:58:13,248 [INFO]  Getting scope within FMU: window_sa
2017-11-09 10:58:13,248 [INFO] <Scope found:SimpleScope[displacement, speed, reaction_force, disp, tau] -> NULLSCOPE
2017-11-09 10:58:13,249 [DEBUG] after getLinkedObjects: node: 'tau' result: tau
2017-11-09 10:58:13,249 [DEBUG] before getLinkedObjects: node: 'stored_obstacle_reaction_force'
2017-11-09 10:58:13,249 [INFO] >Getting scope for ref within context class be.uantwerpen.ansymo.semanticadaptation.semanticAdaptation.impl.VariableImpl
2017-11-09 10:58:13,249 [INFO] <Scope found:SimpleScope[displacement, speed, tau, displacement, speed, reaction_force, disp, tau, disp, reaction_force, MAXITER, REL_TOL, ABS_TOL, INIT_LOOP_SA_DISPLACEMENT, INIT_LOOP_SA_SPEED, INIT_WINDOW_SA_DISP, INIT_WINDOW_SA_TAU, INIT_OBSTACLE_REACTION_FORCE, prev_disp, repeat, iter, stored_loop_sa_displacement, stored_loop_sa_speed, stored_window_sa_disp, stored_window_sa_tau, stored_obstacle_reaction_force] -> NULLSCOPE
2017-11-09 10:58:13,249 [DEBUG] after getLinkedObjects: node: 'stored_obstacle_reaction_force' result: stored_obstacle_reaction_force
2017-11-09 10:58:13,249 [DEBUG] before getLinkedObjects: node: 'obstacle'
2017-11-09 10:58:13,249 [INFO] >Getting scope for owner within context class be.uantwerpen.ansymo.semanticadaptation.semanticAdaptation.impl.VariableImpl
2017-11-09 10:58:13,249 [INFO]  Delegating scope discovery to super class...
2017-11-09 10:58:13,249 [INFO] <Scope found:ImportScope[loop_sa.*] imports from org.eclipse.xtext.scoping.impl.MultimapBasedSelectable@77c10a5f for type FMU
2017-11-09 10:58:13,249 [DEBUG] after getLinkedObjects: node: 'obstacle' result: obstacle
2017-11-09 10:58:13,249 [DEBUG] before getLinkedObjects: node: 'reaction_force'
2017-11-09 10:58:13,249 [INFO] >Getting scope for ref within context class be.uantwerpen.ansymo.semanticadaptation.semanticAdaptation.impl.VariableImpl
2017-11-09 10:58:13,249 [INFO]  Getting scope within FMU: obstacle
2017-11-09 10:58:13,249 [INFO] <Scope found:SimpleScope[disp, reaction_force] -> NULLSCOPE
2017-11-09 10:58:13,249 [DEBUG] after getLinkedObjects: node: 'reaction_force' result: reaction_force
2017-11-09 10:58:13,249 [DEBUG] before getLinkedObjects: node: 'loop_sa'
2017-11-09 10:58:13,249 [INFO] >Getting scope for owner within context class be.uantwerpen.ansymo.semanticadaptation.semanticAdaptation.impl.VariableImpl
2017-11-09 10:58:13,249 [INFO]  Delegating scope discovery to super class...
2017-11-09 10:58:13,249 [INFO] <Scope found:ImportScope[loop_sa.*] imports from org.eclipse.xtext.scoping.impl.MultimapBasedSelectable@77c10a5f for type FMU
2017-11-09 10:58:13,249 [DEBUG] after getLinkedObjects: node: 'loop_sa' result: loop_sa
2017-11-09 10:58:13,249 [DEBUG] before getLinkedObjects: node: 'tau'
2017-11-09 10:58:13,250 [INFO] >Getting scope for ref within context class be.uantwerpen.ansymo.semanticadaptation.semanticAdaptation.impl.VariableImpl
2017-11-09 10:58:13,250 [INFO]  Getting scope within FMU: loop_sa
2017-11-09 10:58:13,250 [INFO] <Scope found:SimpleScope[displacement, speed, tau, displacement, speed, reaction_force, disp, tau, disp, reaction_force] -> NULLSCOPE
2017-11-09 10:58:13,250 [DEBUG] after getLinkedObjects: node: 'tau' result: tau
2017-11-09 10:58:13,250 [DEBUG] before getLinkedObjects: node: 'stored_window_sa_tau'
2017-11-09 10:58:13,250 [INFO] >Getting scope for ref within context class be.uantwerpen.ansymo.semanticadaptation.semanticAdaptation.impl.VariableImpl
2017-11-09 10:58:13,250 [INFO] <Scope found:SimpleScope[displacement, speed, tau, displacement, speed, reaction_force, disp, tau, disp, reaction_force, MAXITER, REL_TOL, ABS_TOL, INIT_LOOP_SA_DISPLACEMENT, INIT_LOOP_SA_SPEED, INIT_WINDOW_SA_DISP, INIT_WINDOW_SA_TAU, INIT_OBSTACLE_REACTION_FORCE, prev_disp, repeat, iter, stored_loop_sa_displacement, stored_loop_sa_speed, stored_window_sa_disp, stored_window_sa_tau, stored_obstacle_reaction_force] -> NULLSCOPE
2017-11-09 10:58:13,250 [DEBUG] after getLinkedObjects: node: 'stored_window_sa_tau' result: stored_window_sa_tau
2017-11-09 10:58:13,250 [DEBUG] before getLinkedObjects: node: 'INIT_WINDOW_SA_DISP'
2017-11-09 10:58:13,250 [INFO] >Getting scope for ref within context class be.uantwerpen.ansymo.semanticadaptation.semanticAdaptation.impl.VariableImpl
2017-11-09 10:58:13,250 [INFO] <Scope found:SimpleScope[displacement, speed, tau, displacement, speed, reaction_force, disp, tau, disp, reaction_force, MAXITER, REL_TOL, ABS_TOL, INIT_LOOP_SA_DISPLACEMENT, INIT_LOOP_SA_SPEED, INIT_WINDOW_SA_DISP, INIT_WINDOW_SA_TAU, INIT_OBSTACLE_REACTION_FORCE, prev_disp, repeat, iter, stored_loop_sa_displacement, stored_loop_sa_speed, stored_window_sa_disp, stored_window_sa_tau, stored_obstacle_reaction_force] -> NULLSCOPE
2017-11-09 10:58:13,250 [DEBUG] after getLinkedObjects: node: 'INIT_WINDOW_SA_DISP' result: INIT_WINDOW_SA_DISP
2017-11-09 10:58:13,250 [DEBUG] before getLinkedObjects: node: 'INIT_WINDOW_SA_TAU'
2017-11-09 10:58:13,250 [INFO] >Getting scope for ref within context class be.uantwerpen.ansymo.semanticadaptation.semanticAdaptation.impl.VariableImpl
2017-11-09 10:58:13,250 [INFO] <Scope found:SimpleScope[displacement, speed, tau, displacement, speed, reaction_force, disp, tau, disp, reaction_force, MAXITER, REL_TOL, ABS_TOL, INIT_LOOP_SA_DISPLACEMENT, INIT_LOOP_SA_SPEED, INIT_WINDOW_SA_DISP, INIT_WINDOW_SA_TAU, INIT_OBSTACLE_REACTION_FORCE, prev_disp, repeat, iter, stored_loop_sa_displacement, stored_loop_sa_speed, stored_window_sa_disp, stored_window_sa_tau, stored_obstacle_reaction_force] -> NULLSCOPE
2017-11-09 10:58:13,250 [DEBUG] after getLinkedObjects: node: 'INIT_WINDOW_SA_TAU' result: INIT_WINDOW_SA_TAU
2017-11-09 10:58:13,251 [DEBUG] before getLinkedObjects: node: 'INIT_OBSTACLE_REACTION_FORCE'
2017-11-09 10:58:13,251 [INFO] >Getting scope for ref within context class be.uantwerpen.ansymo.semanticadaptation.semanticAdaptation.impl.VariableImpl
2017-11-09 10:58:13,251 [INFO] <Scope found:SimpleScope[displacement, speed, tau, displacement, speed, reaction_force, disp, tau, disp, reaction_force, MAXITER, REL_TOL, ABS_TOL, INIT_LOOP_SA_DISPLACEMENT, INIT_LOOP_SA_SPEED, INIT_WINDOW_SA_DISP, INIT_WINDOW_SA_TAU, INIT_OBSTACLE_REACTION_FORCE, prev_disp, repeat, iter, stored_loop_sa_displacement, stored_loop_sa_speed, stored_window_sa_disp, stored_window_sa_tau, stored_obstacle_reaction_force] -> NULLSCOPE
2017-11-09 10:58:13,251 [DEBUG] after getLinkedObjects: node: 'INIT_OBSTACLE_REACTION_FORCE' result: INIT_OBSTACLE_REACTION_FORCE
2017-11-09 10:58:13,251 [DEBUG] Syntax check OK! Resource: __synthetic0.sa
Stored file: target/generated/loop/sources/Fmu.cpp
Stored file: target/generated/loop/sources/Loop_sa.cpp
Stored file: target/generated/loop/sources/Loop_sa.h
Stored file: target/generated/loop/modelDescription.xml
Stored file: target/generated/loop/sources/main.cpp
Copied file to: target/generated/loop/resources/WindowSA.fmu
Copied file to: target/generated/loop/resources/Obstacle.fmu
Stored file: target/generated/loop/CMakeLists.txt
Stored file: target/generated/loop/msys-toolchain.cmake
-- The C compiler identification is GNU 5.4.0
-- The CXX compiler identification is GNU 5.4.0
-- Check for working C compiler: /usr/bin/cc
-- Check for working C compiler: /usr/bin/cc -- works
-- Detecting C compiler ABI info
-- Detecting C compiler ABI info - done
-- Detecting C compile features
-- Detecting C compile features - done
-- Check for working CXX compiler: /usr/bin/c++
-- Check for working CXX compiler: /usr/bin/c++ -- works
-- Detecting CXX compiler ABI info
-- Detecting CXX compiler ABI info - done
-- Detecting CXX compile features
-- Detecting CXX compile features - done
Already up-to-date.
-- Performing Test COMPILER_SUPPORTS_CXX11
-- Performing Test COMPILER_SUPPORTS_CXX11 - Success
-- Performing Test COMPILER_SUPPORTS_CXX0X
-- Performing Test COMPILER_SUPPORTS_CXX0X - Success
-- Found ZLIB: /usr/lib/x86_64-linux-gnu/libz.so (found version "1.2.8") 
-- Configuring done
-- Generating done
-- Build files have been written to: /var/lib/jenkins/workspace/HybridCosimulation_master-LDEVB56LP46DTRNYHQSCKMS3FR4JD6RBBK6S2LPONMGDZRBJQH3A/DSL_SemanticAdaptation/be.uantwerpen.ansymo.semanticadaptation.cg.cpp.tests/target/generated/loop
Scanning dependencies of target minizip
[  4%] Building C object hcf/semantic-adaptation/third_party/into-cpp-fmi/thrird_party/projects/minizip/CMakeFiles/minizip.dir/miniunz.c.o
[  9%] Building C object hcf/semantic-adaptation/third_party/into-cpp-fmi/thrird_party/projects/minizip/CMakeFiles/minizip.dir/__/__/zlib/contrib/minizip/ioapi.c.o
[ 14%] Building C object hcf/semantic-adaptation/third_party/into-cpp-fmi/thrird_party/projects/minizip/CMakeFiles/minizip.dir/__/__/zlib/contrib/minizip/mztools.c.o
[ 19%] Building C object hcf/semantic-adaptation/third_party/into-cpp-fmi/thrird_party/projects/minizip/CMakeFiles/minizip.dir/__/__/zlib/contrib/minizip/unzip.c.o
[ 23%] Building C object hcf/semantic-adaptation/third_party/into-cpp-fmi/thrird_party/projects/minizip/CMakeFiles/minizip.dir/__/__/zlib/contrib/minizip/zip.c.o
[ 28%] Linking C static library libminizipd.a
/usr/bin/ar qc libminizipd.a  CMakeFiles/minizip.dir/__/__/zlib/contrib/minizip/ioapi.c.o CMakeFiles/minizip.dir/miniunz.c.o CMakeFiles/minizip.dir/__/__/zlib/contrib/minizip/mztools.c.o CMakeFiles/minizip.dir/__/__/zlib/contrib/minizip/unzip.c.o CMakeFiles/minizip.dir/__/__/zlib/contrib/minizip/zip.c.o
/usr/bin/ranlib libminizipd.a
[ 28%] Built target minizip
Scanning dependencies of target intocppfmi
[ 33%] Building C object hcf/semantic-adaptation/third_party/into-cpp-fmi/CMakeFiles/intocppfmi.dir/src/uri.c.o
[ 38%] Building C object hcf/semantic-adaptation/third_party/into-cpp-fmi/CMakeFiles/intocppfmi.dir/src/FmuLoader.c.o
[ 42%] Building CXX object hcf/semantic-adaptation/third_party/into-cpp-fmi/CMakeFiles/intocppfmi.dir/src/FilesystemUtil.cpp.o
[ 47%] Building CXX object hcf/semantic-adaptation/third_party/into-cpp-fmi/CMakeFiles/intocppfmi.dir/src/Fmu.cpp.o
[ 52%] Linking CXX static library libintocppfmi.a
/usr/bin/ar qc libintocppfmi.a  CMakeFiles/intocppfmi.dir/src/FmuLoader.c.o CMakeFiles/intocppfmi.dir/src/uri.c.o CMakeFiles/intocppfmi.dir/src/FilesystemUtil.cpp.o CMakeFiles/intocppfmi.dir/src/Fmu.cpp.o
/usr/bin/ranlib libintocppfmi.a
[ 52%] Built target intocppfmi
Scanning dependencies of target hcf
[ 57%] Building CXX object hcf/semantic-adaptation/CMakeFiles/hcf.dir/src/HyfMath.cpp.o
[ 61%] Building CXX object hcf/semantic-adaptation/CMakeFiles/hcf.dir/src/Empty.cpp.o
[ 66%] Linking CXX static library libhcf.a
/usr/bin/ar qc libhcf.a  CMakeFiles/hcf.dir/src/Empty.cpp.o CMakeFiles/hcf.dir/src/HyfMath.cpp.o
/usr/bin/ranlib libhcf.a
[ 66%] Built target hcf
Scanning dependencies of target loop_main
Scanning dependencies of target loop
[ 71%] Building CXX object CMakeFiles/loop_main.dir/sources/main.cpp.o
[ 76%] Building CXX object CMakeFiles/loop.dir/sources/Fmu.cpp.o
[ 80%] Building CXX object CMakeFiles/loop_main.dir/sources/Fmu.cpp.o
[ 85%] Building CXX object CMakeFiles/loop.dir/sources/Loop_sa.cpp.o
[ 90%] Building CXX object CMakeFiles/loop_main.dir/sources/Loop_sa.cpp.o
[ 95%] Linking CXX shared library binaries/linux64/loop.so
[ 95%] Built target loop
[100%] Linking CXX executable loop_main
[100%] Built target loop_main
Scanning dependencies of target pack
modelDescription.xml
resources
resources/WindowSA.fmu
resources/Obstacle.fmu
binaries/linux64
binaries/linux64/loop.so
Built target pack
2017-11-09 10:58:27,219 [DEBUG] Parsing took: 16 ms
2017-11-09 10:58:27,219 [DEBUG] beforeModelLinked took: 0ms
2017-11-09 10:58:27,222 [DEBUG] doLinkModel took: 2ms
2017-11-09 10:58:27,222 [DEBUG] afterModelLinked took: 1ms
2017-11-09 10:58:27,227 [DEBUG] before getLinkedObjects: node: 'loop_sa'
2017-11-09 10:58:27,228 [INFO] >Getting scope for owner within context class be.uantwerpen.ansymo.semanticadaptation.semanticAdaptation.impl.SpecifiedPortImpl
2017-11-09 10:58:27,228 [INFO]  Delegating scope discovery to super class...
2017-11-09 10:58:27,228 [DEBUG] No explicit container state set. Falling back to default.
2017-11-09 10:58:27,228 [DEBUG] No explicit container state set. Falling back to default.
2017-11-09 10:58:27,228 [DEBUG] No explicit container state set. Falling back to default.
2017-11-09 10:58:27,234 [INFO] <Scope found:ImportScope[rate_sa.tau.*] imports from org.eclipse.xtext.scoping.impl.MultimapBasedSelectable@40230eb9 for type FMU
2017-11-09 10:58:27,235 [DEBUG] after getLinkedObjects: node: 'loop_sa' result: loop_sa
2017-11-09 10:58:27,235 [DEBUG] before getLinkedObjects: node: 'tau'
2017-11-09 10:58:27,235 [INFO] >Getting scope for port within context class be.uantwerpen.ansymo.semanticadaptation.semanticAdaptation.impl.SpecifiedPortImpl
2017-11-09 10:58:27,235 [INFO]  Getting scope within FMU: loop_sa
2017-11-09 10:58:27,235 [INFO] <Scope found:SimpleScope[displacement, speed, tau] -> NULLSCOPE
2017-11-09 10:58:27,235 [DEBUG] after getLinkedObjects: node: 'tau' result: tau
2017-11-09 10:58:27,235 [DEBUG] before getLinkedObjects: node: 'RATE'
2017-11-09 10:58:27,235 [INFO] >Getting scope for ref within context class be.uantwerpen.ansymo.semanticadaptation.semanticAdaptation.impl.VariableImpl
2017-11-09 10:58:27,235 [INFO] <Scope found:SimpleScope[speed, tau, displacement, speed, tau, RATE, previous_speed, micro_step, inner_time, iter, current_speed] -> NULLSCOPE
2017-11-09 10:58:27,235 [DEBUG] after getLinkedObjects: node: 'RATE' result: RATE
2017-11-09 10:58:27,235 [DEBUG] before getLinkedObjects: node: 'RATE'
2017-11-09 10:58:27,235 [INFO] >Getting scope for ref within context class be.uantwerpen.ansymo.semanticadaptation.semanticAdaptation.impl.VariableImpl
2017-11-09 10:58:27,236 [INFO] <Scope found:SimpleScope[speed, tau, displacement, speed, tau, RATE, previous_speed, micro_step, inner_time, iter, current_speed] -> NULLSCOPE
2017-11-09 10:58:27,236 [DEBUG] after getLinkedObjects: node: 'RATE' result: RATE
2017-11-09 10:58:27,236 [DEBUG] before getLinkedObjects: node: 'loop_sa'
2017-11-09 10:58:27,236 [INFO] >Getting scope for fmu within context class be.uantwerpen.ansymo.semanticadaptation.semanticAdaptation.impl.DoStepImpl
2017-11-09 10:58:27,236 [INFO]  Delegating scope discovery to super class...
2017-11-09 10:58:27,236 [INFO] <Scope found:ImportScope[rate_sa.*] imports from org.eclipse.xtext.scoping.impl.MultimapBasedSelectable@40230eb9 for type FMU
2017-11-09 10:58:27,236 [DEBUG] after getLinkedObjects: node: 'loop_sa' result: loop_sa
2017-11-09 10:58:27,236 [DEBUG] before getLinkedObjects: node: 'inner_time'
2017-11-09 10:58:27,236 [INFO] >Getting scope for ref within context class be.uantwerpen.ansymo.semanticadaptation.semanticAdaptation.impl.VariableImpl
2017-11-09 10:58:27,236 [INFO] <Scope found:SimpleScope[speed, tau, displacement, speed, tau, RATE, previous_speed, micro_step, inner_time, iter, current_speed] -> NULLSCOPE
2017-11-09 10:58:27,236 [DEBUG] after getLinkedObjects: node: 'inner_time' result: inner_time
2017-11-09 10:58:27,236 [DEBUG] before getLinkedObjects: node: 'micro_step'
2017-11-09 10:58:27,236 [INFO] >Getting scope for ref within context class be.uantwerpen.ansymo.semanticadaptation.semanticAdaptation.impl.VariableImpl
2017-11-09 10:58:27,237 [INFO] <Scope found:SimpleScope[speed, tau, displacement, speed, tau, RATE, previous_speed, micro_step, inner_time, iter, current_speed] -> NULLSCOPE
2017-11-09 10:58:27,237 [DEBUG] after getLinkedObjects: node: 'micro_step' result: micro_step
2017-11-09 10:58:27,237 [DEBUG] before getLinkedObjects: node: 'inner_time'
2017-11-09 10:58:27,237 [INFO] >Getting scope for ref within context class be.uantwerpen.ansymo.semanticadaptation.semanticAdaptation.impl.VariableImpl
2017-11-09 10:58:27,237 [INFO] <Scope found:SimpleScope[speed, tau, displacement, speed, tau, RATE, previous_speed, micro_step, inner_time, iter, current_speed] -> NULLSCOPE
2017-11-09 10:58:27,237 [DEBUG] after getLinkedObjects: node: 'inner_time' result: inner_time
2017-11-09 10:58:27,237 [DEBUG] before getLinkedObjects: node: 'inner_time'
2017-11-09 10:58:27,237 [INFO] >Getting scope for ref within context class be.uantwerpen.ansymo.semanticadaptation.semanticAdaptation.impl.VariableImpl
2017-11-09 10:58:27,237 [INFO] <Scope found:SimpleScope[speed, tau, displacement, speed, tau, RATE, previous_speed, micro_step, inner_time, iter, current_speed] -> NULLSCOPE
2017-11-09 10:58:27,237 [DEBUG] after getLinkedObjects: node: 'inner_time' result: inner_time
2017-11-09 10:58:27,237 [DEBUG] before getLinkedObjects: node: 'micro_step'
2017-11-09 10:58:27,237 [INFO] >Getting scope for ref within context class be.uantwerpen.ansymo.semanticadaptation.semanticAdaptation.impl.VariableImpl
2017-11-09 10:58:27,237 [INFO] <Scope found:SimpleScope[speed, tau, displacement, speed, tau, RATE, previous_speed, micro_step, inner_time, iter, current_speed] -> NULLSCOPE
2017-11-09 10:58:27,237 [DEBUG] after getLinkedObjects: node: 'micro_step' result: micro_step
2017-11-09 10:58:27,238 [DEBUG] before getLinkedObjects: node: 'previous_speed'
2017-11-09 10:58:27,238 [INFO] >Getting scope for ref within context class be.uantwerpen.ansymo.semanticadaptation.semanticAdaptation.impl.VariableImpl
2017-11-09 10:58:27,238 [INFO] <Scope found:SimpleScope[speed, tau, displacement, speed, tau, RATE, previous_speed, micro_step, inner_time, iter, current_speed] -> NULLSCOPE
2017-11-09 10:58:27,238 [DEBUG] after getLinkedObjects: node: 'previous_speed' result: previous_speed
2017-11-09 10:58:27,238 [DEBUG] before getLinkedObjects: node: 'current_speed'
2017-11-09 10:58:27,238 [INFO] >Getting scope for ref within context class be.uantwerpen.ansymo.semanticadaptation.semanticAdaptation.impl.VariableImpl
2017-11-09 10:58:27,238 [INFO] <Scope found:SimpleScope[speed, tau, displacement, speed, tau, RATE, previous_speed, micro_step, inner_time, iter, current_speed] -> NULLSCOPE
2017-11-09 10:58:27,238 [DEBUG] after getLinkedObjects: node: 'current_speed' result: current_speed
2017-11-09 10:58:27,238 [DEBUG] before getLinkedObjects: node: 'current_speed'
2017-11-09 10:58:27,238 [INFO] >Getting scope for ref within context class be.uantwerpen.ansymo.semanticadaptation.semanticAdaptation.impl.VariableImpl
2017-11-09 10:58:27,238 [INFO] <Scope found:SimpleScope[speed, tau, displacement, speed, tau, RATE, previous_speed, micro_step, inner_time, iter, current_speed] -> NULLSCOPE
2017-11-09 10:58:27,238 [DEBUG] after getLinkedObjects: node: 'current_speed' result: current_speed
2017-11-09 10:58:27,238 [DEBUG] before getLinkedObjects: node: 'speed'
2017-11-09 10:58:27,238 [INFO] >Getting scope for ref within context class be.uantwerpen.ansymo.semanticadaptation.semanticAdaptation.impl.VariableImpl
2017-11-09 10:58:27,243 [INFO] <Scope found:SimpleScope[speed, tau, displacement, speed, tau, RATE, previous_speed, micro_step, inner_time, iter, current_speed] -> NULLSCOPE
2017-11-09 10:58:27,243 [DEBUG] after getLinkedObjects: node: 'speed' result: speed
2017-11-09 10:58:27,243 [DEBUG] before getLinkedObjects: node: 'loop_sa'
2017-11-09 10:58:27,243 [INFO] >Getting scope for owner within context class be.uantwerpen.ansymo.semanticadaptation.semanticAdaptation.impl.VariableImpl
2017-11-09 10:58:27,243 [INFO]  Delegating scope discovery to super class...
2017-11-09 10:58:27,243 [INFO] <Scope found:ImportScope[rate_sa.*] imports from org.eclipse.xtext.scoping.impl.MultimapBasedSelectable@40230eb9 for type FMU
2017-11-09 10:58:27,243 [DEBUG] after getLinkedObjects: node: 'loop_sa' result: loop_sa
2017-11-09 10:58:27,243 [DEBUG] before getLinkedObjects: node: 'speed'
2017-11-09 10:58:27,243 [INFO] >Getting scope for ref within context class be.uantwerpen.ansymo.semanticadaptation.semanticAdaptation.impl.VariableImpl
2017-11-09 10:58:27,243 [INFO]  Getting scope within FMU: loop_sa
2017-11-09 10:58:27,243 [INFO] <Scope found:SimpleScope[displacement, speed, tau] -> NULLSCOPE
2017-11-09 10:58:27,243 [DEBUG] after getLinkedObjects: node: 'speed' result: speed
2017-11-09 10:58:27,243 [DEBUG] before getLinkedObjects: node: 'previous_speed'
2017-11-09 10:58:27,243 [INFO] >Getting scope for ref within context class be.uantwerpen.ansymo.semanticadaptation.semanticAdaptation.impl.VariableImpl
2017-11-09 10:58:27,243 [INFO] <Scope found:SimpleScope[speed, tau, displacement, speed, tau, RATE, previous_speed, micro_step, inner_time, iter, current_speed] -> NULLSCOPE
2017-11-09 10:58:27,243 [DEBUG] after getLinkedObjects: node: 'previous_speed' result: previous_speed
2017-11-09 10:58:27,244 [DEBUG] before getLinkedObjects: node: 'current_speed'
2017-11-09 10:58:27,244 [INFO] >Getting scope for ref within context class be.uantwerpen.ansymo.semanticadaptation.semanticAdaptation.impl.VariableImpl
2017-11-09 10:58:27,244 [INFO] <Scope found:SimpleScope[speed, tau, displacement, speed, tau, RATE, previous_speed, micro_step, inner_time, iter, current_speed] -> NULLSCOPE
2017-11-09 10:58:27,244 [DEBUG] after getLinkedObjects: node: 'current_speed' result: current_speed
2017-11-09 10:58:27,244 [DEBUG] before getLinkedObjects: node: 'previous_speed'
2017-11-09 10:58:27,244 [INFO] >Getting scope for ref within context class be.uantwerpen.ansymo.semanticadaptation.semanticAdaptation.impl.VariableImpl
2017-11-09 10:58:27,244 [INFO] <Scope found:SimpleScope[speed, tau, displacement, speed, tau, RATE, previous_speed, micro_step, inner_time, iter, current_speed] -> NULLSCOPE
2017-11-09 10:58:27,244 [DEBUG] after getLinkedObjects: node: 'previous_speed' result: previous_speed
2017-11-09 10:58:27,244 [DEBUG] Syntax check OK! Resource: __synthetic0.sa
Stored file: target/generated/rate/sources/Fmu.cpp
Stored file: target/generated/rate/sources/Rate_sa.cpp
Stored file: target/generated/rate/sources/Rate_sa.h
Stored file: target/generated/rate/modelDescription.xml
Stored file: target/generated/rate/sources/main.cpp
Copied file to: target/generated/rate/resources/LoopSA.fmu
Stored file: target/generated/rate/CMakeLists.txt
Stored file: target/generated/rate/msys-toolchain.cmake
-- The C compiler identification is GNU 5.4.0
-- The CXX compiler identification is GNU 5.4.0
-- Check for working C compiler: /usr/bin/cc
-- Check for working C compiler: /usr/bin/cc -- works
-- Detecting C compiler ABI info
-- Detecting C compiler ABI info - done
-- Detecting C compile features
-- Detecting C compile features - done
-- Check for working CXX compiler: /usr/bin/c++
-- Check for working CXX compiler: /usr/bin/c++ -- works
-- Detecting CXX compiler ABI info
-- Detecting CXX compiler ABI info - done
-- Detecting CXX compile features
-- Detecting CXX compile features - done
Already up-to-date.
-- Performing Test COMPILER_SUPPORTS_CXX11
-- Performing Test COMPILER_SUPPORTS_CXX11 - Success
-- Performing Test COMPILER_SUPPORTS_CXX0X
-- Performing Test COMPILER_SUPPORTS_CXX0X - Success
-- Found ZLIB: /usr/lib/x86_64-linux-gnu/libz.so (found version "1.2.8") 
-- Configuring done
-- Generating done
-- Build files have been written to: /var/lib/jenkins/workspace/HybridCosimulation_master-LDEVB56LP46DTRNYHQSCKMS3FR4JD6RBBK6S2LPONMGDZRBJQH3A/DSL_SemanticAdaptation/be.uantwerpen.ansymo.semanticadaptation.cg.cpp.tests/target/generated/rate
Scanning dependencies of target minizip
[  4%] Building C object hcf/semantic-adaptation/third_party/into-cpp-fmi/thrird_party/projects/minizip/CMakeFiles/minizip.dir/miniunz.c.o
[  9%] Building C object hcf/semantic-adaptation/third_party/into-cpp-fmi/thrird_party/projects/minizip/CMakeFiles/minizip.dir/__/__/zlib/contrib/minizip/mztools.c.o
[ 14%] Building C object hcf/semantic-adaptation/third_party/into-cpp-fmi/thrird_party/projects/minizip/CMakeFiles/minizip.dir/__/__/zlib/contrib/minizip/ioapi.c.o
[ 19%] Building C object hcf/semantic-adaptation/third_party/into-cpp-fmi/thrird_party/projects/minizip/CMakeFiles/minizip.dir/__/__/zlib/contrib/minizip/unzip.c.o
[ 23%] Building C object hcf/semantic-adaptation/third_party/into-cpp-fmi/thrird_party/projects/minizip/CMakeFiles/minizip.dir/__/__/zlib/contrib/minizip/zip.c.o
[ 28%] Linking C static library libminizipd.a
/usr/bin/ar qc libminizipd.a  CMakeFiles/minizip.dir/__/__/zlib/contrib/minizip/ioapi.c.o CMakeFiles/minizip.dir/miniunz.c.o CMakeFiles/minizip.dir/__/__/zlib/contrib/minizip/mztools.c.o CMakeFiles/minizip.dir/__/__/zlib/contrib/minizip/unzip.c.o CMakeFiles/minizip.dir/__/__/zlib/contrib/minizip/zip.c.o
/usr/bin/ranlib libminizipd.a
[ 28%] Built target minizip
Scanning dependencies of target intocppfmi
[ 33%] Building C object hcf/semantic-adaptation/third_party/into-cpp-fmi/CMakeFiles/intocppfmi.dir/src/FmuLoader.c.o
[ 38%] Building CXX object hcf/semantic-adaptation/third_party/into-cpp-fmi/CMakeFiles/intocppfmi.dir/src/FilesystemUtil.cpp.o
[ 42%] Building C object hcf/semantic-adaptation/third_party/into-cpp-fmi/CMakeFiles/intocppfmi.dir/src/uri.c.o
[ 47%] Building CXX object hcf/semantic-adaptation/third_party/into-cpp-fmi/CMakeFiles/intocppfmi.dir/src/Fmu.cpp.o
[ 52%] Linking CXX static library libintocppfmi.a
/usr/bin/ar qc libintocppfmi.a  CMakeFiles/intocppfmi.dir/src/FmuLoader.c.o CMakeFiles/intocppfmi.dir/src/uri.c.o CMakeFiles/intocppfmi.dir/src/FilesystemUtil.cpp.o CMakeFiles/intocppfmi.dir/src/Fmu.cpp.o
/usr/bin/ranlib libintocppfmi.a
[ 52%] Built target intocppfmi
Scanning dependencies of target hcf
[ 57%] Building CXX object hcf/semantic-adaptation/CMakeFiles/hcf.dir/src/Empty.cpp.o
[ 61%] Building CXX object hcf/semantic-adaptation/CMakeFiles/hcf.dir/src/HyfMath.cpp.o
[ 66%] Linking CXX static library libhcf.a
/usr/bin/ar qc libhcf.a  CMakeFiles/hcf.dir/src/Empty.cpp.o CMakeFiles/hcf.dir/src/HyfMath.cpp.o
/usr/bin/ranlib libhcf.a
[ 66%] Built target hcf
Scanning dependencies of target rate_main
Scanning dependencies of target rate
[ 71%] Building CXX object CMakeFiles/rate_main.dir/sources/main.cpp.o
[ 76%] Building CXX object CMakeFiles/rate.dir/sources/Fmu.cpp.o
[ 80%] Building CXX object CMakeFiles/rate_main.dir/sources/Fmu.cpp.o
[ 85%] Building CXX object CMakeFiles/rate.dir/sources/Rate_sa.cpp.o
[ 90%] Building CXX object CMakeFiles/rate_main.dir/sources/Rate_sa.cpp.o
[ 95%] Linking CXX shared library binaries/linux64/rate.so
[ 95%] Built target rate
[100%] Linking CXX executable rate_main
[100%] Built target rate_main
Scanning dependencies of target pack
modelDescription.xml
resources
resources/LoopSA.fmu
binaries/linux64
binaries/linux64/rate.so
Built target pack
2017-11-09 10:58:37,655 [DEBUG] Parsing took: 10 ms
2017-11-09 10:58:37,656 [DEBUG] beforeModelLinked took: 0ms
2017-11-09 10:58:37,657 [DEBUG] doLinkModel took: 1ms
2017-11-09 10:58:37,657 [DEBUG] afterModelLinked took: 0ms
2017-11-09 10:58:37,662 [DEBUG] before getLinkedObjects: node: 'power'
2017-11-09 10:58:37,662 [INFO] >Getting scope for owner within context class be.uantwerpen.ansymo.semanticadaptation.semanticAdaptation.impl.SpecifiedPortImpl
2017-11-09 10:58:37,662 [INFO]  Delegating scope discovery to super class...
2017-11-09 10:58:37,663 [DEBUG] No explicit container state set. Falling back to default.
2017-11-09 10:58:37,663 [DEBUG] No explicit container state set. Falling back to default.
2017-11-09 10:58:37,663 [DEBUG] No explicit container state set. Falling back to default.
2017-11-09 10:58:37,665 [INFO] <Scope found:ImportScope[power_sa.u.*] imports from org.eclipse.xtext.scoping.impl.MultimapBasedSelectable@724aefc3 for type FMU
2017-11-09 10:58:37,665 [DEBUG] after getLinkedObjects: node: 'power' result: power
2017-11-09 10:58:37,665 [DEBUG] before getLinkedObjects: node: 'u'
2017-11-09 10:58:37,665 [INFO] >Getting scope for port within context class be.uantwerpen.ansymo.semanticadaptation.semanticAdaptation.impl.SpecifiedPortImpl
2017-11-09 10:58:37,665 [INFO]  Getting scope within FMU: power
2017-11-09 10:58:37,665 [INFO] <Scope found:SimpleScope[u, d, tau, armature_current, speed, displacement] -> NULLSCOPE
2017-11-09 10:58:37,665 [DEBUG] after getLinkedObjects: node: 'u' result: u
2017-11-09 10:58:37,665 [DEBUG] before getLinkedObjects: node: 'power'
2017-11-09 10:58:37,665 [INFO] >Getting scope for owner within context class be.uantwerpen.ansymo.semanticadaptation.semanticAdaptation.impl.SpecifiedPortImpl
2017-11-09 10:58:37,665 [INFO]  Delegating scope discovery to super class...
2017-11-09 10:58:37,666 [INFO] <Scope found:ImportScope[power_sa.d.*] imports from org.eclipse.xtext.scoping.impl.MultimapBasedSelectable@724aefc3 for type FMU
2017-11-09 10:58:37,666 [DEBUG] after getLinkedObjects: node: 'power' result: power
2017-11-09 10:58:37,666 [DEBUG] before getLinkedObjects: node: 'd'
2017-11-09 10:58:37,666 [INFO] >Getting scope for port within context class be.uantwerpen.ansymo.semanticadaptation.semanticAdaptation.impl.SpecifiedPortImpl
2017-11-09 10:58:37,666 [INFO]  Getting scope within FMU: power
2017-11-09 10:58:37,666 [INFO] <Scope found:SimpleScope[u, d, tau, armature_current, speed, displacement] -> NULLSCOPE
2017-11-09 10:58:37,666 [DEBUG] after getLinkedObjects: node: 'd' result: d
2017-11-09 10:58:37,666 [DEBUG] before getLinkedObjects: node: 'power'
2017-11-09 10:58:37,666 [INFO] >Getting scope for owner within context class be.uantwerpen.ansymo.semanticadaptation.semanticAdaptation.impl.SpecifiedPortImpl
2017-11-09 10:58:37,666 [INFO]  Delegating scope discovery to super class...
2017-11-09 10:58:37,666 [INFO] <Scope found:ImportScope[power_sa.tau.*] imports from org.eclipse.xtext.scoping.impl.MultimapBasedSelectable@724aefc3 for type FMU
2017-11-09 10:58:37,666 [DEBUG] after getLinkedObjects: node: 'power' result: power
2017-11-09 10:58:37,666 [DEBUG] before getLinkedObjects: node: 'tau'
2017-11-09 10:58:37,667 [INFO] >Getting scope for port within context class be.uantwerpen.ansymo.semanticadaptation.semanticAdaptation.impl.SpecifiedPortImpl
2017-11-09 10:58:37,667 [INFO]  Getting scope within FMU: power
2017-11-09 10:58:37,667 [INFO] <Scope found:SimpleScope[u, d, tau, armature_current, speed, displacement] -> NULLSCOPE
2017-11-09 10:58:37,667 [DEBUG] after getLinkedObjects: node: 'tau' result: tau
2017-11-09 10:58:37,667 [DEBUG] before getLinkedObjects: node: 'power'
2017-11-09 10:58:37,667 [INFO] >Getting scope for owner within context class be.uantwerpen.ansymo.semanticadaptation.semanticAdaptation.impl.SpecifiedPortImpl
2017-11-09 10:58:37,667 [INFO]  Delegating scope discovery to super class...
2017-11-09 10:58:37,667 [INFO] <Scope found:ImportScope[power_sa.armature_current.*] imports from org.eclipse.xtext.scoping.impl.MultimapBasedSelectable@724aefc3 for type FMU
2017-11-09 10:58:37,667 [DEBUG] after getLinkedObjects: node: 'power' result: power
2017-11-09 10:58:37,667 [DEBUG] before getLinkedObjects: node: 'armature_current'
2017-11-09 10:58:37,667 [INFO] >Getting scope for port within context class be.uantwerpen.ansymo.semanticadaptation.semanticAdaptation.impl.SpecifiedPortImpl
2017-11-09 10:58:37,667 [INFO]  Getting scope within FMU: power
2017-11-09 10:58:37,667 [INFO] <Scope found:SimpleScope[u, d, tau, armature_current, speed, displacement] -> NULLSCOPE
2017-11-09 10:58:37,667 [DEBUG] after getLinkedObjects: node: 'armature_current' result: armature_current
2017-11-09 10:58:37,667 [DEBUG] before getLinkedObjects: node: 'power'
2017-11-09 10:58:37,667 [INFO] >Getting scope for owner within context class be.uantwerpen.ansymo.semanticadaptation.semanticAdaptation.impl.SpecifiedPortImpl
2017-11-09 10:58:37,667 [INFO]  Delegating scope discovery to super class...
2017-11-09 10:58:37,668 [INFO] <Scope found:ImportScope[power_sa.speed.*] imports from org.eclipse.xtext.scoping.impl.MultimapBasedSelectable@724aefc3 for type FMU
2017-11-09 10:58:37,668 [DEBUG] after getLinkedObjects: node: 'power' result: power
2017-11-09 10:58:37,668 [DEBUG] before getLinkedObjects: node: 'speed'
2017-11-09 10:58:37,668 [INFO] >Getting scope for port within context class be.uantwerpen.ansymo.semanticadaptation.semanticAdaptation.impl.SpecifiedPortImpl
2017-11-09 10:58:37,668 [INFO]  Getting scope within FMU: power
2017-11-09 10:58:37,668 [INFO] <Scope found:SimpleScope[u, d, tau, armature_current, speed, displacement] -> NULLSCOPE
2017-11-09 10:58:37,668 [DEBUG] after getLinkedObjects: node: 'speed' result: speed
2017-11-09 10:58:37,668 [DEBUG] before getLinkedObjects: node: 'power'
2017-11-09 10:58:37,668 [INFO] >Getting scope for owner within context class be.uantwerpen.ansymo.semanticadaptation.semanticAdaptation.impl.SpecifiedPortImpl
2017-11-09 10:58:37,668 [INFO]  Delegating scope discovery to super class...
2017-11-09 10:58:37,668 [INFO] <Scope found:ImportScope[power_sa.displacement.*] imports from org.eclipse.xtext.scoping.impl.MultimapBasedSelectable@724aefc3 for type FMU
2017-11-09 10:58:37,668 [DEBUG] after getLinkedObjects: node: 'power' result: power
2017-11-09 10:58:37,669 [DEBUG] before getLinkedObjects: node: 'displacement'
2017-11-09 10:58:37,669 [INFO] >Getting scope for port within context class be.uantwerpen.ansymo.semanticadaptation.semanticAdaptation.impl.SpecifiedPortImpl
2017-11-09 10:58:37,669 [INFO]  Getting scope within FMU: power
2017-11-09 10:58:37,669 [INFO] <Scope found:SimpleScope[u, d, tau, armature_current, speed, displacement] -> NULLSCOPE
2017-11-09 10:58:37,669 [DEBUG] after getLinkedObjects: node: 'displacement' result: displacement
2017-11-09 10:58:37,669 [DEBUG] Syntax check OK! Resource: __synthetic0.sa
Stored file: target/generated/power/sources/Fmu.cpp
Stored file: target/generated/power/sources/Power_sa.cpp
Stored file: target/generated/power/sources/Power_sa.h
Stored file: target/generated/power/modelDescription.xml
Stored file: target/generated/power/sources/main.cpp
Copied file to: target/generated/power/resources/Power.fmu
Stored file: target/generated/power/CMakeLists.txt
Stored file: target/generated/power/msys-toolchain.cmake
-- The C compiler identification is GNU 5.4.0
-- The CXX compiler identification is GNU 5.4.0
-- Check for working C compiler: /usr/bin/cc
-- Check for working C compiler: /usr/bin/cc -- works
-- Detecting C compiler ABI info
-- Detecting C compiler ABI info - done
-- Detecting C compile features
-- Detecting C compile features - done
-- Check for working CXX compiler: /usr/bin/c++
-- Check for working CXX compiler: /usr/bin/c++ -- works
-- Detecting CXX compiler ABI info
-- Detecting CXX compiler ABI info - done
-- Detecting CXX compile features
-- Detecting CXX compile features - done
Already up-to-date.
-- Performing Test COMPILER_SUPPORTS_CXX11
-- Performing Test COMPILER_SUPPORTS_CXX11 - Success
-- Performing Test COMPILER_SUPPORTS_CXX0X
-- Performing Test COMPILER_SUPPORTS_CXX0X - Success
-- Found ZLIB: /usr/lib/x86_64-linux-gnu/libz.so (found version "1.2.8") 
-- Configuring done
-- Generating done
-- Build files have been written to: /var/lib/jenkins/workspace/HybridCosimulation_master-LDEVB56LP46DTRNYHQSCKMS3FR4JD6RBBK6S2LPONMGDZRBJQH3A/DSL_SemanticAdaptation/be.uantwerpen.ansymo.semanticadaptation.cg.cpp.tests/target/generated/power
Scanning dependencies of target minizip
[  4%] Building C object hcf/semantic-adaptation/third_party/into-cpp-fmi/thrird_party/projects/minizip/CMakeFiles/minizip.dir/__/__/zlib/contrib/minizip/ioapi.c.o
[  9%] Building C object hcf/semantic-adaptation/third_party/into-cpp-fmi/thrird_party/projects/minizip/CMakeFiles/minizip.dir/miniunz.c.o
[ 14%] Building C object hcf/semantic-adaptation/third_party/into-cpp-fmi/thrird_party/projects/minizip/CMakeFiles/minizip.dir/__/__/zlib/contrib/minizip/mztools.c.o
[ 19%] Building C object hcf/semantic-adaptation/third_party/into-cpp-fmi/thrird_party/projects/minizip/CMakeFiles/minizip.dir/__/__/zlib/contrib/minizip/unzip.c.o
[ 23%] Building C object hcf/semantic-adaptation/third_party/into-cpp-fmi/thrird_party/projects/minizip/CMakeFiles/minizip.dir/__/__/zlib/contrib/minizip/zip.c.o
[ 28%] Linking C static library libminizipd.a
/usr/bin/ar qc libminizipd.a  CMakeFiles/minizip.dir/__/__/zlib/contrib/minizip/ioapi.c.o CMakeFiles/minizip.dir/miniunz.c.o CMakeFiles/minizip.dir/__/__/zlib/contrib/minizip/mztools.c.o CMakeFiles/minizip.dir/__/__/zlib/contrib/minizip/unzip.c.o CMakeFiles/minizip.dir/__/__/zlib/contrib/minizip/zip.c.o
/usr/bin/ranlib libminizipd.a
[ 28%] Built target minizip
Scanning dependencies of target intocppfmi
[ 33%] Building CXX object hcf/semantic-adaptation/third_party/into-cpp-fmi/CMakeFiles/intocppfmi.dir/src/FilesystemUtil.cpp.o
[ 38%] Building C object hcf/semantic-adaptation/third_party/into-cpp-fmi/CMakeFiles/intocppfmi.dir/src/FmuLoader.c.o
[ 42%] Building C object hcf/semantic-adaptation/third_party/into-cpp-fmi/CMakeFiles/intocppfmi.dir/src/uri.c.o
[ 47%] Building CXX object hcf/semantic-adaptation/third_party/into-cpp-fmi/CMakeFiles/intocppfmi.dir/src/Fmu.cpp.o
[ 52%] Linking CXX static library libintocppfmi.a
/usr/bin/ar qc libintocppfmi.a  CMakeFiles/intocppfmi.dir/src/FmuLoader.c.o CMakeFiles/intocppfmi.dir/src/uri.c.o CMakeFiles/intocppfmi.dir/src/FilesystemUtil.cpp.o CMakeFiles/intocppfmi.dir/src/Fmu.cpp.o
/usr/bin/ranlib libintocppfmi.a
[ 52%] Built target intocppfmi
Scanning dependencies of target hcf
[ 57%] Building CXX object hcf/semantic-adaptation/CMakeFiles/hcf.dir/src/Empty.cpp.o
[ 61%] Building CXX object hcf/semantic-adaptation/CMakeFiles/hcf.dir/src/HyfMath.cpp.o
[ 66%] Linking CXX static library libhcf.a
/usr/bin/ar qc libhcf.a  CMakeFiles/hcf.dir/src/Empty.cpp.o CMakeFiles/hcf.dir/src/HyfMath.cpp.o
/usr/bin/ranlib libhcf.a
[ 66%] Built target hcf
Scanning dependencies of target power
Scanning dependencies of target power_main
[ 71%] Building CXX object CMakeFiles/power.dir/sources/Fmu.cpp.o
[ 76%] Building CXX object CMakeFiles/power_main.dir/sources/main.cpp.o
[ 80%] Building CXX object CMakeFiles/power.dir/sources/Power_sa.cpp.o
[ 85%] Building CXX object CMakeFiles/power_main.dir/sources/Fmu.cpp.o
[ 90%] Building CXX object CMakeFiles/power_main.dir/sources/Power_sa.cpp.o
[ 95%] Linking CXX shared library binaries/linux64/power.so
[ 95%] Built target power
[100%] Linking CXX executable power_main
[100%] Built target power_main
Scanning dependencies of target pack
modelDescription.xml
resources
resources/Power.fmu
binaries/linux64
binaries/linux64/power.so
Built target pack
2017-11-09 10:58:48,848 [DEBUG] Parsing took: 7 ms
2017-11-09 10:58:48,849 [DEBUG] beforeModelLinked took: 0ms
2017-11-09 10:58:48,852 [DEBUG] doLinkModel took: 3ms
2017-11-09 10:58:48,852 [DEBUG] afterModelLinked took: 0ms
2017-11-09 10:58:48,854 [DEBUG] before getLinkedObjects: node: 'RATE'
2017-11-09 10:58:48,854 [INFO] >Getting scope for ref within context class be.uantwerpen.ansymo.semanticadaptation.semanticAdaptation.impl.VariableImpl
2017-11-09 10:58:48,855 [INFO] <Scope found:SimpleScope[speed, tau, displacement, speed, tau, RATE, previous_speed, micro_step, inner_time, iter, current_speed, stored_loop_sa_tau] -> NULLSCOPE
2017-11-09 10:58:48,855 [DEBUG] after getLinkedObjects: node: 'RATE' result: RATE
2017-11-09 10:58:48,855 [DEBUG] before getLinkedObjects: node: 'RATE'
2017-11-09 10:58:48,855 [INFO] >Getting scope for ref within context class be.uantwerpen.ansymo.semanticadaptation.semanticAdaptation.impl.VariableImpl
2017-11-09 10:58:48,862 [INFO] <Scope found:SimpleScope[speed, tau, displacement, speed, tau, RATE, previous_speed, micro_step, inner_time, iter, current_speed, stored_loop_sa_tau] -> NULLSCOPE
2017-11-09 10:58:48,863 [DEBUG] after getLinkedObjects: node: 'RATE' result: RATE
2017-11-09 10:58:48,863 [DEBUG] before getLinkedObjects: node: 'loop_sa'
2017-11-09 10:58:48,863 [INFO] >Getting scope for fmu within context class be.uantwerpen.ansymo.semanticadaptation.semanticAdaptation.impl.DoStepImpl
2017-11-09 10:58:48,863 [INFO]  Delegating scope discovery to super class...
2017-11-09 10:58:48,863 [DEBUG] No explicit container state set. Falling back to default.
2017-11-09 10:58:48,863 [DEBUG] No explicit container state set. Falling back to default.
2017-11-09 10:58:48,863 [DEBUG] No explicit container state set. Falling back to default.
2017-11-09 10:58:48,865 [INFO] <Scope found:ImportScope[rate_sa.*] imports from org.eclipse.xtext.scoping.impl.MultimapBasedSelectable@74d6736 for type FMU
2017-11-09 10:58:48,866 [DEBUG] after getLinkedObjects: node: 'loop_sa' result: loop_sa
2017-11-09 10:58:48,866 [DEBUG] before getLinkedObjects: node: 'inner_time'
2017-11-09 10:58:48,866 [INFO] >Getting scope for ref within context class be.uantwerpen.ansymo.semanticadaptation.semanticAdaptation.impl.VariableImpl
2017-11-09 10:58:48,866 [INFO] <Scope found:SimpleScope[speed, tau, displacement, speed, tau, RATE, previous_speed, micro_step, inner_time, iter, current_speed, stored_loop_sa_tau] -> NULLSCOPE
2017-11-09 10:58:48,866 [DEBUG] after getLinkedObjects: node: 'inner_time' result: inner_time
2017-11-09 10:58:48,866 [DEBUG] before getLinkedObjects: node: 'micro_step'
2017-11-09 10:58:48,866 [INFO] >Getting scope for ref within context class be.uantwerpen.ansymo.semanticadaptation.semanticAdaptation.impl.VariableImpl
2017-11-09 10:58:48,866 [INFO] <Scope found:SimpleScope[speed, tau, displacement, speed, tau, RATE, previous_speed, micro_step, inner_time, iter, current_speed, stored_loop_sa_tau] -> NULLSCOPE
2017-11-09 10:58:48,867 [DEBUG] after getLinkedObjects: node: 'micro_step' result: micro_step
2017-11-09 10:58:48,867 [DEBUG] before getLinkedObjects: node: 'inner_time'
2017-11-09 10:58:48,867 [INFO] >Getting scope for ref within context class be.uantwerpen.ansymo.semanticadaptation.semanticAdaptation.impl.VariableImpl
2017-11-09 10:58:48,867 [INFO] <Scope found:SimpleScope[speed, tau, displacement, speed, tau, RATE, previous_speed, micro_step, inner_time, iter, current_speed, stored_loop_sa_tau] -> NULLSCOPE
2017-11-09 10:58:48,867 [DEBUG] after getLinkedObjects: node: 'inner_time' result: inner_time
2017-11-09 10:58:48,867 [DEBUG] before getLinkedObjects: node: 'inner_time'
2017-11-09 10:58:48,867 [INFO] >Getting scope for ref within context class be.uantwerpen.ansymo.semanticadaptation.semanticAdaptation.impl.VariableImpl
2017-11-09 10:58:48,867 [INFO] <Scope found:SimpleScope[speed, tau, displacement, speed, tau, RATE, previous_speed, micro_step, inner_time, iter, current_speed, stored_loop_sa_tau] -> NULLSCOPE
2017-11-09 10:58:48,867 [DEBUG] after getLinkedObjects: node: 'inner_time' result: inner_time
2017-11-09 10:58:48,868 [DEBUG] before getLinkedObjects: node: 'micro_step'
2017-11-09 10:58:48,868 [INFO] >Getting scope for ref within context class be.uantwerpen.ansymo.semanticadaptation.semanticAdaptation.impl.VariableImpl
2017-11-09 10:58:48,868 [INFO] <Scope found:SimpleScope[speed, tau, displacement, speed, tau, RATE, previous_speed, micro_step, inner_time, iter, current_speed, stored_loop_sa_tau] -> NULLSCOPE
2017-11-09 10:58:48,868 [DEBUG] after getLinkedObjects: node: 'micro_step' result: micro_step
2017-11-09 10:58:48,868 [DEBUG] before getLinkedObjects: node: 'previous_speed'
2017-11-09 10:58:48,868 [INFO] >Getting scope for ref within context class be.uantwerpen.ansymo.semanticadaptation.semanticAdaptation.impl.VariableImpl
2017-11-09 10:58:48,868 [INFO] <Scope found:SimpleScope[speed, tau, displacement, speed, tau, RATE, previous_speed, micro_step, inner_time, iter, current_speed, stored_loop_sa_tau] -> NULLSCOPE
2017-11-09 10:58:48,868 [DEBUG] after getLinkedObjects: node: 'previous_speed' result: previous_speed
2017-11-09 10:58:48,868 [DEBUG] before getLinkedObjects: node: 'current_speed'
2017-11-09 10:58:48,869 [INFO] >Getting scope for ref within context class be.uantwerpen.ansymo.semanticadaptation.semanticAdaptation.impl.VariableImpl
2017-11-09 10:58:48,869 [INFO] <Scope found:SimpleScope[speed, tau, displacement, speed, tau, RATE, previous_speed, micro_step, inner_time, iter, current_speed, stored_loop_sa_tau] -> NULLSCOPE
2017-11-09 10:58:48,869 [DEBUG] after getLinkedObjects: node: 'current_speed' result: current_speed
2017-11-09 10:58:48,869 [DEBUG] before getLinkedObjects: node: 'current_speed'
2017-11-09 10:58:48,869 [INFO] >Getting scope for ref within context class be.uantwerpen.ansymo.semanticadaptation.semanticAdaptation.impl.VariableImpl
2017-11-09 10:58:48,869 [INFO] <Scope found:SimpleScope[speed, tau, displacement, speed, tau, RATE, previous_speed, micro_step, inner_time, iter, current_speed, stored_loop_sa_tau] -> NULLSCOPE
2017-11-09 10:58:48,869 [DEBUG] after getLinkedObjects: node: 'current_speed' result: current_speed
2017-11-09 10:58:48,869 [DEBUG] before getLinkedObjects: node: 'speed'
2017-11-09 10:58:48,870 [INFO] >Getting scope for ref within context class be.uantwerpen.ansymo.semanticadaptation.semanticAdaptation.impl.VariableImpl
2017-11-09 10:58:48,870 [INFO] <Scope found:SimpleScope[speed, tau, displacement, speed, tau, RATE, previous_speed, micro_step, inner_time, iter, current_speed, stored_loop_sa_tau] -> NULLSCOPE
2017-11-09 10:58:48,870 [DEBUG] after getLinkedObjects: node: 'speed' result: speed
2017-11-09 10:58:48,870 [DEBUG] before getLinkedObjects: node: 'loop_sa'
2017-11-09 10:58:48,870 [INFO] >Getting scope for owner within context class be.uantwerpen.ansymo.semanticadaptation.semanticAdaptation.impl.VariableImpl
2017-11-09 10:58:48,870 [INFO]  Delegating scope discovery to super class...
2017-11-09 10:58:48,870 [INFO] <Scope found:ImportScope[rate_sa.*] imports from org.eclipse.xtext.scoping.impl.MultimapBasedSelectable@74d6736 for type FMU
2017-11-09 10:58:48,871 [DEBUG] after getLinkedObjects: node: 'loop_sa' result: loop_sa
2017-11-09 10:58:48,871 [DEBUG] before getLinkedObjects: node: 'speed'
2017-11-09 10:58:48,871 [INFO] >Getting scope for ref within context class be.uantwerpen.ansymo.semanticadaptation.semanticAdaptation.impl.VariableImpl
2017-11-09 10:58:48,871 [INFO]  Getting scope within FMU: loop_sa
2017-11-09 10:58:48,871 [INFO] <Scope found:SimpleScope[displacement, speed, tau] -> NULLSCOPE
2017-11-09 10:58:48,871 [DEBUG] after getLinkedObjects: node: 'speed' result: speed
2017-11-09 10:58:48,871 [DEBUG] before getLinkedObjects: node: 'previous_speed'
2017-11-09 10:58:48,871 [INFO] >Getting scope for ref within context class be.uantwerpen.ansymo.semanticadaptation.semanticAdaptation.impl.VariableImpl
2017-11-09 10:58:48,871 [INFO] <Scope found:SimpleScope[speed, tau, displacement, speed, tau, RATE, previous_speed, micro_step, inner_time, iter, current_speed, stored_loop_sa_tau] -> NULLSCOPE
2017-11-09 10:58:48,871 [DEBUG] after getLinkedObjects: node: 'previous_speed' result: previous_speed
2017-11-09 10:58:48,872 [DEBUG] before getLinkedObjects: node: 'current_speed'
2017-11-09 10:58:48,872 [INFO] >Getting scope for ref within context class be.uantwerpen.ansymo.semanticadaptation.semanticAdaptation.impl.VariableImpl
2017-11-09 10:58:48,872 [INFO] <Scope found:SimpleScope[speed, tau, displacement, speed, tau, RATE, previous_speed, micro_step, inner_time, iter, current_speed, stored_loop_sa_tau] -> NULLSCOPE
2017-11-09 10:58:48,872 [DEBUG] after getLinkedObjects: node: 'current_speed' result: current_speed
2017-11-09 10:58:48,872 [DEBUG] before getLinkedObjects: node: 'previous_speed'
2017-11-09 10:58:48,872 [INFO] >Getting scope for ref within context class be.uantwerpen.ansymo.semanticadaptation.semanticAdaptation.impl.VariableImpl
2017-11-09 10:58:48,872 [INFO] <Scope found:SimpleScope[speed, tau, displacement, speed, tau, RATE, previous_speed, micro_step, inner_time, iter, current_speed, stored_loop_sa_tau] -> NULLSCOPE
2017-11-09 10:58:48,872 [DEBUG] after getLinkedObjects: node: 'previous_speed' result: previous_speed
2017-11-09 10:58:48,872 [DEBUG] before getLinkedObjects: node: 'stored_loop_sa_tau'
2017-11-09 10:58:48,873 [INFO] >Getting scope for ref within context class be.uantwerpen.ansymo.semanticadaptation.semanticAdaptation.impl.VariableImpl
2017-11-09 10:58:48,873 [INFO] <Scope found:SimpleScope[speed, tau, displacement, speed, tau, RATE, previous_speed, micro_step, inner_time, iter, current_speed, stored_loop_sa_tau] -> NULLSCOPE
2017-11-09 10:58:48,873 [DEBUG] after getLinkedObjects: node: 'stored_loop_sa_tau' result: stored_loop_sa_tau
2017-11-09 10:58:48,873 [DEBUG] before getLinkedObjects: node: 'loop_sa'
2017-11-09 10:58:48,873 [INFO] >Getting scope for owner within context class be.uantwerpen.ansymo.semanticadaptation.semanticAdaptation.impl.VariableImpl
2017-11-09 10:58:48,873 [INFO]  Delegating scope discovery to super class...
2017-11-09 10:58:48,874 [INFO] <Scope found:ImportScope[rate_sa.*] imports from org.eclipse.xtext.scoping.impl.MultimapBasedSelectable@74d6736 for type FMU
2017-11-09 10:58:48,874 [DEBUG] after getLinkedObjects: node: 'loop_sa' result: loop_sa
2017-11-09 10:58:48,874 [DEBUG] before getLinkedObjects: node: 'tau'
2017-11-09 10:58:48,874 [INFO] >Getting scope for ref within context class be.uantwerpen.ansymo.semanticadaptation.semanticAdaptation.impl.VariableImpl
2017-11-09 10:58:48,874 [INFO]  Getting scope within FMU: loop_sa
2017-11-09 10:58:48,874 [INFO] <Scope found:SimpleScope[displacement, speed, tau] -> NULLSCOPE
2017-11-09 10:58:48,874 [DEBUG] after getLinkedObjects: node: 'tau' result: tau
2017-11-09 10:58:48,874 [DEBUG] before getLinkedObjects: node: 'rate_sa'
2017-11-09 10:58:48,874 [INFO] >Getting scope for owner within context class be.uantwerpen.ansymo.semanticadaptation.semanticAdaptation.impl.VariableImpl
2017-11-09 10:58:48,874 [INFO]  Delegating scope discovery to super class...
2017-11-09 10:58:48,875 [INFO] <Scope found:ImportScope[rate_sa.*] imports from org.eclipse.xtext.scoping.impl.MultimapBasedSelectable@74d6736 for type FMU
2017-11-09 10:58:48,875 [DEBUG] after getLinkedObjects: node: 'rate_sa' result: rate_sa
2017-11-09 10:58:48,875 [DEBUG] before getLinkedObjects: node: 'tau'
2017-11-09 10:58:48,875 [INFO] >Getting scope for ref within context class be.uantwerpen.ansymo.semanticadaptation.semanticAdaptation.impl.VariableImpl
2017-11-09 10:58:48,875 [INFO]  Getting scope within FMU: rate_sa
2017-11-09 10:58:48,875 [INFO] <Scope found:SimpleScope[speed, tau, displacement, speed, tau] -> NULLSCOPE
2017-11-09 10:58:48,875 [DEBUG] after getLinkedObjects: node: 'tau' result: tau
2017-11-09 10:58:48,875 [DEBUG] before getLinkedObjects: node: 'stored_loop_sa_tau'
2017-11-09 10:58:48,875 [INFO] >Getting scope for ref within context class be.uantwerpen.ansymo.semanticadaptation.semanticAdaptation.impl.VariableImpl
2017-11-09 10:58:48,876 [INFO] <Scope found:SimpleScope[speed, tau, displacement, speed, tau, RATE, previous_speed, micro_step, inner_time, iter, current_speed, stored_loop_sa_tau] -> NULLSCOPE
2017-11-09 10:58:48,876 [DEBUG] after getLinkedObjects: node: 'stored_loop_sa_tau' result: stored_loop_sa_tau
2017-11-09 10:58:48,876 [DEBUG] Syntax check OK! Resource: __synthetic0.sa
Stored file: target/generated/rate_canonical/sources/Fmu.cpp
Stored file: target/generated/rate_canonical/sources/Rate_sa.cpp
Stored file: target/generated/rate_canonical/sources/Rate_sa.h
Stored file: target/generated/rate_canonical/modelDescription.xml
Stored file: target/generated/rate_canonical/sources/main.cpp
Copied file to: target/generated/rate_canonical/resources/LoopSA.fmu
Stored file: target/generated/rate_canonical/CMakeLists.txt
Stored file: target/generated/rate_canonical/msys-toolchain.cmake
-- The C compiler identification is GNU 5.4.0
-- The CXX compiler identification is GNU 5.4.0
-- Check for working C compiler: /usr/bin/cc
-- Check for working C compiler: /usr/bin/cc -- works
-- Detecting C compiler ABI info
-- Detecting C compiler ABI info - done
-- Detecting C compile features
-- Detecting C compile features - done
-- Check for working CXX compiler: /usr/bin/c++
-- Check for working CXX compiler: /usr/bin/c++ -- works
-- Detecting CXX compiler ABI info
-- Detecting CXX compiler ABI info - done
-- Detecting CXX compile features
-- Detecting CXX compile features - done
Already up-to-date.
-- Performing Test COMPILER_SUPPORTS_CXX11
-- Performing Test COMPILER_SUPPORTS_CXX11 - Success
-- Performing Test COMPILER_SUPPORTS_CXX0X
-- Performing Test COMPILER_SUPPORTS_CXX0X - Success
-- Found ZLIB: /usr/lib/x86_64-linux-gnu/libz.so (found version "1.2.8") 
-- Configuring done
-- Generating done
-- Build files have been written to: /var/lib/jenkins/workspace/HybridCosimulation_master-LDEVB56LP46DTRNYHQSCKMS3FR4JD6RBBK6S2LPONMGDZRBJQH3A/DSL_SemanticAdaptation/be.uantwerpen.ansymo.semanticadaptation.cg.cpp.tests/target/generated/rate_canonical
Scanning dependencies of target minizip
[  4%] Building C object hcf/semantic-adaptation/third_party/into-cpp-fmi/thrird_party/projects/minizip/CMakeFiles/minizip.dir/miniunz.c.o
[  9%] Building C object hcf/semantic-adaptation/third_party/into-cpp-fmi/thrird_party/projects/minizip/CMakeFiles/minizip.dir/__/__/zlib/contrib/minizip/ioapi.c.o
[ 14%] Building C object hcf/semantic-adaptation/third_party/into-cpp-fmi/thrird_party/projects/minizip/CMakeFiles/minizip.dir/__/__/zlib/contrib/minizip/mztools.c.o
[ 19%] Building C object hcf/semantic-adaptation/third_party/into-cpp-fmi/thrird_party/projects/minizip/CMakeFiles/minizip.dir/__/__/zlib/contrib/minizip/unzip.c.o
[ 23%] Building C object hcf/semantic-adaptation/third_party/into-cpp-fmi/thrird_party/projects/minizip/CMakeFiles/minizip.dir/__/__/zlib/contrib/minizip/zip.c.o
[ 28%] Linking C static library libminizipd.a
/usr/bin/ar qc libminizipd.a  CMakeFiles/minizip.dir/__/__/zlib/contrib/minizip/ioapi.c.o CMakeFiles/minizip.dir/miniunz.c.o CMakeFiles/minizip.dir/__/__/zlib/contrib/minizip/mztools.c.o CMakeFiles/minizip.dir/__/__/zlib/contrib/minizip/unzip.c.o CMakeFiles/minizip.dir/__/__/zlib/contrib/minizip/zip.c.o
/usr/bin/ranlib libminizipd.a
[ 28%] Built target minizip
Scanning dependencies of target intocppfmi
[ 33%] Building C object hcf/semantic-adaptation/third_party/into-cpp-fmi/CMakeFiles/intocppfmi.dir/src/FmuLoader.c.o
[ 38%] Building C object hcf/semantic-adaptation/third_party/into-cpp-fmi/CMakeFiles/intocppfmi.dir/src/uri.c.o
[ 42%] Building CXX object hcf/semantic-adaptation/third_party/into-cpp-fmi/CMakeFiles/intocppfmi.dir/src/FilesystemUtil.cpp.o
[ 47%] Building CXX object hcf/semantic-adaptation/third_party/into-cpp-fmi/CMakeFiles/intocppfmi.dir/src/Fmu.cpp.o
[ 52%] Linking CXX static library libintocppfmi.a
/usr/bin/ar qc libintocppfmi.a  CMakeFiles/intocppfmi.dir/src/FmuLoader.c.o CMakeFiles/intocppfmi.dir/src/uri.c.o CMakeFiles/intocppfmi.dir/src/FilesystemUtil.cpp.o CMakeFiles/intocppfmi.dir/src/Fmu.cpp.o
/usr/bin/ranlib libintocppfmi.a
[ 52%] Built target intocppfmi
Scanning dependencies of target hcf
[ 57%] Building CXX object hcf/semantic-adaptation/CMakeFiles/hcf.dir/src/HyfMath.cpp.o
[ 61%] Building CXX object hcf/semantic-adaptation/CMakeFiles/hcf.dir/src/Empty.cpp.o
[ 66%] Linking CXX static library libhcf.a
/usr/bin/ar qc libhcf.a  CMakeFiles/hcf.dir/src/Empty.cpp.o CMakeFiles/hcf.dir/src/HyfMath.cpp.o
/usr/bin/ranlib libhcf.a
[ 66%] Built target hcf
Scanning dependencies of target rate_canonical_main
Scanning dependencies of target rate_canonical
[ 71%] Building CXX object CMakeFiles/rate_canonical_main.dir/sources/Fmu.cpp.o
[ 76%] Building CXX object CMakeFiles/rate_canonical_main.dir/sources/main.cpp.o
[ 80%] Building CXX object CMakeFiles/rate_canonical.dir/sources/Fmu.cpp.o
[ 85%] Building CXX object CMakeFiles/rate_canonical_main.dir/sources/Rate_sa.cpp.o
[ 90%] Building CXX object CMakeFiles/rate_canonical.dir/sources/Rate_sa.cpp.o
[ 95%] Linking CXX executable rate_canonical_main
[ 95%] Built target rate_canonical_main
[100%] Linking CXX shared library binaries/linux64/rate_canonical.so
[100%] Built target rate_canonical
Scanning dependencies of target pack
modelDescription.xml
resources
resources/LoopSA.fmu
binaries/linux64
binaries/linux64/rate_canonical.so
Built target pack
Tests run: 9, Failures: 0, Errors: 1, Skipped: 0, Time elapsed: 124.221 sec <<< FAILURE! - in be.uantwerpen.ansymo.semanticadaptation.cg.cpp.tests.CgCppBasicTest
lazy_canonical(be.uantwerpen.ansymo.semanticadaptation.cg.cpp.tests.CgCppBasicTest)  Time elapsed: 10.648 sec
getSetState_sa(be.uantwerpen.ansymo.semanticadaptation.cg.cpp.tests.CgCppBasicTest)  Time elapsed: 9.268 sec  <<< ERROR!
be.uantwerpen.ansymo.semanticadaptation.cg.cpp.tests.CMakeUtil$CMakeGenerateException: /var/lib/jenkins/workspace/HybridCosimulation_master-LDEVB56LP46DTRNYHQSCKMS3FR4JD6RBBK6S2LPONMGDZRBJQH3A/DSL_SemanticAdaptation/be.uantwerpen.ansymo.semanticadaptation.cg.cpp.tests/target/generated/getSetState/hcf/semantic-adaptation/third_party/into-cpp-fmi/thrird_party/projects/minizip/miniunz.c: In function ‘change_file_date’:
/var/lib/jenkins/workspace/HybridCosimulation_master-LDEVB56LP46DTRNYHQSCKMS3FR4JD6RBBK6S2LPONMGDZRBJQH3A/DSL_SemanticAdaptation/be.uantwerpen.ansymo.semanticadaptation.cg.cpp.tests/target/generated/getSetState/hcf/semantic-adaptation/third_party/into-cpp-fmi/thrird_party/projects/minizip/miniunz.c:102:13: warning: extra tokens at end of #ifdef directive
 #ifdef unix || __APPLE__
             ^
/var/lib/jenkins/workspace/HybridCosimulation_master-LDEVB56LP46DTRNYHQSCKMS3FR4JD6RBBK6S2LPONMGDZRBJQH3A/DSL_SemanticAdaptation/be.uantwerpen.ansymo.semanticadaptation.cg.cpp.tests/target/generated/getSetState/hcf/semantic-adaptation/third_party/into-cpp-fmi/thrird_party/projects/minizip/miniunz.c: In function ‘mymkdir’:
/var/lib/jenkins/workspace/HybridCosimulation_master-LDEVB56LP46DTRNYHQSCKMS3FR4JD6RBBK6S2LPONMGDZRBJQH3A/DSL_SemanticAdaptation/be.uantwerpen.ansymo.semanticadaptation.cg.cpp.tests/target/generated/getSetState/hcf/semantic-adaptation/third_party/into-cpp-fmi/thrird_party/projects/minizip/miniunz.c:133:11: warning: implicit declaration of function ‘mkdir’ [-Wimplicit-function-declaration]
     ret = mkdir (dirname,0775);
           ^
/var/lib/jenkins/workspace/HybridCosimulation_master-LDEVB56LP46DTRNYHQSCKMS3FR4JD6RBBK6S2LPONMGDZRBJQH3A/DSL_SemanticAdaptation/be.uantwerpen.ansymo.semanticadaptation.cg.cpp.tests/target/generated/getSetState/sources/GetSetStateSA.cpp: In member function ‘virtual double adaptation::GetSetStateSA::executeInternalControlFlow(double, double)’:
/var/lib/jenkins/workspace/HybridCosimulation_master-LDEVB56LP46DTRNYHQSCKMS3FR4JD6RBBK6S2LPONMGDZRBJQH3A/DSL_SemanticAdaptation/be.uantwerpen.ansymo.semanticadaptation.cg.cpp.tests/target/generated/getSetState/sources/GetSetStateSA.cpp:124:6: error: ‘dt’ was not declared in this scope
   if(dt < 1.0 && dt > 0.5){
      ^
make[2]: *** [CMakeFiles/getSetState.dir/sources/GetSetStateSA.cpp.o] Error 1
make[1]: *** [CMakeFiles/getSetState.dir/all] Error 2
make[1]: *** Waiting for unfinished jobs....
/var/lib/jenkins/workspace/HybridCosimulation_master-LDEVB56LP46DTRNYHQSCKMS3FR4JD6RBBK6S2LPONMGDZRBJQH3A/DSL_SemanticAdaptation/be.uantwerpen.ansymo.semanticadaptation.cg.cpp.tests/target/generated/getSetState/sources/GetSetStateSA.cpp: In member function ‘virtual double adaptation::GetSetStateSA::executeInternalControlFlow(double, double)’:
/var/lib/jenkins/workspace/HybridCosimulation_master-LDEVB56LP46DTRNYHQSCKMS3FR4JD6RBBK6S2LPONMGDZRBJQH3A/DSL_SemanticAdaptation/be.uantwerpen.ansymo.semanticadaptation.cg.cpp.tests/target/generated/getSetState/sources/GetSetStateSA.cpp:124:6: error: ‘dt’ was not declared in this scope
   if(dt < 1.0 && dt > 0.5){
      ^
make[2]: *** [CMakeFiles/getSetState_main.dir/sources/GetSetStateSA.cpp.o] Error 1
make[1]: *** [CMakeFiles/getSetState_main.dir/all] Error 2
make: *** [all] Error 2

	at be.uantwerpen.ansymo.semanticadaptation.cg.cpp.tests.CMakeUtil.runProcess(CMakeUtil.java:143)
	at be.uantwerpen.ansymo.semanticadaptation.cg.cpp.tests.CMakeUtil.make(CMakeUtil.java:69)
	at be.uantwerpen.ansymo.semanticadaptation.cg.cpp.tests.CgCppBasicTest.__parseNoErrors(CgCppBasicTest.xtend:207)
	at be.uantwerpen.ansymo.semanticadaptation.cg.cpp.tests.CgCppBasicTest.getSetState_sa(CgCppBasicTest.xtend:68)

window_sa_canonical_new(be.uantwerpen.ansymo.semanticadaptation.cg.cpp.tests.CgCppBasicTest)  Time elapsed: 11.6 sec
rollback_test(be.uantwerpen.ansymo.semanticadaptation.cg.cpp.tests.CgCppBasicTest)  Time elapsed: 10.952 sec
controller_test(be.uantwerpen.ansymo.semanticadaptation.cg.cpp.tests.CgCppBasicTest)  Time elapsed: 11.245 sec
loop(be.uantwerpen.ansymo.semanticadaptation.cg.cpp.tests.CgCppBasicTest)  Time elapsed: 13.983 sec
rate(be.uantwerpen.ansymo.semanticadaptation.cg.cpp.tests.CgCppBasicTest)  Time elapsed: 10.437 sec
power(be.uantwerpen.ansymo.semanticadaptation.cg.cpp.tests.CgCppBasicTest)  Time elapsed: 11.199 sec
rate_canonical(be.uantwerpen.ansymo.semanticadaptation.cg.cpp.tests.CgCppBasicTest)  Time elapsed: 11.225 sec
Running be.uantwerpen.ansymo.semanticadaptation.cg.cpp.tests.CgCppAutoTest
Tests run: 1, Failures: 0, Errors: 0, Skipped: 1, Time elapsed: 0.015 sec - in be.uantwerpen.ansymo.semanticadaptation.cg.cpp.tests.CgCppAutoTest
allSemanticAdaptations[0](be.uantwerpen.ansymo.semanticadaptation.cg.cpp.tests.CgCppAutoTest) skipped

Results :

Tests in error: 
  CgCppBasicTest.getSetState_sa:68->__parseNoErrors:207 » CMakeGenerate /var/lib...

Tests run: 10, Failures: 0, Errors: 1, Skipped: 1

[INFO] ------------------------------------------------------------------------
[INFO] Reactor Summary:
[INFO] 
[INFO] Semantics Adaptation Root .......................... SUCCESS [  0.514 s]
[INFO] be.uantwerpen.ansymo.semanticadaptation Testframework SUCCESS [  7.523 s]
[INFO] be.uantwerpen.ansymo.semanticadaptation Logger ..... SUCCESS [  1.639 s]
[INFO] be.uantwerpen.ansymo.semanticadaptation Language Core SUCCESS [ 26.482 s]
[INFO] be.uantwerpen.ansymo.semanticadaptation Canonical Generator SUCCESS [  4.600 s]
[INFO] be.uantwerpen.ansymo.semanticadaptation Code Generation to C++ SUCCESS [  4.717 s]
[INFO] be.uantwerpen.ansymo.semanticadaptation Code Generator SUCCESS [  1.955 s]
[INFO] be.uantwerpen.ansymo.semanticadaptation Language Tests SUCCESS [ 11.292 s]
[INFO] be.uantwerpen.ansymo.semanticadaptation.ide ........ SUCCESS [  2.125 s]
[INFO] be.uantwerpen.ansymo.semanticadaptation.ui Language UI SUCCESS [  4.152 s]
[INFO] be.uantwerpen.ansymo.semanticadaptation Code Generation to C++ Tests FAILURE [02:15 min]
[INFO] be.uantwerpen.ansymo.semanticadaptation Code Generation to C++ Tests SKIPPED
[INFO] Feature ............................................ SKIPPED
[INFO] be.uantwerpen.ansymo.semanticadaptation.ide.platform SKIPPED
[INFO] Core ............................................... SKIPPED
[INFO] Semantics Adaptation IDE Eclipse repository ........ SKIPPED
[INFO] SA IDE Standalone Product .......................... SKIPPED
[INFO] ------------------------------------------------------------------------
[INFO] BUILD FAILURE
[INFO] ------------------------------------------------------------------------
[INFO] Total time: 04:27 min
[INFO] Finished at: 2017-11-09T10:59:02+01:00
[INFO] Final Memory: 189M/899M
[INFO] ------------------------------------------------------------------------
[jenkins-maven-event-spy] INFO generated /var/lib/jenkins/workspace/HybridCosimulation_master-LDEVB56LP46DTRNYHQSCKMS3FR4JD6RBBK6S2LPONMGDZRBJQH3A@tmp/withMavenff18bba3/maven-spy-20171109-105434-358.log
[ERROR] Failed to execute goal org.eclipse.tycho:tycho-surefire-plugin:1.0.0:test (default-test) on project be.uantwerpen.ansymo.semanticadaptation.cg.cpp.tests: There are test failures.
[ERROR] 
[ERROR] Please refer to /var/lib/jenkins/workspace/HybridCosimulation_master-LDEVB56LP46DTRNYHQSCKMS3FR4JD6RBBK6S2LPONMGDZRBJQH3A/DSL_SemanticAdaptation/be.uantwerpen.ansymo.semanticadaptation.cg.cpp.tests/target/surefire-reports for the individual test results.
[ERROR] -> [Help 1]
[ERROR] 
[ERROR] To see the full stack trace of the errors, re-run Maven with the -e switch.
[ERROR] Re-run Maven using the -X switch to enable full debug logging.
[ERROR] 
[ERROR] For more information about the errors and possible solutions, please read the following articles:
[ERROR] [Help 1] http://cwiki.apache.org/confluence/display/MAVEN/MojoFailureException
[ERROR] 
[ERROR] After correcting the problems, you can resume the build with the command
[ERROR]   mvn <goals> -rf :be.uantwerpen.ansymo.semanticadaptation.cg.cpp.tests
[Pipeline] }
[withMaven] artifactsPublisher - Archive artifact DSL_SemanticAdaptation/pom.xml under be/uantwerpen/ansymo/semanticadaptation/parent/1.0.0-SNAPSHOT/parent-1.0.0-SNAPSHOT.pom
[withMaven] artifactsPublisher - Archive artifact DSL_SemanticAdaptation/be.uantwerpen.ansymo.semanticadaptation.testframework/pom.xml under be/uantwerpen/ansymo/semanticadaptation/be.uantwerpen.ansymo.semanticadaptation.testframework/1.0.0-SNAPSHOT/be.uantwerpen.ansymo.semanticadaptation.testframework-1.0.0-SNAPSHOT.pom
[withMaven] artifactsPublisher - Archive artifact DSL_SemanticAdaptation/be.uantwerpen.ansymo.semanticadaptation.testframework/target/be.uantwerpen.ansymo.semanticadaptation.testframework-1.0.0-SNAPSHOT.jar under be/uantwerpen/ansymo/semanticadaptation/be.uantwerpen.ansymo.semanticadaptation.testframework/1.0.0-SNAPSHOT/be.uantwerpen.ansymo.semanticadaptation.testframework-1.0.0-SNAPSHOT.jar
[withMaven] artifactsPublisher - Archive artifact DSL_SemanticAdaptation/be.uantwerpen.ansymo.semanticadaptation.log/pom.xml under be/uantwerpen/ansymo/semanticadaptation/be.uantwerpen.ansymo.semanticadaptation.log/1.0.0-SNAPSHOT/be.uantwerpen.ansymo.semanticadaptation.log-1.0.0-SNAPSHOT.pom
[withMaven] artifactsPublisher - Archive artifact DSL_SemanticAdaptation/be.uantwerpen.ansymo.semanticadaptation.log/target/be.uantwerpen.ansymo.semanticadaptation.log-1.0.0-SNAPSHOT.jar under be/uantwerpen/ansymo/semanticadaptation/be.uantwerpen.ansymo.semanticadaptation.log/1.0.0-SNAPSHOT/be.uantwerpen.ansymo.semanticadaptation.log-1.0.0-SNAPSHOT.jar
[withMaven] artifactsPublisher - Archive artifact DSL_SemanticAdaptation/be.uantwerpen.ansymo.semanticadaptation/pom.xml under be/uantwerpen/ansymo/semanticadaptation/be.uantwerpen.ansymo.semanticadaptation/1.0.0-SNAPSHOT/be.uantwerpen.ansymo.semanticadaptation-1.0.0-SNAPSHOT.pom
[withMaven] artifactsPublisher - Archive artifact DSL_SemanticAdaptation/be.uantwerpen.ansymo.semanticadaptation/target/be.uantwerpen.ansymo.semanticadaptation-1.0.0-SNAPSHOT.jar under be/uantwerpen/ansymo/semanticadaptation/be.uantwerpen.ansymo.semanticadaptation/1.0.0-SNAPSHOT/be.uantwerpen.ansymo.semanticadaptation-1.0.0-SNAPSHOT.jar
[withMaven] artifactsPublisher - Archive artifact DSL_SemanticAdaptation/be.uantwerpen.ansymo.semanticadaptation.cg.canonical/pom.xml under be/uantwerpen/ansymo/semanticadaptation/be.uantwerpen.ansymo.semanticadaptation.cg.canonical/1.0.0-SNAPSHOT/be.uantwerpen.ansymo.semanticadaptation.cg.canonical-1.0.0-SNAPSHOT.pom
[withMaven] artifactsPublisher - Archive artifact DSL_SemanticAdaptation/be.uantwerpen.ansymo.semanticadaptation.cg.canonical/target/be.uantwerpen.ansymo.semanticadaptation.cg.canonical-1.0.0-SNAPSHOT.jar under be/uantwerpen/ansymo/semanticadaptation/be.uantwerpen.ansymo.semanticadaptation.cg.canonical/1.0.0-SNAPSHOT/be.uantwerpen.ansymo.semanticadaptation.cg.canonical-1.0.0-SNAPSHOT.jar
[withMaven] artifactsPublisher - Archive artifact DSL_SemanticAdaptation/be.uantwerpen.ansymo.semanticadaptation.cg.cpp/pom.xml under be/uantwerpen/ansymo/semanticadaptation/be.uantwerpen.ansymo.semanticadaptation.cg.cpp/1.0.0-SNAPSHOT/be.uantwerpen.ansymo.semanticadaptation.cg.cpp-1.0.0-SNAPSHOT.pom
[withMaven] artifactsPublisher - Archive artifact DSL_SemanticAdaptation/be.uantwerpen.ansymo.semanticadaptation.cg.cpp/target/be.uantwerpen.ansymo.semanticadaptation.cg.cpp-1.0.0-SNAPSHOT.jar under be/uantwerpen/ansymo/semanticadaptation/be.uantwerpen.ansymo.semanticadaptation.cg.cpp/1.0.0-SNAPSHOT/be.uantwerpen.ansymo.semanticadaptation.cg.cpp-1.0.0-SNAPSHOT.jar
[withMaven] artifactsPublisher - Archive artifact DSL_SemanticAdaptation/be.uantwerpen.ansymo.semanticadaptation.cg.chain/pom.xml under be/uantwerpen/ansymo/semanticadaptation/be.uantwerpen.ansymo.semanticadaptation.cg.chain/1.0.0-SNAPSHOT/be.uantwerpen.ansymo.semanticadaptation.cg.chain-1.0.0-SNAPSHOT.pom
[withMaven] artifactsPublisher - Archive artifact DSL_SemanticAdaptation/be.uantwerpen.ansymo.semanticadaptation.cg.chain/target/be.uantwerpen.ansymo.semanticadaptation.cg.chain-1.0.0-SNAPSHOT.jar under be/uantwerpen/ansymo/semanticadaptation/be.uantwerpen.ansymo.semanticadaptation.cg.chain/1.0.0-SNAPSHOT/be.uantwerpen.ansymo.semanticadaptation.cg.chain-1.0.0-SNAPSHOT.jar
[withMaven] artifactsPublisher - Archive artifact DSL_SemanticAdaptation/be.uantwerpen.ansymo.semanticadaptation.tests/pom.xml under be/uantwerpen/ansymo/semanticadaptation/be.uantwerpen.ansymo.semanticadaptation.tests/1.0.0-SNAPSHOT/be.uantwerpen.ansymo.semanticadaptation.tests-1.0.0-SNAPSHOT.pom
[withMaven] artifactsPublisher - Archive artifact DSL_SemanticAdaptation/be.uantwerpen.ansymo.semanticadaptation.tests/target/be.uantwerpen.ansymo.semanticadaptation.tests-1.0.0-SNAPSHOT.jar under be/uantwerpen/ansymo/semanticadaptation/be.uantwerpen.ansymo.semanticadaptation.tests/1.0.0-SNAPSHOT/be.uantwerpen.ansymo.semanticadaptation.tests-1.0.0-SNAPSHOT.jar
[withMaven] artifactsPublisher - Archive artifact DSL_SemanticAdaptation/be.uantwerpen.ansymo.semanticadaptation.ide/pom.xml under be/uantwerpen/ansymo/semanticadaptation/be.uantwerpen.ansymo.semanticadaptation.ide/1.0.0-SNAPSHOT/be.uantwerpen.ansymo.semanticadaptation.ide-1.0.0-SNAPSHOT.pom
[withMaven] artifactsPublisher - Archive artifact DSL_SemanticAdaptation/be.uantwerpen.ansymo.semanticadaptation.ide/target/be.uantwerpen.ansymo.semanticadaptation.ide-1.0.0-SNAPSHOT.jar under be/uantwerpen/ansymo/semanticadaptation/be.uantwerpen.ansymo.semanticadaptation.ide/1.0.0-SNAPSHOT/be.uantwerpen.ansymo.semanticadaptation.ide-1.0.0-SNAPSHOT.jar
[withMaven] artifactsPublisher - Archive artifact DSL_SemanticAdaptation/be.uantwerpen.ansymo.semanticadaptation.ui/pom.xml under be/uantwerpen/ansymo/semanticadaptation/be.uantwerpen.ansymo.semanticadaptation.ui/1.0.0-SNAPSHOT/be.uantwerpen.ansymo.semanticadaptation.ui-1.0.0-SNAPSHOT.pom
[withMaven] artifactsPublisher - Archive artifact DSL_SemanticAdaptation/be.uantwerpen.ansymo.semanticadaptation.ui/target/be.uantwerpen.ansymo.semanticadaptation.ui-1.0.0-SNAPSHOT.jar under be/uantwerpen/ansymo/semanticadaptation/be.uantwerpen.ansymo.semanticadaptation.ui/1.0.0-SNAPSHOT/be.uantwerpen.ansymo.semanticadaptation.ui-1.0.0-SNAPSHOT.jar
[withMaven] artifactsPublisher - Archive artifact DSL_SemanticAdaptation/be.uantwerpen.ansymo.semanticadaptation.testframework/target/p2content.xml under be/uantwerpen/ansymo/semanticadaptation/be.uantwerpen.ansymo.semanticadaptation.testframework/1.0.0-SNAPSHOT/be.uantwerpen.ansymo.semanticadaptation.testframework-1.0.0-SNAPSHOT-p2metadata.xml
[withMaven] artifactsPublisher - Archive artifact DSL_SemanticAdaptation/be.uantwerpen.ansymo.semanticadaptation.testframework/target/p2artifacts.xml under be/uantwerpen/ansymo/semanticadaptation/be.uantwerpen.ansymo.semanticadaptation.testframework/1.0.0-SNAPSHOT/be.uantwerpen.ansymo.semanticadaptation.testframework-1.0.0-SNAPSHOT-p2artifacts.xml
[withMaven] artifactsPublisher - Archive artifact DSL_SemanticAdaptation/be.uantwerpen.ansymo.semanticadaptation.log/target/p2content.xml under be/uantwerpen/ansymo/semanticadaptation/be.uantwerpen.ansymo.semanticadaptation.log/1.0.0-SNAPSHOT/be.uantwerpen.ansymo.semanticadaptation.log-1.0.0-SNAPSHOT-p2metadata.xml
[withMaven] artifactsPublisher - Archive artifact DSL_SemanticAdaptation/be.uantwerpen.ansymo.semanticadaptation.log/target/p2artifacts.xml under be/uantwerpen/ansymo/semanticadaptation/be.uantwerpen.ansymo.semanticadaptation.log/1.0.0-SNAPSHOT/be.uantwerpen.ansymo.semanticadaptation.log-1.0.0-SNAPSHOT-p2artifacts.xml
[withMaven] artifactsPublisher - Archive artifact DSL_SemanticAdaptation/be.uantwerpen.ansymo.semanticadaptation/target/p2content.xml under be/uantwerpen/ansymo/semanticadaptation/be.uantwerpen.ansymo.semanticadaptation/1.0.0-SNAPSHOT/be.uantwerpen.ansymo.semanticadaptation-1.0.0-SNAPSHOT-p2metadata.xml
[withMaven] artifactsPublisher - Archive artifact DSL_SemanticAdaptation/be.uantwerpen.ansymo.semanticadaptation/target/p2artifacts.xml under be/uantwerpen/ansymo/semanticadaptation/be.uantwerpen.ansymo.semanticadaptation/1.0.0-SNAPSHOT/be.uantwerpen.ansymo.semanticadaptation-1.0.0-SNAPSHOT-p2artifacts.xml
[withMaven] artifactsPublisher - Archive artifact DSL_SemanticAdaptation/be.uantwerpen.ansymo.semanticadaptation.cg.canonical/target/p2content.xml under be/uantwerpen/ansymo/semanticadaptation/be.uantwerpen.ansymo.semanticadaptation.cg.canonical/1.0.0-SNAPSHOT/be.uantwerpen.ansymo.semanticadaptation.cg.canonical-1.0.0-SNAPSHOT-p2metadata.xml
[withMaven] artifactsPublisher - Archive artifact DSL_SemanticAdaptation/be.uantwerpen.ansymo.semanticadaptation.cg.canonical/target/p2artifacts.xml under be/uantwerpen/ansymo/semanticadaptation/be.uantwerpen.ansymo.semanticadaptation.cg.canonical/1.0.0-SNAPSHOT/be.uantwerpen.ansymo.semanticadaptation.cg.canonical-1.0.0-SNAPSHOT-p2artifacts.xml
[withMaven] artifactsPublisher - Archive artifact DSL_SemanticAdaptation/be.uantwerpen.ansymo.semanticadaptation.cg.cpp/target/p2content.xml under be/uantwerpen/ansymo/semanticadaptation/be.uantwerpen.ansymo.semanticadaptation.cg.cpp/1.0.0-SNAPSHOT/be.uantwerpen.ansymo.semanticadaptation.cg.cpp-1.0.0-SNAPSHOT-p2metadata.xml
[withMaven] artifactsPublisher - Archive artifact DSL_SemanticAdaptation/be.uantwerpen.ansymo.semanticadaptation.cg.cpp/target/p2artifacts.xml under be/uantwerpen/ansymo/semanticadaptation/be.uantwerpen.ansymo.semanticadaptation.cg.cpp/1.0.0-SNAPSHOT/be.uantwerpen.ansymo.semanticadaptation.cg.cpp-1.0.0-SNAPSHOT-p2artifacts.xml
[withMaven] artifactsPublisher - Archive artifact DSL_SemanticAdaptation/be.uantwerpen.ansymo.semanticadaptation.cg.chain/target/p2content.xml under be/uantwerpen/ansymo/semanticadaptation/be.uantwerpen.ansymo.semanticadaptation.cg.chain/1.0.0-SNAPSHOT/be.uantwerpen.ansymo.semanticadaptation.cg.chain-1.0.0-SNAPSHOT-p2metadata.xml
[withMaven] artifactsPublisher - Archive artifact DSL_SemanticAdaptation/be.uantwerpen.ansymo.semanticadaptation.cg.chain/target/p2artifacts.xml under be/uantwerpen/ansymo/semanticadaptation/be.uantwerpen.ansymo.semanticadaptation.cg.chain/1.0.0-SNAPSHOT/be.uantwerpen.ansymo.semanticadaptation.cg.chain-1.0.0-SNAPSHOT-p2artifacts.xml
[withMaven] artifactsPublisher - Archive artifact DSL_SemanticAdaptation/be.uantwerpen.ansymo.semanticadaptation.tests/target/p2content.xml under be/uantwerpen/ansymo/semanticadaptation/be.uantwerpen.ansymo.semanticadaptation.tests/1.0.0-SNAPSHOT/be.uantwerpen.ansymo.semanticadaptation.tests-1.0.0-SNAPSHOT-p2metadata.xml
[withMaven] artifactsPublisher - Archive artifact DSL_SemanticAdaptation/be.uantwerpen.ansymo.semanticadaptation.tests/target/p2artifacts.xml under be/uantwerpen/ansymo/semanticadaptation/be.uantwerpen.ansymo.semanticadaptation.tests/1.0.0-SNAPSHOT/be.uantwerpen.ansymo.semanticadaptation.tests-1.0.0-SNAPSHOT-p2artifacts.xml
[withMaven] artifactsPublisher - Archive artifact DSL_SemanticAdaptation/be.uantwerpen.ansymo.semanticadaptation.ide/target/p2content.xml under be/uantwerpen/ansymo/semanticadaptation/be.uantwerpen.ansymo.semanticadaptation.ide/1.0.0-SNAPSHOT/be.uantwerpen.ansymo.semanticadaptation.ide-1.0.0-SNAPSHOT-p2metadata.xml
[withMaven] artifactsPublisher - Archive artifact DSL_SemanticAdaptation/be.uantwerpen.ansymo.semanticadaptation.ide/target/p2artifacts.xml under be/uantwerpen/ansymo/semanticadaptation/be.uantwerpen.ansymo.semanticadaptation.ide/1.0.0-SNAPSHOT/be.uantwerpen.ansymo.semanticadaptation.ide-1.0.0-SNAPSHOT-p2artifacts.xml
[withMaven] artifactsPublisher - Archive artifact DSL_SemanticAdaptation/be.uantwerpen.ansymo.semanticadaptation.ui/target/p2content.xml under be/uantwerpen/ansymo/semanticadaptation/be.uantwerpen.ansymo.semanticadaptation.ui/1.0.0-SNAPSHOT/be.uantwerpen.ansymo.semanticadaptation.ui-1.0.0-SNAPSHOT-p2metadata.xml
[withMaven] artifactsPublisher - Archive artifact DSL_SemanticAdaptation/be.uantwerpen.ansymo.semanticadaptation.ui/target/p2artifacts.xml under be/uantwerpen/ansymo/semanticadaptation/be.uantwerpen.ansymo.semanticadaptation.ui/1.0.0-SNAPSHOT/be.uantwerpen.ansymo.semanticadaptation.ui-1.0.0-SNAPSHOT-p2artifacts.xml
[TASKS] Scanning folder '/var/lib/jenkins/workspace/HybridCosimulation_master-LDEVB56LP46DTRNYHQSCKMS3FR4JD6RBBK6S2LPONMGDZRBJQH3A' for files matching the pattern '**/*.java' - excludes: null
[TASKS] Found 428 files to scan for tasks
[TASKS] Found 27 open tasks.
Skipping warnings blame since pipelines do not have an SCM link.%n
[TASKS] Computing warning deltas based on reference build #142
[Pipeline] // withMaven
[Pipeline] }
[Pipeline] // stage
[Pipeline] stage
[Pipeline] { (Reporting)
[Pipeline] emailextrecipients
Not sending mail to user casper.thule@eng.au.dk with no permission to view HybridCosimulation » master #145[Pipeline] emailext
Sending email to: lausdahl@eng.au.dk
[Pipeline] }
[Pipeline] // stage
[Pipeline] }
[Pipeline] // node
[Pipeline] End of Pipeline
ERROR: script returned exit code 1
Finished: FAILURE