FailedConsole Output

Skipping 106 KB.. Full Log
.98kB)
[INFO] Fetching org.eclipse.jetty.io_9.3.9.v20160517.jar.pack.gz from http://mirror.kumi.systems/eclipse/releases/neon/201705151400/plugins/ (77.98kB)
[INFO] Fetching org.eclipse.jetty.security_9.3.9.v20160517.jar.pack.gz from http://mirror.switch.ch/eclipse/releases/neon/201705151400/plugins/ (71.65kB)
[INFO] Fetching org.eclipse.jetty.security_9.3.9.v20160517.jar.pack.gz from http://mirror.switch.ch/eclipse/releases/neon/201705151400/plugins/ (71.65kB)
[INFO] Fetching org.eclipse.help_2.2.2.v20170301-0400.jar from http://ftp-stud.fht-esslingen.de/pub/Mirrors/eclipse/releases/neon/201705151400/features/ (18.28kB)
[INFO] Fetching org.eclipse.help_2.2.2.v20170301-0400.jar from http://ftp-stud.fht-esslingen.de/pub/Mirrors/eclipse/releases/neon/201705151400/features/ (18.28kB)
[INFO] Fetching org.eclipse.jsch.core_1.3.0.v20160422-1917.jar.pack.gz from http://ftp.fau.de/eclipse/releases/neon/201705151400/plugins/ (20.72kB)
[INFO] Fetching org.eclipse.jsch.core_1.3.0.v20160422-1917.jar.pack.gz from http://ftp.fau.de/eclipse/releases/neon/201705151400/plugins/ (20.72kB)
[INFO] Fetching org.eclipse.jsch.ui_1.3.0.v20160323-1650.jar.pack.gz from http://ftp-stud.fht-esslingen.de/pub/Mirrors/eclipse/releases/neon/201705151400/plugins/ (35.81kB)
[INFO] Fetching org.eclipse.osgi.util_3.3.100.v20150423-1351.jar.pack.gz from http://ftp-stud.fht-esslingen.de/pub/Mirrors/eclipse/releases/neon/201705151400/plugins/ (17.34kB)
[INFO] Fetching org.eclipse.osgi.util_3.3.100.v20150423-1351.jar.pack.gz from http://ftp-stud.fht-esslingen.de/pub/Mirrors/eclipse/releases/neon/201705151400/plugins/ (17.34kB)
[INFO] Fetching org.eclipse.platform_4.6.3.v20170301-0400.jar.pack.gz from http://ftp.fau.de/eclipse/releases/neon/201705151400/plugins/ (450.15kB)
[INFO] Fetching org.eclipse.platform_4.6.3.v20170301-0400.jar.pack.gz from http://ftp.fau.de/eclipse/releases/neon/201705151400/plugins/ (450.15kB)
[INFO] Fetching org.eclipse.platform.doc.user_4.6.1.v20160727-2009.jar.pack.gz from http://ftp.fau.de/eclipse/releases/neon/201705151400/plugins/ (7.97MB)
[INFO] Fetching org.eclipse.ui.cheatsheets_3.5.0.v20160504-0839.jar.pack.gz from http://ftp.fau.de/eclipse/releases/neon/201705151400/plugins/ (119.26kB)
[INFO] Fetching org.eclipse.ui.cheatsheets_3.5.0.v20160504-0839.jar.pack.gz from http://ftp.fau.de/eclipse/releases/neon/201705151400/plugins/ (119.26kB)
[INFO] Fetching org.eclipse.ui.net_1.3.0.v20160426-1633.jar.pack.gz from http://ftp.fau.de/eclipse/releases/neon/201705151400/plugins/ (20.79kB)
[INFO] Fetching org.eclipse.ui.net_1.3.0.v20160426-1633.jar.pack.gz from http://ftp.fau.de/eclipse/releases/neon/201705151400/plugins/ (20.79kB)
[INFO] Fetching org.eclipse.ui.externaltools_3.3.100.v20160518-1858.jar.pack.gz from http://ftp-stud.fht-esslingen.de/pub/Mirrors/eclipse/releases/neon/201705151400/plugins/ (69.75kB)
[INFO] Fetching org.eclipse.ui.externaltools_3.3.100.v20160518-1858.jar.pack.gz from http://ftp-stud.fht-esslingen.de/pub/Mirrors/eclipse/releases/neon/201705151400/plugins/ (69.75kB)
[INFO] Fetching org.eclipse.ui.win32_3.3.0.v20160505-1310.jar.pack.gz from http://ftp.fau.de/eclipse/releases/neon/201705151400/plugins/ (14.12kB)
[INFO] Fetching org.eclipse.ui.intro.quicklinks_1.0.0.v20160515-0255.jar.pack.gz from http://mirror.tspu.ru/eclipse/releases/neon/201705151400/plugins/ (14.27kB)
[INFO] Fetching org.eclipse.ui.intro.quicklinks_1.0.0.v20160515-0255.jar.pack.gz from http://mirror.tspu.ru/eclipse/releases/neon/201705151400/plugins/ (14.27kB)
[INFO] Fetching org.eclipse.ui.intro.universal_3.3.1.v20160829-1558.jar.pack.gz from http://ftp.fau.de/eclipse/releases/neon/201705151400/plugins/ (1.71MB)
[INFO] Fetching org.eclipse.ui.intro.universal_3.3.1.v20160829-1558.jar.pack.gz from http://ftp.fau.de/eclipse/releases/neon/201705151400/plugins/ (1.71MB)
[INFO] Fetching org.eclipse.ui.browser_3.5.2.v20161114-0210.jar.pack.gz from http://ftp-stud.fht-esslingen.de/pub/Mirrors/eclipse/releases/neon/201705151400/plugins/ (100.95kB)
[INFO] Fetching org.eclipse.ui.browser_3.5.2.v20161114-0210.jar.pack.gz from http://ftp-stud.fht-esslingen.de/pub/Mirrors/eclipse/releases/neon/201705151400/plugins/ (100.95kB)
[INFO] Fetching org.eclipse.ui.themes_1.1.300.v20161107-1827.jar.pack.gz from http://ftp.fau.de/eclipse/releases/neon/201705151400/plugins/ (28.68kB)
[INFO] Fetching org.eclipse.ui.themes_1.1.300.v20161107-1827.jar.pack.gz from http://ftp.fau.de/eclipse/releases/neon/201705151400/plugins/ (28.68kB)
[INFO] Fetching org.eclipse.ui.monitoring_1.1.2.v20170203-1115.jar.pack.gz from http://ftp.fau.de/eclipse/releases/neon/201705151400/plugins/ (27.77kB)
[INFO] Fetching org.eclipse.ui.monitoring_1.1.2.v20170203-1115.jar.pack.gz from http://ftp.fau.de/eclipse/releases/neon/201705151400/plugins/ (27.77kB)
[INFO] Fetching org.eclipse.platform_4.6.3.v20170301-0400.jar from http://ftp.fau.de/eclipse/releases/neon/201705151400/features/ (19.31kB)
[INFO] Fetching org.eclipse.platform_root_4.6.3.v20170301-0400 from http://ftp.fau.de/eclipse/releases/neon/201705151400/binary/ (195B)
[INFO] Fetching org.eclipse.update.configurator_3.3.400.v20160506-0750.jar.pack.gz from http://ftp-stud.fht-esslingen.de/pub/Mirrors/eclipse/releases/neon/201705151400/plugins/ (44.89kB)
[INFO] Fetching org.eclipse.rcp_4.6.3.v20170301-0400.jar.pack.gz from http://ftp.fau.de/eclipse/releases/neon/201705151400/plugins/ (9.46kB)
[INFO] Fetching org.eclipse.rcp_4.6.3.v20170301-0400.jar.pack.gz from http://ftp.fau.de/eclipse/releases/neon/201705151400/plugins/ (9.46kB)
[INFO] Fetching org.eclipse.rcp_4.6.3.v20170301-0400.jar from http://ftp.fau.de/eclipse/releases/neon/201705151400/features/ (17.88kB)
[INFO] Fetching org.eclipse.rcp_root_4.6.3.v20170301-0400 from http://mirror.onet.pl/pub/mirrors/eclipse//releases/neon/201705151400/binary/ (27.05kB)
[INFO] Fetching org.eclipse.core.filesystem.win32.x86_64_1.4.0.v20140124-1940.jar.pack.gz from http://mirror.kumi.systems/eclipse/releases/neon/201705151400/plugins/ (30.19kB)
[INFO] Fetching org.eclipse.core.filesystem.win32.x86_64_1.4.0.v20140124-1940.jar.pack.gz from http://mirror.kumi.systems/eclipse/releases/neon/201705151400/plugins/ (30.19kB)
[INFO] Fetching org.eclipse.core.net.win32.x86_64_1.1.0.v20160323-1650.jar.pack.gz from http://ftp.fau.de/eclipse/releases/neon/201705151400/plugins/ (27.76kB)
[INFO] Fetching org.eclipse.core.net.win32.x86_64_1.1.0.v20160323-1650.jar.pack.gz from http://ftp.fau.de/eclipse/releases/neon/201705151400/plugins/ (27.76kB)
[INFO] Fetching org.eclipse.core.resources.win32.x86_64_3.5.0.v20140124-1940.jar.pack.gz from http://ftp-stud.fht-esslingen.de/pub/Mirrors/eclipse/releases/neon/201705151400/plugins/ (25.91kB)
[INFO] Fetching org.eclipse.equinox.launcher.win32.win32.x86_64_1.1.401.v20161122-1740.jar.pack.gz from http://mirror.kumi.systems/eclipse/releases/neon/201705151400/plugins/ (29.07kB)
[INFO] Fetching org.eclipse.equinox.executable_root.win32.win32.x86_64_3.6.300.v20161122-1740 from http://mirror.switch.ch/eclipse/releases/neon/201705151400/binary/ (34.39kB)
[INFO] Fetching org.eclipse.equinox.executable_root.win32.win32.x86_64_3.6.300.v20161122-1740 from http://mirror.switch.ch/eclipse/releases/neon/201705151400/binary/ (34.39kB)
[INFO] Fetching org.eclipse.equinox.security.win32.x86_64_1.0.100.v20130327-1442.jar.pack.gz from http://ftp-stud.fht-esslingen.de/pub/Mirrors/eclipse/releases/neon/201705151400/plugins/ (30.78kB)
[INFO] Fetching org.eclipse.equinox.security.win32.x86_64_1.0.100.v20130327-1442.jar.pack.gz from http://ftp-stud.fht-esslingen.de/pub/Mirrors/eclipse/releases/neon/201705151400/plugins/ (30.78kB)
[INFO] Fetching org.eclipse.core.filesystem.linux.x86_1.4.200.v20140124-1940.jar.pack.gz from http://ftp.fau.de/eclipse/releases/neon/201705151400/plugins/ (8.87kB)
[INFO] Fetching org.eclipse.core.filesystem.linux.x86_1.4.200.v20140124-1940.jar.pack.gz from http://ftp.fau.de/eclipse/releases/neon/201705151400/plugins/ (8.87kB)
[INFO] Fetching org.eclipse.core.net.linux.x86_1.2.0.v20160323-1650.jar.pack.gz from http://ftp.fau.de/eclipse/releases/neon/201705151400/plugins/ (36.03kB)
[INFO] Fetching org.eclipse.core.net.linux.x86_1.2.0.v20160323-1650.jar.pack.gz from http://ftp.fau.de/eclipse/releases/neon/201705151400/plugins/ (36.03kB)
[INFO] Fetching org.eclipse.e4.ui.swt.gtk_1.0.100.v20160301-1001.jar.pack.gz from http://mirror.kumi.systems/eclipse/releases/neon/201705151400/plugins/ (7.95kB)
[INFO] Fetching org.eclipse.equinox.launcher.gtk.linux.x86_1.1.401.v20161122-1740.jar.pack.gz from http://ftp-stud.fht-esslingen.de/pub/Mirrors/eclipse/releases/neon/201705151400/plugins/ (78.08kB)
[INFO] Fetching org.eclipse.equinox.launcher.gtk.linux.x86_1.1.401.v20161122-1740.jar.pack.gz from http://ftp-stud.fht-esslingen.de/pub/Mirrors/eclipse/releases/neon/201705151400/plugins/ (78.08kB)
[INFO] Fetching org.eclipse.equinox.executable_root.gtk.linux.x86_3.6.300.v20161122-1740 from http://mirror.onet.pl/pub/mirrors/eclipse//releases/neon/201705151400/binary/ (30.16kB)
[INFO] Fetching org.eclipse.equinox.executable_root.gtk.linux.x86_3.6.300.v20161122-1740 from http://mirror.onet.pl/pub/mirrors/eclipse//releases/neon/201705151400/binary/ (30.16kB)
[INFO] Fetching org.eclipse.core.filesystem.linux.x86_64_1.2.200.v20140124-1940.jar.pack.gz from http://mirror.onet.pl/pub/mirrors/eclipse//releases/neon/201705151400/plugins/ (9.15kB)
[INFO] Fetching org.eclipse.core.filesystem.linux.x86_64_1.2.200.v20140124-1940.jar.pack.gz from http://mirror.onet.pl/pub/mirrors/eclipse//releases/neon/201705151400/plugins/ (9.15kB)
[INFO] Fetching org.eclipse.core.net.linux.x86_64_1.2.0.v20160323-1650.jar.pack.gz from http://ftp.fau.de/eclipse/releases/neon/201705151400/plugins/ (36.9kB)
[INFO] Fetching org.eclipse.core.net.linux.x86_64_1.2.0.v20160323-1650.jar.pack.gz from http://ftp.fau.de/eclipse/releases/neon/201705151400/plugins/ (36.9kB)
[INFO] Fetching org.eclipse.equinox.launcher.gtk.linux.x86_64_1.1.401.v20161122-1740.jar.pack.gz from http://ftp.fau.de/eclipse/releases/neon/201705151400/plugins/ (82.37kB)
[INFO] Fetching org.eclipse.equinox.launcher.gtk.linux.x86_64_1.1.401.v20161122-1740.jar.pack.gz from http://ftp.fau.de/eclipse/releases/neon/201705151400/plugins/ (82.37kB)
[INFO] Fetching org.eclipse.equinox.executable_root.gtk.linux.x86_64_3.6.300.v20161122-1740 from http://ftp.fau.de/eclipse/releases/neon/201705151400/binary/ (31.17kB)
[INFO] Fetching org.eclipse.equinox.executable_root.gtk.linux.x86_64_3.6.300.v20161122-1740 from http://ftp.fau.de/eclipse/releases/neon/201705151400/binary/ (31.17kB)
[INFO] Fetching org.eclipse.core.filesystem.macosx_1.3.0.v20140124-1940.jar.pack.gz from http://ftp.fau.de/eclipse/releases/neon/201705151400/plugins/ (12.4kB)
[INFO] Fetching org.eclipse.core.filesystem.macosx_1.3.0.v20140124-1940.jar.pack.gz from http://ftp.fau.de/eclipse/releases/neon/201705151400/plugins/ (12.4kB)
[INFO] Fetching org.eclipse.e4.ui.workbench.renderers.swt.cocoa_0.11.300.v20160330-1418.jar.pack.gz from http://ftp.fau.de/eclipse/releases/neon/201705151400/plugins/ (18.69kB)
[INFO] Fetching org.eclipse.equinox.launcher.cocoa.macosx.x86_64_1.1.401.v20161122-1740.jar.pack.gz from http://mirror.switch.ch/eclipse/releases/neon/201705151400/plugins/ (32.14kB)
[INFO] Fetching org.eclipse.equinox.launcher.cocoa.macosx.x86_64_1.1.401.v20161122-1740.jar.pack.gz from http://mirror.switch.ch/eclipse/releases/neon/201705151400/plugins/ (32.14kB)
[INFO] Fetching org.eclipse.equinox.executable_root.cocoa.macosx.x86_64_3.6.300.v20161122-1740 from http://ftp.fau.de/eclipse/releases/neon/201705151400/binary/ (10.72kB)
[INFO] Fetching org.eclipse.equinox.security.macosx_1.100.200.v20130327-1442.jar.pack.gz from http://ftp.fau.de/eclipse/releases/neon/201705151400/plugins/ (12.77kB)
[INFO] Fetching org.eclipse.ui.cocoa_1.1.100.v20151202-1450.jar.pack.gz from http://ftp.fau.de/eclipse/releases/neon/201705151400/plugins/ (7.62kB)
[INFO] Fetching org.eclipse.ui.cocoa_1.1.100.v20151202-1450.jar.pack.gz from http://ftp.fau.de/eclipse/releases/neon/201705151400/plugins/ (7.62kB)
[INFO] Resolving class path of MavenProject: be.uantwerpen.ansymo.semanticadaptation.ide:be.uantwerpen.ansymo.semanticadaptation.product:1.0.0-SNAPSHOT @ /var/lib/jenkins/workspace/HybridCosimulation_master-LDEVB56LP46DTRNYHQSCKMS3FR4JD6RBBK6S2LPONMGDZRBJQH3A@2/DSL_SemanticAdaptation/product/pom.xml
[INFO] ------------------------------------------------------------------------
[INFO] Reactor Build Order:
[INFO] 
[INFO] Semantics Adaptation Root
[INFO] be.uantwerpen.ansymo.semanticadaptation Testframework
[INFO] be.uantwerpen.ansymo.semanticadaptation Logger
[INFO] be.uantwerpen.ansymo.semanticadaptation Language Core
[INFO] be.uantwerpen.ansymo.semanticadaptation Canonical Generator
[INFO] be.uantwerpen.ansymo.semanticadaptation Code Generation to C++
[INFO] be.uantwerpen.ansymo.semanticadaptation Code Generator
[INFO] be.uantwerpen.ansymo.semanticadaptation Language Tests
[INFO] be.uantwerpen.ansymo.semanticadaptation.ide
[INFO] be.uantwerpen.ansymo.semanticadaptation.ui Language UI
[INFO] be.uantwerpen.ansymo.semanticadaptation Code Generation to C++ Tests
[INFO] be.uantwerpen.ansymo.semanticadaptation Code Generation to C++ Tests
[INFO] Feature
[INFO] be.uantwerpen.ansymo.semanticadaptation.ide.platform
[INFO] Core
[INFO] Semantics Adaptation IDE Eclipse repository
[INFO] SA IDE Standalone Product
[INFO]                                                                         
[INFO] ------------------------------------------------------------------------
[INFO] Building Semantics Adaptation Root 1.0.0-SNAPSHOT
[INFO] ------------------------------------------------------------------------
[INFO] 
[INFO] --- maven-javadoc-plugin:2.9:jar (attach-javadocs) @ parent ---
[INFO] Downloading: http://overture.au.dk/artifactory/remote-repos/org/apache/maven/shared/maven-invoker/2.0.9/maven-invoker-2.0.9.pom
[INFO] Downloaded: http://overture.au.dk/artifactory/remote-repos/org/apache/maven/shared/maven-invoker/2.0.9/maven-invoker-2.0.9.pom (6 KB at 122.6 KB/sec)
[INFO] Downloading: http://overture.au.dk/artifactory/remote-repos/org/apache/maven/shared/maven-shared-components/9/maven-shared-components-9.pom
[INFO] Downloaded: http://overture.au.dk/artifactory/remote-repos/org/apache/maven/shared/maven-shared-components/9/maven-shared-components-9.pom (4 KB at 79.5 KB/sec)
[INFO] Downloading: http://overture.au.dk/artifactory/remote-repos/org/apache/maven/shared/maven-common-artifact-filters/1.3/maven-common-artifact-filters-1.3.pom
[INFO] Downloaded: http://overture.au.dk/artifactory/remote-repos/org/apache/maven/shared/maven-common-artifact-filters/1.3/maven-common-artifact-filters-1.3.pom (4 KB at 90.4 KB/sec)
[INFO] Downloading: http://overture.au.dk/artifactory/remote-repos/org/codehaus/plexus/plexus-utils/1.4.9/plexus-utils-1.4.9.pom
[INFO] Downloaded: http://overture.au.dk/artifactory/remote-repos/org/codehaus/plexus/plexus-utils/1.4.9/plexus-utils-1.4.9.pom (3 KB at 48.7 KB/sec)
[INFO] Downloading: http://overture.au.dk/artifactory/remote-repos/org/codehaus/plexus/plexus-utils/1.4.2/plexus-utils-1.4.2.pom
[INFO] Downloaded: http://overture.au.dk/artifactory/remote-repos/org/codehaus/plexus/plexus-utils/1.4.2/plexus-utils-1.4.2.pom (2 KB at 45.5 KB/sec)
[INFO] Downloading: http://overture.au.dk/artifactory/remote-repos/commons-lang/commons-lang/2.4/commons-lang-2.4.pom
[INFO] Downloaded: http://overture.au.dk/artifactory/remote-repos/commons-lang/commons-lang/2.4/commons-lang-2.4.pom (14 KB at 223.7 KB/sec)
[INFO] Downloading: http://overture.au.dk/artifactory/remote-repos/commons-httpclient/commons-httpclient/3.1/commons-httpclient-3.1.pom
[INFO] Downloaded: http://overture.au.dk/artifactory/remote-repos/commons-httpclient/commons-httpclient/3.1/commons-httpclient-3.1.pom (8 KB at 315.9 KB/sec)
[INFO] Downloading: http://overture.au.dk/artifactory/remote-repos/commons-codec/commons-codec/1.2/commons-codec-1.2.pom
[INFO] Downloaded: http://overture.au.dk/artifactory/remote-repos/commons-codec/commons-codec/1.2/commons-codec-1.2.pom (4 KB at 186.8 KB/sec)
[INFO] Downloading: http://overture.au.dk/artifactory/remote-repos/commons-logging/commons-logging/1.1.1/commons-logging-1.1.1.pom
[INFO] Downloaded: http://overture.au.dk/artifactory/remote-repos/commons-logging/commons-logging/1.1.1/commons-logging-1.1.1.pom (18 KB at 427.0 KB/sec)
[INFO] Downloading: http://overture.au.dk/artifactory/remote-repos/org/apache/commons/commons-parent/5/commons-parent-5.pom
[INFO] Downloaded: http://overture.au.dk/artifactory/remote-repos/org/apache/commons/commons-parent/5/commons-parent-5.pom (16 KB at 447.6 KB/sec)
[INFO] Downloading: http://overture.au.dk/artifactory/remote-repos/log4j/log4j/1.2.14/log4j-1.2.14.pom
[INFO] Downloaded: http://overture.au.dk/artifactory/remote-repos/log4j/log4j/1.2.14/log4j-1.2.14.pom (3 KB at 61.0 KB/sec)
[INFO] Downloading: http://overture.au.dk/artifactory/remote-repos/com/thoughtworks/qdox/qdox/1.12/qdox-1.12.pom
[INFO] Downloaded: http://overture.au.dk/artifactory/remote-repos/com/thoughtworks/qdox/qdox/1.12/qdox-1.12.pom (19 KB at 341.9 KB/sec)
[INFO] Downloading: http://overture.au.dk/artifactory/remote-repos/org/codehaus/plexus/plexus-archiver/2.1.2/plexus-archiver-2.1.2.pom
[INFO] Downloaded: http://overture.au.dk/artifactory/remote-repos/org/codehaus/plexus/plexus-archiver/2.1.2/plexus-archiver-2.1.2.pom (4 KB at 131.7 KB/sec)
[INFO] Downloading: http://overture.au.dk/artifactory/remote-repos/org/codehaus/plexus/plexus-utils/3.0.2/plexus-utils-3.0.2.pom
[INFO] Downloaded: http://overture.au.dk/artifactory/remote-repos/org/codehaus/plexus/plexus-utils/3.0.2/plexus-utils-3.0.2.pom (3 KB at 70.1 KB/sec)
[INFO] Downloading: http://overture.au.dk/artifactory/remote-repos/org/codehaus/plexus/plexus-io/2.0.4/plexus-io-2.0.4.pom
[INFO] Downloaded: http://overture.au.dk/artifactory/remote-repos/org/codehaus/plexus/plexus-io/2.0.4/plexus-io-2.0.4.pom (2 KB at 36.8 KB/sec)
[INFO] Downloading: http://overture.au.dk/artifactory/remote-repos/org/codehaus/plexus/plexus-utils/3.0.5/plexus-utils-3.0.5.pom
[INFO] Downloaded: http://overture.au.dk/artifactory/remote-repos/org/codehaus/plexus/plexus-utils/3.0.5/plexus-utils-3.0.5.pom (3 KB at 102.2 KB/sec)
[INFO] Downloading: http://overture.au.dk/artifactory/remote-repos/org/apache/maven/maven-core/2.2.1/maven-core-2.2.1.jar
[INFO] Downloading: http://overture.au.dk/artifactory/remote-repos/org/apache/maven/maven-plugin-parameter-documenter/2.2.1/maven-plugin-parameter-documenter-2.2.1.jar
[INFO] Downloading: http://overture.au.dk/artifactory/remote-repos/org/slf4j/slf4j-jdk14/1.5.6/slf4j-jdk14-1.5.6.jar
[INFO] Downloading: http://overture.au.dk/artifactory/remote-repos/org/slf4j/slf4j-api/1.5.6/slf4j-api-1.5.6.jar
[INFO] Downloading: http://overture.au.dk/artifactory/remote-repos/org/slf4j/jcl-over-slf4j/1.5.6/jcl-over-slf4j-1.5.6.jar
[INFO] Downloaded: http://overture.au.dk/artifactory/remote-repos/org/slf4j/slf4j-jdk14/1.5.6/slf4j-jdk14-1.5.6.jar (9 KB at 260.9 KB/sec)
[INFO] Downloading: http://overture.au.dk/artifactory/remote-repos/org/apache/maven/maven-error-diagnostics/2.2.1/maven-error-diagnostics-2.2.1.jar
[INFO] Downloaded: http://overture.au.dk/artifactory/remote-repos/org/apache/maven/maven-plugin-parameter-documenter/2.2.1/maven-plugin-parameter-documenter-2.2.1.jar (22 KB at 318.7 KB/sec)
[INFO] Downloading: http://overture.au.dk/artifactory/remote-repos/org/apache/maven/maven-plugin-descriptor/2.2.1/maven-plugin-descriptor-2.2.1.jar
[INFO] Downloaded: http://overture.au.dk/artifactory/remote-repos/org/slf4j/slf4j-api/1.5.6/slf4j-api-1.5.6.jar (22 KB at 340.9 KB/sec)
[INFO] Downloading: http://overture.au.dk/artifactory/remote-repos/org/apache/maven/maven-monitor/2.2.1/maven-monitor-2.2.1.jar
[INFO] Downloaded: http://overture.au.dk/artifactory/remote-repos/org/apache/maven/maven-error-diagnostics/2.2.1/maven-error-diagnostics-2.2.1.jar (13 KB at 171.8 KB/sec)
[INFO] Downloading: http://overture.au.dk/artifactory/remote-repos/org/apache/maven/shared/maven-invoker/2.0.9/maven-invoker-2.0.9.jar
[INFO] Downloaded: http://overture.au.dk/artifactory/remote-repos/org/slf4j/jcl-over-slf4j/1.5.6/jcl-over-slf4j-1.5.6.jar (17 KB at 212.1 KB/sec)
[INFO] Downloading: http://overture.au.dk/artifactory/remote-repos/org/apache/maven/shared/maven-common-artifact-filters/1.3/maven-common-artifact-filters-1.3.jar
[INFO] Downloaded: http://overture.au.dk/artifactory/remote-repos/org/apache/maven/maven-core/2.2.1/maven-core-2.2.1.jar (174 KB at 2043.7 KB/sec)
[INFO] Downloading: http://overture.au.dk/artifactory/remote-repos/commons-collections/commons-collections/3.2/commons-collections-3.2.jar
[INFO] Downloaded: http://overture.au.dk/artifactory/remote-repos/org/apache/maven/maven-plugin-descriptor/2.2.1/maven-plugin-descriptor-2.2.1.jar (39 KB at 403.8 KB/sec)
[INFO] Downloading: http://overture.au.dk/artifactory/remote-repos/commons-lang/commons-lang/2.4/commons-lang-2.4.jar
[INFO] Downloaded: http://overture.au.dk/artifactory/remote-repos/org/apache/maven/shared/maven-common-artifact-filters/1.3/maven-common-artifact-filters-1.3.jar (31 KB at 297.4 KB/sec)
[INFO] Downloading: http://overture.au.dk/artifactory/remote-repos/commons-httpclient/commons-httpclient/3.1/commons-httpclient-3.1.jar
[INFO] Downloaded: http://overture.au.dk/artifactory/remote-repos/org/apache/maven/shared/maven-invoker/2.0.9/maven-invoker-2.0.9.jar (28 KB at 270.8 KB/sec)
[INFO] Downloading: http://overture.au.dk/artifactory/remote-repos/commons-codec/commons-codec/1.2/commons-codec-1.2.jar
[INFO] Downloaded: http://overture.au.dk/artifactory/remote-repos/org/apache/maven/maven-monitor/2.2.1/maven-monitor-2.2.1.jar (11 KB at 96.3 KB/sec)
[INFO] Downloading: http://overture.au.dk/artifactory/remote-repos/commons-logging/commons-logging/1.1.1/commons-logging-1.1.1.jar
[INFO] Downloaded: http://overture.au.dk/artifactory/remote-repos/commons-logging/commons-logging/1.1.1/commons-logging-1.1.1.jar (60 KB at 417.3 KB/sec)
[INFO] Downloading: http://overture.au.dk/artifactory/remote-repos/log4j/log4j/1.2.14/log4j-1.2.14.jar
[INFO] Downloaded: http://overture.au.dk/artifactory/remote-repos/commons-codec/commons-codec/1.2/commons-codec-1.2.jar (30 KB at 187.1 KB/sec)
[INFO] Downloading: http://overture.au.dk/artifactory/remote-repos/com/thoughtworks/qdox/qdox/1.12/qdox-1.12.jar
[INFO] Downloaded: http://overture.au.dk/artifactory/remote-repos/commons-httpclient/commons-httpclient/3.1/commons-httpclient-3.1.jar (298 KB at 1673.3 KB/sec)
[INFO] Downloading: http://overture.au.dk/artifactory/remote-repos/org/codehaus/plexus/plexus-archiver/2.1.2/plexus-archiver-2.1.2.jar
[INFO] Downloaded: http://overture.au.dk/artifactory/remote-repos/com/thoughtworks/qdox/qdox/1.12/qdox-1.12.jar (176 KB at 975.0 KB/sec)
[INFO] Downloading: http://overture.au.dk/artifactory/remote-repos/org/codehaus/plexus/plexus-io/2.0.4/plexus-io-2.0.4.jar
[INFO] Downloaded: http://overture.au.dk/artifactory/remote-repos/org/codehaus/plexus/plexus-io/2.0.4/plexus-io-2.0.4.jar (57 KB at 268.5 KB/sec)
[INFO] Downloading: http://overture.au.dk/artifactory/remote-repos/org/codehaus/plexus/plexus-utils/3.0.5/plexus-utils-3.0.5.jar
[INFO] Downloaded: http://overture.au.dk/artifactory/remote-repos/commons-lang/commons-lang/2.4/commons-lang-2.4.jar (256 KB at 1183.7 KB/sec)
[INFO] Downloaded: http://overture.au.dk/artifactory/remote-repos/log4j/log4j/1.2.14/log4j-1.2.14.jar (359 KB at 1594.8 KB/sec)
[INFO] Downloaded: http://overture.au.dk/artifactory/remote-repos/commons-collections/commons-collections/3.2/commons-collections-3.2.jar (558 KB at 2394.3 KB/sec)
[INFO] Downloaded: http://overture.au.dk/artifactory/remote-repos/org/codehaus/plexus/plexus-archiver/2.1.2/plexus-archiver-2.1.2.jar (181 KB at 764.9 KB/sec)
[INFO] Downloaded: http://overture.au.dk/artifactory/remote-repos/org/codehaus/plexus/plexus-utils/3.0.5/plexus-utils-3.0.5.jar (226 KB at 868.9 KB/sec)
[INFO] Skipping javadoc generation
[INFO] 
[INFO] --- maven-jarsigner-plugin:1.4:sign (sign) @ parent ---
[INFO] Downloading: http://overture.au.dk/artifactory/remote-repos/org/apache/maven/shared/maven-shared-utils/0.7/maven-shared-utils-0.7.pom
[INFO] Downloaded: http://overture.au.dk/artifactory/remote-repos/org/apache/maven/shared/maven-shared-utils/0.7/maven-shared-utils-0.7.pom (5 KB at 204.0 KB/sec)
[INFO] Downloading: http://overture.au.dk/artifactory/remote-repos/org/apache/maven/shared/maven-shared-components/20/maven-shared-components-20.pom
[INFO] Downloaded: http://overture.au.dk/artifactory/remote-repos/org/apache/maven/shared/maven-shared-components/20/maven-shared-components-20.pom (5 KB at 133.9 KB/sec)
[INFO] Downloading: http://overture.au.dk/artifactory/remote-repos/org/sonatype/plexus/plexus-sec-dispatcher/1.4/plexus-sec-dispatcher-1.4.pom
[INFO] Downloaded: http://overture.au.dk/artifactory/remote-repos/org/sonatype/plexus/plexus-sec-dispatcher/1.4/plexus-sec-dispatcher-1.4.pom (3 KB at 107.1 KB/sec)
[INFO] Downloading: http://overture.au.dk/artifactory/remote-repos/org/apache/maven/shared/maven-jarsigner/1.4/maven-jarsigner-1.4.pom
[INFO] Downloaded: http://overture.au.dk/artifactory/remote-repos/org/apache/maven/shared/maven-jarsigner/1.4/maven-jarsigner-1.4.pom (4 KB at 109.7 KB/sec)
[INFO] Downloading: http://overture.au.dk/artifactory/remote-repos/org/codehaus/plexus/plexus-utils/1.5.15/plexus-utils-1.5.15.jar
[INFO] Downloading: http://overture.au.dk/artifactory/remote-repos/org/sonatype/plexus/plexus-sec-dispatcher/1.4/plexus-sec-dispatcher-1.4.jar
[INFO] Downloading: http://overture.au.dk/artifactory/remote-repos/org/apache/maven/shared/maven-shared-utils/0.7/maven-shared-utils-0.7.jar
[INFO] Downloading: http://overture.au.dk/artifactory/remote-repos/org/apache/maven/shared/maven-jarsigner/1.4/maven-jarsigner-1.4.jar
[INFO] Downloading: http://overture.au.dk/artifactory/remote-repos/org/apache/maven/reporting/maven-reporting-api/2.2.1/maven-reporting-api-2.2.1.jar
[INFO] Downloaded: http://overture.au.dk/artifactory/remote-repos/org/apache/maven/shared/maven-jarsigner/1.4/maven-jarsigner-1.4.jar (22 KB at 602.7 KB/sec)
[INFO] Downloading: http://overture.au.dk/artifactory/remote-repos/org/apache/maven/doxia/doxia-sink-api/1.1/doxia-sink-api-1.1.jar
[INFO] Downloaded: http://overture.au.dk/artifactory/remote-repos/org/sonatype/plexus/plexus-sec-dispatcher/1.4/plexus-sec-dispatcher-1.4.jar (28 KB at 541.1 KB/sec)
[INFO] Downloading: http://overture.au.dk/artifactory/remote-repos/org/apache/maven/doxia/doxia-logging-api/1.1/doxia-logging-api-1.1.jar
[INFO] Downloaded: http://overture.au.dk/artifactory/remote-repos/org/codehaus/plexus/plexus-utils/1.5.15/plexus-utils-1.5.15.jar (223 KB at 3593.0 KB/sec)
[INFO] Downloaded: http://overture.au.dk/artifactory/remote-repos/org/apache/maven/reporting/maven-reporting-api/2.2.1/maven-reporting-api-2.2.1.jar (10 KB at 180.3 KB/sec)
[INFO] Downloaded: http://overture.au.dk/artifactory/remote-repos/org/apache/maven/shared/maven-shared-utils/0.7/maven-shared-utils-0.7.jar (167 KB at 2595.4 KB/sec)
[INFO] Downloaded: http://overture.au.dk/artifactory/remote-repos/org/apache/maven/doxia/doxia-sink-api/1.1/doxia-sink-api-1.1.jar (13 KB at 186.8 KB/sec)
[INFO] Downloaded: http://overture.au.dk/artifactory/remote-repos/org/apache/maven/doxia/doxia-logging-api/1.1/doxia-logging-api-1.1.jar (12 KB at 149.6 KB/sec)
[INFO] 0 archive(s) processed
[INFO] 
[INFO] --- maven-install-plugin:2.5.2:install (default-install) @ parent ---
[INFO] Installing /var/lib/jenkins/workspace/HybridCosimulation_master-LDEVB56LP46DTRNYHQSCKMS3FR4JD6RBBK6S2LPONMGDZRBJQH3A@2/DSL_SemanticAdaptation/pom.xml to /var/lib/jenkins/workspace/HybridCosimulation_master-LDEVB56LP46DTRNYHQSCKMS3FR4JD6RBBK6S2LPONMGDZRBJQH3A@2/.repository/be/uantwerpen/ansymo/semanticadaptation/parent/1.0.0-SNAPSHOT/parent-1.0.0-SNAPSHOT.pom
[INFO]                                                                         
[INFO] ------------------------------------------------------------------------
[INFO] Building be.uantwerpen.ansymo.semanticadaptation Testframework 1.0.0-SNAPSHOT
[INFO] ------------------------------------------------------------------------
[INFO] 
[INFO] --- tycho-packaging-plugin:1.0.0:build-qualifier (default-build-qualifier) @ be.uantwerpen.ansymo.semanticadaptation.testframework ---
[INFO] The project's OSGi version is 1.0.0.201711090956
[INFO] 
[INFO] --- tycho-packaging-plugin:1.0.0:validate-id (default-validate-id) @ be.uantwerpen.ansymo.semanticadaptation.testframework ---
[INFO] 
[INFO] --- tycho-packaging-plugin:1.0.0:validate-version (default-validate-version) @ be.uantwerpen.ansymo.semanticadaptation.testframework ---
[INFO] 
[INFO] --- xtend-maven-plugin:2.11.0:compile (default) @ be.uantwerpen.ansymo.semanticadaptation.testframework ---
[INFO] 
[INFO] --- maven-resources-plugin:2.7:resources (default-resources) @ be.uantwerpen.ansymo.semanticadaptation.testframework ---
[INFO] Downloading: http://overture.au.dk/artifactory/remote-repos/org/apache/maven/shared/maven-filtering/1.2/maven-filtering-1.2.pom
[INFO] Downloaded: http://overture.au.dk/artifactory/remote-repos/org/apache/maven/shared/maven-filtering/1.2/maven-filtering-1.2.pom (7 KB at 211.9 KB/sec)
[INFO] Downloading: http://overture.au.dk/artifactory/remote-repos/org/apache/maven/shared/maven-shared-utils/0.3/maven-shared-utils-0.3.pom
[INFO] Downloaded: http://overture.au.dk/artifactory/remote-repos/org/apache/maven/shared/maven-shared-utils/0.3/maven-shared-utils-0.3.pom (4 KB at 179.6 KB/sec)
[INFO] Downloading: http://overture.au.dk/artifactory/remote-repos/org/codehaus/plexus/plexus-interpolation/1.19/plexus-interpolation-1.19.pom
[INFO] Downloaded: http://overture.au.dk/artifactory/remote-repos/org/codehaus/plexus/plexus-interpolation/1.19/plexus-interpolation-1.19.pom (2 KB at 40.2 KB/sec)
[INFO] Downloading: http://overture.au.dk/artifactory/remote-repos/org/apache/maven/shared/maven-filtering/1.2/maven-filtering-1.2.jar
[INFO] Downloading: http://overture.au.dk/artifactory/remote-repos/org/codehaus/plexus/plexus-interpolation/1.19/plexus-interpolation-1.19.jar
[INFO] Downloading: http://overture.au.dk/artifactory/remote-repos/org/apache/maven/shared/maven-shared-utils/0.3/maven-shared-utils-0.3.jar
[INFO] Downloaded: http://overture.au.dk/artifactory/remote-repos/org/apache/maven/shared/maven-filtering/1.2/maven-filtering-1.2.jar (44 KB at 695.8 KB/sec)
[INFO] Downloaded: http://overture.au.dk/artifactory/remote-repos/org/codehaus/plexus/plexus-interpolation/1.19/plexus-interpolation-1.19.jar (61 KB at 1115.8 KB/sec)
[INFO] Downloaded: http://overture.au.dk/artifactory/remote-repos/org/apache/maven/shared/maven-shared-utils/0.3/maven-shared-utils-0.3.jar (152 KB at 2263.8 KB/sec)
[INFO] Using 'UTF-8' encoding to copy filtered resources.
[INFO] skip non existing resourceDirectory /var/lib/jenkins/workspace/HybridCosimulation_master-LDEVB56LP46DTRNYHQSCKMS3FR4JD6RBBK6S2LPONMGDZRBJQH3A@2/DSL_SemanticAdaptation/be.uantwerpen.ansymo.semanticadaptation.testframework/src/main/resources
[INFO] 
[INFO] --- tycho-compiler-plugin:1.0.0:compile (default-compile) @ be.uantwerpen.ansymo.semanticadaptation.testframework ---
[WARNING] Parameter 'useProjectSettings' is set to true, but preferences file '/var/lib/jenkins/workspace/HybridCosimulation_master-LDEVB56LP46DTRNYHQSCKMS3FR4JD6RBBK6S2LPONMGDZRBJQH3A@2/DSL_SemanticAdaptation/be.uantwerpen.ansymo.semanticadaptation.testframework/.settings/org.eclipse.jdt.core.prefs' could not be found!
[INFO] Compiling 5 source files to /var/lib/jenkins/workspace/HybridCosimulation_master-LDEVB56LP46DTRNYHQSCKMS3FR4JD6RBBK6S2LPONMGDZRBJQH3A@2/DSL_SemanticAdaptation/be.uantwerpen.ansymo.semanticadaptation.testframework/target/classes
[WARNING] Source directory /var/lib/jenkins/workspace/HybridCosimulation_master-LDEVB56LP46DTRNYHQSCKMS3FR4JD6RBBK6S2LPONMGDZRBJQH3A@2/DSL_SemanticAdaptation/be.uantwerpen.ansymo.semanticadaptation.testframework/src-gen does not exist
[INFO] 
[INFO] --- xtend-maven-plugin:2.11.0:xtend-install-debug-info (default) @ be.uantwerpen.ansymo.semanticadaptation.testframework ---
[WARNING] Directory /var/lib/jenkins/workspace/HybridCosimulation_master-LDEVB56LP46DTRNYHQSCKMS3FR4JD6RBBK6S2LPONMGDZRBJQH3A@2/DSL_SemanticAdaptation/be.uantwerpen.ansymo.semanticadaptation.testframework/src/main/java is empty. Can't process.
[WARNING] Directory /var/lib/jenkins/workspace/HybridCosimulation_master-LDEVB56LP46DTRNYHQSCKMS3FR4JD6RBBK6S2LPONMGDZRBJQH3A@2/DSL_SemanticAdaptation/be.uantwerpen.ansymo.semanticadaptation.testframework/src-gen is empty. Can't process.
[INFO] Installing Xtend files into 2 class files as primary debug sources in: /var/lib/jenkins/workspace/HybridCosimulation_master-LDEVB56LP46DTRNYHQSCKMS3FR4JD6RBBK6S2LPONMGDZRBJQH3A@2/DSL_SemanticAdaptation/be.uantwerpen.ansymo.semanticadaptation.testframework/target/classes
[INFO] 
[INFO] --- xtend-maven-plugin:2.11.0:testCompile (default) @ be.uantwerpen.ansymo.semanticadaptation.testframework ---
[INFO] skip compiling sources because the configured directory '[/var/lib/jenkins/workspace/HybridCosimulation_master-LDEVB56LP46DTRNYHQSCKMS3FR4JD6RBBK6S2LPONMGDZRBJQH3A@2/DSL_SemanticAdaptation/be.uantwerpen.ansymo.semanticadaptation.testframework/src/test/java]' does not exists.
[INFO] 
[INFO] --- maven-resources-plugin:2.7:testResources (default-testResources) @ be.uantwerpen.ansymo.semanticadaptation.testframework ---
[INFO] Using 'UTF-8' encoding to copy filtered resources.
[INFO] skip non existing resourceDirectory /var/lib/jenkins/workspace/HybridCosimulation_master-LDEVB56LP46DTRNYHQSCKMS3FR4JD6RBBK6S2LPONMGDZRBJQH3A@2/DSL_SemanticAdaptation/be.uantwerpen.ansymo.semanticadaptation.testframework/src/test/resources
[INFO] 
[INFO] --- xtend-maven-plugin:2.11.0:xtend-test-install-debug-info (default) @ be.uantwerpen.ansymo.semanticadaptation.testframework ---
[WARNING] Directory /var/lib/jenkins/workspace/HybridCosimulation_master-LDEVB56LP46DTRNYHQSCKMS3FR4JD6RBBK6S2LPONMGDZRBJQH3A@2/DSL_SemanticAdaptation/be.uantwerpen.ansymo.semanticadaptation.testframework/src/test/java is empty. Can't process.
[WARNING] Directory /var/lib/jenkins/workspace/HybridCosimulation_master-LDEVB56LP46DTRNYHQSCKMS3FR4JD6RBBK6S2LPONMGDZRBJQH3A@2/DSL_SemanticAdaptation/be.uantwerpen.ansymo.semanticadaptation.testframework/target/xtend-gen/test is empty. Can't process.
[INFO] Installing Xtend files into 0 class files as primary debug sources in: /var/lib/jenkins/workspace/HybridCosimulation_master-LDEVB56LP46DTRNYHQSCKMS3FR4JD6RBBK6S2LPONMGDZRBJQH3A@2/DSL_SemanticAdaptation/be.uantwerpen.ansymo.semanticadaptation.testframework/target/test-classes
[INFO] 
[INFO] --- target-platform-configuration:1.0.0:target-platform (default-target-platform) @ be.uantwerpen.ansymo.semanticadaptation.testframework ---
[INFO] 
[INFO] --- tycho-packaging-plugin:1.0.0:package-plugin (default-package-plugin) @ be.uantwerpen.ansymo.semanticadaptation.testframework ---
[INFO] Building jar: /var/lib/jenkins/workspace/HybridCosimulation_master-LDEVB56LP46DTRNYHQSCKMS3FR4JD6RBBK6S2LPONMGDZRBJQH3A@2/DSL_SemanticAdaptation/be.uantwerpen.ansymo.semanticadaptation.testframework/target/be.uantwerpen.ansymo.semanticadaptation.testframework-1.0.0-SNAPSHOT.jar
[INFO] 
[INFO] --- tycho-p2-plugin:1.0.0:p2-metadata-default (default-p2-metadata-default) @ be.uantwerpen.ansymo.semanticadaptation.testframework ---
[INFO] 
[INFO] --- maven-javadoc-plugin:2.9:jar (attach-javadocs) @ be.uantwerpen.ansymo.semanticadaptation.testframework ---
[INFO] Skipping javadoc generation
[INFO] 
[INFO] --- maven-jarsigner-plugin:1.4:sign (sign) @ be.uantwerpen.ansymo.semanticadaptation.testframework ---
[WARNING] Picked up JAVA_TOOL_OPTIONS: -Dmaven.ext.class.path="/var/lib/jenkins/workspace/HybridCosimulation_master-LDEVB56LP46DTRNYHQSCKMS3FR4JD6RBBK6S2LPONMGDZRBJQH3A@2@tmp/withMaven83433f04/pipeline-maven-spy.jar" -Dorg.jenkinsci.plugins.pipeline.maven.reportsFolder="/var/lib/jenkins/workspace/HybridCosimulation_master-LDEVB56LP46DTRNYHQSCKMS3FR4JD6RBBK6S2LPONMGDZRBJQH3A@2@tmp/withMaven83433f04" 
[INFO] 1 archive(s) processed
[INFO] 
[INFO] --- maven-install-plugin:2.3.1:install (default-install) @ be.uantwerpen.ansymo.semanticadaptation.testframework ---
[INFO] Installing /var/lib/jenkins/workspace/HybridCosimulation_master-LDEVB56LP46DTRNYHQSCKMS3FR4JD6RBBK6S2LPONMGDZRBJQH3A@2/DSL_SemanticAdaptation/be.uantwerpen.ansymo.semanticadaptation.testframework/target/be.uantwerpen.ansymo.semanticadaptation.testframework-1.0.0-SNAPSHOT.jar to /var/lib/jenkins/workspace/HybridCosimulation_master-LDEVB56LP46DTRNYHQSCKMS3FR4JD6RBBK6S2LPONMGDZRBJQH3A@2/.repository/be/uantwerpen/ansymo/semanticadaptation/be.uantwerpen.ansymo.semanticadaptation.testframework/1.0.0-SNAPSHOT/be.uantwerpen.ansymo.semanticadaptation.testframework-1.0.0-SNAPSHOT.jar
[INFO] Installing /var/lib/jenkins/workspace/HybridCosimulation_master-LDEVB56LP46DTRNYHQSCKMS3FR4JD6RBBK6S2LPONMGDZRBJQH3A@2/DSL_SemanticAdaptation/be.uantwerpen.ansymo.semanticadaptation.testframework/pom.xml to /var/lib/jenkins/workspace/HybridCosimulation_master-LDEVB56LP46DTRNYHQSCKMS3FR4JD6RBBK6S2LPONMGDZRBJQH3A@2/.repository/be/uantwerpen/ansymo/semanticadaptation/be.uantwerpen.ansymo.semanticadaptation.testframework/1.0.0-SNAPSHOT/be.uantwerpen.ansymo.semanticadaptation.testframework-1.0.0-SNAPSHOT.pom
[INFO] Installing /var/lib/jenkins/workspace/HybridCosimulation_master-LDEVB56LP46DTRNYHQSCKMS3FR4JD6RBBK6S2LPONMGDZRBJQH3A@2/DSL_SemanticAdaptation/be.uantwerpen.ansymo.semanticadaptation.testframework/target/p2content.xml to /var/lib/jenkins/workspace/HybridCosimulation_master-LDEVB56LP46DTRNYHQSCKMS3FR4JD6RBBK6S2LPONMGDZRBJQH3A@2/.repository/be/uantwerpen/ansymo/semanticadaptation/be.uantwerpen.ansymo.semanticadaptation.testframework/1.0.0-SNAPSHOT/be.uantwerpen.ansymo.semanticadaptation.testframework-1.0.0-SNAPSHOT-p2metadata.xml
[INFO] Installing /var/lib/jenkins/workspace/HybridCosimulation_master-LDEVB56LP46DTRNYHQSCKMS3FR4JD6RBBK6S2LPONMGDZRBJQH3A@2/DSL_SemanticAdaptation/be.uantwerpen.ansymo.semanticadaptation.testframework/target/p2artifacts.xml to /var/lib/jenkins/workspace/HybridCosimulation_master-LDEVB56LP46DTRNYHQSCKMS3FR4JD6RBBK6S2LPONMGDZRBJQH3A@2/.repository/be/uantwerpen/ansymo/semanticadaptation/be.uantwerpen.ansymo.semanticadaptation.testframework/1.0.0-SNAPSHOT/be.uantwerpen.ansymo.semanticadaptation.testframework-1.0.0-SNAPSHOT-p2artifacts.xml
[INFO] 
[INFO] --- tycho-p2-plugin:1.0.0:update-local-index (default-update-local-index) @ be.uantwerpen.ansymo.semanticadaptation.testframework ---
[INFO]                                                                         
[INFO] ------------------------------------------------------------------------
[INFO] Building be.uantwerpen.ansymo.semanticadaptation Logger 1.0.0-SNAPSHOT
[INFO] ------------------------------------------------------------------------
[INFO] 
[INFO] --- tycho-packaging-plugin:1.0.0:build-qualifier (default-build-qualifier) @ be.uantwerpen.ansymo.semanticadaptation.log ---
[INFO] The project's OSGi version is 1.0.0.201711090956
[INFO] 
[INFO] --- tycho-packaging-plugin:1.0.0:validate-id (default-validate-id) @ be.uantwerpen.ansymo.semanticadaptation.log ---
[INFO] 
[INFO] --- tycho-packaging-plugin:1.0.0:validate-version (default-validate-version) @ be.uantwerpen.ansymo.semanticadaptation.log ---
[INFO] 
[INFO] --- xtend-maven-plugin:2.11.0:compile (default) @ be.uantwerpen.ansymo.semanticadaptation.log ---
[INFO] 
[INFO] --- maven-resources-plugin:2.7:resources (default-resources) @ be.uantwerpen.ansymo.semanticadaptation.log ---
[INFO] Using 'UTF-8' encoding to copy filtered resources.
[INFO] skip non existing resourceDirectory /var/lib/jenkins/workspace/HybridCosimulation_master-LDEVB56LP46DTRNYHQSCKMS3FR4JD6RBBK6S2LPONMGDZRBJQH3A@2/DSL_SemanticAdaptation/be.uantwerpen.ansymo.semanticadaptation.log/src/main/resources
[INFO] 
[INFO] --- tycho-compiler-plugin:1.0.0:compile (default-compile) @ be.uantwerpen.ansymo.semanticadaptation.log ---
[WARNING] Parameter 'useProjectSettings' is set to true, but preferences file '/var/lib/jenkins/workspace/HybridCosimulation_master-LDEVB56LP46DTRNYHQSCKMS3FR4JD6RBBK6S2LPONMGDZRBJQH3A@2/DSL_SemanticAdaptation/be.uantwerpen.ansymo.semanticadaptation.log/.settings/org.eclipse.jdt.core.prefs' could not be found!
[INFO] Compiling 1 source file to /var/lib/jenkins/workspace/HybridCosimulation_master-LDEVB56LP46DTRNYHQSCKMS3FR4JD6RBBK6S2LPONMGDZRBJQH3A@2/DSL_SemanticAdaptation/be.uantwerpen.ansymo.semanticadaptation.log/target/classes
[WARNING] Source directory /var/lib/jenkins/workspace/HybridCosimulation_master-LDEVB56LP46DTRNYHQSCKMS3FR4JD6RBBK6S2LPONMGDZRBJQH3A@2/DSL_SemanticAdaptation/be.uantwerpen.ansymo.semanticadaptation.log/src-gen does not exist
[INFO] 
[INFO] --- xtend-maven-plugin:2.11.0:xtend-install-debug-info (default) @ be.uantwerpen.ansymo.semanticadaptation.log ---
[WARNING] Directory /var/lib/jenkins/workspace/HybridCosimulation_master-LDEVB56LP46DTRNYHQSCKMS3FR4JD6RBBK6S2LPONMGDZRBJQH3A@2/DSL_SemanticAdaptation/be.uantwerpen.ansymo.semanticadaptation.log/src/main/java is empty. Can't process.
[WARNING] Directory /var/lib/jenkins/workspace/HybridCosimulation_master-LDEVB56LP46DTRNYHQSCKMS3FR4JD6RBBK6S2LPONMGDZRBJQH3A@2/DSL_SemanticAdaptation/be.uantwerpen.ansymo.semanticadaptation.log/src-gen is empty. Can't process.
[INFO] Installing Xtend files into 1 class files as primary debug sources in: /var/lib/jenkins/workspace/HybridCosimulation_master-LDEVB56LP46DTRNYHQSCKMS3FR4JD6RBBK6S2LPONMGDZRBJQH3A@2/DSL_SemanticAdaptation/be.uantwerpen.ansymo.semanticadaptation.log/target/classes
[INFO] 
[INFO] --- xtend-maven-plugin:2.11.0:testCompile (default) @ be.uantwerpen.ansymo.semanticadaptation.log ---
[INFO] skip compiling sources because the configured directory '[/var/lib/jenkins/workspace/HybridCosimulation_master-LDEVB56LP46DTRNYHQSCKMS3FR4JD6RBBK6S2LPONMGDZRBJQH3A@2/DSL_SemanticAdaptation/be.uantwerpen.ansymo.semanticadaptation.log/src/test/java]' does not exists.
[INFO] 
[INFO] --- maven-resources-plugin:2.7:testResources (default-testResources) @ be.uantwerpen.ansymo.semanticadaptation.log ---
[INFO] Using 'UTF-8' encoding to copy filtered resources.
[INFO] skip non existing resourceDirectory /var/lib/jenkins/workspace/HybridCosimulation_master-LDEVB56LP46DTRNYHQSCKMS3FR4JD6RBBK6S2LPONMGDZRBJQH3A@2/DSL_SemanticAdaptation/be.uantwerpen.ansymo.semanticadaptation.log/src/test/resources
[INFO] 
[INFO] --- xtend-maven-plugin:2.11.0:xtend-test-install-debug-info (default) @ be.uantwerpen.ansymo.semanticadaptation.log ---
[WARNING] Directory /var/lib/jenkins/workspace/HybridCosimulation_master-LDEVB56LP46DTRNYHQSCKMS3FR4JD6RBBK6S2LPONMGDZRBJQH3A@2/DSL_SemanticAdaptation/be.uantwerpen.ansymo.semanticadaptation.log/src/test/java is empty. Can't process.
[WARNING] Directory /var/lib/jenkins/workspace/HybridCosimulation_master-LDEVB56LP46DTRNYHQSCKMS3FR4JD6RBBK6S2LPONMGDZRBJQH3A@2/DSL_SemanticAdaptation/be.uantwerpen.ansymo.semanticadaptation.log/target/xtend-gen/test is empty. Can't process.
[INFO] Installing Xtend files into 0 class files as primary debug sources in: /var/lib/jenkins/workspace/HybridCosimulation_master-LDEVB56LP46DTRNYHQSCKMS3FR4JD6RBBK6S2LPONMGDZRBJQH3A@2/DSL_SemanticAdaptation/be.uantwerpen.ansymo.semanticadaptation.log/target/test-classes
[INFO] 
[INFO] --- target-platform-configuration:1.0.0:target-platform (default-target-platform) @ be.uantwerpen.ansymo.semanticadaptation.log ---
[INFO] 
[INFO] --- tycho-packaging-plugin:1.0.0:package-plugin (default-package-plugin) @ be.uantwerpen.ansymo.semanticadaptation.log ---
[INFO] Building jar: /var/lib/jenkins/workspace/HybridCosimulation_master-LDEVB56LP46DTRNYHQSCKMS3FR4JD6RBBK6S2LPONMGDZRBJQH3A@2/DSL_SemanticAdaptation/be.uantwerpen.ansymo.semanticadaptation.log/target/be.uantwerpen.ansymo.semanticadaptation.log-1.0.0-SNAPSHOT.jar
[INFO] 
[INFO] --- tycho-p2-plugin:1.0.0:p2-metadata-default (default-p2-metadata-default) @ be.uantwerpen.ansymo.semanticadaptation.log ---
[INFO] 
[INFO] --- maven-javadoc-plugin:2.9:jar (attach-javadocs) @ be.uantwerpen.ansymo.semanticadaptation.log ---
[INFO] Skipping javadoc generation
[INFO] 
[INFO] --- maven-jarsigner-plugin:1.4:sign (sign) @ be.uantwerpen.ansymo.semanticadaptation.log ---
[WARNING] Picked up JAVA_TOOL_OPTIONS: -Dmaven.ext.class.path="/var/lib/jenkins/workspace/HybridCosimulation_master-LDEVB56LP46DTRNYHQSCKMS3FR4JD6RBBK6S2LPONMGDZRBJQH3A@2@tmp/withMaven83433f04/pipeline-maven-spy.jar" -Dorg.jenkinsci.plugins.pipeline.maven.reportsFolder="/var/lib/jenkins/workspace/HybridCosimulation_master-LDEVB56LP46DTRNYHQSCKMS3FR4JD6RBBK6S2LPONMGDZRBJQH3A@2@tmp/withMaven83433f04" 
[INFO] 1 archive(s) processed
[INFO] 
[INFO] --- maven-install-plugin:2.3.1:install (default-install) @ be.uantwerpen.ansymo.semanticadaptation.log ---
[INFO] Installing /var/lib/jenkins/workspace/HybridCosimulation_master-LDEVB56LP46DTRNYHQSCKMS3FR4JD6RBBK6S2LPONMGDZRBJQH3A@2/DSL_SemanticAdaptation/be.uantwerpen.ansymo.semanticadaptation.log/target/be.uantwerpen.ansymo.semanticadaptation.log-1.0.0-SNAPSHOT.jar to /var/lib/jenkins/workspace/HybridCosimulation_master-LDEVB56LP46DTRNYHQSCKMS3FR4JD6RBBK6S2LPONMGDZRBJQH3A@2/.repository/be/uantwerpen/ansymo/semanticadaptation/be.uantwerpen.ansymo.semanticadaptation.log/1.0.0-SNAPSHOT/be.uantwerpen.ansymo.semanticadaptation.log-1.0.0-SNAPSHOT.jar
[INFO] Installing /var/lib/jenkins/workspace/HybridCosimulation_master-LDEVB56LP46DTRNYHQSCKMS3FR4JD6RBBK6S2LPONMGDZRBJQH3A@2/DSL_SemanticAdaptation/be.uantwerpen.ansymo.semanticadaptation.log/pom.xml to /var/lib/jenkins/workspace/HybridCosimulation_master-LDEVB56LP46DTRNYHQSCKMS3FR4JD6RBBK6S2LPONMGDZRBJQH3A@2/.repository/be/uantwerpen/ansymo/semanticadaptation/be.uantwerpen.ansymo.semanticadaptation.log/1.0.0-SNAPSHOT/be.uantwerpen.ansymo.semanticadaptation.log-1.0.0-SNAPSHOT.pom
[INFO] Installing /var/lib/jenkins/workspace/HybridCosimulation_master-LDEVB56LP46DTRNYHQSCKMS3FR4JD6RBBK6S2LPONMGDZRBJQH3A@2/DSL_SemanticAdaptation/be.uantwerpen.ansymo.semanticadaptation.log/target/p2content.xml to /var/lib/jenkins/workspace/HybridCosimulation_master-LDEVB56LP46DTRNYHQSCKMS3FR4JD6RBBK6S2LPONMGDZRBJQH3A@2/.repository/be/uantwerpen/ansymo/semanticadaptation/be.uantwerpen.ansymo.semanticadaptation.log/1.0.0-SNAPSHOT/be.uantwerpen.ansymo.semanticadaptation.log-1.0.0-SNAPSHOT-p2metadata.xml
[INFO] Installing /var/lib/jenkins/workspace/HybridCosimulation_master-LDEVB56LP46DTRNYHQSCKMS3FR4JD6RBBK6S2LPONMGDZRBJQH3A@2/DSL_SemanticAdaptation/be.uantwerpen.ansymo.semanticadaptation.log/target/p2artifacts.xml to /var/lib/jenkins/workspace/HybridCosimulation_master-LDEVB56LP46DTRNYHQSCKMS3FR4JD6RBBK6S2LPONMGDZRBJQH3A@2/.repository/be/uantwerpen/ansymo/semanticadaptation/be.uantwerpen.ansymo.semanticadaptation.log/1.0.0-SNAPSHOT/be.uantwerpen.ansymo.semanticadaptation.log-1.0.0-SNAPSHOT-p2artifacts.xml
[INFO] 
[INFO] --- tycho-p2-plugin:1.0.0:update-local-index (default-update-local-index) @ be.uantwerpen.ansymo.semanticadaptation.log ---
[INFO]                                                                         
[INFO] ------------------------------------------------------------------------
[INFO] Building be.uantwerpen.ansymo.semanticadaptation Language Core 1.0.0-SNAPSHOT
[INFO] ------------------------------------------------------------------------
[INFO] 
[INFO] --- tycho-packaging-plugin:1.0.0:build-qualifier (default-build-qualifier) @ be.uantwerpen.ansymo.semanticadaptation ---
[INFO] The project's OSGi version is 1.0.0.201711090956
[INFO] 
[INFO] --- tycho-packaging-plugin:1.0.0:validate-id (default-validate-id) @ be.uantwerpen.ansymo.semanticadaptation ---
[INFO] 
[INFO] --- tycho-packaging-plugin:1.0.0:validate-version (default-validate-version) @ be.uantwerpen.ansymo.semanticadaptation ---
[INFO] 
[INFO] >>> exec-maven-plugin:1.2.1:java (default) > validate @ be.uantwerpen.ansymo.semanticadaptation >>>
[INFO] 
[INFO] --- tycho-packaging-plugin:1.0.0:build-qualifier (default-build-qualifier) @ be.uantwerpen.ansymo.semanticadaptation ---
[INFO] The project's OSGi version is 1.0.0.201711090956
[INFO] 
[INFO] --- tycho-packaging-plugin:1.0.0:validate-id (default-validate-id) @ be.uantwerpen.ansymo.semanticadaptation ---
[INFO] 
[INFO] --- tycho-packaging-plugin:1.0.0:validate-version (default-validate-version) @ be.uantwerpen.ansymo.semanticadaptation ---
[INFO] 
[INFO] <<< exec-maven-plugin:1.2.1:java (default) < validate @ be.uantwerpen.ansymo.semanticadaptation <<<
[INFO] 
[INFO] --- exec-maven-plugin:1.2.1:java (default) @ be.uantwerpen.ansymo.semanticadaptation ---
0    INFO  XtextGenerator     - Initializing Xtext generator
7    INFO  StandaloneSetup    - Adding generated EPackage 'org.eclipse.xtext.common.types.TypesPackage'
53   WARN  StandaloneSetup    - Skipping conflicting project plexus at 'archive:file:/usr/share/java/plexus-classworlds2-2.5.2.jar!/' and using 'archive:file:/var/lib/jenkins/workspace/HybridCosimulation_master-LDEVB56LP46DTRNYHQSCKMS3FR4JD6RBBK6S2LPONMGDZRBJQH3A@2/.repository/org/codehaus/plexus/plexus-utils/2.0.5/plexus-utils-2.0.5.jar!/' instead.
55   WARN  StandaloneSetup    - Skipping conflicting project maven at 'archive:file:/var/lib/jenkins/workspace/HybridCosimulation_master-LDEVB56LP46DTRNYHQSCKMS3FR4JD6RBBK6S2LPONMGDZRBJQH3A@2/.repository/org/apache/maven/maven-settings/2.0.6/maven-settings-2.0.6.jar!/' and using 'archive:file:/var/lib/jenkins/workspace/HybridCosimulation_master-LDEVB56LP46DTRNYHQSCKMS3FR4JD6RBBK6S2LPONMGDZRBJQH3A@2/.repository/org/apache/maven/maven-monitor/2.0.6/maven-monitor-2.0.6.jar!/' instead.
60   WARN  StandaloneSetup    - Skipping conflicting project maven at 'archive:file:/var/lib/jenkins/workspace/HybridCosimulation_master-LDEVB56LP46DTRNYHQSCKMS3FR4JD6RBBK6S2LPONMGDZRBJQH3A@2/.repository/org/apache/maven/maven-monitor/2.0.6/maven-monitor-2.0.6.jar!/' and using 'archive:file:/var/lib/jenkins/workspace/HybridCosimulation_master-LDEVB56LP46DTRNYHQSCKMS3FR4JD6RBBK6S2LPONMGDZRBJQH3A@2/.repository/org/apache/maven/maven-plugin-registry/2.0.6/maven-plugin-registry-2.0.6.jar!/' instead.
60   WARN  StandaloneSetup    - Skipping conflicting project maven at 'archive:file:/var/lib/jenkins/workspace/HybridCosimulation_master-LDEVB56LP46DTRNYHQSCKMS3FR4JD6RBBK6S2LPONMGDZRBJQH3A@2/.repository/org/apache/maven/maven-plugin-registry/2.0.6/maven-plugin-registry-2.0.6.jar!/' and using 'archive:file:/var/lib/jenkins/workspace/HybridCosimulation_master-LDEVB56LP46DTRNYHQSCKMS3FR4JD6RBBK6S2LPONMGDZRBJQH3A@2/.repository/org/apache/maven/maven-toolchain/1.0/maven-toolchain-1.0.jar!/' instead.
61   WARN  StandaloneSetup    - Skipping conflicting project maven at 'archive:file:/var/lib/jenkins/workspace/HybridCosimulation_master-LDEVB56LP46DTRNYHQSCKMS3FR4JD6RBBK6S2LPONMGDZRBJQH3A@2/.repository/org/apache/maven/maven-toolchain/1.0/maven-toolchain-1.0.jar!/' and using 'archive:file:/var/lib/jenkins/workspace/HybridCosimulation_master-LDEVB56LP46DTRNYHQSCKMS3FR4JD6RBBK6S2LPONMGDZRBJQH3A@2/.repository/org/apache/maven/maven-error-diagnostics/2.0.6/maven-error-diagnostics-2.0.6.jar!/' instead.
61   WARN  StandaloneSetup    - Skipping conflicting project maven at 'archive:file:/var/lib/jenkins/workspace/HybridCosimulation_master-LDEVB56LP46DTRNYHQSCKMS3FR4JD6RBBK6S2LPONMGDZRBJQH3A@2/.repository/org/apache/maven/maven-error-diagnostics/2.0.6/maven-error-diagnostics-2.0.6.jar!/' and using 'archive:file:/var/lib/jenkins/workspace/HybridCosimulation_master-LDEVB56LP46DTRNYHQSCKMS3FR4JD6RBBK6S2LPONMGDZRBJQH3A@2/.repository/org/apache/maven/maven-plugin-api/2.0.6/maven-plugin-api-2.0.6.jar!/' instead.
62   WARN  StandaloneSetup    - Skipping conflicting project plexus at 'archive:file:/var/lib/jenkins/workspace/HybridCosimulation_master-LDEVB56LP46DTRNYHQSCKMS3FR4JD6RBBK6S2LPONMGDZRBJQH3A@2/.repository/org/codehaus/plexus/plexus-utils/2.0.5/plexus-utils-2.0.5.jar!/' and using 'archive:file:/var/lib/jenkins/workspace/HybridCosimulation_master-LDEVB56LP46DTRNYHQSCKMS3FR4JD6RBBK6S2LPONMGDZRBJQH3A@2/.repository/org/codehaus/plexus/plexus-container-default/1.0-alpha-9/plexus-container-default-1.0-alpha-9.jar!/' instead.
67   WARN  StandaloneSetup    - Skipping conflicting project maven at 'archive:file:/var/lib/jenkins/workspace/HybridCosimulation_master-LDEVB56LP46DTRNYHQSCKMS3FR4JD6RBBK6S2LPONMGDZRBJQH3A@2/.repository/org/apache/maven/maven-plugin-api/2.0.6/maven-plugin-api-2.0.6.jar!/' and using 'archive:file:/var/lib/jenkins/workspace/HybridCosimulation_master-LDEVB56LP46DTRNYHQSCKMS3FR4JD6RBBK6S2LPONMGDZRBJQH3A@2/.repository/org/apache/maven/maven-repository-metadata/2.0.6/maven-repository-metadata-2.0.6.jar!/' instead.
67   WARN  StandaloneSetup    - Skipping conflicting project org.eclipse.equinox.common at 'archive:file:/var/lib/jenkins/workspace/HybridCosimulation_master-LDEVB56LP46DTRNYHQSCKMS3FR4JD6RBBK6S2LPONMGDZRBJQH3A@2/.repository/org/eclipse/equinox/common/3.6.200-v20130402-1505/common-3.6.200-v20130402-1505.jar!/' and using 'archive:file:/var/lib/jenkins/workspace/HybridCosimulation_master-LDEVB56LP46DTRNYHQSCKMS3FR4JD6RBBK6S2LPONMGDZRBJQH3A@2/.repository/org/eclipse/platform/org.eclipse.equinox.common/3.8.0/org.eclipse.equinox.common-3.8.0.jar!/' instead.
68   WARN  StandaloneSetup    - Skipping conflicting project plexus at 'archive:file:/var/lib/jenkins/workspace/HybridCosimulation_master-LDEVB56LP46DTRNYHQSCKMS3FR4JD6RBBK6S2LPONMGDZRBJQH3A@2/.repository/org/codehaus/plexus/plexus-container-default/1.0-alpha-9/plexus-container-default-1.0-alpha-9.jar!/' and using 'archive:file:/var/lib/jenkins/workspace/HybridCosimulation_master-LDEVB56LP46DTRNYHQSCKMS3FR4JD6RBBK6S2LPONMGDZRBJQH3A@2/.repository/org/codehaus/plexus/plexus-interactivity-api/1.0-alpha-4/plexus-interactivity-api-1.0-alpha-4.jar!/' instead.
69   WARN  StandaloneSetup    - Skipping conflicting project maven at 'archive:file:/var/lib/jenkins/workspace/HybridCosimulation_master-LDEVB56LP46DTRNYHQSCKMS3FR4JD6RBBK6S2LPONMGDZRBJQH3A@2/.repository/org/apache/maven/maven-repository-metadata/2.0.6/maven-repository-metadata-2.0.6.jar!/' and using 'archive:file:/var/lib/jenkins/workspace/HybridCosimulation_master-LDEVB56LP46DTRNYHQSCKMS3FR4JD6RBBK6S2LPONMGDZRBJQH3A@2/.repository/org/apache/maven/maven-model/2.0.6/maven-model-2.0.6.jar!/' instead.
69   WARN  StandaloneSetup    - Skipping conflicting project maven at 'archive:file:/var/lib/jenkins/workspace/HybridCosimulation_master-LDEVB56LP46DTRNYHQSCKMS3FR4JD6RBBK6S2LPONMGDZRBJQH3A@2/.repository/org/apache/maven/maven-model/2.0.6/maven-model-2.0.6.jar!/' and using 'archive:file:/var/lib/jenkins/workspace/HybridCosimulation_master-LDEVB56LP46DTRNYHQSCKMS3FR4JD6RBBK6S2LPONMGDZRBJQH3A@2/.repository/org/apache/maven/maven-core/2.0.6/maven-core-2.0.6.jar!/' instead.
70   WARN  StandaloneSetup    - Skipping conflicting project maven at 'archive:file:/var/lib/jenkins/workspace/HybridCosimulation_master-LDEVB56LP46DTRNYHQSCKMS3FR4JD6RBBK6S2LPONMGDZRBJQH3A@2/.repository/org/apache/maven/maven-core/2.0.6/maven-core-2.0.6.jar!/' and using 'archive:file:/var/lib/jenkins/workspace/HybridCosimulation_master-LDEVB56LP46DTRNYHQSCKMS3FR4JD6RBBK6S2LPONMGDZRBJQH3A@2/.repository/org/apache/maven/maven-project/2.0.6/maven-project-2.0.6.jar!/' instead.
71   WARN  StandaloneSetup    - Skipping conflicting project maven at 'archive:file:/var/lib/jenkins/workspace/HybridCosimulation_master-LDEVB56LP46DTRNYHQSCKMS3FR4JD6RBBK6S2LPONMGDZRBJQH3A@2/.repository/org/apache/maven/maven-project/2.0.6/maven-project-2.0.6.jar!/' and using 'archive:file:/var/lib/jenkins/workspace/HybridCosimulation_master-LDEVB56LP46DTRNYHQSCKMS3FR4JD6RBBK6S2LPONMGDZRBJQH3A@2/.repository/org/apache/maven/maven-artifact/2.0.6/maven-artifact-2.0.6.jar!/' instead.
72   WARN  StandaloneSetup    - Skipping conflicting project maven at 'archive:file:/var/lib/jenkins/workspace/HybridCosimulation_master-LDEVB56LP46DTRNYHQSCKMS3FR4JD6RBBK6S2LPONMGDZRBJQH3A@2/.repository/org/apache/maven/maven-artifact/2.0.6/maven-artifact-2.0.6.jar!/' and using 'archive:file:/var/lib/jenkins/workspace/HybridCosimulation_master-LDEVB56LP46DTRNYHQSCKMS3FR4JD6RBBK6S2LPONMGDZRBJQH3A@2/.repository/org/apache/maven/maven-plugin-descriptor/2.0.6/maven-plugin-descriptor-2.0.6.jar!/' instead.
73   WARN  StandaloneSetup    - Skipping conflicting project maven at 'archive:file:/var/lib/jenkins/workspace/HybridCosimulation_master-LDEVB56LP46DTRNYHQSCKMS3FR4JD6RBBK6S2LPONMGDZRBJQH3A@2/.repository/org/apache/maven/maven-plugin-descriptor/2.0.6/maven-plugin-descriptor-2.0.6.jar!/' and using 'archive:file:/var/lib/jenkins/workspace/HybridCosimulation_master-LDEVB56LP46DTRNYHQSCKMS3FR4JD6RBBK6S2LPONMGDZRBJQH3A@2/.repository/org/apache/maven/maven-profile/2.0.6/maven-profile-2.0.6.jar!/' instead.
73   WARN  StandaloneSetup    - Skipping conflicting project maven at 'archive:file:/var/lib/jenkins/workspace/HybridCosimulation_master-LDEVB56LP46DTRNYHQSCKMS3FR4JD6RBBK6S2LPONMGDZRBJQH3A@2/.repository/org/apache/maven/maven-profile/2.0.6/maven-profile-2.0.6.jar!/' and using 'archive:file:/var/lib/jenkins/workspace/HybridCosimulation_master-LDEVB56LP46DTRNYHQSCKMS3FR4JD6RBBK6S2LPONMGDZRBJQH3A@2/.repository/org/apache/maven/reporting/maven-reporting-api/2.0.6/maven-reporting-api-2.0.6.jar!/' instead.
76   WARN  StandaloneSetup    - Skipping conflicting project maven at 'archive:file:/var/lib/jenkins/workspace/HybridCosimulation_master-LDEVB56LP46DTRNYHQSCKMS3FR4JD6RBBK6S2LPONMGDZRBJQH3A@2/.repository/org/apache/maven/reporting/maven-reporting-api/2.0.6/maven-reporting-api-2.0.6.jar!/' and using 'archive:file:/var/lib/jenkins/workspace/HybridCosimulation_master-LDEVB56LP46DTRNYHQSCKMS3FR4JD6RBBK6S2LPONMGDZRBJQH3A@2/.repository/org/apache/maven/maven-plugin-parameter-documenter/2.0.6/maven-plugin-parameter-documenter-2.0.6.jar!/' instead.
76   WARN  StandaloneSetup    - Skipping conflicting project maven at 'archive:file:/var/lib/jenkins/workspace/HybridCosimulation_master-LDEVB56LP46DTRNYHQSCKMS3FR4JD6RBBK6S2LPONMGDZRBJQH3A@2/.repository/org/apache/maven/maven-plugin-parameter-documenter/2.0.6/maven-plugin-parameter-documenter-2.0.6.jar!/' and using 'archive:file:/var/lib/jenkins/workspace/HybridCosimulation_master-LDEVB56LP46DTRNYHQSCKMS3FR4JD6RBBK6S2LPONMGDZRBJQH3A@2/.repository/org/apache/maven/maven-artifact-manager/2.0.6/maven-artifact-manager-2.0.6.jar!/' instead.
78   INFO  StandaloneSetup    - Registering project be.uantwerpen.ansymo.semanticadaptation at 'file:/var/lib/jenkins/workspace/HybridCosimulation_master-LDEVB56LP46DTRNYHQSCKMS3FR4JD6RBBK6S2LPONMGDZRBJQH3A@2/DSL_SemanticAdaptation/be.uantwerpen.ansymo.semanticadaptation/'
78   INFO  StandaloneSetup    - Registering project be.uantwerpen.ansymo.semanticadaptation.tests at 'file:/var/lib/jenkins/workspace/HybridCosimulation_master-LDEVB56LP46DTRNYHQSCKMS3FR4JD6RBBK6S2LPONMGDZRBJQH3A@2/DSL_SemanticAdaptation/be.uantwerpen.ansymo.semanticadaptation.tests/'
78   INFO  StandaloneSetup    - Registering project be.uantwerpen.ansymo.semanticadaptation.ide at 'file:/var/lib/jenkins/workspace/HybridCosimulation_master-LDEVB56LP46DTRNYHQSCKMS3FR4JD6RBBK6S2LPONMGDZRBJQH3A@2/DSL_SemanticAdaptation/be.uantwerpen.ansymo.semanticadaptation.ide/'
79   INFO  StandaloneSetup    - Registering project be.uantwerpen.ansymo.semanticadaptation.ui at 'file:/var/lib/jenkins/workspace/HybridCosimulation_master-LDEVB56LP46DTRNYHQSCKMS3FR4JD6RBBK6S2LPONMGDZRBJQH3A@2/DSL_SemanticAdaptation/be.uantwerpen.ansymo.semanticadaptation.ui/'
79   INFO  StandaloneSetup    - Registering project be.uantwerpen.ansymo.semanticadaptation.ui.tests at 'file:/var/lib/jenkins/workspace/HybridCosimulation_master-LDEVB56LP46DTRNYHQSCKMS3FR4JD6RBBK6S2LPONMGDZRBJQH3A@2/DSL_SemanticAdaptation/be.uantwerpen.ansymo.semanticadaptation.ui.tests/'
86   INFO  StandaloneSetup    - Using resourceSet registry. The registered Packages will not be registered in the global EPackage.Registry.INSTANCE!
305  INFO  GenModelHelper     - Registered GenModel 'http://www.eclipse.org/Xtext/Xbase/XAnnotations' from 'platform:/resource/org.eclipse.xtext.xbase/model/Xbase.genmodel'
308  INFO  GenModelHelper     - Registered GenModel 'http://www.eclipse.org/xtext/xbase/Xtype' from 'platform:/resource/org.eclipse.xtext.xbase/model/Xbase.genmodel'
319  INFO  GenModelHelper     - Registered GenModel 'http://www.eclipse.org/xtext/xbase/Xbase' from 'platform:/resource/org.eclipse.xtext.xbase/model/Xbase.genmodel'
320  INFO  GenModelHelper     - Registered GenModel 'http://www.eclipse.org/xtext/common/JavaVMTypes' from 'platform:/resource/org.eclipse.xtext.common.types/model/JavaVMTypes.genmodel'
1439 INFO  XtextGenerator     - Generating be.uantwerpen.ansymo.semanticadaptation.SemanticAdaptation
7313 INFO  EMFGeneratorFragment2 - Generating EMF model code
7367 INFO  GenModelHelper     - Registered GenModel 'http://www.uantwerpen.be/ansymo/semanticadaptation/SemanticAdaptation' from 'platform:/resource/be.uantwerpen.ansymo.semanticadaptation/model/generated/SemanticAdaptation.genmodel'
19074 INFO  XtextGenerator     - Generating common infrastructure
19102 INFO  Workflow           - Done.
[INFO] 
[INFO] --- xtend-maven-plugin:2.11.0:compile (default) @ be.uantwerpen.ansymo.semanticadaptation ---
[WARNING] 
WARNING: 	SemanticAdaptationScopeProvider.xtend - /var/lib/jenkins/workspace/HybridCosimulation_master-LDEVB56LP46DTRNYHQSCKMS3FR4JD6RBBK6S2LPONMGDZRBJQH3A@2/DSL_SemanticAdaptation/be.uantwerpen.ansymo.semanticadaptation/src/be/uantwerpen/ansymo/semanticadaptation/scoping/SemanticAdaptationScopeProvider.xtend
225: EList is a raw type. References to generic type EList<E> should be parameterized
[WARNING] 
WARNING: 	SemanticAdaptationScopeProvider.xtend - /var/lib/jenkins/workspace/HybridCosimulation_master-LDEVB56LP46DTRNYHQSCKMS3FR4JD6RBBK6S2LPONMGDZRBJQH3A@2/DSL_SemanticAdaptation/be.uantwerpen.ansymo.semanticadaptation/src/be/uantwerpen/ansymo/semanticadaptation/scoping/SemanticAdaptationScopeProvider.xtend
292: EList is a raw type. References to generic type EList<E> should be parameterized
[INFO] 
[INFO] --- maven-resources-plugin:2.7:resources (default-resources) @ be.uantwerpen.ansymo.semanticadaptation ---
[INFO] Using 'UTF-8' encoding to copy filtered resources.
[INFO] skip non existing resourceDirectory /var/lib/jenkins/workspace/HybridCosimulation_master-LDEVB56LP46DTRNYHQSCKMS3FR4JD6RBBK6S2LPONMGDZRBJQH3A@2/DSL_SemanticAdaptation/be.uantwerpen.ansymo.semanticadaptation/src/main/resources
[INFO] 
[INFO] --- tycho-compiler-plugin:1.0.0:compile (default-compile) @ be.uantwerpen.ansymo.semanticadaptation ---
[WARNING] Parameter 'useProjectSettings' is set to true, but preferences file '/var/lib/jenkins/workspace/HybridCosimulation_master-LDEVB56LP46DTRNYHQSCKMS3FR4JD6RBBK6S2LPONMGDZRBJQH3A@2/DSL_SemanticAdaptation/be.uantwerpen.ansymo.semanticadaptation/.settings/org.eclipse.jdt.core.prefs' could not be found!
[INFO] Compiling 314 source files to /var/lib/jenkins/workspace/HybridCosimulation_master-LDEVB56LP46DTRNYHQSCKMS3FR4JD6RBBK6S2LPONMGDZRBJQH3A@2/DSL_SemanticAdaptation/be.uantwerpen.ansymo.semanticadaptation/target/classes
[INFO] 
[INFO] --- xtend-maven-plugin:2.11.0:xtend-install-debug-info (default) @ be.uantwerpen.ansymo.semanticadaptation ---
[WARNING] Directory /var/lib/jenkins/workspace/HybridCosimulation_master-LDEVB56LP46DTRNYHQSCKMS3FR4JD6RBBK6S2LPONMGDZRBJQH3A@2/DSL_SemanticAdaptation/be.uantwerpen.ansymo.semanticadaptation/src/main/java is empty. Can't process.
[INFO] Installing Xtend files into 25 class files as primary debug sources in: /var/lib/jenkins/workspace/HybridCosimulation_master-LDEVB56LP46DTRNYHQSCKMS3FR4JD6RBBK6S2LPONMGDZRBJQH3A@2/DSL_SemanticAdaptation/be.uantwerpen.ansymo.semanticadaptation/target/classes
[INFO] 
[INFO] --- xtend-maven-plugin:2.11.0:testCompile (default) @ be.uantwerpen.ansymo.semanticadaptation ---
[INFO] skip compiling sources because the configured directory '[/var/lib/jenkins/workspace/HybridCosimulation_master-LDEVB56LP46DTRNYHQSCKMS3FR4JD6RBBK6S2LPONMGDZRBJQH3A@2/DSL_SemanticAdaptation/be.uantwerpen.ansymo.semanticadaptation/src/test/java]' does not exists.
[INFO] 
[INFO] --- maven-resources-plugin:2.7:testResources (default-testResources) @ be.uantwerpen.ansymo.semanticadaptation ---
[INFO] Using 'UTF-8' encoding to copy filtered resources.
[INFO] skip non existing resourceDirectory /var/lib/jenkins/workspace/HybridCosimulation_master-LDEVB56LP46DTRNYHQSCKMS3FR4JD6RBBK6S2LPONMGDZRBJQH3A@2/DSL_SemanticAdaptation/be.uantwerpen.ansymo.semanticadaptation/src/test/resources
[INFO] 
[INFO] --- xtend-maven-plugin:2.11.0:xtend-test-install-debug-info (default) @ be.uantwerpen.ansymo.semanticadaptation ---
[WARNING] Directory /var/lib/jenkins/workspace/HybridCosimulation_master-LDEVB56LP46DTRNYHQSCKMS3FR4JD6RBBK6S2LPONMGDZRBJQH3A@2/DSL_SemanticAdaptation/be.uantwerpen.ansymo.semanticadaptation/src/test/java is empty. Can't process.
[WARNING] Directory /var/lib/jenkins/workspace/HybridCosimulation_master-LDEVB56LP46DTRNYHQSCKMS3FR4JD6RBBK6S2LPONMGDZRBJQH3A@2/DSL_SemanticAdaptation/be.uantwerpen.ansymo.semanticadaptation/target/xtend-gen/test is empty. Can't process.
[INFO] Installing Xtend files into 0 class files as primary debug sources in: /var/lib/jenkins/workspace/HybridCosimulation_master-LDEVB56LP46DTRNYHQSCKMS3FR4JD6RBBK6S2LPONMGDZRBJQH3A@2/DSL_SemanticAdaptation/be.uantwerpen.ansymo.semanticadaptation/target/test-classes
[INFO] 
[INFO] --- target-platform-configuration:1.0.0:target-platform (default-target-platform) @ be.uantwerpen.ansymo.semanticadaptation ---
[INFO] 
[INFO] --- tycho-packaging-plugin:1.0.0:package-plugin (default-package-plugin) @ be.uantwerpen.ansymo.semanticadaptation ---
[INFO] Building jar: /var/lib/jenkins/workspace/HybridCosimulation_master-LDEVB56LP46DTRNYHQSCKMS3FR4JD6RBBK6S2LPONMGDZRBJQH3A@2/DSL_SemanticAdaptation/be.uantwerpen.ansymo.semanticadaptation/target/be.uantwerpen.ansymo.semanticadaptation-1.0.0-SNAPSHOT.jar
[INFO] 
[INFO] --- tycho-p2-plugin:1.0.0:p2-metadata-default (default-p2-metadata-default) @ be.uantwerpen.ansymo.semanticadaptation ---
[INFO] 
[INFO] --- maven-javadoc-plugin:2.9:jar (attach-javadocs) @ be.uantwerpen.ansymo.semanticadaptation ---
[INFO] Skipping javadoc generation
[INFO] 
[INFO] --- maven-jarsigner-plugin:1.4:sign (sign) @ be.uantwerpen.ansymo.semanticadaptation ---
[WARNING] Picked up JAVA_TOOL_OPTIONS: -Dmaven.ext.class.path="/var/lib/jenkins/workspace/HybridCosimulation_master-LDEVB56LP46DTRNYHQSCKMS3FR4JD6RBBK6S2LPONMGDZRBJQH3A@2@tmp/withMaven83433f04/pipeline-maven-spy.jar" -Dorg.jenkinsci.plugins.pipeline.maven.reportsFolder="/var/lib/jenkins/workspace/HybridCosimulation_master-LDEVB56LP46DTRNYHQSCKMS3FR4JD6RBBK6S2LPONMGDZRBJQH3A@2@tmp/withMaven83433f04" 
[INFO] 1 archive(s) processed
[INFO] 
[INFO] --- maven-install-plugin:2.3.1:install (default-install) @ be.uantwerpen.ansymo.semanticadaptation ---
[INFO] Installing /var/lib/jenkins/workspace/HybridCosimulation_master-LDEVB56LP46DTRNYHQSCKMS3FR4JD6RBBK6S2LPONMGDZRBJQH3A@2/DSL_SemanticAdaptation/be.uantwerpen.ansymo.semanticadaptation/target/be.uantwerpen.ansymo.semanticadaptation-1.0.0-SNAPSHOT.jar to /var/lib/jenkins/workspace/HybridCosimulation_master-LDEVB56LP46DTRNYHQSCKMS3FR4JD6RBBK6S2LPONMGDZRBJQH3A@2/.repository/be/uantwerpen/ansymo/semanticadaptation/be.uantwerpen.ansymo.semanticadaptation/1.0.0-SNAPSHOT/be.uantwerpen.ansymo.semanticadaptation-1.0.0-SNAPSHOT.jar
[INFO] Installing /var/lib/jenkins/workspace/HybridCosimulation_master-LDEVB56LP46DTRNYHQSCKMS3FR4JD6RBBK6S2LPONMGDZRBJQH3A@2/DSL_SemanticAdaptation/be.uantwerpen.ansymo.semanticadaptation/pom.xml to /var/lib/jenkins/workspace/HybridCosimulation_master-LDEVB56LP46DTRNYHQSCKMS3FR4JD6RBBK6S2LPONMGDZRBJQH3A@2/.repository/be/uantwerpen/ansymo/semanticadaptation/be.uantwerpen.ansymo.semanticadaptation/1.0.0-SNAPSHOT/be.uantwerpen.ansymo.semanticadaptation-1.0.0-SNAPSHOT.pom
[INFO] Installing /var/lib/jenkins/workspace/HybridCosimulation_master-LDEVB56LP46DTRNYHQSCKMS3FR4JD6RBBK6S2LPONMGDZRBJQH3A@2/DSL_SemanticAdaptation/be.uantwerpen.ansymo.semanticadaptation/target/p2content.xml to /var/lib/jenkins/workspace/HybridCosimulation_master-LDEVB56LP46DTRNYHQSCKMS3FR4JD6RBBK6S2LPONMGDZRBJQH3A@2/.repository/be/uantwerpen/ansymo/semanticadaptation/be.uantwerpen.ansymo.semanticadaptation/1.0.0-SNAPSHOT/be.uantwerpen.ansymo.semanticadaptation-1.0.0-SNAPSHOT-p2metadata.xml
[INFO] Installing /var/lib/jenkins/workspace/HybridCosimulation_master-LDEVB56LP46DTRNYHQSCKMS3FR4JD6RBBK6S2LPONMGDZRBJQH3A@2/DSL_SemanticAdaptation/be.uantwerpen.ansymo.semanticadaptation/target/p2artifacts.xml to /var/lib/jenkins/workspace/HybridCosimulation_master-LDEVB56LP46DTRNYHQSCKMS3FR4JD6RBBK6S2LPONMGDZRBJQH3A@2/.repository/be/uantwerpen/ansymo/semanticadaptation/be.uantwerpen.ansymo.semanticadaptation/1.0.0-SNAPSHOT/be.uantwerpen.ansymo.semanticadaptation-1.0.0-SNAPSHOT-p2artifacts.xml
[INFO] 
[INFO] --- tycho-p2-plugin:1.0.0:update-local-index (default-update-local-index) @ be.uantwerpen.ansymo.semanticadaptation ---
[INFO]                                                                         
[INFO] ------------------------------------------------------------------------
[INFO] Building be.uantwerpen.ansymo.semanticadaptation Canonical Generator 1.0.0-SNAPSHOT
[INFO] ------------------------------------------------------------------------
[INFO] 
[INFO] --- tycho-packaging-plugin:1.0.0:build-qualifier (default-build-qualifier) @ be.uantwerpen.ansymo.semanticadaptation.cg.canonical ---
[INFO] The project's OSGi version is 1.0.0.201711090956
[INFO] 
[INFO] --- tycho-packaging-plugin:1.0.0:validate-id (default-validate-id) @ be.uantwerpen.ansymo.semanticadaptation.cg.canonical ---
[INFO] 
[INFO] --- tycho-packaging-plugin:1.0.0:validate-version (default-validate-version) @ be.uantwerpen.ansymo.semanticadaptation.cg.canonical ---
[INFO] 
[INFO] --- xtend-maven-plugin:2.11.0:compile (default) @ be.uantwerpen.ansymo.semanticadaptation.cg.canonical ---
[WARNING] 
WARNING: 	SemanticAdaptationCanonicalGenerator.xtend - /var/lib/jenkins/workspace/HybridCosimulation_master-LDEVB56LP46DTRNYHQSCKMS3FR4JD6RBBK6S2LPONMGDZRBJQH3A@2/DSL_SemanticAdaptation/be.uantwerpen.ansymo.semanticadaptation.cg.canonical/src/be/uantwerpen/ansymo/semanticadaptation/cg/canonical/SemanticAdaptationCanonicalGenerator.xtend
54: The import 'org.eclipse.xtext.generator.IGeneratorContext' is never used.
[WARNING] 
WARNING: 	SemanticAdaptationCanonicalGenerator.xtend - /var/lib/jenkins/workspace/HybridCosimulation_master-LDEVB56LP46DTRNYHQSCKMS3FR4JD6RBBK6S2LPONMGDZRBJQH3A@2/DSL_SemanticAdaptation/be.uantwerpen.ansymo.semanticadaptation.cg.canonical/src/be/uantwerpen/ansymo/semanticadaptation/cg/canonical/SemanticAdaptationCanonicalGenerator.xtend
366: The expression of type SingleVarDeclaration is already of type SingleVarDeclaration
[WARNING] 
WARNING: 	SemanticAdaptationCanonicalGenerator.xtend - /var/lib/jenkins/workspace/HybridCosimulation_master-LDEVB56LP46DTRNYHQSCKMS3FR4JD6RBBK6S2LPONMGDZRBJQH3A@2/DSL_SemanticAdaptation/be.uantwerpen.ansymo.semanticadaptation.cg.canonical/src/be/uantwerpen/ansymo/semanticadaptation/cg/canonical/SemanticAdaptationCanonicalGenerator.xtend
367: Unnecessary cast from SingleVarDeclaration to SingleVarDeclaration
[WARNING] 
WARNING: 	SemanticAdaptationCanonicalGenerator.xtend - /var/lib/jenkins/workspace/HybridCosimulation_master-LDEVB56LP46DTRNYHQSCKMS3FR4JD6RBBK6S2LPONMGDZRBJQH3A@2/DSL_SemanticAdaptation/be.uantwerpen.ansymo.semanticadaptation.cg.canonical/src/be/uantwerpen/ansymo/semanticadaptation/cg/canonical/SemanticAdaptationCanonicalGenerator.xtend
368: Unnecessary cast from SingleVarDeclaration to SingleVarDeclaration
[WARNING] 
WARNING: 	SemanticAdaptationCanonicalGenerator.xtend - /var/lib/jenkins/workspace/HybridCosimulation_master-LDEVB56LP46DTRNYHQSCKMS3FR4JD6RBBK6S2LPONMGDZRBJQH3A@2/DSL_SemanticAdaptation/be.uantwerpen.ansymo.semanticadaptation.cg.canonical/src/be/uantwerpen/ansymo/semanticadaptation/cg/canonical/SemanticAdaptationCanonicalGenerator.xtend
569: The value of the local variable parentFMU is not used
[WARNING] 
WARNING: 	SemanticAdaptationCanonicalGenerator.xtend - /var/lib/jenkins/workspace/HybridCosimulation_master-LDEVB56LP46DTRNYHQSCKMS3FR4JD6RBBK6S2LPONMGDZRBJQH3A@2/DSL_SemanticAdaptation/be.uantwerpen.ansymo.semanticadaptation.cg.canonical/src/be/uantwerpen/ansymo/semanticadaptation/cg/canonical/SemanticAdaptationCanonicalGenerator.xtend
649: Unnecessary cast from Variable to Variable
[WARNING] 
WARNING: 	SemanticAdaptationCanonicalGenerator.xtend - /var/lib/jenkins/workspace/HybridCosimulation_master-LDEVB56LP46DTRNYHQSCKMS3FR4JD6RBBK6S2LPONMGDZRBJQH3A@2/DSL_SemanticAdaptation/be.uantwerpen.ansymo.semanticadaptation.cg.canonical/src/be/uantwerpen/ansymo/semanticadaptation/cg/canonical/SemanticAdaptationCanonicalGenerator.xtend
650: Unnecessary cast from Variable to Variable
[WARNING] 
WARNING: 	SemanticAdaptationCanonicalGenerator.xtend - /var/lib/jenkins/workspace/HybridCosimulation_master-LDEVB56LP46DTRNYHQSCKMS3FR4JD6RBBK6S2LPONMGDZRBJQH3A@2/DSL_SemanticAdaptation/be.uantwerpen.ansymo.semanticadaptation.cg.canonical/src/be/uantwerpen/ansymo/semanticadaptation/cg/canonical/SemanticAdaptationCanonicalGenerator.xtend
1049: Unnecessary cast from Variable to Variable
[WARNING] 
WARNING: 	SemanticAdaptationCanonicalGenerator.xtend - /var/lib/jenkins/workspace/HybridCosimulation_master-LDEVB56LP46DTRNYHQSCKMS3FR4JD6RBBK6S2LPONMGDZRBJQH3A@2/DSL_SemanticAdaptation/be.uantwerpen.ansymo.semanticadaptation.cg.canonical/src/be/uantwerpen/ansymo/semanticadaptation/cg/canonical/SemanticAdaptationCanonicalGenerator.xtend
1345: Unnecessary cast from InnerFMUDeclarationFull to InnerFMUDeclarationFull
[INFO] 
[INFO] --- maven-resources-plugin:2.7:resources (default-resources) @ be.uantwerpen.ansymo.semanticadaptation.cg.canonical ---
[INFO] Using 'UTF-8' encoding to copy filtered resources.
[INFO] skip non existing resourceDirectory /var/lib/jenkins/workspace/HybridCosimulation_master-LDEVB56LP46DTRNYHQSCKMS3FR4JD6RBBK6S2LPONMGDZRBJQH3A@2/DSL_SemanticAdaptation/be.uantwerpen.ansymo.semanticadaptation.cg.canonical/src/main/resources
[INFO] 
[INFO] --- tycho-compiler-plugin:1.0.0:compile (default-compile) @ be.uantwerpen.ansymo.semanticadaptation.cg.canonical ---
[WARNING] Parameter 'useProjectSettings' is set to true, but preferences file '/var/lib/jenkins/workspace/HybridCosimulation_master-LDEVB56LP46DTRNYHQSCKMS3FR4JD6RBBK6S2LPONMGDZRBJQH3A@2/DSL_SemanticAdaptation/be.uantwerpen.ansymo.semanticadaptation.cg.canonical/.settings/org.eclipse.jdt.core.prefs' could not be found!
[INFO] Compiling 4 source files to /var/lib/jenkins/workspace/HybridCosimulation_master-LDEVB56LP46DTRNYHQSCKMS3FR4JD6RBBK6S2LPONMGDZRBJQH3A@2/DSL_SemanticAdaptation/be.uantwerpen.ansymo.semanticadaptation.cg.canonical/target/classes
[WARNING] Source directory /var/lib/jenkins/workspace/HybridCosimulation_master-LDEVB56LP46DTRNYHQSCKMS3FR4JD6RBBK6S2LPONMGDZRBJQH3A@2/DSL_SemanticAdaptation/be.uantwerpen.ansymo.semanticadaptation.cg.canonical/src-gen does not exist
[INFO] 
[INFO] --- xtend-maven-plugin:2.11.0:xtend-install-debug-info (default) @ be.uantwerpen.ansymo.semanticadaptation.cg.canonical ---
[WARNING] Directory /var/lib/jenkins/workspace/HybridCosimulation_master-LDEVB56LP46DTRNYHQSCKMS3FR4JD6RBBK6S2LPONMGDZRBJQH3A@2/DSL_SemanticAdaptation/be.uantwerpen.ansymo.semanticadaptation.cg.canonical/src/main/java is empty. Can't process.
[WARNING] Directory /var/lib/jenkins/workspace/HybridCosimulation_master-LDEVB56LP46DTRNYHQSCKMS3FR4JD6RBBK6S2LPONMGDZRBJQH3A@2/DSL_SemanticAdaptation/be.uantwerpen.ansymo.semanticadaptation.cg.canonical/src-gen is empty. Can't process.
[INFO] Installing Xtend files into 14 class files as primary debug sources in: /var/lib/jenkins/workspace/HybridCosimulation_master-LDEVB56LP46DTRNYHQSCKMS3FR4JD6RBBK6S2LPONMGDZRBJQH3A@2/DSL_SemanticAdaptation/be.uantwerpen.ansymo.semanticadaptation.cg.canonical/target/classes
[INFO] 
[INFO] --- xtend-maven-plugin:2.11.0:testCompile (default) @ be.uantwerpen.ansymo.semanticadaptation.cg.canonical ---
[INFO] skip compiling sources because the configured directory '[/var/lib/jenkins/workspace/HybridCosimulation_master-LDEVB56LP46DTRNYHQSCKMS3FR4JD6RBBK6S2LPONMGDZRBJQH3A@2/DSL_SemanticAdaptation/be.uantwerpen.ansymo.semanticadaptation.cg.canonical/src/test/java]' does not exists.
[INFO] 
[INFO] --- maven-resources-plugin:2.7:testResources (default-testResources) @ be.uantwerpen.ansymo.semanticadaptation.cg.canonical ---
[INFO] Using 'UTF-8' encoding to copy filtered resources.
[INFO] skip non existing resourceDirectory /var/lib/jenkins/workspace/HybridCosimulation_master-LDEVB56LP46DTRNYHQSCKMS3FR4JD6RBBK6S2LPONMGDZRBJQH3A@2/DSL_SemanticAdaptation/be.uantwerpen.ansymo.semanticadaptation.cg.canonical/src/test/resources
[INFO] 
[INFO] --- xtend-maven-plugin:2.11.0:xtend-test-install-debug-info (default) @ be.uantwerpen.ansymo.semanticadaptation.cg.canonical ---
[WARNING] Directory /var/lib/jenkins/workspace/HybridCosimulation_master-LDEVB56LP46DTRNYHQSCKMS3FR4JD6RBBK6S2LPONMGDZRBJQH3A@2/DSL_SemanticAdaptation/be.uantwerpen.ansymo.semanticadaptation.cg.canonical/src/test/java is empty. Can't process.
[WARNING] Directory /var/lib/jenkins/workspace/HybridCosimulation_master-LDEVB56LP46DTRNYHQSCKMS3FR4JD6RBBK6S2LPONMGDZRBJQH3A@2/DSL_SemanticAdaptation/be.uantwerpen.ansymo.semanticadaptation.cg.canonical/target/xtend-gen/test is empty. Can't process.
[INFO] Installing Xtend files into 0 class files as primary debug sources in: /var/lib/jenkins/workspace/HybridCosimulation_master-LDEVB56LP46DTRNYHQSCKMS3FR4JD6RBBK6S2LPONMGDZRBJQH3A@2/DSL_SemanticAdaptation/be.uantwerpen.ansymo.semanticadaptation.cg.canonical/target/test-classes
[INFO] 
[INFO] --- target-platform-configuration:1.0.0:target-platform (default-target-platform) @ be.uantwerpen.ansymo.semanticadaptation.cg.canonical ---
[INFO] 
[INFO] --- tycho-packaging-plugin:1.0.0:package-plugin (default-package-plugin) @ be.uantwerpen.ansymo.semanticadaptation.cg.canonical ---
[INFO] Building jar: /var/lib/jenkins/workspace/HybridCosimulation_master-LDEVB56LP46DTRNYHQSCKMS3FR4JD6RBBK6S2LPONMGDZRBJQH3A@2/DSL_SemanticAdaptation/be.uantwerpen.ansymo.semanticadaptation.cg.canonical/target/be.uantwerpen.ansymo.semanticadaptation.cg.canonical-1.0.0-SNAPSHOT.jar
[INFO] 
[INFO] --- tycho-p2-plugin:1.0.0:p2-metadata-default (default-p2-metadata-default) @ be.uantwerpen.ansymo.semanticadaptation.cg.canonical ---
[INFO] 
[INFO] --- maven-javadoc-plugin:2.9:jar (attach-javadocs) @ be.uantwerpen.ansymo.semanticadaptation.cg.canonical ---
[INFO] Skipping javadoc generation
[INFO] 
[INFO] --- maven-jarsigner-plugin:1.4:sign (sign) @ be.uantwerpen.ansymo.semanticadaptation.cg.canonical ---
[WARNING] Picked up JAVA_TOOL_OPTIONS: -Dmaven.ext.class.path="/var/lib/jenkins/workspace/HybridCosimulation_master-LDEVB56LP46DTRNYHQSCKMS3FR4JD6RBBK6S2LPONMGDZRBJQH3A@2@tmp/withMaven83433f04/pipeline-maven-spy.jar" -Dorg.jenkinsci.plugins.pipeline.maven.reportsFolder="/var/lib/jenkins/workspace/HybridCosimulation_master-LDEVB56LP46DTRNYHQSCKMS3FR4JD6RBBK6S2LPONMGDZRBJQH3A@2@tmp/withMaven83433f04" 
[INFO] 1 archive(s) processed
[INFO] 
[INFO] --- maven-install-plugin:2.3.1:install (default-install) @ be.uantwerpen.ansymo.semanticadaptation.cg.canonical ---
[INFO] Installing /var/lib/jenkins/workspace/HybridCosimulation_master-LDEVB56LP46DTRNYHQSCKMS3FR4JD6RBBK6S2LPONMGDZRBJQH3A@2/DSL_SemanticAdaptation/be.uantwerpen.ansymo.semanticadaptation.cg.canonical/target/be.uantwerpen.ansymo.semanticadaptation.cg.canonical-1.0.0-SNAPSHOT.jar to /var/lib/jenkins/workspace/HybridCosimulation_master-LDEVB56LP46DTRNYHQSCKMS3FR4JD6RBBK6S2LPONMGDZRBJQH3A@2/.repository/be/uantwerpen/ansymo/semanticadaptation/be.uantwerpen.ansymo.semanticadaptation.cg.canonical/1.0.0-SNAPSHOT/be.uantwerpen.ansymo.semanticadaptation.cg.canonical-1.0.0-SNAPSHOT.jar
[INFO] Installing /var/lib/jenkins/workspace/HybridCosimulation_master-LDEVB56LP46DTRNYHQSCKMS3FR4JD6RBBK6S2LPONMGDZRBJQH3A@2/DSL_SemanticAdaptation/be.uantwerpen.ansymo.semanticadaptation.cg.canonical/pom.xml to /var/lib/jenkins/workspace/HybridCosimulation_master-LDEVB56LP46DTRNYHQSCKMS3FR4JD6RBBK6S2LPONMGDZRBJQH3A@2/.repository/be/uantwerpen/ansymo/semanticadaptation/be.uantwerpen.ansymo.semanticadaptation.cg.canonical/1.0.0-SNAPSHOT/be.uantwerpen.ansymo.semanticadaptation.cg.canonical-1.0.0-SNAPSHOT.pom
[INFO] Installing /var/lib/jenkins/workspace/HybridCosimulation_master-LDEVB56LP46DTRNYHQSCKMS3FR4JD6RBBK6S2LPONMGDZRBJQH3A@2/DSL_SemanticAdaptation/be.uantwerpen.ansymo.semanticadaptation.cg.canonical/target/p2content.xml to /var/lib/jenkins/workspace/HybridCosimulation_master-LDEVB56LP46DTRNYHQSCKMS3FR4JD6RBBK6S2LPONMGDZRBJQH3A@2/.repository/be/uantwerpen/ansymo/semanticadaptation/be.uantwerpen.ansymo.semanticadaptation.cg.canonical/1.0.0-SNAPSHOT/be.uantwerpen.ansymo.semanticadaptation.cg.canonical-1.0.0-SNAPSHOT-p2metadata.xml
[INFO] Installing /var/lib/jenkins/workspace/HybridCosimulation_master-LDEVB56LP46DTRNYHQSCKMS3FR4JD6RBBK6S2LPONMGDZRBJQH3A@2/DSL_SemanticAdaptation/be.uantwerpen.ansymo.semanticadaptation.cg.canonical/target/p2artifacts.xml to /var/lib/jenkins/workspace/HybridCosimulation_master-LDEVB56LP46DTRNYHQSCKMS3FR4JD6RBBK6S2LPONMGDZRBJQH3A@2/.repository/be/uantwerpen/ansymo/semanticadaptation/be.uantwerpen.ansymo.semanticadaptation.cg.canonical/1.0.0-SNAPSHOT/be.uantwerpen.ansymo.semanticadaptation.cg.canonical-1.0.0-SNAPSHOT-p2artifacts.xml
[INFO] 
[INFO] --- tycho-p2-plugin:1.0.0:update-local-index (default-update-local-index) @ be.uantwerpen.ansymo.semanticadaptation.cg.canonical ---
[INFO]                                                                         
[INFO] ------------------------------------------------------------------------
[INFO] Building be.uantwerpen.ansymo.semanticadaptation Code Generation to C++ 1.0.0-SNAPSHOT
[INFO] ------------------------------------------------------------------------
[INFO] 
[INFO] --- tycho-packaging-plugin:1.0.0:build-qualifier (default-build-qualifier) @ be.uantwerpen.ansymo.semanticadaptation.cg.cpp ---
[INFO] The project's OSGi version is 1.0.0.201711090956
[INFO] 
[INFO] --- tycho-packaging-plugin:1.0.0:validate-id (default-validate-id) @ be.uantwerpen.ansymo.semanticadaptation.cg.cpp ---
[INFO] 
[INFO] --- tycho-packaging-plugin:1.0.0:validate-version (default-validate-version) @ be.uantwerpen.ansymo.semanticadaptation.cg.cpp ---
[INFO] 
[INFO] --- xtend-maven-plugin:2.11.0:compile (default) @ be.uantwerpen.ansymo.semanticadaptation.cg.cpp ---
[INFO] 
[INFO] --- maven-resources-plugin:2.7:resources (default-resources) @ be.uantwerpen.ansymo.semanticadaptation.cg.cpp ---
[INFO] Using 'UTF-8' encoding to copy filtered resources.
[INFO] skip non existing resourceDirectory /var/lib/jenkins/workspace/HybridCosimulation_master-LDEVB56LP46DTRNYHQSCKMS3FR4JD6RBBK6S2LPONMGDZRBJQH3A@2/DSL_SemanticAdaptation/be.uantwerpen.ansymo.semanticadaptation.cg.cpp/src/main/resources
[INFO] 
[INFO] --- tycho-compiler-plugin:1.0.0:compile (default-compile) @ be.uantwerpen.ansymo.semanticadaptation.cg.cpp ---
[WARNING] Parameter 'useProjectSettings' is set to true, but preferences file '/var/lib/jenkins/workspace/HybridCosimulation_master-LDEVB56LP46DTRNYHQSCKMS3FR4JD6RBBK6S2LPONMGDZRBJQH3A@2/DSL_SemanticAdaptation/be.uantwerpen.ansymo.semanticadaptation.cg.cpp/.settings/org.eclipse.jdt.core.prefs' could not be found!
[INFO] Compiling 35 source files to /var/lib/jenkins/workspace/HybridCosimulation_master-LDEVB56LP46DTRNYHQSCKMS3FR4JD6RBBK6S2LPONMGDZRBJQH3A@2/DSL_SemanticAdaptation/be.uantwerpen.ansymo.semanticadaptation.cg.cpp/target/classes
[INFO] ------------------------------------------------------------------------
[INFO] Reactor Summary:
[INFO] 
[INFO] Semantics Adaptation Root .......................... SUCCESS [  2.767 s]
[INFO] be.uantwerpen.ansymo.semanticadaptation Testframework SUCCESS [ 14.137 s]
[INFO] be.uantwerpen.ansymo.semanticadaptation Logger ..... SUCCESS [  2.172 s]
[INFO] be.uantwerpen.ansymo.semanticadaptation Language Core SUCCESS [ 30.002 s]
[INFO] be.uantwerpen.ansymo.semanticadaptation Canonical Generator SUCCESS [  4.007 s]
[INFO] be.uantwerpen.ansymo.semanticadaptation Code Generation to C++ FAILURE [  3.943 s]
[INFO] be.uantwerpen.ansymo.semanticadaptation Code Generator SKIPPED
[INFO] be.uantwerpen.ansymo.semanticadaptation Language Tests SKIPPED
[INFO] be.uantwerpen.ansymo.semanticadaptation.ide ........ SKIPPED
[INFO] be.uantwerpen.ansymo.semanticadaptation.ui Language UI SKIPPED
[INFO] be.uantwerpen.ansymo.semanticadaptation Code Generation to C++ Tests SKIPPED
[INFO] be.uantwerpen.ansymo.semanticadaptation Code Generation to C++ Tests SKIPPED
[INFO] Feature ............................................ SKIPPED
[INFO] be.uantwerpen.ansymo.semanticadaptation.ide.platform SKIPPED
[INFO] Core ............................................... SKIPPED
[INFO] Semantics Adaptation IDE Eclipse repository ........ SKIPPED
[INFO] SA IDE Standalone Product .......................... SKIPPED
[INFO] ------------------------------------------------------------------------
[INFO] BUILD FAILURE
[INFO] ------------------------------------------------------------------------
[INFO] Total time: 03:32 min
[INFO] Finished at: 2017-11-09T11:00:13+01:00
[INFO] Final Memory: 239M/896M
[INFO] ------------------------------------------------------------------------
[jenkins-maven-event-spy] INFO generated /var/lib/jenkins/workspace/HybridCosimulation_master-LDEVB56LP46DTRNYHQSCKMS3FR4JD6RBBK6S2LPONMGDZRBJQH3A@2@tmp/withMaven83433f04/maven-spy-20171109-105641-311.log
[ERROR] Failed to execute goal org.eclipse.tycho:tycho-compiler-plugin:1.0.0:compile (default-compile) on project be.uantwerpen.ansymo.semanticadaptation.cg.cpp: Compilation failure: Compilation failure:
[ERROR] /var/lib/jenkins/workspace/HybridCosimulation_master-LDEVB56LP46DTRNYHQSCKMS3FR4JD6RBBK6S2LPONMGDZRBJQH3A@2/DSL_SemanticAdaptation/be.uantwerpen.ansymo.semanticadaptation.cg.cpp/xtend-gen/be/uantwerpen/ansymo/semanticadaptation/cg/cpp/ModelDescriptionCreator.java:[3]
[ERROR] import be.uantwerpen.ansymo.semanticadaptation.cg.cpp.ModelDescriptionBuilder;
[ERROR] ^^^^^^^^^^^^^^^^^^^^^^^^^^^^^^^^^^^^^^^^^^^^^^^^^^^^^^^^^^^^^^^^^^^^^^
[ERROR] The import be.uantwerpen.ansymo.semanticadaptation.cg.cpp.ModelDescriptionBuilder cannot be resolved
[ERROR] /var/lib/jenkins/workspace/HybridCosimulation_master-LDEVB56LP46DTRNYHQSCKMS3FR4JD6RBBK6S2LPONMGDZRBJQH3A@2/DSL_SemanticAdaptation/be.uantwerpen.ansymo.semanticadaptation.cg.cpp/xtend-gen/be/uantwerpen/ansymo/semanticadaptation/cg/cpp/ModelDescriptionCreator.java:[4]
[ERROR] import be.uantwerpen.ansymo.semanticadaptation.cg.cpp.SVCausality;
[ERROR] ^^^^^^^^^^^^^^^^^^^^^^^^^^^^^^^^^^^^^^^^^^^^^^^^^^^^^^^^^^
[ERROR] The import be.uantwerpen.ansymo.semanticadaptation.cg.cpp.SVCausality cannot be resolved
[ERROR] /var/lib/jenkins/workspace/HybridCosimulation_master-LDEVB56LP46DTRNYHQSCKMS3FR4JD6RBBK6S2LPONMGDZRBJQH3A@2/DSL_SemanticAdaptation/be.uantwerpen.ansymo.semanticadaptation.cg.cpp/xtend-gen/be/uantwerpen/ansymo/semanticadaptation/cg/cpp/ModelDescriptionCreator.java:[5]
[ERROR] import be.uantwerpen.ansymo.semanticadaptation.cg.cpp.SVType;
[ERROR] ^^^^^^^^^^^^^^^^^^^^^^^^^^^^^^^^^^^^^^^^^^^^^^^^^^^^^
[ERROR] The import be.uantwerpen.ansymo.semanticadaptation.cg.cpp.SVType cannot be resolved
[ERROR] /var/lib/jenkins/workspace/HybridCosimulation_master-LDEVB56LP46DTRNYHQSCKMS3FR4JD6RBBK6S2LPONMGDZRBJQH3A@2/DSL_SemanticAdaptation/be.uantwerpen.ansymo.semanticadaptation.cg.cpp/xtend-gen/be/uantwerpen/ansymo/semanticadaptation/cg/cpp/ModelDescriptionCreator.java:[6]
[ERROR] import be.uantwerpen.ansymo.semanticadaptation.cg.cpp.ScalarVariable;
[ERROR] ^^^^^^^^^^^^^^^^^^^^^^^^^^^^^^^^^^^^^^^^^^^^^^^^^^^^^^^^^^^^^
[ERROR] The import be.uantwerpen.ansymo.semanticadaptation.cg.cpp.ScalarVariable cannot be resolved
[ERROR] /var/lib/jenkins/workspace/HybridCosimulation_master-LDEVB56LP46DTRNYHQSCKMS3FR4JD6RBBK6S2LPONMGDZRBJQH3A@2/DSL_SemanticAdaptation/be.uantwerpen.ansymo.semanticadaptation.cg.cpp/xtend-gen/be/uantwerpen/ansymo/semanticadaptation/cg/cpp/ModelDescriptionCreator.java:[38]
[ERROR] private List<ScalarVariable> sVars = new Vector<ScalarVariable>();
[ERROR] ^^^^^^^^^^^^^^
[ERROR] ScalarVariable cannot be resolved to a type
[ERROR] /var/lib/jenkins/workspace/HybridCosimulation_master-LDEVB56LP46DTRNYHQSCKMS3FR4JD6RBBK6S2LPONMGDZRBJQH3A@2/DSL_SemanticAdaptation/be.uantwerpen.ansymo.semanticadaptation.cg.cpp/xtend-gen/be/uantwerpen/ansymo/semanticadaptation/cg/cpp/ModelDescriptionCreator.java:[38]
[ERROR] private List<ScalarVariable> sVars = new Vector<ScalarVariable>();
[ERROR] ^^^^^^^^^^^^^^
[ERROR] ScalarVariable cannot be resolved to a type
[ERROR] /var/lib/jenkins/workspace/HybridCosimulation_master-LDEVB56LP46DTRNYHQSCKMS3FR4JD6RBBK6S2LPONMGDZRBJQH3A@2/DSL_SemanticAdaptation/be.uantwerpen.ansymo.semanticadaptation.cg.cpp/xtend-gen/be/uantwerpen/ansymo/semanticadaptation/cg/cpp/ModelDescriptionCreator.java:[40]
[ERROR] private ModelDescriptionBuilder mdBuilder = new Function0<ModelDescriptionBuilder>() {
[ERROR] ^^^^^^^^^^^^^^^^^^^^^^^
[ERROR] ModelDescriptionBuilder cannot be resolved to a type
[ERROR] /var/lib/jenkins/workspace/HybridCosimulation_master-LDEVB56LP46DTRNYHQSCKMS3FR4JD6RBBK6S2LPONMGDZRBJQH3A@2/DSL_SemanticAdaptation/be.uantwerpen.ansymo.semanticadaptation.cg.cpp/xtend-gen/be/uantwerpen/ansymo/semanticadaptation/cg/cpp/ModelDescriptionCreator.java:[40]
[ERROR] private ModelDescriptionBuilder mdBuilder = new Function0<ModelDescriptionBuilder>() {
[ERROR] ^^^^^^^^^^^^^^^^^^^^^^^
[ERROR] ModelDescriptionBuilder cannot be resolved to a type
[ERROR] /var/lib/jenkins/workspace/HybridCosimulation_master-LDEVB56LP46DTRNYHQSCKMS3FR4JD6RBBK6S2LPONMGDZRBJQH3A@2/DSL_SemanticAdaptation/be.uantwerpen.ansymo.semanticadaptation.cg.cpp/xtend-gen/be/uantwerpen/ansymo/semanticadaptation/cg/cpp/ModelDescriptionCreator.java:[41]
[ERROR] public ModelDescriptionBuilder apply() {
[ERROR] ^^^^^^^^^^^^^^^^^^^^^^^
[ERROR] ModelDescriptionBuilder cannot be resolved to a type
[ERROR] /var/lib/jenkins/workspace/HybridCosimulation_master-LDEVB56LP46DTRNYHQSCKMS3FR4JD6RBBK6S2LPONMGDZRBJQH3A@2/DSL_SemanticAdaptation/be.uantwerpen.ansymo.semanticadaptation.cg.cpp/xtend-gen/be/uantwerpen/ansymo/semanticadaptation/cg/cpp/ModelDescriptionCreator.java:[43]
[ERROR] ModelDescriptionBuilder _modelDescriptionBuilder = new ModelDescriptionBuilder();
[ERROR] ^^^^^^^^^^^^^^^^^^^^^^^
[ERROR] ModelDescriptionBuilder cannot be resolved to a type
[ERROR] /var/lib/jenkins/workspace/HybridCosimulation_master-LDEVB56LP46DTRNYHQSCKMS3FR4JD6RBBK6S2LPONMGDZRBJQH3A@2/DSL_SemanticAdaptation/be.uantwerpen.ansymo.semanticadaptation.cg.cpp/xtend-gen/be/uantwerpen/ansymo/semanticadaptation/cg/cpp/ModelDescriptionCreator.java:[43]
[ERROR] ModelDescriptionBuilder _modelDescriptionBuilder = new ModelDescriptionBuilder();
[ERROR] ^^^^^^^^^^^^^^^^^^^^^^^
[ERROR] ModelDescriptionBuilder cannot be resolved to a type
[ERROR] /var/lib/jenkins/workspace/HybridCosimulation_master-LDEVB56LP46DTRNYHQSCKMS3FR4JD6RBBK6S2LPONMGDZRBJQH3A@2/DSL_SemanticAdaptation/be.uantwerpen.ansymo.semanticadaptation.cg.cpp/xtend-gen/be/uantwerpen/ansymo/semanticadaptation/cg/cpp/ModelDescriptionCreator.java:[49]
[ERROR] }.apply();
[ERROR] ^^^^^
[ERROR] The method apply() from the type new Functions.Function0<ModelDescriptionBuilder>(){} refers to the missing type ModelDescriptionBuilder
[ERROR] /var/lib/jenkins/workspace/HybridCosimulation_master-LDEVB56LP46DTRNYHQSCKMS3FR4JD6RBBK6S2LPONMGDZRBJQH3A@2/DSL_SemanticAdaptation/be.uantwerpen.ansymo.semanticadaptation.cg.cpp/xtend-gen/be/uantwerpen/ansymo/semanticadaptation/cg/cpp/ModelDescriptionCreator.java:[60]
[ERROR] this.mdBuilder.CreateTemplate(this.mdName, UUID.randomUUID().toString());
[ERROR] ^^^^^^^^^^^^^^
[ERROR] ModelDescriptionBuilder cannot be resolved to a type
[ERROR] /var/lib/jenkins/workspace/HybridCosimulation_master-LDEVB56LP46DTRNYHQSCKMS3FR4JD6RBBK6S2LPONMGDZRBJQH3A@2/DSL_SemanticAdaptation/be.uantwerpen.ansymo.semanticadaptation.cg.cpp/xtend-gen/be/uantwerpen/ansymo/semanticadaptation/cg/cpp/ModelDescriptionCreator.java:[61]
[ERROR] for (final ScalarVariable sVar : this.sVars) {
[ERROR] ^^^^^^^^^^^^^^
[ERROR] ScalarVariable cannot be resolved to a type
[ERROR] /var/lib/jenkins/workspace/HybridCosimulation_master-LDEVB56LP46DTRNYHQSCKMS3FR4JD6RBBK6S2LPONMGDZRBJQH3A@2/DSL_SemanticAdaptation/be.uantwerpen.ansymo.semanticadaptation.cg.cpp/xtend-gen/be/uantwerpen/ansymo/semanticadaptation/cg/cpp/ModelDescriptionCreator.java:[61]
[ERROR] for (final ScalarVariable sVar : this.sVars) {
[ERROR] ^^^^^^^^^^
[ERROR] ScalarVariable cannot be resolved to a type
[ERROR] /var/lib/jenkins/workspace/HybridCosimulation_master-LDEVB56LP46DTRNYHQSCKMS3FR4JD6RBBK6S2LPONMGDZRBJQH3A@2/DSL_SemanticAdaptation/be.uantwerpen.ansymo.semanticadaptation.cg.cpp/xtend-gen/be/uantwerpen/ansymo/semanticadaptation/cg/cpp/ModelDescriptionCreator.java:[62]
[ERROR] this.mdBuilder.addScalarVariable(sVar);
[ERROR] ^^^^^^^^^^^^^^
[ERROR] ModelDescriptionBuilder cannot be resolved to a type
[ERROR] /var/lib/jenkins/workspace/HybridCosimulation_master-LDEVB56LP46DTRNYHQSCKMS3FR4JD6RBBK6S2LPONMGDZRBJQH3A@2/DSL_SemanticAdaptation/be.uantwerpen.ansymo.semanticadaptation.cg.cpp/xtend-gen/be/uantwerpen/ansymo/semanticadaptation/cg/cpp/ModelDescriptionCreator.java:[64]
[ERROR] return this.mdBuilder.toString();
[ERROR] ^^^^^^^^^^^^^^
[ERROR] ModelDescriptionBuilder cannot be resolved to a type
[ERROR] /var/lib/jenkins/workspace/HybridCosimulation_master-LDEVB56LP46DTRNYHQSCKMS3FR4JD6RBBK6S2LPONMGDZRBJQH3A@2/DSL_SemanticAdaptation/be.uantwerpen.ansymo.semanticadaptation.cg.cpp/xtend-gen/be/uantwerpen/ansymo/semanticadaptation/cg/cpp/ModelDescriptionCreator.java:[126]
[ERROR] this.sVars.add(
[ERROR] ^^^^^^^^^^
[ERROR] ScalarVariable cannot be resolved to a type
[ERROR] /var/lib/jenkins/workspace/HybridCosimulation_master-LDEVB56LP46DTRNYHQSCKMS3FR4JD6RBBK6S2LPONMGDZRBJQH3A@2/DSL_SemanticAdaptation/be.uantwerpen.ansymo.semanticadaptation.cg.cpp/xtend-gen/be/uantwerpen/ansymo/semanticadaptation/cg/cpp/ModelDescriptionCreator.java:[127]
[ERROR] ScalarVariable.Create().setName(port.getName()).setValueReference(this.mdBuilder.getNextValueReference()).setCausality(
[ERROR] ^^^^^^^^^^^^^^
[ERROR] ScalarVariable cannot be resolved
[ERROR] /var/lib/jenkins/workspace/HybridCosimulation_master-LDEVB56LP46DTRNYHQSCKMS3FR4JD6RBBK6S2LPONMGDZRBJQH3A@2/DSL_SemanticAdaptation/be.uantwerpen.ansymo.semanticadaptation.cg.cpp/xtend-gen/be/uantwerpen/ansymo/semanticadaptation/cg/cpp/ModelDescriptionCreator.java:[127]
[ERROR] ScalarVariable.Create().setName(port.getName()).setValueReference(this.mdBuilder.getNextValueReference()).setCausality(
[ERROR] ^^^^^^^^^^^^^^
[ERROR] ModelDescriptionBuilder cannot be resolved to a type
[ERROR] /var/lib/jenkins/workspace/HybridCosimulation_master-LDEVB56LP46DTRNYHQSCKMS3FR4JD6RBBK6S2LPONMGDZRBJQH3A@2/DSL_SemanticAdaptation/be.uantwerpen.ansymo.semanticadaptation.cg.cpp/xtend-gen/be/uantwerpen/ansymo/semanticadaptation/cg/cpp/ModelDescriptionCreator.java:[128]
[ERROR] SVCausality.input).setType(SVType.valueOf(nl.getNodeName())));
[ERROR] ^^^^^^^^^^^
[ERROR] SVCausality cannot be resolved to a variable
[ERROR] /var/lib/jenkins/workspace/HybridCosimulation_master-LDEVB56LP46DTRNYHQSCKMS3FR4JD6RBBK6S2LPONMGDZRBJQH3A@2/DSL_SemanticAdaptation/be.uantwerpen.ansymo.semanticadaptation.cg.cpp/xtend-gen/be/uantwerpen/ansymo/semanticadaptation/cg/cpp/ModelDescriptionCreator.java:[128]
[ERROR] SVCausality.input).setType(SVType.valueOf(nl.getNodeName())));
[ERROR] ^^^^^^
[ERROR] SVType cannot be resolved
[ERROR] /var/lib/jenkins/workspace/HybridCosimulation_master-LDEVB56LP46DTRNYHQSCKMS3FR4JD6RBBK6S2LPONMGDZRBJQH3A@2/DSL_SemanticAdaptation/be.uantwerpen.ansymo.semanticadaptation.cg.cpp/xtend-gen/be/uantwerpen/ansymo/semanticadaptation/cg/cpp/ModelDescriptionCreator.java:[143]
[ERROR] this.sVars.add(
[ERROR] ^^^^^^^^^^
[ERROR] ScalarVariable cannot be resolved to a type
[ERROR] /var/lib/jenkins/workspace/HybridCosimulation_master-LDEVB56LP46DTRNYHQSCKMS3FR4JD6RBBK6S2LPONMGDZRBJQH3A@2/DSL_SemanticAdaptation/be.uantwerpen.ansymo.semanticadaptation.cg.cpp/xtend-gen/be/uantwerpen/ansymo/semanticadaptation/cg/cpp/ModelDescriptionCreator.java:[144]
[ERROR] ScalarVariable.Create().setName(port_1.getName()).setValueReference(this.mdBuilder.getNextValueReference()).setCausality(
[ERROR] ^^^^^^^^^^^^^^
[ERROR] ScalarVariable cannot be resolved
[ERROR] /var/lib/jenkins/workspace/HybridCosimulation_master-LDEVB56LP46DTRNYHQSCKMS3FR4JD6RBBK6S2LPONMGDZRBJQH3A@2/DSL_SemanticAdaptation/be.uantwerpen.ansymo.semanticadaptation.cg.cpp/xtend-gen/be/uantwerpen/ansymo/semanticadaptation/cg/cpp/ModelDescriptionCreator.java:[144]
[ERROR] ScalarVariable.Create().setName(port_1.getName()).setValueReference(this.mdBuilder.getNextValueReference()).setCausality(
[ERROR] ^^^^^^^^^^^^^^
[ERROR] ModelDescriptionBuilder cannot be resolved to a type
[ERROR] /var/lib/jenkins/workspace/HybridCosimulation_master-LDEVB56LP46DTRNYHQSCKMS3FR4JD6RBBK6S2LPONMGDZRBJQH3A@2/DSL_SemanticAdaptation/be.uantwerpen.ansymo.semanticadaptation.cg.cpp/xtend-gen/be/uantwerpen/ansymo/semanticadaptation/cg/cpp/ModelDescriptionCreator.java:[145]
[ERROR] SVCausality.output).setType(SVType.valueOf(nl.getNodeName())));
[ERROR] ^^^^^^^^^^^
[ERROR] SVCausality cannot be resolved to a variable
[ERROR] /var/lib/jenkins/workspace/HybridCosimulation_master-LDEVB56LP46DTRNYHQSCKMS3FR4JD6RBBK6S2LPONMGDZRBJQH3A@2/DSL_SemanticAdaptation/be.uantwerpen.ansymo.semanticadaptation.cg.cpp/xtend-gen/be/uantwerpen/ansymo/semanticadaptation/cg/cpp/ModelDescriptionCreator.java:[145]
[ERROR] SVCausality.output).setType(SVType.valueOf(nl.getNodeName())));
[ERROR] ^^^^^^
[ERROR] SVType cannot be resolved
[ERROR] 27 problems (27 errors)
[ERROR] -> [Help 1]
[ERROR] 
[ERROR] To see the full stack trace of the errors, re-run Maven with the -e switch.
[ERROR] Re-run Maven using the -X switch to enable full debug logging.
[ERROR] 
[ERROR] For more information about the errors and possible solutions, please read the following articles:
[ERROR] [Help 1] http://cwiki.apache.org/confluence/display/MAVEN/MojoFailureException
[ERROR] 
[ERROR] After correcting the problems, you can resume the build with the command
[ERROR]   mvn <goals> -rf :be.uantwerpen.ansymo.semanticadaptation.cg.cpp
[Pipeline] }
[withMaven] artifactsPublisher - Archive artifact DSL_SemanticAdaptation/pom.xml under be/uantwerpen/ansymo/semanticadaptation/parent/1.0.0-SNAPSHOT/parent-1.0.0-SNAPSHOT.pom
[withMaven] artifactsPublisher - Archive artifact DSL_SemanticAdaptation/be.uantwerpen.ansymo.semanticadaptation.testframework/pom.xml under be/uantwerpen/ansymo/semanticadaptation/be.uantwerpen.ansymo.semanticadaptation.testframework/1.0.0-SNAPSHOT/be.uantwerpen.ansymo.semanticadaptation.testframework-1.0.0-SNAPSHOT.pom
[withMaven] artifactsPublisher - Archive artifact DSL_SemanticAdaptation/be.uantwerpen.ansymo.semanticadaptation.testframework/target/be.uantwerpen.ansymo.semanticadaptation.testframework-1.0.0-SNAPSHOT.jar under be/uantwerpen/ansymo/semanticadaptation/be.uantwerpen.ansymo.semanticadaptation.testframework/1.0.0-SNAPSHOT/be.uantwerpen.ansymo.semanticadaptation.testframework-1.0.0-SNAPSHOT.jar
[withMaven] artifactsPublisher - Archive artifact DSL_SemanticAdaptation/be.uantwerpen.ansymo.semanticadaptation.log/pom.xml under be/uantwerpen/ansymo/semanticadaptation/be.uantwerpen.ansymo.semanticadaptation.log/1.0.0-SNAPSHOT/be.uantwerpen.ansymo.semanticadaptation.log-1.0.0-SNAPSHOT.pom
[withMaven] artifactsPublisher - Archive artifact DSL_SemanticAdaptation/be.uantwerpen.ansymo.semanticadaptation.log/target/be.uantwerpen.ansymo.semanticadaptation.log-1.0.0-SNAPSHOT.jar under be/uantwerpen/ansymo/semanticadaptation/be.uantwerpen.ansymo.semanticadaptation.log/1.0.0-SNAPSHOT/be.uantwerpen.ansymo.semanticadaptation.log-1.0.0-SNAPSHOT.jar
[withMaven] artifactsPublisher - Archive artifact DSL_SemanticAdaptation/be.uantwerpen.ansymo.semanticadaptation/pom.xml under be/uantwerpen/ansymo/semanticadaptation/be.uantwerpen.ansymo.semanticadaptation/1.0.0-SNAPSHOT/be.uantwerpen.ansymo.semanticadaptation-1.0.0-SNAPSHOT.pom
[withMaven] artifactsPublisher - Archive artifact DSL_SemanticAdaptation/be.uantwerpen.ansymo.semanticadaptation/target/be.uantwerpen.ansymo.semanticadaptation-1.0.0-SNAPSHOT.jar under be/uantwerpen/ansymo/semanticadaptation/be.uantwerpen.ansymo.semanticadaptation/1.0.0-SNAPSHOT/be.uantwerpen.ansymo.semanticadaptation-1.0.0-SNAPSHOT.jar
[withMaven] artifactsPublisher - Archive artifact DSL_SemanticAdaptation/be.uantwerpen.ansymo.semanticadaptation.cg.canonical/pom.xml under be/uantwerpen/ansymo/semanticadaptation/be.uantwerpen.ansymo.semanticadaptation.cg.canonical/1.0.0-SNAPSHOT/be.uantwerpen.ansymo.semanticadaptation.cg.canonical-1.0.0-SNAPSHOT.pom
[withMaven] artifactsPublisher - Archive artifact DSL_SemanticAdaptation/be.uantwerpen.ansymo.semanticadaptation.cg.canonical/target/be.uantwerpen.ansymo.semanticadaptation.cg.canonical-1.0.0-SNAPSHOT.jar under be/uantwerpen/ansymo/semanticadaptation/be.uantwerpen.ansymo.semanticadaptation.cg.canonical/1.0.0-SNAPSHOT/be.uantwerpen.ansymo.semanticadaptation.cg.canonical-1.0.0-SNAPSHOT.jar
[withMaven] artifactsPublisher - Archive artifact DSL_SemanticAdaptation/be.uantwerpen.ansymo.semanticadaptation.testframework/target/p2content.xml under be/uantwerpen/ansymo/semanticadaptation/be.uantwerpen.ansymo.semanticadaptation.testframework/1.0.0-SNAPSHOT/be.uantwerpen.ansymo.semanticadaptation.testframework-1.0.0-SNAPSHOT-p2metadata.xml
[withMaven] artifactsPublisher - Archive artifact DSL_SemanticAdaptation/be.uantwerpen.ansymo.semanticadaptation.testframework/target/p2artifacts.xml under be/uantwerpen/ansymo/semanticadaptation/be.uantwerpen.ansymo.semanticadaptation.testframework/1.0.0-SNAPSHOT/be.uantwerpen.ansymo.semanticadaptation.testframework-1.0.0-SNAPSHOT-p2artifacts.xml
[withMaven] artifactsPublisher - Archive artifact DSL_SemanticAdaptation/be.uantwerpen.ansymo.semanticadaptation.log/target/p2content.xml under be/uantwerpen/ansymo/semanticadaptation/be.uantwerpen.ansymo.semanticadaptation.log/1.0.0-SNAPSHOT/be.uantwerpen.ansymo.semanticadaptation.log-1.0.0-SNAPSHOT-p2metadata.xml
[withMaven] artifactsPublisher - Archive artifact DSL_SemanticAdaptation/be.uantwerpen.ansymo.semanticadaptation.log/target/p2artifacts.xml under be/uantwerpen/ansymo/semanticadaptation/be.uantwerpen.ansymo.semanticadaptation.log/1.0.0-SNAPSHOT/be.uantwerpen.ansymo.semanticadaptation.log-1.0.0-SNAPSHOT-p2artifacts.xml
[withMaven] artifactsPublisher - Archive artifact DSL_SemanticAdaptation/be.uantwerpen.ansymo.semanticadaptation/target/p2content.xml under be/uantwerpen/ansymo/semanticadaptation/be.uantwerpen.ansymo.semanticadaptation/1.0.0-SNAPSHOT/be.uantwerpen.ansymo.semanticadaptation-1.0.0-SNAPSHOT-p2metadata.xml
[withMaven] artifactsPublisher - Archive artifact DSL_SemanticAdaptation/be.uantwerpen.ansymo.semanticadaptation/target/p2artifacts.xml under be/uantwerpen/ansymo/semanticadaptation/be.uantwerpen.ansymo.semanticadaptation/1.0.0-SNAPSHOT/be.uantwerpen.ansymo.semanticadaptation-1.0.0-SNAPSHOT-p2artifacts.xml
[withMaven] artifactsPublisher - Archive artifact DSL_SemanticAdaptation/be.uantwerpen.ansymo.semanticadaptation.cg.canonical/target/p2content.xml under be/uantwerpen/ansymo/semanticadaptation/be.uantwerpen.ansymo.semanticadaptation.cg.canonical/1.0.0-SNAPSHOT/be.uantwerpen.ansymo.semanticadaptation.cg.canonical-1.0.0-SNAPSHOT-p2metadata.xml
[withMaven] artifactsPublisher - Archive artifact DSL_SemanticAdaptation/be.uantwerpen.ansymo.semanticadaptation.cg.canonical/target/p2artifacts.xml under be/uantwerpen/ansymo/semanticadaptation/be.uantwerpen.ansymo.semanticadaptation.cg.canonical/1.0.0-SNAPSHOT/be.uantwerpen.ansymo.semanticadaptation.cg.canonical-1.0.0-SNAPSHOT-p2artifacts.xml
[TASKS] Scanning folder '/var/lib/jenkins/workspace/HybridCosimulation_master-LDEVB56LP46DTRNYHQSCKMS3FR4JD6RBBK6S2LPONMGDZRBJQH3A@2' for files matching the pattern '**/*.java' - excludes: null
[TASKS] Found 397 files to scan for tasks
[TASKS] Found 27 open tasks.
Skipping warnings blame since pipelines do not have an SCM link.%n
[TASKS] Computing warning deltas based on reference build #142
[Pipeline] // withMaven
[Pipeline] }
[Pipeline] // stage
[Pipeline] stage
[Pipeline] { (Reporting)
[Pipeline] emailextrecipients
Not sending mail to user casper.thule@eng.au.dk with no permission to view HybridCosimulation » master #146[Pipeline] emailext
Sending email to: lausdahl@eng.au.dk
[Pipeline] }
[Pipeline] // stage
[Pipeline] }
[Pipeline] // node
[Pipeline] End of Pipeline
ERROR: script returned exit code 1
Finished: FAILURE