FailedConsole Output

Skipping 41 KB.. Full Log
z2kMPbfk/9GAAAAYx+LCAAAAAAAAP9b85aBtbiIQSWjNKU4P0+vJLE4u1gvPjexLDVPzxdEhicW5WXmpfvll6S2fNly5fzGzauYGBgqihikoFqS8/OK83NS9ZwhNEghAwQwghQWAACwxA+XYgAAAA==[WARNING] 'build.plugins.plugin.version' for org.apache.maven.plugins:maven-jarsigner-plugin is missing. @ be.uantwerpen.ansymo.semanticadaptation:parent:1.0.0-SNAPSHOT, /var/lib/jenkins/workspace/HybridCosimulation_master-LDEVB56LP46DTRNYHQSCKMS3FR4JD6RBBK6S2LPONMGDZRBJQH3A@2/DSL_SemanticAdaptation/pom.xml, line 480, column 19
[WARNING] 
[WARNING] Some problems were encountered while building the effective model for be.uantwerpen.ansymo.semanticadaptation:be.uantwerpen.ansymo.semanticadaptation.cg.cpp.tests:eclipse-test-plugin:1.0.0-SNAPSHOT
[WARNING] 'build.plugins.plugin.version' for org.apache.maven.plugins:maven-jarsigner-plugin is missing. @ be.uantwerpen.ansymo.semanticadaptation:parent:1.0.0-SNAPSHOT, /var/lib/jenkins/workspace/HybridCosimulation_master-LDEVB56LP46DTRNYHQSCKMS3FR4JD6RBBK6S2LPONMGDZRBJQH3A@2/DSL_SemanticAdaptation/pom.xml, line 480, column 19
[WARNING] 
[WARNING] Some problems were encountered while building the effective model for be.uantwerpen.ansymo.semanticadaptation:be.uantwerpen.ansymo.semanticadaptation.cg.canonical.tests:eclipse-test-plugin:1.0.0-SNAPSHOT
[WARNING] 'build.plugins.plugin.version' for org.apache.maven.plugins:maven-jarsigner-plugin is missing. @ be.uantwerpen.ansymo.semanticadaptation:parent:1.0.0-SNAPSHOT, /var/lib/jenkins/workspace/HybridCosimulation_master-LDEVB56LP46DTRNYHQSCKMS3FR4JD6RBBK6S2LPONMGDZRBJQH3A@2/DSL_SemanticAdaptation/pom.xml, line 480, column 19
[WARNING] 
[WARNING] Some problems were encountered while building the effective model for be.uantwerpen.ansymo.semanticadaptation.features:be.uantwerpen.ansymo.semanticadaptation.features.core:eclipse-feature:1.0.0-SNAPSHOT
[WARNING] 'build.plugins.plugin.version' for org.apache.maven.plugins:maven-jarsigner-plugin is missing. @ be.uantwerpen.ansymo.semanticadaptation:parent:1.0.0-SNAPSHOT, /var/lib/jenkins/workspace/HybridCosimulation_master-LDEVB56LP46DTRNYHQSCKMS3FR4JD6RBBK6S2LPONMGDZRBJQH3A@2/DSL_SemanticAdaptation/pom.xml, line 480, column 19
[WARNING] 
[WARNING] Some problems were encountered while building the effective model for be.uantwerpen.ansymo.semanticadaptation:be.uantwerpen.ansymo.semanticadaptation.features:pom:1.0.0-SNAPSHOT
[WARNING] 'build.plugins.plugin.version' for org.apache.maven.plugins:maven-jarsigner-plugin is missing. @ be.uantwerpen.ansymo.semanticadaptation:parent:1.0.0-SNAPSHOT, /var/lib/jenkins/workspace/HybridCosimulation_master-LDEVB56LP46DTRNYHQSCKMS3FR4JD6RBBK6S2LPONMGDZRBJQH3A@2/DSL_SemanticAdaptation/pom.xml, line 480, column 19
[WARNING] 
[WARNING] Some problems were encountered while building the effective model for be.uantwerpen.ansymo.semanticadaptation:be.uantwerpen.ansymo.semanticadaptation.repository:eclipse-repository:1.0.0-SNAPSHOT
[WARNING] 'build.plugins.plugin.version' for org.apache.maven.plugins:maven-jarsigner-plugin is missing. @ be.uantwerpen.ansymo.semanticadaptation:parent:1.0.0-SNAPSHOT, /var/lib/jenkins/workspace/HybridCosimulation_master-LDEVB56LP46DTRNYHQSCKMS3FR4JD6RBBK6S2LPONMGDZRBJQH3A@2/DSL_SemanticAdaptation/pom.xml, line 480, column 19
[WARNING] 
[WARNING] Some problems were encountered while building the effective model for be.uantwerpen.ansymo.semanticadaptation.ide:be.uantwerpen.ansymo.semanticadaptation.ide.platform:eclipse-plugin:1.0.0-SNAPSHOT
[WARNING] 'build.plugins.plugin.version' for org.apache.maven.plugins:maven-jarsigner-plugin is missing. @ be.uantwerpen.ansymo.semanticadaptation:parent:1.0.0-SNAPSHOT, /var/lib/jenkins/workspace/HybridCosimulation_master-LDEVB56LP46DTRNYHQSCKMS3FR4JD6RBBK6S2LPONMGDZRBJQH3A@2/DSL_SemanticAdaptation/pom.xml, line 480, column 19
[WARNING] 
[WARNING] Some problems were encountered while building the effective model for be.uantwerpen.ansymo.semanticadaptation.ide:be.uantwerpen.ansymo.semanticadaptation.product:eclipse-repository:1.0.0-SNAPSHOT
[WARNING] 'build.plugins.plugin.version' for org.apache.maven.plugins:maven-jarsigner-plugin is missing. @ be.uantwerpen.ansymo.semanticadaptation:parent:1.0.0-SNAPSHOT, /var/lib/jenkins/workspace/HybridCosimulation_master-LDEVB56LP46DTRNYHQSCKMS3FR4JD6RBBK6S2LPONMGDZRBJQH3A@2/DSL_SemanticAdaptation/pom.xml, line 480, column 19
[WARNING] 
[WARNING] Some problems were encountered while building the effective model for be.uantwerpen.ansymo.semanticadaptation:parent:pom:1.0.0-SNAPSHOT
[WARNING] 'build.plugins.plugin.version' for org.apache.maven.plugins:maven-jarsigner-plugin is missing. @ line 480, column 19
[WARNING] 
[WARNING] It is highly recommended to fix these problems because they threaten the stability of your build.
[WARNING] 
[WARNING] For this reason, future Maven versions might no longer support building such malformed projects.
[WARNING] 
[INFO] Computing target platform for MavenProject: be.uantwerpen.ansymo.semanticadaptation:be.uantwerpen.ansymo.semanticadaptation.testframework:1.0.0-SNAPSHOT @ /var/lib/jenkins/workspace/HybridCosimulation_master-LDEVB56LP46DTRNYHQSCKMS3FR4JD6RBBK6S2LPONMGDZRBJQH3A@2/DSL_SemanticAdaptation/be.uantwerpen.ansymo.semanticadaptation.testframework/pom.xml
[INFO] Fetching p2.index from http://download.eclipse.org/releases/neon/
[INFO] Fetching p2.index from http://download.eclipse.org/releases/neon/
[INFO] Adding repository http://download.eclipse.org/releases/neon
[INFO] Fetching p2.index from http://download.eclipse.org/technology/epp/packages/neon/
[INFO] Fetching p2.index from http://download.eclipse.org/technology/epp/packages/neon/
[INFO] Fetching p2.index from http://download.eclipse.org/releases/neon/201705151400/
[INFO] Fetching p2.index from http://download.eclipse.org/releases/neon/201705151400/
[INFO] Fetching p2.index from http://download.eclipse.org/releases/neon/201703141400/
[INFO] Fetching p2.index from http://download.eclipse.org/releases/neon/201703141400/
[INFO] Fetching p2.index from http://download.eclipse.org/releases/neon/201703231000/
[INFO] Fetching p2.index from http://download.eclipse.org/releases/neon/201703231000/
[INFO] Fetching p2.index from http://download.eclipse.org/releases/neon/201606221000/
[INFO] Fetching p2.index from http://download.eclipse.org/releases/neon/201606221000/
[INFO] Fetching p2.index from http://download.eclipse.org/releases/neon/201609281000/
[INFO] Fetching p2.index from http://download.eclipse.org/releases/neon/201609281000/
[INFO] Fetching p2.index from http://download.eclipse.org/releases/neon/201610111000/
[INFO] Fetching p2.index from http://download.eclipse.org/releases/neon/201610111000/
[INFO] Fetching p2.index from http://download.eclipse.org/releases/neon/201612211000/
[INFO] Fetching p2.index from http://download.eclipse.org/releases/neon/201612211000/
[INFO] Fetching p2.index from http://download.eclipse.org/modeling/tmf/xtext/updates/releases/2.11.0/
[INFO] Fetching p2.index from http://download.eclipse.org/modeling/tmf/xtext/updates/releases/2.11.0/
[INFO] Adding repository http://download.eclipse.org/modeling/tmf/xtext/updates/releases/2.11.0
[INFO] Resolving dependencies of MavenProject: be.uantwerpen.ansymo.semanticadaptation:be.uantwerpen.ansymo.semanticadaptation.testframework:1.0.0-SNAPSHOT @ /var/lib/jenkins/workspace/HybridCosimulation_master-LDEVB56LP46DTRNYHQSCKMS3FR4JD6RBBK6S2LPONMGDZRBJQH3A@2/DSL_SemanticAdaptation/be.uantwerpen.ansymo.semanticadaptation.testframework/pom.xml
[INFO] Resolving class path of MavenProject: be.uantwerpen.ansymo.semanticadaptation:be.uantwerpen.ansymo.semanticadaptation.testframework:1.0.0-SNAPSHOT @ /var/lib/jenkins/workspace/HybridCosimulation_master-LDEVB56LP46DTRNYHQSCKMS3FR4JD6RBBK6S2LPONMGDZRBJQH3A@2/DSL_SemanticAdaptation/be.uantwerpen.ansymo.semanticadaptation.testframework/pom.xml
[INFO] Computing target platform for MavenProject: be.uantwerpen.ansymo.semanticadaptation:be.uantwerpen.ansymo.semanticadaptation:1.0.0-SNAPSHOT @ /var/lib/jenkins/workspace/HybridCosimulation_master-LDEVB56LP46DTRNYHQSCKMS3FR4JD6RBBK6S2LPONMGDZRBJQH3A@2/DSL_SemanticAdaptation/be.uantwerpen.ansymo.semanticadaptation/pom.xml
[INFO] Resolving dependencies of MavenProject: be.uantwerpen.ansymo.semanticadaptation:be.uantwerpen.ansymo.semanticadaptation:1.0.0-SNAPSHOT @ /var/lib/jenkins/workspace/HybridCosimulation_master-LDEVB56LP46DTRNYHQSCKMS3FR4JD6RBBK6S2LPONMGDZRBJQH3A@2/DSL_SemanticAdaptation/be.uantwerpen.ansymo.semanticadaptation/pom.xml
[INFO] Resolving class path of MavenProject: be.uantwerpen.ansymo.semanticadaptation:be.uantwerpen.ansymo.semanticadaptation:1.0.0-SNAPSHOT @ /var/lib/jenkins/workspace/HybridCosimulation_master-LDEVB56LP46DTRNYHQSCKMS3FR4JD6RBBK6S2LPONMGDZRBJQH3A@2/DSL_SemanticAdaptation/be.uantwerpen.ansymo.semanticadaptation/pom.xml
[INFO] Computing target platform for MavenProject: be.uantwerpen.ansymo.semanticadaptation:be.uantwerpen.ansymo.semanticadaptation.log:1.0.0-SNAPSHOT @ /var/lib/jenkins/workspace/HybridCosimulation_master-LDEVB56LP46DTRNYHQSCKMS3FR4JD6RBBK6S2LPONMGDZRBJQH3A@2/DSL_SemanticAdaptation/be.uantwerpen.ansymo.semanticadaptation.log/pom.xml
[INFO] Resolving dependencies of MavenProject: be.uantwerpen.ansymo.semanticadaptation:be.uantwerpen.ansymo.semanticadaptation.log:1.0.0-SNAPSHOT @ /var/lib/jenkins/workspace/HybridCosimulation_master-LDEVB56LP46DTRNYHQSCKMS3FR4JD6RBBK6S2LPONMGDZRBJQH3A@2/DSL_SemanticAdaptation/be.uantwerpen.ansymo.semanticadaptation.log/pom.xml
[INFO] Resolving class path of MavenProject: be.uantwerpen.ansymo.semanticadaptation:be.uantwerpen.ansymo.semanticadaptation.log:1.0.0-SNAPSHOT @ /var/lib/jenkins/workspace/HybridCosimulation_master-LDEVB56LP46DTRNYHQSCKMS3FR4JD6RBBK6S2LPONMGDZRBJQH3A@2/DSL_SemanticAdaptation/be.uantwerpen.ansymo.semanticadaptation.log/pom.xml
[INFO] Computing target platform for MavenProject: be.uantwerpen.ansymo.semanticadaptation:be.uantwerpen.ansymo.semanticadaptation.cg.chain:1.0.0-SNAPSHOT @ /var/lib/jenkins/workspace/HybridCosimulation_master-LDEVB56LP46DTRNYHQSCKMS3FR4JD6RBBK6S2LPONMGDZRBJQH3A@2/DSL_SemanticAdaptation/be.uantwerpen.ansymo.semanticadaptation.cg.chain/pom.xml
[INFO] Resolving dependencies of MavenProject: be.uantwerpen.ansymo.semanticadaptation:be.uantwerpen.ansymo.semanticadaptation.cg.chain:1.0.0-SNAPSHOT @ /var/lib/jenkins/workspace/HybridCosimulation_master-LDEVB56LP46DTRNYHQSCKMS3FR4JD6RBBK6S2LPONMGDZRBJQH3A@2/DSL_SemanticAdaptation/be.uantwerpen.ansymo.semanticadaptation.cg.chain/pom.xml
[INFO] Resolving class path of MavenProject: be.uantwerpen.ansymo.semanticadaptation:be.uantwerpen.ansymo.semanticadaptation.cg.chain:1.0.0-SNAPSHOT @ /var/lib/jenkins/workspace/HybridCosimulation_master-LDEVB56LP46DTRNYHQSCKMS3FR4JD6RBBK6S2LPONMGDZRBJQH3A@2/DSL_SemanticAdaptation/be.uantwerpen.ansymo.semanticadaptation.cg.chain/pom.xml
[INFO] Computing target platform for MavenProject: be.uantwerpen.ansymo.semanticadaptation:be.uantwerpen.ansymo.semanticadaptation.tests:1.0.0-SNAPSHOT @ /var/lib/jenkins/workspace/HybridCosimulation_master-LDEVB56LP46DTRNYHQSCKMS3FR4JD6RBBK6S2LPONMGDZRBJQH3A@2/DSL_SemanticAdaptation/be.uantwerpen.ansymo.semanticadaptation.tests/pom.xml
[INFO] Resolving dependencies of MavenProject: be.uantwerpen.ansymo.semanticadaptation:be.uantwerpen.ansymo.semanticadaptation.tests:1.0.0-SNAPSHOT @ /var/lib/jenkins/workspace/HybridCosimulation_master-LDEVB56LP46DTRNYHQSCKMS3FR4JD6RBBK6S2LPONMGDZRBJQH3A@2/DSL_SemanticAdaptation/be.uantwerpen.ansymo.semanticadaptation.tests/pom.xml
[INFO] Resolving class path of MavenProject: be.uantwerpen.ansymo.semanticadaptation:be.uantwerpen.ansymo.semanticadaptation.tests:1.0.0-SNAPSHOT @ /var/lib/jenkins/workspace/HybridCosimulation_master-LDEVB56LP46DTRNYHQSCKMS3FR4JD6RBBK6S2LPONMGDZRBJQH3A@2/DSL_SemanticAdaptation/be.uantwerpen.ansymo.semanticadaptation.tests/pom.xml
[INFO] Computing target platform for MavenProject: be.uantwerpen.ansymo.semanticadaptation:be.uantwerpen.ansymo.semanticadaptation.ide:1.0.0-SNAPSHOT @ /var/lib/jenkins/workspace/HybridCosimulation_master-LDEVB56LP46DTRNYHQSCKMS3FR4JD6RBBK6S2LPONMGDZRBJQH3A@2/DSL_SemanticAdaptation/be.uantwerpen.ansymo.semanticadaptation.ide/pom.xml
[INFO] Resolving dependencies of MavenProject: be.uantwerpen.ansymo.semanticadaptation:be.uantwerpen.ansymo.semanticadaptation.ide:1.0.0-SNAPSHOT @ /var/lib/jenkins/workspace/HybridCosimulation_master-LDEVB56LP46DTRNYHQSCKMS3FR4JD6RBBK6S2LPONMGDZRBJQH3A@2/DSL_SemanticAdaptation/be.uantwerpen.ansymo.semanticadaptation.ide/pom.xml
[INFO] Resolving class path of MavenProject: be.uantwerpen.ansymo.semanticadaptation:be.uantwerpen.ansymo.semanticadaptation.ide:1.0.0-SNAPSHOT @ /var/lib/jenkins/workspace/HybridCosimulation_master-LDEVB56LP46DTRNYHQSCKMS3FR4JD6RBBK6S2LPONMGDZRBJQH3A@2/DSL_SemanticAdaptation/be.uantwerpen.ansymo.semanticadaptation.ide/pom.xml
[INFO] Computing target platform for MavenProject: be.uantwerpen.ansymo.semanticadaptation:be.uantwerpen.ansymo.semanticadaptation.ui:1.0.0-SNAPSHOT @ /var/lib/jenkins/workspace/HybridCosimulation_master-LDEVB56LP46DTRNYHQSCKMS3FR4JD6RBBK6S2LPONMGDZRBJQH3A@2/DSL_SemanticAdaptation/be.uantwerpen.ansymo.semanticadaptation.ui/pom.xml
[INFO] Resolving dependencies of MavenProject: be.uantwerpen.ansymo.semanticadaptation:be.uantwerpen.ansymo.semanticadaptation.ui:1.0.0-SNAPSHOT @ /var/lib/jenkins/workspace/HybridCosimulation_master-LDEVB56LP46DTRNYHQSCKMS3FR4JD6RBBK6S2LPONMGDZRBJQH3A@2/DSL_SemanticAdaptation/be.uantwerpen.ansymo.semanticadaptation.ui/pom.xml
[INFO] Resolving class path of MavenProject: be.uantwerpen.ansymo.semanticadaptation:be.uantwerpen.ansymo.semanticadaptation.ui:1.0.0-SNAPSHOT @ /var/lib/jenkins/workspace/HybridCosimulation_master-LDEVB56LP46DTRNYHQSCKMS3FR4JD6RBBK6S2LPONMGDZRBJQH3A@2/DSL_SemanticAdaptation/be.uantwerpen.ansymo.semanticadaptation.ui/pom.xml
[INFO] Computing target platform for MavenProject: be.uantwerpen.ansymo.semanticadaptation:be.uantwerpen.ansymo.semanticadaptation.cg.cpp:1.0.0-SNAPSHOT @ /var/lib/jenkins/workspace/HybridCosimulation_master-LDEVB56LP46DTRNYHQSCKMS3FR4JD6RBBK6S2LPONMGDZRBJQH3A@2/DSL_SemanticAdaptation/be.uantwerpen.ansymo.semanticadaptation.cg.cpp/pom.xml
[INFO] Resolving dependencies of MavenProject: be.uantwerpen.ansymo.semanticadaptation:be.uantwerpen.ansymo.semanticadaptation.cg.cpp:1.0.0-SNAPSHOT @ /var/lib/jenkins/workspace/HybridCosimulation_master-LDEVB56LP46DTRNYHQSCKMS3FR4JD6RBBK6S2LPONMGDZRBJQH3A@2/DSL_SemanticAdaptation/be.uantwerpen.ansymo.semanticadaptation.cg.cpp/pom.xml
[INFO] Resolving class path of MavenProject: be.uantwerpen.ansymo.semanticadaptation:be.uantwerpen.ansymo.semanticadaptation.cg.cpp:1.0.0-SNAPSHOT @ /var/lib/jenkins/workspace/HybridCosimulation_master-LDEVB56LP46DTRNYHQSCKMS3FR4JD6RBBK6S2LPONMGDZRBJQH3A@2/DSL_SemanticAdaptation/be.uantwerpen.ansymo.semanticadaptation.cg.cpp/pom.xml
[INFO] Computing target platform for MavenProject: be.uantwerpen.ansymo.semanticadaptation:be.uantwerpen.ansymo.semanticadaptation.cg.canonical:1.0.0-SNAPSHOT @ /var/lib/jenkins/workspace/HybridCosimulation_master-LDEVB56LP46DTRNYHQSCKMS3FR4JD6RBBK6S2LPONMGDZRBJQH3A@2/DSL_SemanticAdaptation/be.uantwerpen.ansymo.semanticadaptation.cg.canonical/pom.xml
[INFO] Resolving dependencies of MavenProject: be.uantwerpen.ansymo.semanticadaptation:be.uantwerpen.ansymo.semanticadaptation.cg.canonical:1.0.0-SNAPSHOT @ /var/lib/jenkins/workspace/HybridCosimulation_master-LDEVB56LP46DTRNYHQSCKMS3FR4JD6RBBK6S2LPONMGDZRBJQH3A@2/DSL_SemanticAdaptation/be.uantwerpen.ansymo.semanticadaptation.cg.canonical/pom.xml
[INFO] Resolving class path of MavenProject: be.uantwerpen.ansymo.semanticadaptation:be.uantwerpen.ansymo.semanticadaptation.cg.canonical:1.0.0-SNAPSHOT @ /var/lib/jenkins/workspace/HybridCosimulation_master-LDEVB56LP46DTRNYHQSCKMS3FR4JD6RBBK6S2LPONMGDZRBJQH3A@2/DSL_SemanticAdaptation/be.uantwerpen.ansymo.semanticadaptation.cg.canonical/pom.xml
[INFO] Computing target platform for MavenProject: be.uantwerpen.ansymo.semanticadaptation:be.uantwerpen.ansymo.semanticadaptation.cg.cpp.tests:1.0.0-SNAPSHOT @ /var/lib/jenkins/workspace/HybridCosimulation_master-LDEVB56LP46DTRNYHQSCKMS3FR4JD6RBBK6S2LPONMGDZRBJQH3A@2/DSL_SemanticAdaptation/be.uantwerpen.ansymo.semanticadaptation.cg.cpp.tests/pom.xml
[INFO] Resolving dependencies of MavenProject: be.uantwerpen.ansymo.semanticadaptation:be.uantwerpen.ansymo.semanticadaptation.cg.cpp.tests:1.0.0-SNAPSHOT @ /var/lib/jenkins/workspace/HybridCosimulation_master-LDEVB56LP46DTRNYHQSCKMS3FR4JD6RBBK6S2LPONMGDZRBJQH3A@2/DSL_SemanticAdaptation/be.uantwerpen.ansymo.semanticadaptation.cg.cpp.tests/pom.xml
[INFO] Resolving class path of MavenProject: be.uantwerpen.ansymo.semanticadaptation:be.uantwerpen.ansymo.semanticadaptation.cg.cpp.tests:1.0.0-SNAPSHOT @ /var/lib/jenkins/workspace/HybridCosimulation_master-LDEVB56LP46DTRNYHQSCKMS3FR4JD6RBBK6S2LPONMGDZRBJQH3A@2/DSL_SemanticAdaptation/be.uantwerpen.ansymo.semanticadaptation.cg.cpp.tests/pom.xml
[INFO] Computing target platform for MavenProject: be.uantwerpen.ansymo.semanticadaptation:be.uantwerpen.ansymo.semanticadaptation.cg.canonical.tests:1.0.0-SNAPSHOT @ /var/lib/jenkins/workspace/HybridCosimulation_master-LDEVB56LP46DTRNYHQSCKMS3FR4JD6RBBK6S2LPONMGDZRBJQH3A@2/DSL_SemanticAdaptation/be.uantwerpen.ansymo.semanticadaptation.cg.canonical.tests/pom.xml
[INFO] Resolving dependencies of MavenProject: be.uantwerpen.ansymo.semanticadaptation:be.uantwerpen.ansymo.semanticadaptation.cg.canonical.tests:1.0.0-SNAPSHOT @ /var/lib/jenkins/workspace/HybridCosimulation_master-LDEVB56LP46DTRNYHQSCKMS3FR4JD6RBBK6S2LPONMGDZRBJQH3A@2/DSL_SemanticAdaptation/be.uantwerpen.ansymo.semanticadaptation.cg.canonical.tests/pom.xml
[INFO] Resolving class path of MavenProject: be.uantwerpen.ansymo.semanticadaptation:be.uantwerpen.ansymo.semanticadaptation.cg.canonical.tests:1.0.0-SNAPSHOT @ /var/lib/jenkins/workspace/HybridCosimulation_master-LDEVB56LP46DTRNYHQSCKMS3FR4JD6RBBK6S2LPONMGDZRBJQH3A@2/DSL_SemanticAdaptation/be.uantwerpen.ansymo.semanticadaptation.cg.canonical.tests/pom.xml
[INFO] Computing target platform for MavenProject: be.uantwerpen.ansymo.semanticadaptation.features:be.uantwerpen.ansymo.semanticadaptation.features.core:1.0.0-SNAPSHOT @ /var/lib/jenkins/workspace/HybridCosimulation_master-LDEVB56LP46DTRNYHQSCKMS3FR4JD6RBBK6S2LPONMGDZRBJQH3A@2/DSL_SemanticAdaptation/features/core/pom.xml
[INFO] Resolving dependencies of MavenProject: be.uantwerpen.ansymo.semanticadaptation.features:be.uantwerpen.ansymo.semanticadaptation.features.core:1.0.0-SNAPSHOT @ /var/lib/jenkins/workspace/HybridCosimulation_master-LDEVB56LP46DTRNYHQSCKMS3FR4JD6RBBK6S2LPONMGDZRBJQH3A@2/DSL_SemanticAdaptation/features/core/pom.xml
[INFO] Resolving class path of MavenProject: be.uantwerpen.ansymo.semanticadaptation.features:be.uantwerpen.ansymo.semanticadaptation.features.core:1.0.0-SNAPSHOT @ /var/lib/jenkins/workspace/HybridCosimulation_master-LDEVB56LP46DTRNYHQSCKMS3FR4JD6RBBK6S2LPONMGDZRBJQH3A@2/DSL_SemanticAdaptation/features/core/pom.xml
[INFO] Computing target platform for MavenProject: be.uantwerpen.ansymo.semanticadaptation:be.uantwerpen.ansymo.semanticadaptation.repository:1.0.0-SNAPSHOT @ /var/lib/jenkins/workspace/HybridCosimulation_master-LDEVB56LP46DTRNYHQSCKMS3FR4JD6RBBK6S2LPONMGDZRBJQH3A@2/DSL_SemanticAdaptation/repository/pom.xml
[INFO] Resolving dependencies of MavenProject: be.uantwerpen.ansymo.semanticadaptation:be.uantwerpen.ansymo.semanticadaptation.repository:1.0.0-SNAPSHOT @ /var/lib/jenkins/workspace/HybridCosimulation_master-LDEVB56LP46DTRNYHQSCKMS3FR4JD6RBBK6S2LPONMGDZRBJQH3A@2/DSL_SemanticAdaptation/repository/pom.xml
[INFO] Resolving class path of MavenProject: be.uantwerpen.ansymo.semanticadaptation:be.uantwerpen.ansymo.semanticadaptation.repository:1.0.0-SNAPSHOT @ /var/lib/jenkins/workspace/HybridCosimulation_master-LDEVB56LP46DTRNYHQSCKMS3FR4JD6RBBK6S2LPONMGDZRBJQH3A@2/DSL_SemanticAdaptation/repository/pom.xml
[INFO] Computing target platform for MavenProject: be.uantwerpen.ansymo.semanticadaptation.ide:be.uantwerpen.ansymo.semanticadaptation.ide.platform:1.0.0-SNAPSHOT @ /var/lib/jenkins/workspace/HybridCosimulation_master-LDEVB56LP46DTRNYHQSCKMS3FR4JD6RBBK6S2LPONMGDZRBJQH3A@2/DSL_SemanticAdaptation/platform/pom.xml
[INFO] Resolving dependencies of MavenProject: be.uantwerpen.ansymo.semanticadaptation.ide:be.uantwerpen.ansymo.semanticadaptation.ide.platform:1.0.0-SNAPSHOT @ /var/lib/jenkins/workspace/HybridCosimulation_master-LDEVB56LP46DTRNYHQSCKMS3FR4JD6RBBK6S2LPONMGDZRBJQH3A@2/DSL_SemanticAdaptation/platform/pom.xml
[INFO] Resolving class path of MavenProject: be.uantwerpen.ansymo.semanticadaptation.ide:be.uantwerpen.ansymo.semanticadaptation.ide.platform:1.0.0-SNAPSHOT @ /var/lib/jenkins/workspace/HybridCosimulation_master-LDEVB56LP46DTRNYHQSCKMS3FR4JD6RBBK6S2LPONMGDZRBJQH3A@2/DSL_SemanticAdaptation/platform/pom.xml
[INFO] Computing target platform for MavenProject: be.uantwerpen.ansymo.semanticadaptation.ide:be.uantwerpen.ansymo.semanticadaptation.product:1.0.0-SNAPSHOT @ /var/lib/jenkins/workspace/HybridCosimulation_master-LDEVB56LP46DTRNYHQSCKMS3FR4JD6RBBK6S2LPONMGDZRBJQH3A@2/DSL_SemanticAdaptation/product/pom.xml
[INFO] Resolving dependencies of MavenProject: be.uantwerpen.ansymo.semanticadaptation.ide:be.uantwerpen.ansymo.semanticadaptation.product:1.0.0-SNAPSHOT @ /var/lib/jenkins/workspace/HybridCosimulation_master-LDEVB56LP46DTRNYHQSCKMS3FR4JD6RBBK6S2LPONMGDZRBJQH3A@2/DSL_SemanticAdaptation/product/pom.xml
[INFO] Resolving class path of MavenProject: be.uantwerpen.ansymo.semanticadaptation.ide:be.uantwerpen.ansymo.semanticadaptation.product:1.0.0-SNAPSHOT @ /var/lib/jenkins/workspace/HybridCosimulation_master-LDEVB56LP46DTRNYHQSCKMS3FR4JD6RBBK6S2LPONMGDZRBJQH3A@2/DSL_SemanticAdaptation/product/pom.xml
[INFO] ------------------------------------------------------------------------
[INFO] Reactor Build Order:
[INFO] 
[INFO] Semantics Adaptation Root
[INFO] be.uantwerpen.ansymo.semanticadaptation Testframework
[INFO] be.uantwerpen.ansymo.semanticadaptation Logger
[INFO] be.uantwerpen.ansymo.semanticadaptation Language Core
[INFO] be.uantwerpen.ansymo.semanticadaptation Canonical Generator
[INFO] be.uantwerpen.ansymo.semanticadaptation Code Generation to C++
[INFO] be.uantwerpen.ansymo.semanticadaptation Code Generator
[INFO] be.uantwerpen.ansymo.semanticadaptation Language Tests
[INFO] be.uantwerpen.ansymo.semanticadaptation.ide
[INFO] be.uantwerpen.ansymo.semanticadaptation.ui Language UI
[INFO] be.uantwerpen.ansymo.semanticadaptation Code Generation to C++ Tests
[INFO] be.uantwerpen.ansymo.semanticadaptation Code Generation to C++ Tests
[INFO] Feature
[INFO] be.uantwerpen.ansymo.semanticadaptation.ide.platform
[INFO] Core
[INFO] Semantics Adaptation IDE Eclipse repository
[INFO] SA IDE Standalone Product
[INFO]                                                                         
[INFO] ------------------------------------------------------------------------
[INFO] Building Semantics Adaptation Root 1.0.0-SNAPSHOT
[INFO] ------------------------------------------------------------------------
[INFO] 
[INFO] --- maven-javadoc-plugin:2.9:jar (attach-javadocs) @ parent ---
[INFO] Skipping javadoc generation
[INFO] 
[INFO] --- maven-jarsigner-plugin:1.4:sign (sign) @ parent ---
[INFO] 0 archive(s) processed
[INFO] 
[INFO] --- maven-install-plugin:2.5.2:install (default-install) @ parent ---
[INFO] Installing /var/lib/jenkins/workspace/HybridCosimulation_master-LDEVB56LP46DTRNYHQSCKMS3FR4JD6RBBK6S2LPONMGDZRBJQH3A@2/DSL_SemanticAdaptation/pom.xml to /var/lib/jenkins/workspace/HybridCosimulation_master-LDEVB56LP46DTRNYHQSCKMS3FR4JD6RBBK6S2LPONMGDZRBJQH3A@2/.repository/be/uantwerpen/ansymo/semanticadaptation/parent/1.0.0-SNAPSHOT/parent-1.0.0-SNAPSHOT.pom
[INFO]                                                                         
[INFO] ------------------------------------------------------------------------
[INFO] Building be.uantwerpen.ansymo.semanticadaptation Testframework 1.0.0-SNAPSHOT
[INFO] ------------------------------------------------------------------------
[INFO] 
[INFO] --- tycho-packaging-plugin:1.0.0:build-qualifier (default-build-qualifier) @ be.uantwerpen.ansymo.semanticadaptation.testframework ---
[INFO] The project's OSGi version is 1.0.0.201711091143
[INFO] 
[INFO] --- tycho-packaging-plugin:1.0.0:validate-id (default-validate-id) @ be.uantwerpen.ansymo.semanticadaptation.testframework ---
[INFO] 
[INFO] --- tycho-packaging-plugin:1.0.0:validate-version (default-validate-version) @ be.uantwerpen.ansymo.semanticadaptation.testframework ---
[INFO] 
[INFO] --- xtend-maven-plugin:2.11.0:compile (default) @ be.uantwerpen.ansymo.semanticadaptation.testframework ---
[INFO] 
[INFO] --- maven-resources-plugin:2.7:resources (default-resources) @ be.uantwerpen.ansymo.semanticadaptation.testframework ---
[INFO] Using 'UTF-8' encoding to copy filtered resources.
[INFO] skip non existing resourceDirectory /var/lib/jenkins/workspace/HybridCosimulation_master-LDEVB56LP46DTRNYHQSCKMS3FR4JD6RBBK6S2LPONMGDZRBJQH3A@2/DSL_SemanticAdaptation/be.uantwerpen.ansymo.semanticadaptation.testframework/src/main/resources
[INFO] 
[INFO] --- tycho-compiler-plugin:1.0.0:compile (default-compile) @ be.uantwerpen.ansymo.semanticadaptation.testframework ---
[WARNING] Parameter 'useProjectSettings' is set to true, but preferences file '/var/lib/jenkins/workspace/HybridCosimulation_master-LDEVB56LP46DTRNYHQSCKMS3FR4JD6RBBK6S2LPONMGDZRBJQH3A@2/DSL_SemanticAdaptation/be.uantwerpen.ansymo.semanticadaptation.testframework/.settings/org.eclipse.jdt.core.prefs' could not be found!
[INFO] Compiling 5 source files to /var/lib/jenkins/workspace/HybridCosimulation_master-LDEVB56LP46DTRNYHQSCKMS3FR4JD6RBBK6S2LPONMGDZRBJQH3A@2/DSL_SemanticAdaptation/be.uantwerpen.ansymo.semanticadaptation.testframework/target/classes
[WARNING] Source directory /var/lib/jenkins/workspace/HybridCosimulation_master-LDEVB56LP46DTRNYHQSCKMS3FR4JD6RBBK6S2LPONMGDZRBJQH3A@2/DSL_SemanticAdaptation/be.uantwerpen.ansymo.semanticadaptation.testframework/src-gen does not exist
[INFO] 
[INFO] --- xtend-maven-plugin:2.11.0:xtend-install-debug-info (default) @ be.uantwerpen.ansymo.semanticadaptation.testframework ---
[WARNING] Directory /var/lib/jenkins/workspace/HybridCosimulation_master-LDEVB56LP46DTRNYHQSCKMS3FR4JD6RBBK6S2LPONMGDZRBJQH3A@2/DSL_SemanticAdaptation/be.uantwerpen.ansymo.semanticadaptation.testframework/src/main/java is empty. Can't process.
[WARNING] Directory /var/lib/jenkins/workspace/HybridCosimulation_master-LDEVB56LP46DTRNYHQSCKMS3FR4JD6RBBK6S2LPONMGDZRBJQH3A@2/DSL_SemanticAdaptation/be.uantwerpen.ansymo.semanticadaptation.testframework/src-gen is empty. Can't process.
[INFO] Installing Xtend files into 2 class files as primary debug sources in: /var/lib/jenkins/workspace/HybridCosimulation_master-LDEVB56LP46DTRNYHQSCKMS3FR4JD6RBBK6S2LPONMGDZRBJQH3A@2/DSL_SemanticAdaptation/be.uantwerpen.ansymo.semanticadaptation.testframework/target/classes
[INFO] 
[INFO] --- xtend-maven-plugin:2.11.0:testCompile (default) @ be.uantwerpen.ansymo.semanticadaptation.testframework ---
[INFO] skip compiling sources because the configured directory '[/var/lib/jenkins/workspace/HybridCosimulation_master-LDEVB56LP46DTRNYHQSCKMS3FR4JD6RBBK6S2LPONMGDZRBJQH3A@2/DSL_SemanticAdaptation/be.uantwerpen.ansymo.semanticadaptation.testframework/src/test/java]' does not exists.
[INFO] 
[INFO] --- maven-resources-plugin:2.7:testResources (default-testResources) @ be.uantwerpen.ansymo.semanticadaptation.testframework ---
[INFO] Using 'UTF-8' encoding to copy filtered resources.
[INFO] skip non existing resourceDirectory /var/lib/jenkins/workspace/HybridCosimulation_master-LDEVB56LP46DTRNYHQSCKMS3FR4JD6RBBK6S2LPONMGDZRBJQH3A@2/DSL_SemanticAdaptation/be.uantwerpen.ansymo.semanticadaptation.testframework/src/test/resources
[INFO] 
[INFO] --- xtend-maven-plugin:2.11.0:xtend-test-install-debug-info (default) @ be.uantwerpen.ansymo.semanticadaptation.testframework ---
[WARNING] Directory /var/lib/jenkins/workspace/HybridCosimulation_master-LDEVB56LP46DTRNYHQSCKMS3FR4JD6RBBK6S2LPONMGDZRBJQH3A@2/DSL_SemanticAdaptation/be.uantwerpen.ansymo.semanticadaptation.testframework/src/test/java is empty. Can't process.
[WARNING] Directory /var/lib/jenkins/workspace/HybridCosimulation_master-LDEVB56LP46DTRNYHQSCKMS3FR4JD6RBBK6S2LPONMGDZRBJQH3A@2/DSL_SemanticAdaptation/be.uantwerpen.ansymo.semanticadaptation.testframework/target/xtend-gen/test is empty. Can't process.
[INFO] Installing Xtend files into 0 class files as primary debug sources in: /var/lib/jenkins/workspace/HybridCosimulation_master-LDEVB56LP46DTRNYHQSCKMS3FR4JD6RBBK6S2LPONMGDZRBJQH3A@2/DSL_SemanticAdaptation/be.uantwerpen.ansymo.semanticadaptation.testframework/target/test-classes
[INFO] 
[INFO] --- target-platform-configuration:1.0.0:target-platform (default-target-platform) @ be.uantwerpen.ansymo.semanticadaptation.testframework ---
[INFO] 
[INFO] --- tycho-packaging-plugin:1.0.0:package-plugin (default-package-plugin) @ be.uantwerpen.ansymo.semanticadaptation.testframework ---
[INFO] Building jar: /var/lib/jenkins/workspace/HybridCosimulation_master-LDEVB56LP46DTRNYHQSCKMS3FR4JD6RBBK6S2LPONMGDZRBJQH3A@2/DSL_SemanticAdaptation/be.uantwerpen.ansymo.semanticadaptation.testframework/target/be.uantwerpen.ansymo.semanticadaptation.testframework-1.0.0-SNAPSHOT.jar
[INFO] 
[INFO] --- tycho-p2-plugin:1.0.0:p2-metadata-default (default-p2-metadata-default) @ be.uantwerpen.ansymo.semanticadaptation.testframework ---
[INFO] 
[INFO] --- maven-javadoc-plugin:2.9:jar (attach-javadocs) @ be.uantwerpen.ansymo.semanticadaptation.testframework ---
[INFO] Skipping javadoc generation
[INFO] 
[INFO] --- maven-jarsigner-plugin:1.4:sign (sign) @ be.uantwerpen.ansymo.semanticadaptation.testframework ---
[WARNING] Picked up JAVA_TOOL_OPTIONS: -Dmaven.ext.class.path="/var/lib/jenkins/workspace/HybridCosimulation_master-LDEVB56LP46DTRNYHQSCKMS3FR4JD6RBBK6S2LPONMGDZRBJQH3A@2@tmp/withMaven73a19300/pipeline-maven-spy.jar" -Dorg.jenkinsci.plugins.pipeline.maven.reportsFolder="/var/lib/jenkins/workspace/HybridCosimulation_master-LDEVB56LP46DTRNYHQSCKMS3FR4JD6RBBK6S2LPONMGDZRBJQH3A@2@tmp/withMaven73a19300" 
[INFO] 1 archive(s) processed
[INFO] 
[INFO] --- maven-install-plugin:2.3.1:install (default-install) @ be.uantwerpen.ansymo.semanticadaptation.testframework ---
[INFO] Installing /var/lib/jenkins/workspace/HybridCosimulation_master-LDEVB56LP46DTRNYHQSCKMS3FR4JD6RBBK6S2LPONMGDZRBJQH3A@2/DSL_SemanticAdaptation/be.uantwerpen.ansymo.semanticadaptation.testframework/target/be.uantwerpen.ansymo.semanticadaptation.testframework-1.0.0-SNAPSHOT.jar to /var/lib/jenkins/workspace/HybridCosimulation_master-LDEVB56LP46DTRNYHQSCKMS3FR4JD6RBBK6S2LPONMGDZRBJQH3A@2/.repository/be/uantwerpen/ansymo/semanticadaptation/be.uantwerpen.ansymo.semanticadaptation.testframework/1.0.0-SNAPSHOT/be.uantwerpen.ansymo.semanticadaptation.testframework-1.0.0-SNAPSHOT.jar
[INFO] Installing /var/lib/jenkins/workspace/HybridCosimulation_master-LDEVB56LP46DTRNYHQSCKMS3FR4JD6RBBK6S2LPONMGDZRBJQH3A@2/DSL_SemanticAdaptation/be.uantwerpen.ansymo.semanticadaptation.testframework/pom.xml to /var/lib/jenkins/workspace/HybridCosimulation_master-LDEVB56LP46DTRNYHQSCKMS3FR4JD6RBBK6S2LPONMGDZRBJQH3A@2/.repository/be/uantwerpen/ansymo/semanticadaptation/be.uantwerpen.ansymo.semanticadaptation.testframework/1.0.0-SNAPSHOT/be.uantwerpen.ansymo.semanticadaptation.testframework-1.0.0-SNAPSHOT.pom
[INFO] Installing /var/lib/jenkins/workspace/HybridCosimulation_master-LDEVB56LP46DTRNYHQSCKMS3FR4JD6RBBK6S2LPONMGDZRBJQH3A@2/DSL_SemanticAdaptation/be.uantwerpen.ansymo.semanticadaptation.testframework/target/p2content.xml to /var/lib/jenkins/workspace/HybridCosimulation_master-LDEVB56LP46DTRNYHQSCKMS3FR4JD6RBBK6S2LPONMGDZRBJQH3A@2/.repository/be/uantwerpen/ansymo/semanticadaptation/be.uantwerpen.ansymo.semanticadaptation.testframework/1.0.0-SNAPSHOT/be.uantwerpen.ansymo.semanticadaptation.testframework-1.0.0-SNAPSHOT-p2metadata.xml
[INFO] Installing /var/lib/jenkins/workspace/HybridCosimulation_master-LDEVB56LP46DTRNYHQSCKMS3FR4JD6RBBK6S2LPONMGDZRBJQH3A@2/DSL_SemanticAdaptation/be.uantwerpen.ansymo.semanticadaptation.testframework/target/p2artifacts.xml to /var/lib/jenkins/workspace/HybridCosimulation_master-LDEVB56LP46DTRNYHQSCKMS3FR4JD6RBBK6S2LPONMGDZRBJQH3A@2/.repository/be/uantwerpen/ansymo/semanticadaptation/be.uantwerpen.ansymo.semanticadaptation.testframework/1.0.0-SNAPSHOT/be.uantwerpen.ansymo.semanticadaptation.testframework-1.0.0-SNAPSHOT-p2artifacts.xml
[INFO] 
[INFO] --- tycho-p2-plugin:1.0.0:update-local-index (default-update-local-index) @ be.uantwerpen.ansymo.semanticadaptation.testframework ---
[INFO]                                                                         
[INFO] ------------------------------------------------------------------------
[INFO] Building be.uantwerpen.ansymo.semanticadaptation Logger 1.0.0-SNAPSHOT
[INFO] ------------------------------------------------------------------------
[INFO] 
[INFO] --- tycho-packaging-plugin:1.0.0:build-qualifier (default-build-qualifier) @ be.uantwerpen.ansymo.semanticadaptation.log ---
[INFO] The project's OSGi version is 1.0.0.201711091143
[INFO] 
[INFO] --- tycho-packaging-plugin:1.0.0:validate-id (default-validate-id) @ be.uantwerpen.ansymo.semanticadaptation.log ---
[INFO] 
[INFO] --- tycho-packaging-plugin:1.0.0:validate-version (default-validate-version) @ be.uantwerpen.ansymo.semanticadaptation.log ---
[INFO] 
[INFO] --- xtend-maven-plugin:2.11.0:compile (default) @ be.uantwerpen.ansymo.semanticadaptation.log ---
[INFO] 
[INFO] --- maven-resources-plugin:2.7:resources (default-resources) @ be.uantwerpen.ansymo.semanticadaptation.log ---
[INFO] Using 'UTF-8' encoding to copy filtered resources.
[INFO] skip non existing resourceDirectory /var/lib/jenkins/workspace/HybridCosimulation_master-LDEVB56LP46DTRNYHQSCKMS3FR4JD6RBBK6S2LPONMGDZRBJQH3A@2/DSL_SemanticAdaptation/be.uantwerpen.ansymo.semanticadaptation.log/src/main/resources
[INFO] 
[INFO] --- tycho-compiler-plugin:1.0.0:compile (default-compile) @ be.uantwerpen.ansymo.semanticadaptation.log ---
[WARNING] Parameter 'useProjectSettings' is set to true, but preferences file '/var/lib/jenkins/workspace/HybridCosimulation_master-LDEVB56LP46DTRNYHQSCKMS3FR4JD6RBBK6S2LPONMGDZRBJQH3A@2/DSL_SemanticAdaptation/be.uantwerpen.ansymo.semanticadaptation.log/.settings/org.eclipse.jdt.core.prefs' could not be found!
[INFO] Compiling 1 source file to /var/lib/jenkins/workspace/HybridCosimulation_master-LDEVB56LP46DTRNYHQSCKMS3FR4JD6RBBK6S2LPONMGDZRBJQH3A@2/DSL_SemanticAdaptation/be.uantwerpen.ansymo.semanticadaptation.log/target/classes
[WARNING] Source directory /var/lib/jenkins/workspace/HybridCosimulation_master-LDEVB56LP46DTRNYHQSCKMS3FR4JD6RBBK6S2LPONMGDZRBJQH3A@2/DSL_SemanticAdaptation/be.uantwerpen.ansymo.semanticadaptation.log/src-gen does not exist
[INFO] 
[INFO] --- xtend-maven-plugin:2.11.0:xtend-install-debug-info (default) @ be.uantwerpen.ansymo.semanticadaptation.log ---
[WARNING] Directory /var/lib/jenkins/workspace/HybridCosimulation_master-LDEVB56LP46DTRNYHQSCKMS3FR4JD6RBBK6S2LPONMGDZRBJQH3A@2/DSL_SemanticAdaptation/be.uantwerpen.ansymo.semanticadaptation.log/src/main/java is empty. Can't process.
[WARNING] Directory /var/lib/jenkins/workspace/HybridCosimulation_master-LDEVB56LP46DTRNYHQSCKMS3FR4JD6RBBK6S2LPONMGDZRBJQH3A@2/DSL_SemanticAdaptation/be.uantwerpen.ansymo.semanticadaptation.log/src-gen is empty. Can't process.
[INFO] Installing Xtend files into 1 class files as primary debug sources in: /var/lib/jenkins/workspace/HybridCosimulation_master-LDEVB56LP46DTRNYHQSCKMS3FR4JD6RBBK6S2LPONMGDZRBJQH3A@2/DSL_SemanticAdaptation/be.uantwerpen.ansymo.semanticadaptation.log/target/classes
[INFO] 
[INFO] --- xtend-maven-plugin:2.11.0:testCompile (default) @ be.uantwerpen.ansymo.semanticadaptation.log ---
[INFO] skip compiling sources because the configured directory '[/var/lib/jenkins/workspace/HybridCosimulation_master-LDEVB56LP46DTRNYHQSCKMS3FR4JD6RBBK6S2LPONMGDZRBJQH3A@2/DSL_SemanticAdaptation/be.uantwerpen.ansymo.semanticadaptation.log/src/test/java]' does not exists.
[INFO] 
[INFO] --- maven-resources-plugin:2.7:testResources (default-testResources) @ be.uantwerpen.ansymo.semanticadaptation.log ---
[INFO] Using 'UTF-8' encoding to copy filtered resources.
[INFO] skip non existing resourceDirectory /var/lib/jenkins/workspace/HybridCosimulation_master-LDEVB56LP46DTRNYHQSCKMS3FR4JD6RBBK6S2LPONMGDZRBJQH3A@2/DSL_SemanticAdaptation/be.uantwerpen.ansymo.semanticadaptation.log/src/test/resources
[INFO] 
[INFO] --- xtend-maven-plugin:2.11.0:xtend-test-install-debug-info (default) @ be.uantwerpen.ansymo.semanticadaptation.log ---
[WARNING] Directory /var/lib/jenkins/workspace/HybridCosimulation_master-LDEVB56LP46DTRNYHQSCKMS3FR4JD6RBBK6S2LPONMGDZRBJQH3A@2/DSL_SemanticAdaptation/be.uantwerpen.ansymo.semanticadaptation.log/src/test/java is empty. Can't process.
[WARNING] Directory /var/lib/jenkins/workspace/HybridCosimulation_master-LDEVB56LP46DTRNYHQSCKMS3FR4JD6RBBK6S2LPONMGDZRBJQH3A@2/DSL_SemanticAdaptation/be.uantwerpen.ansymo.semanticadaptation.log/target/xtend-gen/test is empty. Can't process.
[INFO] Installing Xtend files into 0 class files as primary debug sources in: /var/lib/jenkins/workspace/HybridCosimulation_master-LDEVB56LP46DTRNYHQSCKMS3FR4JD6RBBK6S2LPONMGDZRBJQH3A@2/DSL_SemanticAdaptation/be.uantwerpen.ansymo.semanticadaptation.log/target/test-classes
[INFO] 
[INFO] --- target-platform-configuration:1.0.0:target-platform (default-target-platform) @ be.uantwerpen.ansymo.semanticadaptation.log ---
[INFO] 
[INFO] --- tycho-packaging-plugin:1.0.0:package-plugin (default-package-plugin) @ be.uantwerpen.ansymo.semanticadaptation.log ---
[INFO] Building jar: /var/lib/jenkins/workspace/HybridCosimulation_master-LDEVB56LP46DTRNYHQSCKMS3FR4JD6RBBK6S2LPONMGDZRBJQH3A@2/DSL_SemanticAdaptation/be.uantwerpen.ansymo.semanticadaptation.log/target/be.uantwerpen.ansymo.semanticadaptation.log-1.0.0-SNAPSHOT.jar
[INFO] 
[INFO] --- tycho-p2-plugin:1.0.0:p2-metadata-default (default-p2-metadata-default) @ be.uantwerpen.ansymo.semanticadaptation.log ---
[INFO] 
[INFO] --- maven-javadoc-plugin:2.9:jar (attach-javadocs) @ be.uantwerpen.ansymo.semanticadaptation.log ---
[INFO] Skipping javadoc generation
[INFO] 
[INFO] --- maven-jarsigner-plugin:1.4:sign (sign) @ be.uantwerpen.ansymo.semanticadaptation.log ---
[WARNING] Picked up JAVA_TOOL_OPTIONS: -Dmaven.ext.class.path="/var/lib/jenkins/workspace/HybridCosimulation_master-LDEVB56LP46DTRNYHQSCKMS3FR4JD6RBBK6S2LPONMGDZRBJQH3A@2@tmp/withMaven73a19300/pipeline-maven-spy.jar" -Dorg.jenkinsci.plugins.pipeline.maven.reportsFolder="/var/lib/jenkins/workspace/HybridCosimulation_master-LDEVB56LP46DTRNYHQSCKMS3FR4JD6RBBK6S2LPONMGDZRBJQH3A@2@tmp/withMaven73a19300" 
[INFO] 1 archive(s) processed
[INFO] 
[INFO] --- maven-install-plugin:2.3.1:install (default-install) @ be.uantwerpen.ansymo.semanticadaptation.log ---
[INFO] Installing /var/lib/jenkins/workspace/HybridCosimulation_master-LDEVB56LP46DTRNYHQSCKMS3FR4JD6RBBK6S2LPONMGDZRBJQH3A@2/DSL_SemanticAdaptation/be.uantwerpen.ansymo.semanticadaptation.log/target/be.uantwerpen.ansymo.semanticadaptation.log-1.0.0-SNAPSHOT.jar to /var/lib/jenkins/workspace/HybridCosimulation_master-LDEVB56LP46DTRNYHQSCKMS3FR4JD6RBBK6S2LPONMGDZRBJQH3A@2/.repository/be/uantwerpen/ansymo/semanticadaptation/be.uantwerpen.ansymo.semanticadaptation.log/1.0.0-SNAPSHOT/be.uantwerpen.ansymo.semanticadaptation.log-1.0.0-SNAPSHOT.jar
[INFO] Installing /var/lib/jenkins/workspace/HybridCosimulation_master-LDEVB56LP46DTRNYHQSCKMS3FR4JD6RBBK6S2LPONMGDZRBJQH3A@2/DSL_SemanticAdaptation/be.uantwerpen.ansymo.semanticadaptation.log/pom.xml to /var/lib/jenkins/workspace/HybridCosimulation_master-LDEVB56LP46DTRNYHQSCKMS3FR4JD6RBBK6S2LPONMGDZRBJQH3A@2/.repository/be/uantwerpen/ansymo/semanticadaptation/be.uantwerpen.ansymo.semanticadaptation.log/1.0.0-SNAPSHOT/be.uantwerpen.ansymo.semanticadaptation.log-1.0.0-SNAPSHOT.pom
[INFO] Installing /var/lib/jenkins/workspace/HybridCosimulation_master-LDEVB56LP46DTRNYHQSCKMS3FR4JD6RBBK6S2LPONMGDZRBJQH3A@2/DSL_SemanticAdaptation/be.uantwerpen.ansymo.semanticadaptation.log/target/p2content.xml to /var/lib/jenkins/workspace/HybridCosimulation_master-LDEVB56LP46DTRNYHQSCKMS3FR4JD6RBBK6S2LPONMGDZRBJQH3A@2/.repository/be/uantwerpen/ansymo/semanticadaptation/be.uantwerpen.ansymo.semanticadaptation.log/1.0.0-SNAPSHOT/be.uantwerpen.ansymo.semanticadaptation.log-1.0.0-SNAPSHOT-p2metadata.xml
[INFO] Installing /var/lib/jenkins/workspace/HybridCosimulation_master-LDEVB56LP46DTRNYHQSCKMS3FR4JD6RBBK6S2LPONMGDZRBJQH3A@2/DSL_SemanticAdaptation/be.uantwerpen.ansymo.semanticadaptation.log/target/p2artifacts.xml to /var/lib/jenkins/workspace/HybridCosimulation_master-LDEVB56LP46DTRNYHQSCKMS3FR4JD6RBBK6S2LPONMGDZRBJQH3A@2/.repository/be/uantwerpen/ansymo/semanticadaptation/be.uantwerpen.ansymo.semanticadaptation.log/1.0.0-SNAPSHOT/be.uantwerpen.ansymo.semanticadaptation.log-1.0.0-SNAPSHOT-p2artifacts.xml
[INFO] 
[INFO] --- tycho-p2-plugin:1.0.0:update-local-index (default-update-local-index) @ be.uantwerpen.ansymo.semanticadaptation.log ---
[INFO]                                                                         
[INFO] ------------------------------------------------------------------------
[INFO] Building be.uantwerpen.ansymo.semanticadaptation Language Core 1.0.0-SNAPSHOT
[INFO] ------------------------------------------------------------------------
[INFO] 
[INFO] --- tycho-packaging-plugin:1.0.0:build-qualifier (default-build-qualifier) @ be.uantwerpen.ansymo.semanticadaptation ---
[INFO] The project's OSGi version is 1.0.0.201711091143
[INFO] 
[INFO] --- tycho-packaging-plugin:1.0.0:validate-id (default-validate-id) @ be.uantwerpen.ansymo.semanticadaptation ---
[INFO] 
[INFO] --- tycho-packaging-plugin:1.0.0:validate-version (default-validate-version) @ be.uantwerpen.ansymo.semanticadaptation ---
[INFO] 
[INFO] >>> exec-maven-plugin:1.2.1:java (default) > validate @ be.uantwerpen.ansymo.semanticadaptation >>>
[INFO] 
[INFO] --- tycho-packaging-plugin:1.0.0:build-qualifier (default-build-qualifier) @ be.uantwerpen.ansymo.semanticadaptation ---
[INFO] The project's OSGi version is 1.0.0.201711091143
[INFO] 
[INFO] --- tycho-packaging-plugin:1.0.0:validate-id (default-validate-id) @ be.uantwerpen.ansymo.semanticadaptation ---
[INFO] 
[INFO] --- tycho-packaging-plugin:1.0.0:validate-version (default-validate-version) @ be.uantwerpen.ansymo.semanticadaptation ---
[INFO] 
[INFO] <<< exec-maven-plugin:1.2.1:java (default) < validate @ be.uantwerpen.ansymo.semanticadaptation <<<
[INFO] 
[INFO] --- exec-maven-plugin:1.2.1:java (default) @ be.uantwerpen.ansymo.semanticadaptation ---
0    INFO  XtextGenerator     - Initializing Xtext generator
6    INFO  StandaloneSetup    - Adding generated EPackage 'org.eclipse.xtext.common.types.TypesPackage'
89   WARN  StandaloneSetup    - Skipping conflicting project plexus at 'archive:file:/usr/share/java/plexus-classworlds2-2.5.2.jar!/' and using 'archive:file:/var/lib/jenkins/workspace/HybridCosimulation_master-LDEVB56LP46DTRNYHQSCKMS3FR4JD6RBBK6S2LPONMGDZRBJQH3A@2/.repository/org/codehaus/plexus/plexus-utils/2.0.5/plexus-utils-2.0.5.jar!/' instead.
94   WARN  StandaloneSetup    - Skipping conflicting project maven at 'archive:file:/var/lib/jenkins/workspace/HybridCosimulation_master-LDEVB56LP46DTRNYHQSCKMS3FR4JD6RBBK6S2LPONMGDZRBJQH3A@2/.repository/org/apache/maven/maven-settings/2.0.6/maven-settings-2.0.6.jar!/' and using 'archive:file:/var/lib/jenkins/workspace/HybridCosimulation_master-LDEVB56LP46DTRNYHQSCKMS3FR4JD6RBBK6S2LPONMGDZRBJQH3A@2/.repository/org/apache/maven/maven-monitor/2.0.6/maven-monitor-2.0.6.jar!/' instead.
101  WARN  StandaloneSetup    - Skipping conflicting project maven at 'archive:file:/var/lib/jenkins/workspace/HybridCosimulation_master-LDEVB56LP46DTRNYHQSCKMS3FR4JD6RBBK6S2LPONMGDZRBJQH3A@2/.repository/org/apache/maven/maven-monitor/2.0.6/maven-monitor-2.0.6.jar!/' and using 'archive:file:/var/lib/jenkins/workspace/HybridCosimulation_master-LDEVB56LP46DTRNYHQSCKMS3FR4JD6RBBK6S2LPONMGDZRBJQH3A@2/.repository/org/apache/maven/maven-plugin-registry/2.0.6/maven-plugin-registry-2.0.6.jar!/' instead.
102  WARN  StandaloneSetup    - Skipping conflicting project maven at 'archive:file:/var/lib/jenkins/workspace/HybridCosimulation_master-LDEVB56LP46DTRNYHQSCKMS3FR4JD6RBBK6S2LPONMGDZRBJQH3A@2/.repository/org/apache/maven/maven-plugin-registry/2.0.6/maven-plugin-registry-2.0.6.jar!/' and using 'archive:file:/var/lib/jenkins/workspace/HybridCosimulation_master-LDEVB56LP46DTRNYHQSCKMS3FR4JD6RBBK6S2LPONMGDZRBJQH3A@2/.repository/org/apache/maven/maven-toolchain/1.0/maven-toolchain-1.0.jar!/' instead.
104  WARN  StandaloneSetup    - Skipping conflicting project maven at 'archive:file:/var/lib/jenkins/workspace/HybridCosimulation_master-LDEVB56LP46DTRNYHQSCKMS3FR4JD6RBBK6S2LPONMGDZRBJQH3A@2/.repository/org/apache/maven/maven-toolchain/1.0/maven-toolchain-1.0.jar!/' and using 'archive:file:/var/lib/jenkins/workspace/HybridCosimulation_master-LDEVB56LP46DTRNYHQSCKMS3FR4JD6RBBK6S2LPONMGDZRBJQH3A@2/.repository/org/apache/maven/maven-error-diagnostics/2.0.6/maven-error-diagnostics-2.0.6.jar!/' instead.
104  WARN  StandaloneSetup    - Skipping conflicting project maven at 'archive:file:/var/lib/jenkins/workspace/HybridCosimulation_master-LDEVB56LP46DTRNYHQSCKMS3FR4JD6RBBK6S2LPONMGDZRBJQH3A@2/.repository/org/apache/maven/maven-error-diagnostics/2.0.6/maven-error-diagnostics-2.0.6.jar!/' and using 'archive:file:/var/lib/jenkins/workspace/HybridCosimulation_master-LDEVB56LP46DTRNYHQSCKMS3FR4JD6RBBK6S2LPONMGDZRBJQH3A@2/.repository/org/apache/maven/maven-plugin-api/2.0.6/maven-plugin-api-2.0.6.jar!/' instead.
104  WARN  StandaloneSetup    - Skipping conflicting project plexus at 'archive:file:/var/lib/jenkins/workspace/HybridCosimulation_master-LDEVB56LP46DTRNYHQSCKMS3FR4JD6RBBK6S2LPONMGDZRBJQH3A@2/.repository/org/codehaus/plexus/plexus-utils/2.0.5/plexus-utils-2.0.5.jar!/' and using 'archive:file:/var/lib/jenkins/workspace/HybridCosimulation_master-LDEVB56LP46DTRNYHQSCKMS3FR4JD6RBBK6S2LPONMGDZRBJQH3A@2/.repository/org/codehaus/plexus/plexus-container-default/1.0-alpha-9/plexus-container-default-1.0-alpha-9.jar!/' instead.
111  WARN  StandaloneSetup    - Skipping conflicting project maven at 'archive:file:/var/lib/jenkins/workspace/HybridCosimulation_master-LDEVB56LP46DTRNYHQSCKMS3FR4JD6RBBK6S2LPONMGDZRBJQH3A@2/.repository/org/apache/maven/maven-plugin-api/2.0.6/maven-plugin-api-2.0.6.jar!/' and using 'archive:file:/var/lib/jenkins/workspace/HybridCosimulation_master-LDEVB56LP46DTRNYHQSCKMS3FR4JD6RBBK6S2LPONMGDZRBJQH3A@2/.repository/org/apache/maven/maven-repository-metadata/2.0.6/maven-repository-metadata-2.0.6.jar!/' instead.
112  WARN  StandaloneSetup    - Skipping conflicting project org.eclipse.equinox.common at 'archive:file:/var/lib/jenkins/workspace/HybridCosimulation_master-LDEVB56LP46DTRNYHQSCKMS3FR4JD6RBBK6S2LPONMGDZRBJQH3A@2/.repository/org/eclipse/equinox/common/3.6.200-v20130402-1505/common-3.6.200-v20130402-1505.jar!/' and using 'archive:file:/var/lib/jenkins/workspace/HybridCosimulation_master-LDEVB56LP46DTRNYHQSCKMS3FR4JD6RBBK6S2LPONMGDZRBJQH3A@2/.repository/org/eclipse/platform/org.eclipse.equinox.common/3.8.0/org.eclipse.equinox.common-3.8.0.jar!/' instead.
113  WARN  StandaloneSetup    - Skipping conflicting project plexus at 'archive:file:/var/lib/jenkins/workspace/HybridCosimulation_master-LDEVB56LP46DTRNYHQSCKMS3FR4JD6RBBK6S2LPONMGDZRBJQH3A@2/.repository/org/codehaus/plexus/plexus-container-default/1.0-alpha-9/plexus-container-default-1.0-alpha-9.jar!/' and using 'archive:file:/var/lib/jenkins/workspace/HybridCosimulation_master-LDEVB56LP46DTRNYHQSCKMS3FR4JD6RBBK6S2LPONMGDZRBJQH3A@2/.repository/org/codehaus/plexus/plexus-interactivity-api/1.0-alpha-4/plexus-interactivity-api-1.0-alpha-4.jar!/' instead.
114  WARN  StandaloneSetup    - Skipping conflicting project maven at 'archive:file:/var/lib/jenkins/workspace/HybridCosimulation_master-LDEVB56LP46DTRNYHQSCKMS3FR4JD6RBBK6S2LPONMGDZRBJQH3A@2/.repository/org/apache/maven/maven-repository-metadata/2.0.6/maven-repository-metadata-2.0.6.jar!/' and using 'archive:file:/var/lib/jenkins/workspace/HybridCosimulation_master-LDEVB56LP46DTRNYHQSCKMS3FR4JD6RBBK6S2LPONMGDZRBJQH3A@2/.repository/org/apache/maven/maven-model/2.0.6/maven-model-2.0.6.jar!/' instead.
115  WARN  StandaloneSetup    - Skipping conflicting project maven at 'archive:file:/var/lib/jenkins/workspace/HybridCosimulation_master-LDEVB56LP46DTRNYHQSCKMS3FR4JD6RBBK6S2LPONMGDZRBJQH3A@2/.repository/org/apache/maven/maven-model/2.0.6/maven-model-2.0.6.jar!/' and using 'archive:file:/var/lib/jenkins/workspace/HybridCosimulation_master-LDEVB56LP46DTRNYHQSCKMS3FR4JD6RBBK6S2LPONMGDZRBJQH3A@2/.repository/org/apache/maven/maven-core/2.0.6/maven-core-2.0.6.jar!/' instead.
116  WARN  StandaloneSetup    - Skipping conflicting project maven at 'archive:file:/var/lib/jenkins/workspace/HybridCosimulation_master-LDEVB56LP46DTRNYHQSCKMS3FR4JD6RBBK6S2LPONMGDZRBJQH3A@2/.repository/org/apache/maven/maven-core/2.0.6/maven-core-2.0.6.jar!/' and using 'archive:file:/var/lib/jenkins/workspace/HybridCosimulation_master-LDEVB56LP46DTRNYHQSCKMS3FR4JD6RBBK6S2LPONMGDZRBJQH3A@2/.repository/org/apache/maven/maven-project/2.0.6/maven-project-2.0.6.jar!/' instead.
118  WARN  StandaloneSetup    - Skipping conflicting project maven at 'archive:file:/var/lib/jenkins/workspace/HybridCosimulation_master-LDEVB56LP46DTRNYHQSCKMS3FR4JD6RBBK6S2LPONMGDZRBJQH3A@2/.repository/org/apache/maven/maven-project/2.0.6/maven-project-2.0.6.jar!/' and using 'archive:file:/var/lib/jenkins/workspace/HybridCosimulation_master-LDEVB56LP46DTRNYHQSCKMS3FR4JD6RBBK6S2LPONMGDZRBJQH3A@2/.repository/org/apache/maven/maven-artifact/2.0.6/maven-artifact-2.0.6.jar!/' instead.
120  WARN  StandaloneSetup    - Skipping conflicting project maven at 'archive:file:/var/lib/jenkins/workspace/HybridCosimulation_master-LDEVB56LP46DTRNYHQSCKMS3FR4JD6RBBK6S2LPONMGDZRBJQH3A@2/.repository/org/apache/maven/maven-artifact/2.0.6/maven-artifact-2.0.6.jar!/' and using 'archive:file:/var/lib/jenkins/workspace/HybridCosimulation_master-LDEVB56LP46DTRNYHQSCKMS3FR4JD6RBBK6S2LPONMGDZRBJQH3A@2/.repository/org/apache/maven/maven-plugin-descriptor/2.0.6/maven-plugin-descriptor-2.0.6.jar!/' instead.
121  WARN  StandaloneSetup    - Skipping conflicting project maven at 'archive:file:/var/lib/jenkins/workspace/HybridCosimulation_master-LDEVB56LP46DTRNYHQSCKMS3FR4JD6RBBK6S2LPONMGDZRBJQH3A@2/.repository/org/apache/maven/maven-plugin-descriptor/2.0.6/maven-plugin-descriptor-2.0.6.jar!/' and using 'archive:file:/var/lib/jenkins/workspace/HybridCosimulation_master-LDEVB56LP46DTRNYHQSCKMS3FR4JD6RBBK6S2LPONMGDZRBJQH3A@2/.repository/org/apache/maven/maven-profile/2.0.6/maven-profile-2.0.6.jar!/' instead.
121  WARN  StandaloneSetup    - Skipping conflicting project maven at 'archive:file:/var/lib/jenkins/workspace/HybridCosimulation_master-LDEVB56LP46DTRNYHQSCKMS3FR4JD6RBBK6S2LPONMGDZRBJQH3A@2/.repository/org/apache/maven/maven-profile/2.0.6/maven-profile-2.0.6.jar!/' and using 'archive:file:/var/lib/jenkins/workspace/HybridCosimulation_master-LDEVB56LP46DTRNYHQSCKMS3FR4JD6RBBK6S2LPONMGDZRBJQH3A@2/.repository/org/apache/maven/reporting/maven-reporting-api/2.0.6/maven-reporting-api-2.0.6.jar!/' instead.
124  WARN  StandaloneSetup    - Skipping conflicting project maven at 'archive:file:/var/lib/jenkins/workspace/HybridCosimulation_master-LDEVB56LP46DTRNYHQSCKMS3FR4JD6RBBK6S2LPONMGDZRBJQH3A@2/.repository/org/apache/maven/reporting/maven-reporting-api/2.0.6/maven-reporting-api-2.0.6.jar!/' and using 'archive:file:/var/lib/jenkins/workspace/HybridCosimulation_master-LDEVB56LP46DTRNYHQSCKMS3FR4JD6RBBK6S2LPONMGDZRBJQH3A@2/.repository/org/apache/maven/maven-plugin-parameter-documenter/2.0.6/maven-plugin-parameter-documenter-2.0.6.jar!/' instead.
125  WARN  StandaloneSetup    - Skipping conflicting project maven at 'archive:file:/var/lib/jenkins/workspace/HybridCosimulation_master-LDEVB56LP46DTRNYHQSCKMS3FR4JD6RBBK6S2LPONMGDZRBJQH3A@2/.repository/org/apache/maven/maven-plugin-parameter-documenter/2.0.6/maven-plugin-parameter-documenter-2.0.6.jar!/' and using 'archive:file:/var/lib/jenkins/workspace/HybridCosimulation_master-LDEVB56LP46DTRNYHQSCKMS3FR4JD6RBBK6S2LPONMGDZRBJQH3A@2/.repository/org/apache/maven/maven-artifact-manager/2.0.6/maven-artifact-manager-2.0.6.jar!/' instead.
128  INFO  StandaloneSetup    - Registering project be.uantwerpen.ansymo.semanticadaptation at 'file:/var/lib/jenkins/workspace/HybridCosimulation_master-LDEVB56LP46DTRNYHQSCKMS3FR4JD6RBBK6S2LPONMGDZRBJQH3A@2/DSL_SemanticAdaptation/be.uantwerpen.ansymo.semanticadaptation/'
128  INFO  StandaloneSetup    - Registering project be.uantwerpen.ansymo.semanticadaptation.tests at 'file:/var/lib/jenkins/workspace/HybridCosimulation_master-LDEVB56LP46DTRNYHQSCKMS3FR4JD6RBBK6S2LPONMGDZRBJQH3A@2/DSL_SemanticAdaptation/be.uantwerpen.ansymo.semanticadaptation.tests/'
128  INFO  StandaloneSetup    - Registering project be.uantwerpen.ansymo.semanticadaptation.ide at 'file:/var/lib/jenkins/workspace/HybridCosimulation_master-LDEVB56LP46DTRNYHQSCKMS3FR4JD6RBBK6S2LPONMGDZRBJQH3A@2/DSL_SemanticAdaptation/be.uantwerpen.ansymo.semanticadaptation.ide/'
129  INFO  StandaloneSetup    - Registering project be.uantwerpen.ansymo.semanticadaptation.ui at 'file:/var/lib/jenkins/workspace/HybridCosimulation_master-LDEVB56LP46DTRNYHQSCKMS3FR4JD6RBBK6S2LPONMGDZRBJQH3A@2/DSL_SemanticAdaptation/be.uantwerpen.ansymo.semanticadaptation.ui/'
129  INFO  StandaloneSetup    - Registering project be.uantwerpen.ansymo.semanticadaptation.ui.tests at 'file:/var/lib/jenkins/workspace/HybridCosimulation_master-LDEVB56LP46DTRNYHQSCKMS3FR4JD6RBBK6S2LPONMGDZRBJQH3A@2/DSL_SemanticAdaptation/be.uantwerpen.ansymo.semanticadaptation.ui.tests/'
138  INFO  StandaloneSetup    - Using resourceSet registry. The registered Packages will not be registered in the global EPackage.Registry.INSTANCE!
392  INFO  GenModelHelper     - Registered GenModel 'http://www.eclipse.org/Xtext/Xbase/XAnnotations' from 'platform:/resource/org.eclipse.xtext.xbase/model/Xbase.genmodel'
407  INFO  GenModelHelper     - Registered GenModel 'http://www.eclipse.org/xtext/xbase/Xtype' from 'platform:/resource/org.eclipse.xtext.xbase/model/Xbase.genmodel'
425  INFO  GenModelHelper     - Registered GenModel 'http://www.eclipse.org/xtext/xbase/Xbase' from 'platform:/resource/org.eclipse.xtext.xbase/model/Xbase.genmodel'
426  INFO  GenModelHelper     - Registered GenModel 'http://www.eclipse.org/xtext/common/JavaVMTypes' from 'platform:/resource/org.eclipse.xtext.common.types/model/JavaVMTypes.genmodel'
3992 INFO  XtextGenerator     - Generating be.uantwerpen.ansymo.semanticadaptation.SemanticAdaptation
10788 INFO  EMFGeneratorFragment2 - Generating EMF model code
10839 INFO  GenModelHelper     - Registered GenModel 'http://www.uantwerpen.be/ansymo/semanticadaptation/SemanticAdaptation' from 'platform:/resource/be.uantwerpen.ansymo.semanticadaptation/model/generated/SemanticAdaptation.genmodel'
25580 INFO  XtextGenerator     - Generating common infrastructure
25614 INFO  Workflow           - Done.
[INFO] 
[INFO] --- xtend-maven-plugin:2.11.0:compile (default) @ be.uantwerpen.ansymo.semanticadaptation ---
[WARNING] 
WARNING: 	SemanticAdaptationScopeProvider.xtend - /var/lib/jenkins/workspace/HybridCosimulation_master-LDEVB56LP46DTRNYHQSCKMS3FR4JD6RBBK6S2LPONMGDZRBJQH3A@2/DSL_SemanticAdaptation/be.uantwerpen.ansymo.semanticadaptation/src/be/uantwerpen/ansymo/semanticadaptation/scoping/SemanticAdaptationScopeProvider.xtend
225: EList is a raw type. References to generic type EList<E> should be parameterized
[WARNING] 
WARNING: 	SemanticAdaptationScopeProvider.xtend - /var/lib/jenkins/workspace/HybridCosimulation_master-LDEVB56LP46DTRNYHQSCKMS3FR4JD6RBBK6S2LPONMGDZRBJQH3A@2/DSL_SemanticAdaptation/be.uantwerpen.ansymo.semanticadaptation/src/be/uantwerpen/ansymo/semanticadaptation/scoping/SemanticAdaptationScopeProvider.xtend
292: EList is a raw type. References to generic type EList<E> should be parameterized
[INFO] 
[INFO] --- maven-resources-plugin:2.7:resources (default-resources) @ be.uantwerpen.ansymo.semanticadaptation ---
[INFO] Using 'UTF-8' encoding to copy filtered resources.
[INFO] skip non existing resourceDirectory /var/lib/jenkins/workspace/HybridCosimulation_master-LDEVB56LP46DTRNYHQSCKMS3FR4JD6RBBK6S2LPONMGDZRBJQH3A@2/DSL_SemanticAdaptation/be.uantwerpen.ansymo.semanticadaptation/src/main/resources
[INFO] 
[INFO] --- tycho-compiler-plugin:1.0.0:compile (default-compile) @ be.uantwerpen.ansymo.semanticadaptation ---
[WARNING] Parameter 'useProjectSettings' is set to true, but preferences file '/var/lib/jenkins/workspace/HybridCosimulation_master-LDEVB56LP46DTRNYHQSCKMS3FR4JD6RBBK6S2LPONMGDZRBJQH3A@2/DSL_SemanticAdaptation/be.uantwerpen.ansymo.semanticadaptation/.settings/org.eclipse.jdt.core.prefs' could not be found!
[INFO] Compiling 314 source files to /var/lib/jenkins/workspace/HybridCosimulation_master-LDEVB56LP46DTRNYHQSCKMS3FR4JD6RBBK6S2LPONMGDZRBJQH3A@2/DSL_SemanticAdaptation/be.uantwerpen.ansymo.semanticadaptation/target/classes
[INFO] 
[INFO] --- xtend-maven-plugin:2.11.0:xtend-install-debug-info (default) @ be.uantwerpen.ansymo.semanticadaptation ---
[WARNING] Directory /var/lib/jenkins/workspace/HybridCosimulation_master-LDEVB56LP46DTRNYHQSCKMS3FR4JD6RBBK6S2LPONMGDZRBJQH3A@2/DSL_SemanticAdaptation/be.uantwerpen.ansymo.semanticadaptation/src/main/java is empty. Can't process.
[INFO] Installing Xtend files into 25 class files as primary debug sources in: /var/lib/jenkins/workspace/HybridCosimulation_master-LDEVB56LP46DTRNYHQSCKMS3FR4JD6RBBK6S2LPONMGDZRBJQH3A@2/DSL_SemanticAdaptation/be.uantwerpen.ansymo.semanticadaptation/target/classes
[INFO] 
[INFO] --- xtend-maven-plugin:2.11.0:testCompile (default) @ be.uantwerpen.ansymo.semanticadaptation ---
[INFO] skip compiling sources because the configured directory '[/var/lib/jenkins/workspace/HybridCosimulation_master-LDEVB56LP46DTRNYHQSCKMS3FR4JD6RBBK6S2LPONMGDZRBJQH3A@2/DSL_SemanticAdaptation/be.uantwerpen.ansymo.semanticadaptation/src/test/java]' does not exists.
[INFO] 
[INFO] --- maven-resources-plugin:2.7:testResources (default-testResources) @ be.uantwerpen.ansymo.semanticadaptation ---
[INFO] Using 'UTF-8' encoding to copy filtered resources.
[INFO] skip non existing resourceDirectory /var/lib/jenkins/workspace/HybridCosimulation_master-LDEVB56LP46DTRNYHQSCKMS3FR4JD6RBBK6S2LPONMGDZRBJQH3A@2/DSL_SemanticAdaptation/be.uantwerpen.ansymo.semanticadaptation/src/test/resources
[INFO] 
[INFO] --- xtend-maven-plugin:2.11.0:xtend-test-install-debug-info (default) @ be.uantwerpen.ansymo.semanticadaptation ---
[WARNING] Directory /var/lib/jenkins/workspace/HybridCosimulation_master-LDEVB56LP46DTRNYHQSCKMS3FR4JD6RBBK6S2LPONMGDZRBJQH3A@2/DSL_SemanticAdaptation/be.uantwerpen.ansymo.semanticadaptation/src/test/java is empty. Can't process.
[WARNING] Directory /var/lib/jenkins/workspace/HybridCosimulation_master-LDEVB56LP46DTRNYHQSCKMS3FR4JD6RBBK6S2LPONMGDZRBJQH3A@2/DSL_SemanticAdaptation/be.uantwerpen.ansymo.semanticadaptation/target/xtend-gen/test is empty. Can't process.
[INFO] Installing Xtend files into 0 class files as primary debug sources in: /var/lib/jenkins/workspace/HybridCosimulation_master-LDEVB56LP46DTRNYHQSCKMS3FR4JD6RBBK6S2LPONMGDZRBJQH3A@2/DSL_SemanticAdaptation/be.uantwerpen.ansymo.semanticadaptation/target/test-classes
[INFO] 
[INFO] --- target-platform-configuration:1.0.0:target-platform (default-target-platform) @ be.uantwerpen.ansymo.semanticadaptation ---
[INFO] 
[INFO] --- tycho-packaging-plugin:1.0.0:package-plugin (default-package-plugin) @ be.uantwerpen.ansymo.semanticadaptation ---
[INFO] Building jar: /var/lib/jenkins/workspace/HybridCosimulation_master-LDEVB56LP46DTRNYHQSCKMS3FR4JD6RBBK6S2LPONMGDZRBJQH3A@2/DSL_SemanticAdaptation/be.uantwerpen.ansymo.semanticadaptation/target/be.uantwerpen.ansymo.semanticadaptation-1.0.0-SNAPSHOT.jar
[INFO] 
[INFO] --- tycho-p2-plugin:1.0.0:p2-metadata-default (default-p2-metadata-default) @ be.uantwerpen.ansymo.semanticadaptation ---
[INFO] 
[INFO] --- maven-javadoc-plugin:2.9:jar (attach-javadocs) @ be.uantwerpen.ansymo.semanticadaptation ---
[INFO] Skipping javadoc generation
[INFO] 
[INFO] --- maven-jarsigner-plugin:1.4:sign (sign) @ be.uantwerpen.ansymo.semanticadaptation ---
[WARNING] Picked up JAVA_TOOL_OPTIONS: -Dmaven.ext.class.path="/var/lib/jenkins/workspace/HybridCosimulation_master-LDEVB56LP46DTRNYHQSCKMS3FR4JD6RBBK6S2LPONMGDZRBJQH3A@2@tmp/withMaven73a19300/pipeline-maven-spy.jar" -Dorg.jenkinsci.plugins.pipeline.maven.reportsFolder="/var/lib/jenkins/workspace/HybridCosimulation_master-LDEVB56LP46DTRNYHQSCKMS3FR4JD6RBBK6S2LPONMGDZRBJQH3A@2@tmp/withMaven73a19300" 
[INFO] 1 archive(s) processed
[INFO] 
[INFO] --- maven-install-plugin:2.3.1:install (default-install) @ be.uantwerpen.ansymo.semanticadaptation ---
[INFO] Installing /var/lib/jenkins/workspace/HybridCosimulation_master-LDEVB56LP46DTRNYHQSCKMS3FR4JD6RBBK6S2LPONMGDZRBJQH3A@2/DSL_SemanticAdaptation/be.uantwerpen.ansymo.semanticadaptation/target/be.uantwerpen.ansymo.semanticadaptation-1.0.0-SNAPSHOT.jar to /var/lib/jenkins/workspace/HybridCosimulation_master-LDEVB56LP46DTRNYHQSCKMS3FR4JD6RBBK6S2LPONMGDZRBJQH3A@2/.repository/be/uantwerpen/ansymo/semanticadaptation/be.uantwerpen.ansymo.semanticadaptation/1.0.0-SNAPSHOT/be.uantwerpen.ansymo.semanticadaptation-1.0.0-SNAPSHOT.jar
[INFO] Installing /var/lib/jenkins/workspace/HybridCosimulation_master-LDEVB56LP46DTRNYHQSCKMS3FR4JD6RBBK6S2LPONMGDZRBJQH3A@2/DSL_SemanticAdaptation/be.uantwerpen.ansymo.semanticadaptation/pom.xml to /var/lib/jenkins/workspace/HybridCosimulation_master-LDEVB56LP46DTRNYHQSCKMS3FR4JD6RBBK6S2LPONMGDZRBJQH3A@2/.repository/be/uantwerpen/ansymo/semanticadaptation/be.uantwerpen.ansymo.semanticadaptation/1.0.0-SNAPSHOT/be.uantwerpen.ansymo.semanticadaptation-1.0.0-SNAPSHOT.pom
[INFO] Installing /var/lib/jenkins/workspace/HybridCosimulation_master-LDEVB56LP46DTRNYHQSCKMS3FR4JD6RBBK6S2LPONMGDZRBJQH3A@2/DSL_SemanticAdaptation/be.uantwerpen.ansymo.semanticadaptation/target/p2content.xml to /var/lib/jenkins/workspace/HybridCosimulation_master-LDEVB56LP46DTRNYHQSCKMS3FR4JD6RBBK6S2LPONMGDZRBJQH3A@2/.repository/be/uantwerpen/ansymo/semanticadaptation/be.uantwerpen.ansymo.semanticadaptation/1.0.0-SNAPSHOT/be.uantwerpen.ansymo.semanticadaptation-1.0.0-SNAPSHOT-p2metadata.xml
[INFO] Installing /var/lib/jenkins/workspace/HybridCosimulation_master-LDEVB56LP46DTRNYHQSCKMS3FR4JD6RBBK6S2LPONMGDZRBJQH3A@2/DSL_SemanticAdaptation/be.uantwerpen.ansymo.semanticadaptation/target/p2artifacts.xml to /var/lib/jenkins/workspace/HybridCosimulation_master-LDEVB56LP46DTRNYHQSCKMS3FR4JD6RBBK6S2LPONMGDZRBJQH3A@2/.repository/be/uantwerpen/ansymo/semanticadaptation/be.uantwerpen.ansymo.semanticadaptation/1.0.0-SNAPSHOT/be.uantwerpen.ansymo.semanticadaptation-1.0.0-SNAPSHOT-p2artifacts.xml
[INFO] 
[INFO] --- tycho-p2-plugin:1.0.0:update-local-index (default-update-local-index) @ be.uantwerpen.ansymo.semanticadaptation ---
[INFO]                                                                         
[INFO] ------------------------------------------------------------------------
[INFO] Building be.uantwerpen.ansymo.semanticadaptation Canonical Generator 1.0.0-SNAPSHOT
[INFO] ------------------------------------------------------------------------
[INFO] 
[INFO] --- tycho-packaging-plugin:1.0.0:build-qualifier (default-build-qualifier) @ be.uantwerpen.ansymo.semanticadaptation.cg.canonical ---
[INFO] The project's OSGi version is 1.0.0.201711091143
[INFO] 
[INFO] --- tycho-packaging-plugin:1.0.0:validate-id (default-validate-id) @ be.uantwerpen.ansymo.semanticadaptation.cg.canonical ---
[INFO] 
[INFO] --- tycho-packaging-plugin:1.0.0:validate-version (default-validate-version) @ be.uantwerpen.ansymo.semanticadaptation.cg.canonical ---
[INFO] 
[INFO] --- xtend-maven-plugin:2.11.0:compile (default) @ be.uantwerpen.ansymo.semanticadaptation.cg.canonical ---
[WARNING] 
WARNING: 	SemanticAdaptationCanonicalGenerator.xtend - /var/lib/jenkins/workspace/HybridCosimulation_master-LDEVB56LP46DTRNYHQSCKMS3FR4JD6RBBK6S2LPONMGDZRBJQH3A@2/DSL_SemanticAdaptation/be.uantwerpen.ansymo.semanticadaptation.cg.canonical/src/be/uantwerpen/ansymo/semanticadaptation/cg/canonical/SemanticAdaptationCanonicalGenerator.xtend
54: The import 'org.eclipse.xtext.generator.IGeneratorContext' is never used.
[WARNING] 
WARNING: 	SemanticAdaptationCanonicalGenerator.xtend - /var/lib/jenkins/workspace/HybridCosimulation_master-LDEVB56LP46DTRNYHQSCKMS3FR4JD6RBBK6S2LPONMGDZRBJQH3A@2/DSL_SemanticAdaptation/be.uantwerpen.ansymo.semanticadaptation.cg.canonical/src/be/uantwerpen/ansymo/semanticadaptation/cg/canonical/SemanticAdaptationCanonicalGenerator.xtend
366: The expression of type SingleVarDeclaration is already of type SingleVarDeclaration
[WARNING] 
WARNING: 	SemanticAdaptationCanonicalGenerator.xtend - /var/lib/jenkins/workspace/HybridCosimulation_master-LDEVB56LP46DTRNYHQSCKMS3FR4JD6RBBK6S2LPONMGDZRBJQH3A@2/DSL_SemanticAdaptation/be.uantwerpen.ansymo.semanticadaptation.cg.canonical/src/be/uantwerpen/ansymo/semanticadaptation/cg/canonical/SemanticAdaptationCanonicalGenerator.xtend
367: Unnecessary cast from SingleVarDeclaration to SingleVarDeclaration
[WARNING] 
WARNING: 	SemanticAdaptationCanonicalGenerator.xtend - /var/lib/jenkins/workspace/HybridCosimulation_master-LDEVB56LP46DTRNYHQSCKMS3FR4JD6RBBK6S2LPONMGDZRBJQH3A@2/DSL_SemanticAdaptation/be.uantwerpen.ansymo.semanticadaptation.cg.canonical/src/be/uantwerpen/ansymo/semanticadaptation/cg/canonical/SemanticAdaptationCanonicalGenerator.xtend
368: Unnecessary cast from SingleVarDeclaration to SingleVarDeclaration
[WARNING] 
WARNING: 	SemanticAdaptationCanonicalGenerator.xtend - /var/lib/jenkins/workspace/HybridCosimulation_master-LDEVB56LP46DTRNYHQSCKMS3FR4JD6RBBK6S2LPONMGDZRBJQH3A@2/DSL_SemanticAdaptation/be.uantwerpen.ansymo.semanticadaptation.cg.canonical/src/be/uantwerpen/ansymo/semanticadaptation/cg/canonical/SemanticAdaptationCanonicalGenerator.xtend
569: The value of the local variable parentFMU is not used
[WARNING] 
WARNING: 	SemanticAdaptationCanonicalGenerator.xtend - /var/lib/jenkins/workspace/HybridCosimulation_master-LDEVB56LP46DTRNYHQSCKMS3FR4JD6RBBK6S2LPONMGDZRBJQH3A@2/DSL_SemanticAdaptation/be.uantwerpen.ansymo.semanticadaptation.cg.canonical/src/be/uantwerpen/ansymo/semanticadaptation/cg/canonical/SemanticAdaptationCanonicalGenerator.xtend
649: Unnecessary cast from Variable to Variable
[WARNING] 
WARNING: 	SemanticAdaptationCanonicalGenerator.xtend - /var/lib/jenkins/workspace/HybridCosimulation_master-LDEVB56LP46DTRNYHQSCKMS3FR4JD6RBBK6S2LPONMGDZRBJQH3A@2/DSL_SemanticAdaptation/be.uantwerpen.ansymo.semanticadaptation.cg.canonical/src/be/uantwerpen/ansymo/semanticadaptation/cg/canonical/SemanticAdaptationCanonicalGenerator.xtend
650: Unnecessary cast from Variable to Variable
[WARNING] 
WARNING: 	SemanticAdaptationCanonicalGenerator.xtend - /var/lib/jenkins/workspace/HybridCosimulation_master-LDEVB56LP46DTRNYHQSCKMS3FR4JD6RBBK6S2LPONMGDZRBJQH3A@2/DSL_SemanticAdaptation/be.uantwerpen.ansymo.semanticadaptation.cg.canonical/src/be/uantwerpen/ansymo/semanticadaptation/cg/canonical/SemanticAdaptationCanonicalGenerator.xtend
1049: Unnecessary cast from Variable to Variable
[WARNING] 
WARNING: 	SemanticAdaptationCanonicalGenerator.xtend - /var/lib/jenkins/workspace/HybridCosimulation_master-LDEVB56LP46DTRNYHQSCKMS3FR4JD6RBBK6S2LPONMGDZRBJQH3A@2/DSL_SemanticAdaptation/be.uantwerpen.ansymo.semanticadaptation.cg.canonical/src/be/uantwerpen/ansymo/semanticadaptation/cg/canonical/SemanticAdaptationCanonicalGenerator.xtend
1345: Unnecessary cast from InnerFMUDeclarationFull to InnerFMUDeclarationFull
[INFO] 
[INFO] --- maven-resources-plugin:2.7:resources (default-resources) @ be.uantwerpen.ansymo.semanticadaptation.cg.canonical ---
[INFO] Using 'UTF-8' encoding to copy filtered resources.
[INFO] skip non existing resourceDirectory /var/lib/jenkins/workspace/HybridCosimulation_master-LDEVB56LP46DTRNYHQSCKMS3FR4JD6RBBK6S2LPONMGDZRBJQH3A@2/DSL_SemanticAdaptation/be.uantwerpen.ansymo.semanticadaptation.cg.canonical/src/main/resources
[INFO] 
[INFO] --- tycho-compiler-plugin:1.0.0:compile (default-compile) @ be.uantwerpen.ansymo.semanticadaptation.cg.canonical ---
[WARNING] Parameter 'useProjectSettings' is set to true, but preferences file '/var/lib/jenkins/workspace/HybridCosimulation_master-LDEVB56LP46DTRNYHQSCKMS3FR4JD6RBBK6S2LPONMGDZRBJQH3A@2/DSL_SemanticAdaptation/be.uantwerpen.ansymo.semanticadaptation.cg.canonical/.settings/org.eclipse.jdt.core.prefs' could not be found!
[INFO] Compiling 4 source files to /var/lib/jenkins/workspace/HybridCosimulation_master-LDEVB56LP46DTRNYHQSCKMS3FR4JD6RBBK6S2LPONMGDZRBJQH3A@2/DSL_SemanticAdaptation/be.uantwerpen.ansymo.semanticadaptation.cg.canonical/target/classes
[WARNING] Source directory /var/lib/jenkins/workspace/HybridCosimulation_master-LDEVB56LP46DTRNYHQSCKMS3FR4JD6RBBK6S2LPONMGDZRBJQH3A@2/DSL_SemanticAdaptation/be.uantwerpen.ansymo.semanticadaptation.cg.canonical/src-gen does not exist
[INFO] 
[INFO] --- xtend-maven-plugin:2.11.0:xtend-install-debug-info (default) @ be.uantwerpen.ansymo.semanticadaptation.cg.canonical ---
[WARNING] Directory /var/lib/jenkins/workspace/HybridCosimulation_master-LDEVB56LP46DTRNYHQSCKMS3FR4JD6RBBK6S2LPONMGDZRBJQH3A@2/DSL_SemanticAdaptation/be.uantwerpen.ansymo.semanticadaptation.cg.canonical/src/main/java is empty. Can't process.
[WARNING] Directory /var/lib/jenkins/workspace/HybridCosimulation_master-LDEVB56LP46DTRNYHQSCKMS3FR4JD6RBBK6S2LPONMGDZRBJQH3A@2/DSL_SemanticAdaptation/be.uantwerpen.ansymo.semanticadaptation.cg.canonical/src-gen is empty. Can't process.
[INFO] Installing Xtend files into 14 class files as primary debug sources in: /var/lib/jenkins/workspace/HybridCosimulation_master-LDEVB56LP46DTRNYHQSCKMS3FR4JD6RBBK6S2LPONMGDZRBJQH3A@2/DSL_SemanticAdaptation/be.uantwerpen.ansymo.semanticadaptation.cg.canonical/target/classes
[INFO] 
[INFO] --- xtend-maven-plugin:2.11.0:testCompile (default) @ be.uantwerpen.ansymo.semanticadaptation.cg.canonical ---
[INFO] skip compiling sources because the configured directory '[/var/lib/jenkins/workspace/HybridCosimulation_master-LDEVB56LP46DTRNYHQSCKMS3FR4JD6RBBK6S2LPONMGDZRBJQH3A@2/DSL_SemanticAdaptation/be.uantwerpen.ansymo.semanticadaptation.cg.canonical/src/test/java]' does not exists.
[INFO] 
[INFO] --- maven-resources-plugin:2.7:testResources (default-testResources) @ be.uantwerpen.ansymo.semanticadaptation.cg.canonical ---
[INFO] Using 'UTF-8' encoding to copy filtered resources.
[INFO] skip non existing resourceDirectory /var/lib/jenkins/workspace/HybridCosimulation_master-LDEVB56LP46DTRNYHQSCKMS3FR4JD6RBBK6S2LPONMGDZRBJQH3A@2/DSL_SemanticAdaptation/be.uantwerpen.ansymo.semanticadaptation.cg.canonical/src/test/resources
[INFO] 
[INFO] --- xtend-maven-plugin:2.11.0:xtend-test-install-debug-info (default) @ be.uantwerpen.ansymo.semanticadaptation.cg.canonical ---
[WARNING] Directory /var/lib/jenkins/workspace/HybridCosimulation_master-LDEVB56LP46DTRNYHQSCKMS3FR4JD6RBBK6S2LPONMGDZRBJQH3A@2/DSL_SemanticAdaptation/be.uantwerpen.ansymo.semanticadaptation.cg.canonical/src/test/java is empty. Can't process.
[WARNING] Directory /var/lib/jenkins/workspace/HybridCosimulation_master-LDEVB56LP46DTRNYHQSCKMS3FR4JD6RBBK6S2LPONMGDZRBJQH3A@2/DSL_SemanticAdaptation/be.uantwerpen.ansymo.semanticadaptation.cg.canonical/target/xtend-gen/test is empty. Can't process.
[INFO] Installing Xtend files into 0 class files as primary debug sources in: /var/lib/jenkins/workspace/HybridCosimulation_master-LDEVB56LP46DTRNYHQSCKMS3FR4JD6RBBK6S2LPONMGDZRBJQH3A@2/DSL_SemanticAdaptation/be.uantwerpen.ansymo.semanticadaptation.cg.canonical/target/test-classes
[INFO] 
[INFO] --- target-platform-configuration:1.0.0:target-platform (default-target-platform) @ be.uantwerpen.ansymo.semanticadaptation.cg.canonical ---
[INFO] 
[INFO] --- tycho-packaging-plugin:1.0.0:package-plugin (default-package-plugin) @ be.uantwerpen.ansymo.semanticadaptation.cg.canonical ---
[INFO] Building jar: /var/lib/jenkins/workspace/HybridCosimulation_master-LDEVB56LP46DTRNYHQSCKMS3FR4JD6RBBK6S2LPONMGDZRBJQH3A@2/DSL_SemanticAdaptation/be.uantwerpen.ansymo.semanticadaptation.cg.canonical/target/be.uantwerpen.ansymo.semanticadaptation.cg.canonical-1.0.0-SNAPSHOT.jar
[INFO] 
[INFO] --- tycho-p2-plugin:1.0.0:p2-metadata-default (default-p2-metadata-default) @ be.uantwerpen.ansymo.semanticadaptation.cg.canonical ---
[INFO] 
[INFO] --- maven-javadoc-plugin:2.9:jar (attach-javadocs) @ be.uantwerpen.ansymo.semanticadaptation.cg.canonical ---
[INFO] Skipping javadoc generation
[INFO] 
[INFO] --- maven-jarsigner-plugin:1.4:sign (sign) @ be.uantwerpen.ansymo.semanticadaptation.cg.canonical ---
[WARNING] Picked up JAVA_TOOL_OPTIONS: -Dmaven.ext.class.path="/var/lib/jenkins/workspace/HybridCosimulation_master-LDEVB56LP46DTRNYHQSCKMS3FR4JD6RBBK6S2LPONMGDZRBJQH3A@2@tmp/withMaven73a19300/pipeline-maven-spy.jar" -Dorg.jenkinsci.plugins.pipeline.maven.reportsFolder="/var/lib/jenkins/workspace/HybridCosimulation_master-LDEVB56LP46DTRNYHQSCKMS3FR4JD6RBBK6S2LPONMGDZRBJQH3A@2@tmp/withMaven73a19300" 
[INFO] 1 archive(s) processed
[INFO] 
[INFO] --- maven-install-plugin:2.3.1:install (default-install) @ be.uantwerpen.ansymo.semanticadaptation.cg.canonical ---
[INFO] Installing /var/lib/jenkins/workspace/HybridCosimulation_master-LDEVB56LP46DTRNYHQSCKMS3FR4JD6RBBK6S2LPONMGDZRBJQH3A@2/DSL_SemanticAdaptation/be.uantwerpen.ansymo.semanticadaptation.cg.canonical/target/be.uantwerpen.ansymo.semanticadaptation.cg.canonical-1.0.0-SNAPSHOT.jar to /var/lib/jenkins/workspace/HybridCosimulation_master-LDEVB56LP46DTRNYHQSCKMS3FR4JD6RBBK6S2LPONMGDZRBJQH3A@2/.repository/be/uantwerpen/ansymo/semanticadaptation/be.uantwerpen.ansymo.semanticadaptation.cg.canonical/1.0.0-SNAPSHOT/be.uantwerpen.ansymo.semanticadaptation.cg.canonical-1.0.0-SNAPSHOT.jar
[INFO] Installing /var/lib/jenkins/workspace/HybridCosimulation_master-LDEVB56LP46DTRNYHQSCKMS3FR4JD6RBBK6S2LPONMGDZRBJQH3A@2/DSL_SemanticAdaptation/be.uantwerpen.ansymo.semanticadaptation.cg.canonical/pom.xml to /var/lib/jenkins/workspace/HybridCosimulation_master-LDEVB56LP46DTRNYHQSCKMS3FR4JD6RBBK6S2LPONMGDZRBJQH3A@2/.repository/be/uantwerpen/ansymo/semanticadaptation/be.uantwerpen.ansymo.semanticadaptation.cg.canonical/1.0.0-SNAPSHOT/be.uantwerpen.ansymo.semanticadaptation.cg.canonical-1.0.0-SNAPSHOT.pom
[INFO] Installing /var/lib/jenkins/workspace/HybridCosimulation_master-LDEVB56LP46DTRNYHQSCKMS3FR4JD6RBBK6S2LPONMGDZRBJQH3A@2/DSL_SemanticAdaptation/be.uantwerpen.ansymo.semanticadaptation.cg.canonical/target/p2content.xml to /var/lib/jenkins/workspace/HybridCosimulation_master-LDEVB56LP46DTRNYHQSCKMS3FR4JD6RBBK6S2LPONMGDZRBJQH3A@2/.repository/be/uantwerpen/ansymo/semanticadaptation/be.uantwerpen.ansymo.semanticadaptation.cg.canonical/1.0.0-SNAPSHOT/be.uantwerpen.ansymo.semanticadaptation.cg.canonical-1.0.0-SNAPSHOT-p2metadata.xml
[INFO] Installing /var/lib/jenkins/workspace/HybridCosimulation_master-LDEVB56LP46DTRNYHQSCKMS3FR4JD6RBBK6S2LPONMGDZRBJQH3A@2/DSL_SemanticAdaptation/be.uantwerpen.ansymo.semanticadaptation.cg.canonical/target/p2artifacts.xml to /var/lib/jenkins/workspace/HybridCosimulation_master-LDEVB56LP46DTRNYHQSCKMS3FR4JD6RBBK6S2LPONMGDZRBJQH3A@2/.repository/be/uantwerpen/ansymo/semanticadaptation/be.uantwerpen.ansymo.semanticadaptation.cg.canonical/1.0.0-SNAPSHOT/be.uantwerpen.ansymo.semanticadaptation.cg.canonical-1.0.0-SNAPSHOT-p2artifacts.xml
[INFO] 
[INFO] --- tycho-p2-plugin:1.0.0:update-local-index (default-update-local-index) @ be.uantwerpen.ansymo.semanticadaptation.cg.canonical ---
[INFO]                                                                         
[INFO] ------------------------------------------------------------------------
[INFO] Building be.uantwerpen.ansymo.semanticadaptation Code Generation to C++ 1.0.0-SNAPSHOT
[INFO] ------------------------------------------------------------------------
[INFO] 
[INFO] --- tycho-packaging-plugin:1.0.0:build-qualifier (default-build-qualifier) @ be.uantwerpen.ansymo.semanticadaptation.cg.cpp ---
[INFO] The project's OSGi version is 1.0.0.201711091143
[INFO] 
[INFO] --- tycho-packaging-plugin:1.0.0:validate-id (default-validate-id) @ be.uantwerpen.ansymo.semanticadaptation.cg.cpp ---
[INFO] 
[INFO] --- tycho-packaging-plugin:1.0.0:validate-version (default-validate-version) @ be.uantwerpen.ansymo.semanticadaptation.cg.cpp ---
[INFO] 
[INFO] --- xtend-maven-plugin:2.11.0:compile (default) @ be.uantwerpen.ansymo.semanticadaptation.cg.cpp ---
[INFO] 
[INFO] --- maven-resources-plugin:2.7:resources (default-resources) @ be.uantwerpen.ansymo.semanticadaptation.cg.cpp ---
[INFO] Using 'UTF-8' encoding to copy filtered resources.
[INFO] skip non existing resourceDirectory /var/lib/jenkins/workspace/HybridCosimulation_master-LDEVB56LP46DTRNYHQSCKMS3FR4JD6RBBK6S2LPONMGDZRBJQH3A@2/DSL_SemanticAdaptation/be.uantwerpen.ansymo.semanticadaptation.cg.cpp/src/main/resources
[INFO] 
[INFO] --- tycho-compiler-plugin:1.0.0:compile (default-compile) @ be.uantwerpen.ansymo.semanticadaptation.cg.cpp ---
[WARNING] Parameter 'useProjectSettings' is set to true, but preferences file '/var/lib/jenkins/workspace/HybridCosimulation_master-LDEVB56LP46DTRNYHQSCKMS3FR4JD6RBBK6S2LPONMGDZRBJQH3A@2/DSL_SemanticAdaptation/be.uantwerpen.ansymo.semanticadaptation.cg.cpp/.settings/org.eclipse.jdt.core.prefs' could not be found!
[INFO] Compiling 35 source files to /var/lib/jenkins/workspace/HybridCosimulation_master-LDEVB56LP46DTRNYHQSCKMS3FR4JD6RBBK6S2LPONMGDZRBJQH3A@2/DSL_SemanticAdaptation/be.uantwerpen.ansymo.semanticadaptation.cg.cpp/target/classes
[INFO] ------------------------------------------------------------------------
[INFO] Reactor Summary:
[INFO] 
[INFO] Semantics Adaptation Root .......................... SUCCESS [  1.095 s]
[INFO] be.uantwerpen.ansymo.semanticadaptation Testframework SUCCESS [ 18.233 s]
[INFO] be.uantwerpen.ansymo.semanticadaptation Logger ..... SUCCESS [  2.277 s]
[INFO] be.uantwerpen.ansymo.semanticadaptation Language Core SUCCESS [ 44.748 s]
[INFO] be.uantwerpen.ansymo.semanticadaptation Canonical Generator SUCCESS [  4.848 s]
[INFO] be.uantwerpen.ansymo.semanticadaptation Code Generation to C++ FAILURE [  5.200 s]
[INFO] be.uantwerpen.ansymo.semanticadaptation Code Generator SKIPPED
[INFO] be.uantwerpen.ansymo.semanticadaptation Language Tests SKIPPED
[INFO] be.uantwerpen.ansymo.semanticadaptation.ide ........ SKIPPED
[INFO] be.uantwerpen.ansymo.semanticadaptation.ui Language UI SKIPPED
[INFO] be.uantwerpen.ansymo.semanticadaptation Code Generation to C++ Tests SKIPPED
[INFO] be.uantwerpen.ansymo.semanticadaptation Code Generation to C++ Tests SKIPPED
[INFO] Feature ............................................ SKIPPED
[INFO] be.uantwerpen.ansymo.semanticadaptation.ide.platform SKIPPED
[INFO] Core ............................................... SKIPPED
[INFO] Semantics Adaptation IDE Eclipse repository ........ SKIPPED
[INFO] SA IDE Standalone Product .......................... SKIPPED
[INFO] ------------------------------------------------------------------------
[INFO] BUILD FAILURE
[INFO] ------------------------------------------------------------------------
[INFO] Total time: 02:49 min
[INFO] Finished at: 2017-11-09T12:46:27+01:00
[INFO] Final Memory: 182M/908M
[INFO] ------------------------------------------------------------------------
[jenkins-maven-event-spy] INFO generated /var/lib/jenkins/workspace/HybridCosimulation_master-LDEVB56LP46DTRNYHQSCKMS3FR4JD6RBBK6S2LPONMGDZRBJQH3A@2@tmp/withMaven73a19300/maven-spy-20171109-124338-330.log
[ERROR] Failed to execute goal org.eclipse.tycho:tycho-compiler-plugin:1.0.0:compile (default-compile) on project be.uantwerpen.ansymo.semanticadaptation.cg.cpp: Compilation failure: Compilation failure:
[ERROR] /var/lib/jenkins/workspace/HybridCosimulation_master-LDEVB56LP46DTRNYHQSCKMS3FR4JD6RBBK6S2LPONMGDZRBJQH3A@2/DSL_SemanticAdaptation/be.uantwerpen.ansymo.semanticadaptation.cg.cpp/xtend-gen/be/uantwerpen/ansymo/semanticadaptation/cg/cpp/ModelDescriptionCreator.java:[3]
[ERROR] import be.uantwerpen.ansymo.semanticadaptation.cg.cpp.ModelDescriptionBuilder;
[ERROR] ^^^^^^^^^^^^^^^^^^^^^^^^^^^^^^^^^^^^^^^^^^^^^^^^^^^^^^^^^^^^^^^^^^^^^^
[ERROR] The import be.uantwerpen.ansymo.semanticadaptation.cg.cpp.ModelDescriptionBuilder cannot be resolved
[ERROR] /var/lib/jenkins/workspace/HybridCosimulation_master-LDEVB56LP46DTRNYHQSCKMS3FR4JD6RBBK6S2LPONMGDZRBJQH3A@2/DSL_SemanticAdaptation/be.uantwerpen.ansymo.semanticadaptation.cg.cpp/xtend-gen/be/uantwerpen/ansymo/semanticadaptation/cg/cpp/ModelDescriptionCreator.java:[4]
[ERROR] import be.uantwerpen.ansymo.semanticadaptation.cg.cpp.SVCausality;
[ERROR] ^^^^^^^^^^^^^^^^^^^^^^^^^^^^^^^^^^^^^^^^^^^^^^^^^^^^^^^^^^
[ERROR] The import be.uantwerpen.ansymo.semanticadaptation.cg.cpp.SVCausality cannot be resolved
[ERROR] /var/lib/jenkins/workspace/HybridCosimulation_master-LDEVB56LP46DTRNYHQSCKMS3FR4JD6RBBK6S2LPONMGDZRBJQH3A@2/DSL_SemanticAdaptation/be.uantwerpen.ansymo.semanticadaptation.cg.cpp/xtend-gen/be/uantwerpen/ansymo/semanticadaptation/cg/cpp/ModelDescriptionCreator.java:[5]
[ERROR] import be.uantwerpen.ansymo.semanticadaptation.cg.cpp.SVType;
[ERROR] ^^^^^^^^^^^^^^^^^^^^^^^^^^^^^^^^^^^^^^^^^^^^^^^^^^^^^
[ERROR] The import be.uantwerpen.ansymo.semanticadaptation.cg.cpp.SVType cannot be resolved
[ERROR] /var/lib/jenkins/workspace/HybridCosimulation_master-LDEVB56LP46DTRNYHQSCKMS3FR4JD6RBBK6S2LPONMGDZRBJQH3A@2/DSL_SemanticAdaptation/be.uantwerpen.ansymo.semanticadaptation.cg.cpp/xtend-gen/be/uantwerpen/ansymo/semanticadaptation/cg/cpp/ModelDescriptionCreator.java:[6]
[ERROR] import be.uantwerpen.ansymo.semanticadaptation.cg.cpp.ScalarVariable;
[ERROR] ^^^^^^^^^^^^^^^^^^^^^^^^^^^^^^^^^^^^^^^^^^^^^^^^^^^^^^^^^^^^^
[ERROR] The import be.uantwerpen.ansymo.semanticadaptation.cg.cpp.ScalarVariable cannot be resolved
[ERROR] /var/lib/jenkins/workspace/HybridCosimulation_master-LDEVB56LP46DTRNYHQSCKMS3FR4JD6RBBK6S2LPONMGDZRBJQH3A@2/DSL_SemanticAdaptation/be.uantwerpen.ansymo.semanticadaptation.cg.cpp/xtend-gen/be/uantwerpen/ansymo/semanticadaptation/cg/cpp/ModelDescriptionCreator.java:[38]
[ERROR] private List<ScalarVariable> sVars = new Vector<ScalarVariable>();
[ERROR] ^^^^^^^^^^^^^^
[ERROR] ScalarVariable cannot be resolved to a type
[ERROR] /var/lib/jenkins/workspace/HybridCosimulation_master-LDEVB56LP46DTRNYHQSCKMS3FR4JD6RBBK6S2LPONMGDZRBJQH3A@2/DSL_SemanticAdaptation/be.uantwerpen.ansymo.semanticadaptation.cg.cpp/xtend-gen/be/uantwerpen/ansymo/semanticadaptation/cg/cpp/ModelDescriptionCreator.java:[38]
[ERROR] private List<ScalarVariable> sVars = new Vector<ScalarVariable>();
[ERROR] ^^^^^^^^^^^^^^
[ERROR] ScalarVariable cannot be resolved to a type
[ERROR] /var/lib/jenkins/workspace/HybridCosimulation_master-LDEVB56LP46DTRNYHQSCKMS3FR4JD6RBBK6S2LPONMGDZRBJQH3A@2/DSL_SemanticAdaptation/be.uantwerpen.ansymo.semanticadaptation.cg.cpp/xtend-gen/be/uantwerpen/ansymo/semanticadaptation/cg/cpp/ModelDescriptionCreator.java:[40]
[ERROR] private ModelDescriptionBuilder mdBuilder = new Function0<ModelDescriptionBuilder>() {
[ERROR] ^^^^^^^^^^^^^^^^^^^^^^^
[ERROR] ModelDescriptionBuilder cannot be resolved to a type
[ERROR] /var/lib/jenkins/workspace/HybridCosimulation_master-LDEVB56LP46DTRNYHQSCKMS3FR4JD6RBBK6S2LPONMGDZRBJQH3A@2/DSL_SemanticAdaptation/be.uantwerpen.ansymo.semanticadaptation.cg.cpp/xtend-gen/be/uantwerpen/ansymo/semanticadaptation/cg/cpp/ModelDescriptionCreator.java:[40]
[ERROR] private ModelDescriptionBuilder mdBuilder = new Function0<ModelDescriptionBuilder>() {
[ERROR] ^^^^^^^^^^^^^^^^^^^^^^^
[ERROR] ModelDescriptionBuilder cannot be resolved to a type
[ERROR] /var/lib/jenkins/workspace/HybridCosimulation_master-LDEVB56LP46DTRNYHQSCKMS3FR4JD6RBBK6S2LPONMGDZRBJQH3A@2/DSL_SemanticAdaptation/be.uantwerpen.ansymo.semanticadaptation.cg.cpp/xtend-gen/be/uantwerpen/ansymo/semanticadaptation/cg/cpp/ModelDescriptionCreator.java:[41]
[ERROR] public ModelDescriptionBuilder apply() {
[ERROR] ^^^^^^^^^^^^^^^^^^^^^^^
[ERROR] ModelDescriptionBuilder cannot be resolved to a type
[ERROR] /var/lib/jenkins/workspace/HybridCosimulation_master-LDEVB56LP46DTRNYHQSCKMS3FR4JD6RBBK6S2LPONMGDZRBJQH3A@2/DSL_SemanticAdaptation/be.uantwerpen.ansymo.semanticadaptation.cg.cpp/xtend-gen/be/uantwerpen/ansymo/semanticadaptation/cg/cpp/ModelDescriptionCreator.java:[43]
[ERROR] ModelDescriptionBuilder _modelDescriptionBuilder = new ModelDescriptionBuilder();
[ERROR] ^^^^^^^^^^^^^^^^^^^^^^^
[ERROR] ModelDescriptionBuilder cannot be resolved to a type
[ERROR] /var/lib/jenkins/workspace/HybridCosimulation_master-LDEVB56LP46DTRNYHQSCKMS3FR4JD6RBBK6S2LPONMGDZRBJQH3A@2/DSL_SemanticAdaptation/be.uantwerpen.ansymo.semanticadaptation.cg.cpp/xtend-gen/be/uantwerpen/ansymo/semanticadaptation/cg/cpp/ModelDescriptionCreator.java:[43]
[ERROR] ModelDescriptionBuilder _modelDescriptionBuilder = new ModelDescriptionBuilder();
[ERROR] ^^^^^^^^^^^^^^^^^^^^^^^
[ERROR] ModelDescriptionBuilder cannot be resolved to a type
[ERROR] /var/lib/jenkins/workspace/HybridCosimulation_master-LDEVB56LP46DTRNYHQSCKMS3FR4JD6RBBK6S2LPONMGDZRBJQH3A@2/DSL_SemanticAdaptation/be.uantwerpen.ansymo.semanticadaptation.cg.cpp/xtend-gen/be/uantwerpen/ansymo/semanticadaptation/cg/cpp/ModelDescriptionCreator.java:[49]
[ERROR] }.apply();
[ERROR] ^^^^^
[ERROR] The method apply() from the type new Functions.Function0<ModelDescriptionBuilder>(){} refers to the missing type ModelDescriptionBuilder
[ERROR] /var/lib/jenkins/workspace/HybridCosimulation_master-LDEVB56LP46DTRNYHQSCKMS3FR4JD6RBBK6S2LPONMGDZRBJQH3A@2/DSL_SemanticAdaptation/be.uantwerpen.ansymo.semanticadaptation.cg.cpp/xtend-gen/be/uantwerpen/ansymo/semanticadaptation/cg/cpp/ModelDescriptionCreator.java:[60]
[ERROR] this.mdBuilder.CreateTemplate(this.mdName, UUID.randomUUID().toString());
[ERROR] ^^^^^^^^^^^^^^
[ERROR] ModelDescriptionBuilder cannot be resolved to a type
[ERROR] /var/lib/jenkins/workspace/HybridCosimulation_master-LDEVB56LP46DTRNYHQSCKMS3FR4JD6RBBK6S2LPONMGDZRBJQH3A@2/DSL_SemanticAdaptation/be.uantwerpen.ansymo.semanticadaptation.cg.cpp/xtend-gen/be/uantwerpen/ansymo/semanticadaptation/cg/cpp/ModelDescriptionCreator.java:[61]
[ERROR] for (final ScalarVariable sVar : this.sVars) {
[ERROR] ^^^^^^^^^^^^^^
[ERROR] ScalarVariable cannot be resolved to a type
[ERROR] /var/lib/jenkins/workspace/HybridCosimulation_master-LDEVB56LP46DTRNYHQSCKMS3FR4JD6RBBK6S2LPONMGDZRBJQH3A@2/DSL_SemanticAdaptation/be.uantwerpen.ansymo.semanticadaptation.cg.cpp/xtend-gen/be/uantwerpen/ansymo/semanticadaptation/cg/cpp/ModelDescriptionCreator.java:[61]
[ERROR] for (final ScalarVariable sVar : this.sVars) {
[ERROR] ^^^^^^^^^^
[ERROR] ScalarVariable cannot be resolved to a type
[ERROR] /var/lib/jenkins/workspace/HybridCosimulation_master-LDEVB56LP46DTRNYHQSCKMS3FR4JD6RBBK6S2LPONMGDZRBJQH3A@2/DSL_SemanticAdaptation/be.uantwerpen.ansymo.semanticadaptation.cg.cpp/xtend-gen/be/uantwerpen/ansymo/semanticadaptation/cg/cpp/ModelDescriptionCreator.java:[62]
[ERROR] this.mdBuilder.addScalarVariable(sVar);
[ERROR] ^^^^^^^^^^^^^^
[ERROR] ModelDescriptionBuilder cannot be resolved to a type
[ERROR] /var/lib/jenkins/workspace/HybridCosimulation_master-LDEVB56LP46DTRNYHQSCKMS3FR4JD6RBBK6S2LPONMGDZRBJQH3A@2/DSL_SemanticAdaptation/be.uantwerpen.ansymo.semanticadaptation.cg.cpp/xtend-gen/be/uantwerpen/ansymo/semanticadaptation/cg/cpp/ModelDescriptionCreator.java:[64]
[ERROR] return this.mdBuilder.toString();
[ERROR] ^^^^^^^^^^^^^^
[ERROR] ModelDescriptionBuilder cannot be resolved to a type
[ERROR] /var/lib/jenkins/workspace/HybridCosimulation_master-LDEVB56LP46DTRNYHQSCKMS3FR4JD6RBBK6S2LPONMGDZRBJQH3A@2/DSL_SemanticAdaptation/be.uantwerpen.ansymo.semanticadaptation.cg.cpp/xtend-gen/be/uantwerpen/ansymo/semanticadaptation/cg/cpp/ModelDescriptionCreator.java:[126]
[ERROR] this.sVars.add(
[ERROR] ^^^^^^^^^^
[ERROR] ScalarVariable cannot be resolved to a type
[ERROR] /var/lib/jenkins/workspace/HybridCosimulation_master-LDEVB56LP46DTRNYHQSCKMS3FR4JD6RBBK6S2LPONMGDZRBJQH3A@2/DSL_SemanticAdaptation/be.uantwerpen.ansymo.semanticadaptation.cg.cpp/xtend-gen/be/uantwerpen/ansymo/semanticadaptation/cg/cpp/ModelDescriptionCreator.java:[127]
[ERROR] ScalarVariable.Create().setName(port.getName()).setValueReference(this.mdBuilder.getNextValueReference()).setCausality(
[ERROR] ^^^^^^^^^^^^^^
[ERROR] ScalarVariable cannot be resolved
[ERROR] /var/lib/jenkins/workspace/HybridCosimulation_master-LDEVB56LP46DTRNYHQSCKMS3FR4JD6RBBK6S2LPONMGDZRBJQH3A@2/DSL_SemanticAdaptation/be.uantwerpen.ansymo.semanticadaptation.cg.cpp/xtend-gen/be/uantwerpen/ansymo/semanticadaptation/cg/cpp/ModelDescriptionCreator.java:[127]
[ERROR] ScalarVariable.Create().setName(port.getName()).setValueReference(this.mdBuilder.getNextValueReference()).setCausality(
[ERROR] ^^^^^^^^^^^^^^
[ERROR] ModelDescriptionBuilder cannot be resolved to a type
[ERROR] /var/lib/jenkins/workspace/HybridCosimulation_master-LDEVB56LP46DTRNYHQSCKMS3FR4JD6RBBK6S2LPONMGDZRBJQH3A@2/DSL_SemanticAdaptation/be.uantwerpen.ansymo.semanticadaptation.cg.cpp/xtend-gen/be/uantwerpen/ansymo/semanticadaptation/cg/cpp/ModelDescriptionCreator.java:[128]
[ERROR] SVCausality.input).setType(SVType.valueOf(nl.getNodeName())));
[ERROR] ^^^^^^^^^^^
[ERROR] SVCausality cannot be resolved to a variable
[ERROR] /var/lib/jenkins/workspace/HybridCosimulation_master-LDEVB56LP46DTRNYHQSCKMS3FR4JD6RBBK6S2LPONMGDZRBJQH3A@2/DSL_SemanticAdaptation/be.uantwerpen.ansymo.semanticadaptation.cg.cpp/xtend-gen/be/uantwerpen/ansymo/semanticadaptation/cg/cpp/ModelDescriptionCreator.java:[128]
[ERROR] SVCausality.input).setType(SVType.valueOf(nl.getNodeName())));
[ERROR] ^^^^^^
[ERROR] SVType cannot be resolved
[ERROR] /var/lib/jenkins/workspace/HybridCosimulation_master-LDEVB56LP46DTRNYHQSCKMS3FR4JD6RBBK6S2LPONMGDZRBJQH3A@2/DSL_SemanticAdaptation/be.uantwerpen.ansymo.semanticadaptation.cg.cpp/xtend-gen/be/uantwerpen/ansymo/semanticadaptation/cg/cpp/ModelDescriptionCreator.java:[143]
[ERROR] this.sVars.add(
[ERROR] ^^^^^^^^^^
[ERROR] ScalarVariable cannot be resolved to a type
[ERROR] /var/lib/jenkins/workspace/HybridCosimulation_master-LDEVB56LP46DTRNYHQSCKMS3FR4JD6RBBK6S2LPONMGDZRBJQH3A@2/DSL_SemanticAdaptation/be.uantwerpen.ansymo.semanticadaptation.cg.cpp/xtend-gen/be/uantwerpen/ansymo/semanticadaptation/cg/cpp/ModelDescriptionCreator.java:[144]
[ERROR] ScalarVariable.Create().setName(port_1.getName()).setValueReference(this.mdBuilder.getNextValueReference()).setCausality(
[ERROR] ^^^^^^^^^^^^^^
[ERROR] ScalarVariable cannot be resolved
[ERROR] /var/lib/jenkins/workspace/HybridCosimulation_master-LDEVB56LP46DTRNYHQSCKMS3FR4JD6RBBK6S2LPONMGDZRBJQH3A@2/DSL_SemanticAdaptation/be.uantwerpen.ansymo.semanticadaptation.cg.cpp/xtend-gen/be/uantwerpen/ansymo/semanticadaptation/cg/cpp/ModelDescriptionCreator.java:[144]
[ERROR] ScalarVariable.Create().setName(port_1.getName()).setValueReference(this.mdBuilder.getNextValueReference()).setCausality(
[ERROR] ^^^^^^^^^^^^^^
[ERROR] ModelDescriptionBuilder cannot be resolved to a type
[ERROR] /var/lib/jenkins/workspace/HybridCosimulation_master-LDEVB56LP46DTRNYHQSCKMS3FR4JD6RBBK6S2LPONMGDZRBJQH3A@2/DSL_SemanticAdaptation/be.uantwerpen.ansymo.semanticadaptation.cg.cpp/xtend-gen/be/uantwerpen/ansymo/semanticadaptation/cg/cpp/ModelDescriptionCreator.java:[145]
[ERROR] SVCausality.output).setType(SVType.valueOf(nl.getNodeName())));
[ERROR] ^^^^^^^^^^^
[ERROR] SVCausality cannot be resolved to a variable
[ERROR] /var/lib/jenkins/workspace/HybridCosimulation_master-LDEVB56LP46DTRNYHQSCKMS3FR4JD6RBBK6S2LPONMGDZRBJQH3A@2/DSL_SemanticAdaptation/be.uantwerpen.ansymo.semanticadaptation.cg.cpp/xtend-gen/be/uantwerpen/ansymo/semanticadaptation/cg/cpp/ModelDescriptionCreator.java:[145]
[ERROR] SVCausality.output).setType(SVType.valueOf(nl.getNodeName())));
[ERROR] ^^^^^^
[ERROR] SVType cannot be resolved
[ERROR] 27 problems (27 errors)
[ERROR] -> [Help 1]
[ERROR] 
[ERROR] To see the full stack trace of the errors, re-run Maven with the -e switch.
[ERROR] Re-run Maven using the -X switch to enable full debug logging.
[ERROR] 
[ERROR] For more information about the errors and possible solutions, please read the following articles:
[ERROR] [Help 1] http://cwiki.apache.org/confluence/display/MAVEN/MojoFailureException
[ERROR] 
[ERROR] After correcting the problems, you can resume the build with the command
[ERROR]   mvn <goals> -rf :be.uantwerpen.ansymo.semanticadaptation.cg.cpp
[Pipeline] }
[withMaven] artifactsPublisher - Archive artifact DSL_SemanticAdaptation/pom.xml under be/uantwerpen/ansymo/semanticadaptation/parent/1.0.0-SNAPSHOT/parent-1.0.0-SNAPSHOT.pom
[withMaven] artifactsPublisher - Archive artifact DSL_SemanticAdaptation/be.uantwerpen.ansymo.semanticadaptation.testframework/pom.xml under be/uantwerpen/ansymo/semanticadaptation/be.uantwerpen.ansymo.semanticadaptation.testframework/1.0.0-SNAPSHOT/be.uantwerpen.ansymo.semanticadaptation.testframework-1.0.0-SNAPSHOT.pom
[withMaven] artifactsPublisher - Archive artifact DSL_SemanticAdaptation/be.uantwerpen.ansymo.semanticadaptation.testframework/target/be.uantwerpen.ansymo.semanticadaptation.testframework-1.0.0-SNAPSHOT.jar under be/uantwerpen/ansymo/semanticadaptation/be.uantwerpen.ansymo.semanticadaptation.testframework/1.0.0-SNAPSHOT/be.uantwerpen.ansymo.semanticadaptation.testframework-1.0.0-SNAPSHOT.jar
[withMaven] artifactsPublisher - Archive artifact DSL_SemanticAdaptation/be.uantwerpen.ansymo.semanticadaptation.log/pom.xml under be/uantwerpen/ansymo/semanticadaptation/be.uantwerpen.ansymo.semanticadaptation.log/1.0.0-SNAPSHOT/be.uantwerpen.ansymo.semanticadaptation.log-1.0.0-SNAPSHOT.pom
[withMaven] artifactsPublisher - Archive artifact DSL_SemanticAdaptation/be.uantwerpen.ansymo.semanticadaptation.log/target/be.uantwerpen.ansymo.semanticadaptation.log-1.0.0-SNAPSHOT.jar under be/uantwerpen/ansymo/semanticadaptation/be.uantwerpen.ansymo.semanticadaptation.log/1.0.0-SNAPSHOT/be.uantwerpen.ansymo.semanticadaptation.log-1.0.0-SNAPSHOT.jar
[withMaven] artifactsPublisher - Archive artifact DSL_SemanticAdaptation/be.uantwerpen.ansymo.semanticadaptation/pom.xml under be/uantwerpen/ansymo/semanticadaptation/be.uantwerpen.ansymo.semanticadaptation/1.0.0-SNAPSHOT/be.uantwerpen.ansymo.semanticadaptation-1.0.0-SNAPSHOT.pom
[withMaven] artifactsPublisher - Archive artifact DSL_SemanticAdaptation/be.uantwerpen.ansymo.semanticadaptation/target/be.uantwerpen.ansymo.semanticadaptation-1.0.0-SNAPSHOT.jar under be/uantwerpen/ansymo/semanticadaptation/be.uantwerpen.ansymo.semanticadaptation/1.0.0-SNAPSHOT/be.uantwerpen.ansymo.semanticadaptation-1.0.0-SNAPSHOT.jar
[withMaven] artifactsPublisher - Archive artifact DSL_SemanticAdaptation/be.uantwerpen.ansymo.semanticadaptation.cg.canonical/pom.xml under be/uantwerpen/ansymo/semanticadaptation/be.uantwerpen.ansymo.semanticadaptation.cg.canonical/1.0.0-SNAPSHOT/be.uantwerpen.ansymo.semanticadaptation.cg.canonical-1.0.0-SNAPSHOT.pom
[withMaven] artifactsPublisher - Archive artifact DSL_SemanticAdaptation/be.uantwerpen.ansymo.semanticadaptation.cg.canonical/target/be.uantwerpen.ansymo.semanticadaptation.cg.canonical-1.0.0-SNAPSHOT.jar under be/uantwerpen/ansymo/semanticadaptation/be.uantwerpen.ansymo.semanticadaptation.cg.canonical/1.0.0-SNAPSHOT/be.uantwerpen.ansymo.semanticadaptation.cg.canonical-1.0.0-SNAPSHOT.jar
[withMaven] artifactsPublisher - Archive artifact DSL_SemanticAdaptation/be.uantwerpen.ansymo.semanticadaptation.testframework/target/p2content.xml under be/uantwerpen/ansymo/semanticadaptation/be.uantwerpen.ansymo.semanticadaptation.testframework/1.0.0-SNAPSHOT/be.uantwerpen.ansymo.semanticadaptation.testframework-1.0.0-SNAPSHOT-p2metadata.xml
[withMaven] artifactsPublisher - Archive artifact DSL_SemanticAdaptation/be.uantwerpen.ansymo.semanticadaptation.testframework/target/p2artifacts.xml under be/uantwerpen/ansymo/semanticadaptation/be.uantwerpen.ansymo.semanticadaptation.testframework/1.0.0-SNAPSHOT/be.uantwerpen.ansymo.semanticadaptation.testframework-1.0.0-SNAPSHOT-p2artifacts.xml
[withMaven] artifactsPublisher - Archive artifact DSL_SemanticAdaptation/be.uantwerpen.ansymo.semanticadaptation.log/target/p2content.xml under be/uantwerpen/ansymo/semanticadaptation/be.uantwerpen.ansymo.semanticadaptation.log/1.0.0-SNAPSHOT/be.uantwerpen.ansymo.semanticadaptation.log-1.0.0-SNAPSHOT-p2metadata.xml
[withMaven] artifactsPublisher - Archive artifact DSL_SemanticAdaptation/be.uantwerpen.ansymo.semanticadaptation.log/target/p2artifacts.xml under be/uantwerpen/ansymo/semanticadaptation/be.uantwerpen.ansymo.semanticadaptation.log/1.0.0-SNAPSHOT/be.uantwerpen.ansymo.semanticadaptation.log-1.0.0-SNAPSHOT-p2artifacts.xml
[withMaven] artifactsPublisher - Archive artifact DSL_SemanticAdaptation/be.uantwerpen.ansymo.semanticadaptation/target/p2content.xml under be/uantwerpen/ansymo/semanticadaptation/be.uantwerpen.ansymo.semanticadaptation/1.0.0-SNAPSHOT/be.uantwerpen.ansymo.semanticadaptation-1.0.0-SNAPSHOT-p2metadata.xml
[withMaven] artifactsPublisher - Archive artifact DSL_SemanticAdaptation/be.uantwerpen.ansymo.semanticadaptation/target/p2artifacts.xml under be/uantwerpen/ansymo/semanticadaptation/be.uantwerpen.ansymo.semanticadaptation/1.0.0-SNAPSHOT/be.uantwerpen.ansymo.semanticadaptation-1.0.0-SNAPSHOT-p2artifacts.xml
[withMaven] artifactsPublisher - Archive artifact DSL_SemanticAdaptation/be.uantwerpen.ansymo.semanticadaptation.cg.canonical/target/p2content.xml under be/uantwerpen/ansymo/semanticadaptation/be.uantwerpen.ansymo.semanticadaptation.cg.canonical/1.0.0-SNAPSHOT/be.uantwerpen.ansymo.semanticadaptation.cg.canonical-1.0.0-SNAPSHOT-p2metadata.xml
[withMaven] artifactsPublisher - Archive artifact DSL_SemanticAdaptation/be.uantwerpen.ansymo.semanticadaptation.cg.canonical/target/p2artifacts.xml under be/uantwerpen/ansymo/semanticadaptation/be.uantwerpen.ansymo.semanticadaptation.cg.canonical/1.0.0-SNAPSHOT/be.uantwerpen.ansymo.semanticadaptation.cg.canonical-1.0.0-SNAPSHOT-p2artifacts.xml
[TASKS] Scanning folder '/var/lib/jenkins/workspace/HybridCosimulation_master-LDEVB56LP46DTRNYHQSCKMS3FR4JD6RBBK6S2LPONMGDZRBJQH3A@2' for files matching the pattern '**/*.java' - excludes: null
[TASKS] Found 397 files to scan for tasks
[TASKS] Found 27 open tasks.
Skipping warnings blame since pipelines do not have an SCM link.%n
[TASKS] Computing warning deltas based on reference build #142
[Pipeline] // withMaven
[Pipeline] }
[Pipeline] // stage
[Pipeline] stage
[Pipeline] { (Reporting)
[Pipeline] emailextrecipients
Not sending mail to user casper.thule@eng.au.dk with no permission to view HybridCosimulation » master #148[Pipeline] emailext
#147 is still in progress; ignoring for purposes of comparison
#147 is still in progress; ignoring for purposes of comparison
#147 is still in progress; ignoring for purposes of comparison
Sending email to: lausdahl@eng.au.dk
[Pipeline] }
[Pipeline] // stage
[Pipeline] }
[Pipeline] // node
[Pipeline] End of Pipeline
ERROR: script returned exit code 1
Finished: FAILURE