FailedConsole Output

Skipping 204 KB.. Full Log
.uantwerpen.ansymo.semanticadaptation.tests/1.0.0-SNAPSHOT/be.uantwerpen.ansymo.semanticadaptation.tests-1.0.0-SNAPSHOT.jar
[INFO] Installing /var/lib/jenkins/workspace/HybridCosimulation_master-LDEVB56LP46DTRNYHQSCKMS3FR4JD6RBBK6S2LPONMGDZRBJQH3A/DSL_SemanticAdaptation/be.uantwerpen.ansymo.semanticadaptation.tests/pom.xml to /var/lib/jenkins/workspace/HybridCosimulation_master-LDEVB56LP46DTRNYHQSCKMS3FR4JD6RBBK6S2LPONMGDZRBJQH3A/.repository/be/uantwerpen/ansymo/semanticadaptation/be.uantwerpen.ansymo.semanticadaptation.tests/1.0.0-SNAPSHOT/be.uantwerpen.ansymo.semanticadaptation.tests-1.0.0-SNAPSHOT.pom
[INFO] Installing /var/lib/jenkins/workspace/HybridCosimulation_master-LDEVB56LP46DTRNYHQSCKMS3FR4JD6RBBK6S2LPONMGDZRBJQH3A/DSL_SemanticAdaptation/be.uantwerpen.ansymo.semanticadaptation.tests/target/p2content.xml to /var/lib/jenkins/workspace/HybridCosimulation_master-LDEVB56LP46DTRNYHQSCKMS3FR4JD6RBBK6S2LPONMGDZRBJQH3A/.repository/be/uantwerpen/ansymo/semanticadaptation/be.uantwerpen.ansymo.semanticadaptation.tests/1.0.0-SNAPSHOT/be.uantwerpen.ansymo.semanticadaptation.tests-1.0.0-SNAPSHOT-p2metadata.xml
[INFO] Installing /var/lib/jenkins/workspace/HybridCosimulation_master-LDEVB56LP46DTRNYHQSCKMS3FR4JD6RBBK6S2LPONMGDZRBJQH3A/DSL_SemanticAdaptation/be.uantwerpen.ansymo.semanticadaptation.tests/target/p2artifacts.xml to /var/lib/jenkins/workspace/HybridCosimulation_master-LDEVB56LP46DTRNYHQSCKMS3FR4JD6RBBK6S2LPONMGDZRBJQH3A/.repository/be/uantwerpen/ansymo/semanticadaptation/be.uantwerpen.ansymo.semanticadaptation.tests/1.0.0-SNAPSHOT/be.uantwerpen.ansymo.semanticadaptation.tests-1.0.0-SNAPSHOT-p2artifacts.xml
[INFO] 
[INFO] --- tycho-p2-plugin:1.0.0:update-local-index (default-update-local-index) @ be.uantwerpen.ansymo.semanticadaptation.tests ---
[INFO]                                                                         
[INFO] ------------------------------------------------------------------------
[INFO] Building be.uantwerpen.ansymo.semanticadaptation.ide 1.0.0-SNAPSHOT
[INFO] ------------------------------------------------------------------------
[INFO] 
[INFO] --- tycho-packaging-plugin:1.0.0:build-qualifier (default-build-qualifier) @ be.uantwerpen.ansymo.semanticadaptation.ide ---
[INFO] The project's OSGi version is 1.0.0.201808160830
[INFO] 
[INFO] --- tycho-packaging-plugin:1.0.0:validate-id (default-validate-id) @ be.uantwerpen.ansymo.semanticadaptation.ide ---
[INFO] 
[INFO] --- tycho-packaging-plugin:1.0.0:validate-version (default-validate-version) @ be.uantwerpen.ansymo.semanticadaptation.ide ---
[INFO] 
[INFO] --- maven-resources-plugin:2.7:resources (default-resources) @ be.uantwerpen.ansymo.semanticadaptation.ide ---
[INFO] Using 'UTF-8' encoding to copy filtered resources.
[INFO] skip non existing resourceDirectory /var/lib/jenkins/workspace/HybridCosimulation_master-LDEVB56LP46DTRNYHQSCKMS3FR4JD6RBBK6S2LPONMGDZRBJQH3A/DSL_SemanticAdaptation/be.uantwerpen.ansymo.semanticadaptation.ide/src/main/resources
[INFO] 
[INFO] --- tycho-compiler-plugin:1.0.0:compile (default-compile) @ be.uantwerpen.ansymo.semanticadaptation.ide ---
[WARNING] Parameter 'useProjectSettings' is set to true, but preferences file '/var/lib/jenkins/workspace/HybridCosimulation_master-LDEVB56LP46DTRNYHQSCKMS3FR4JD6RBBK6S2LPONMGDZRBJQH3A/DSL_SemanticAdaptation/be.uantwerpen.ansymo.semanticadaptation.ide/.settings/org.eclipse.jdt.core.prefs' could not be found!
[INFO] Compiling 5 source files to /var/lib/jenkins/workspace/HybridCosimulation_master-LDEVB56LP46DTRNYHQSCKMS3FR4JD6RBBK6S2LPONMGDZRBJQH3A/DSL_SemanticAdaptation/be.uantwerpen.ansymo.semanticadaptation.ide/target/classes
[WARNING] Source directory /var/lib/jenkins/workspace/HybridCosimulation_master-LDEVB56LP46DTRNYHQSCKMS3FR4JD6RBBK6S2LPONMGDZRBJQH3A/DSL_SemanticAdaptation/be.uantwerpen.ansymo.semanticadaptation.ide/xtend-gen does not exist
[INFO] 
[INFO] --- maven-resources-plugin:2.7:testResources (default-testResources) @ be.uantwerpen.ansymo.semanticadaptation.ide ---
[INFO] Using 'UTF-8' encoding to copy filtered resources.
[INFO] skip non existing resourceDirectory /var/lib/jenkins/workspace/HybridCosimulation_master-LDEVB56LP46DTRNYHQSCKMS3FR4JD6RBBK6S2LPONMGDZRBJQH3A/DSL_SemanticAdaptation/be.uantwerpen.ansymo.semanticadaptation.ide/src/test/resources
[INFO] 
[INFO] --- target-platform-configuration:1.0.0:target-platform (default-target-platform) @ be.uantwerpen.ansymo.semanticadaptation.ide ---
[INFO] 
[INFO] --- tycho-packaging-plugin:1.0.0:package-plugin (default-package-plugin) @ be.uantwerpen.ansymo.semanticadaptation.ide ---
[INFO] Building jar: /var/lib/jenkins/workspace/HybridCosimulation_master-LDEVB56LP46DTRNYHQSCKMS3FR4JD6RBBK6S2LPONMGDZRBJQH3A/DSL_SemanticAdaptation/be.uantwerpen.ansymo.semanticadaptation.ide/target/be.uantwerpen.ansymo.semanticadaptation.ide-1.0.0-SNAPSHOT.jar
[INFO] 
[INFO] --- tycho-p2-plugin:1.0.0:p2-metadata-default (default-p2-metadata-default) @ be.uantwerpen.ansymo.semanticadaptation.ide ---
[INFO] 
[INFO] --- maven-javadoc-plugin:2.9:jar (attach-javadocs) @ be.uantwerpen.ansymo.semanticadaptation.ide ---
[INFO] Skipping javadoc generation
[INFO] 
[INFO] --- maven-jarsigner-plugin:1.4:sign (sign) @ be.uantwerpen.ansymo.semanticadaptation.ide ---
[WARNING] Picked up JAVA_TOOL_OPTIONS: -Dmaven.ext.class.path="/var/lib/jenkins/workspace/HybridCosimulation_master-LDEVB56LP46DTRNYHQSCKMS3FR4JD6RBBK6S2LPONMGDZRBJQH3A@tmp/withMavend05bce59/pipeline-maven-spy.jar" -Dorg.jenkinsci.plugins.pipeline.maven.reportsFolder="/var/lib/jenkins/workspace/HybridCosimulation_master-LDEVB56LP46DTRNYHQSCKMS3FR4JD6RBBK6S2LPONMGDZRBJQH3A@tmp/withMavend05bce59" 
[INFO] 1 archive(s) processed
[INFO] 
[INFO] --- maven-install-plugin:2.3.1:install (default-install) @ be.uantwerpen.ansymo.semanticadaptation.ide ---
[INFO] Installing /var/lib/jenkins/workspace/HybridCosimulation_master-LDEVB56LP46DTRNYHQSCKMS3FR4JD6RBBK6S2LPONMGDZRBJQH3A/DSL_SemanticAdaptation/be.uantwerpen.ansymo.semanticadaptation.ide/target/be.uantwerpen.ansymo.semanticadaptation.ide-1.0.0-SNAPSHOT.jar to /var/lib/jenkins/workspace/HybridCosimulation_master-LDEVB56LP46DTRNYHQSCKMS3FR4JD6RBBK6S2LPONMGDZRBJQH3A/.repository/be/uantwerpen/ansymo/semanticadaptation/be.uantwerpen.ansymo.semanticadaptation.ide/1.0.0-SNAPSHOT/be.uantwerpen.ansymo.semanticadaptation.ide-1.0.0-SNAPSHOT.jar
[INFO] Installing /var/lib/jenkins/workspace/HybridCosimulation_master-LDEVB56LP46DTRNYHQSCKMS3FR4JD6RBBK6S2LPONMGDZRBJQH3A/DSL_SemanticAdaptation/be.uantwerpen.ansymo.semanticadaptation.ide/pom.xml to /var/lib/jenkins/workspace/HybridCosimulation_master-LDEVB56LP46DTRNYHQSCKMS3FR4JD6RBBK6S2LPONMGDZRBJQH3A/.repository/be/uantwerpen/ansymo/semanticadaptation/be.uantwerpen.ansymo.semanticadaptation.ide/1.0.0-SNAPSHOT/be.uantwerpen.ansymo.semanticadaptation.ide-1.0.0-SNAPSHOT.pom
[INFO] Installing /var/lib/jenkins/workspace/HybridCosimulation_master-LDEVB56LP46DTRNYHQSCKMS3FR4JD6RBBK6S2LPONMGDZRBJQH3A/DSL_SemanticAdaptation/be.uantwerpen.ansymo.semanticadaptation.ide/target/p2content.xml to /var/lib/jenkins/workspace/HybridCosimulation_master-LDEVB56LP46DTRNYHQSCKMS3FR4JD6RBBK6S2LPONMGDZRBJQH3A/.repository/be/uantwerpen/ansymo/semanticadaptation/be.uantwerpen.ansymo.semanticadaptation.ide/1.0.0-SNAPSHOT/be.uantwerpen.ansymo.semanticadaptation.ide-1.0.0-SNAPSHOT-p2metadata.xml
[INFO] Installing /var/lib/jenkins/workspace/HybridCosimulation_master-LDEVB56LP46DTRNYHQSCKMS3FR4JD6RBBK6S2LPONMGDZRBJQH3A/DSL_SemanticAdaptation/be.uantwerpen.ansymo.semanticadaptation.ide/target/p2artifacts.xml to /var/lib/jenkins/workspace/HybridCosimulation_master-LDEVB56LP46DTRNYHQSCKMS3FR4JD6RBBK6S2LPONMGDZRBJQH3A/.repository/be/uantwerpen/ansymo/semanticadaptation/be.uantwerpen.ansymo.semanticadaptation.ide/1.0.0-SNAPSHOT/be.uantwerpen.ansymo.semanticadaptation.ide-1.0.0-SNAPSHOT-p2artifacts.xml
[INFO] 
[INFO] --- tycho-p2-plugin:1.0.0:update-local-index (default-update-local-index) @ be.uantwerpen.ansymo.semanticadaptation.ide ---
[INFO]                                                                         
[INFO] ------------------------------------------------------------------------
[INFO] Building be.uantwerpen.ansymo.semanticadaptation.ui Language UI 1.0.0-SNAPSHOT
[INFO] ------------------------------------------------------------------------
[INFO] 
[INFO] --- tycho-packaging-plugin:1.0.0:build-qualifier (default-build-qualifier) @ be.uantwerpen.ansymo.semanticadaptation.ui ---
[INFO] The project's OSGi version is 1.0.0.201808160830
[INFO] 
[INFO] --- tycho-packaging-plugin:1.0.0:validate-id (default-validate-id) @ be.uantwerpen.ansymo.semanticadaptation.ui ---
[INFO] 
[INFO] --- tycho-packaging-plugin:1.0.0:validate-version (default-validate-version) @ be.uantwerpen.ansymo.semanticadaptation.ui ---
[INFO] 
[INFO] --- xtend-maven-plugin:2.14.0:compile (default) @ be.uantwerpen.ansymo.semanticadaptation.ui ---
[INFO] 
[INFO] --- maven-resources-plugin:2.7:resources (default-resources) @ be.uantwerpen.ansymo.semanticadaptation.ui ---
[INFO] Using 'UTF-8' encoding to copy filtered resources.
[INFO] skip non existing resourceDirectory /var/lib/jenkins/workspace/HybridCosimulation_master-LDEVB56LP46DTRNYHQSCKMS3FR4JD6RBBK6S2LPONMGDZRBJQH3A/DSL_SemanticAdaptation/be.uantwerpen.ansymo.semanticadaptation.ui/src/main/resources
[INFO] 
[INFO] --- tycho-compiler-plugin:1.0.0:compile (default-compile) @ be.uantwerpen.ansymo.semanticadaptation.ui ---
[WARNING] Parameter 'useProjectSettings' is set to true, but preferences file '/var/lib/jenkins/workspace/HybridCosimulation_master-LDEVB56LP46DTRNYHQSCKMS3FR4JD6RBBK6S2LPONMGDZRBJQH3A/DSL_SemanticAdaptation/be.uantwerpen.ansymo.semanticadaptation.ui/.settings/org.eclipse.jdt.core.prefs' could not be found!
[INFO] Compiling 12 source files to /var/lib/jenkins/workspace/HybridCosimulation_master-LDEVB56LP46DTRNYHQSCKMS3FR4JD6RBBK6S2LPONMGDZRBJQH3A/DSL_SemanticAdaptation/be.uantwerpen.ansymo.semanticadaptation.ui/target/classes
[INFO] 
[INFO] --- xtend-maven-plugin:2.14.0:xtend-install-debug-info (default) @ be.uantwerpen.ansymo.semanticadaptation.ui ---
[WARNING] Directory /var/lib/jenkins/workspace/HybridCosimulation_master-LDEVB56LP46DTRNYHQSCKMS3FR4JD6RBBK6S2LPONMGDZRBJQH3A/DSL_SemanticAdaptation/be.uantwerpen.ansymo.semanticadaptation.ui/src/main/java is empty. Can't process.
[INFO] Installing Xtend files into 6 class files as primary debug sources in: /var/lib/jenkins/workspace/HybridCosimulation_master-LDEVB56LP46DTRNYHQSCKMS3FR4JD6RBBK6S2LPONMGDZRBJQH3A/DSL_SemanticAdaptation/be.uantwerpen.ansymo.semanticadaptation.ui/target/classes
[INFO] 
[INFO] --- xtend-maven-plugin:2.14.0:testCompile (default) @ be.uantwerpen.ansymo.semanticadaptation.ui ---
[INFO] skip compiling sources because the configured directory '[/var/lib/jenkins/workspace/HybridCosimulation_master-LDEVB56LP46DTRNYHQSCKMS3FR4JD6RBBK6S2LPONMGDZRBJQH3A/DSL_SemanticAdaptation/be.uantwerpen.ansymo.semanticadaptation.ui/src/test/java]' does not exist.
[INFO] 
[INFO] --- maven-resources-plugin:2.7:testResources (default-testResources) @ be.uantwerpen.ansymo.semanticadaptation.ui ---
[INFO] Using 'UTF-8' encoding to copy filtered resources.
[INFO] skip non existing resourceDirectory /var/lib/jenkins/workspace/HybridCosimulation_master-LDEVB56LP46DTRNYHQSCKMS3FR4JD6RBBK6S2LPONMGDZRBJQH3A/DSL_SemanticAdaptation/be.uantwerpen.ansymo.semanticadaptation.ui/src/test/resources
[INFO] 
[INFO] --- xtend-maven-plugin:2.14.0:xtend-test-install-debug-info (default) @ be.uantwerpen.ansymo.semanticadaptation.ui ---
[WARNING] Directory /var/lib/jenkins/workspace/HybridCosimulation_master-LDEVB56LP46DTRNYHQSCKMS3FR4JD6RBBK6S2LPONMGDZRBJQH3A/DSL_SemanticAdaptation/be.uantwerpen.ansymo.semanticadaptation.ui/src/test/java is empty. Can't process.
[WARNING] Directory /var/lib/jenkins/workspace/HybridCosimulation_master-LDEVB56LP46DTRNYHQSCKMS3FR4JD6RBBK6S2LPONMGDZRBJQH3A/DSL_SemanticAdaptation/be.uantwerpen.ansymo.semanticadaptation.ui/target/xtend-gen/test is empty. Can't process.
[INFO] Installing Xtend files into 0 class files as primary debug sources in: /var/lib/jenkins/workspace/HybridCosimulation_master-LDEVB56LP46DTRNYHQSCKMS3FR4JD6RBBK6S2LPONMGDZRBJQH3A/DSL_SemanticAdaptation/be.uantwerpen.ansymo.semanticadaptation.ui/target/test-classes
[INFO] 
[INFO] --- target-platform-configuration:1.0.0:target-platform (default-target-platform) @ be.uantwerpen.ansymo.semanticadaptation.ui ---
[INFO] 
[INFO] --- tycho-packaging-plugin:1.0.0:package-plugin (default-package-plugin) @ be.uantwerpen.ansymo.semanticadaptation.ui ---
[INFO] Building jar: /var/lib/jenkins/workspace/HybridCosimulation_master-LDEVB56LP46DTRNYHQSCKMS3FR4JD6RBBK6S2LPONMGDZRBJQH3A/DSL_SemanticAdaptation/be.uantwerpen.ansymo.semanticadaptation.ui/target/be.uantwerpen.ansymo.semanticadaptation.ui-1.0.0-SNAPSHOT.jar
[INFO] 
[INFO] --- tycho-p2-plugin:1.0.0:p2-metadata-default (default-p2-metadata-default) @ be.uantwerpen.ansymo.semanticadaptation.ui ---
[INFO] 
[INFO] --- maven-javadoc-plugin:2.9:jar (attach-javadocs) @ be.uantwerpen.ansymo.semanticadaptation.ui ---
[INFO] Skipping javadoc generation
[INFO] 
[INFO] --- maven-jarsigner-plugin:1.4:sign (sign) @ be.uantwerpen.ansymo.semanticadaptation.ui ---
[WARNING] Picked up JAVA_TOOL_OPTIONS: -Dmaven.ext.class.path="/var/lib/jenkins/workspace/HybridCosimulation_master-LDEVB56LP46DTRNYHQSCKMS3FR4JD6RBBK6S2LPONMGDZRBJQH3A@tmp/withMavend05bce59/pipeline-maven-spy.jar" -Dorg.jenkinsci.plugins.pipeline.maven.reportsFolder="/var/lib/jenkins/workspace/HybridCosimulation_master-LDEVB56LP46DTRNYHQSCKMS3FR4JD6RBBK6S2LPONMGDZRBJQH3A@tmp/withMavend05bce59" 
[INFO] 1 archive(s) processed
[INFO] 
[INFO] --- maven-install-plugin:2.3.1:install (default-install) @ be.uantwerpen.ansymo.semanticadaptation.ui ---
[INFO] Installing /var/lib/jenkins/workspace/HybridCosimulation_master-LDEVB56LP46DTRNYHQSCKMS3FR4JD6RBBK6S2LPONMGDZRBJQH3A/DSL_SemanticAdaptation/be.uantwerpen.ansymo.semanticadaptation.ui/target/be.uantwerpen.ansymo.semanticadaptation.ui-1.0.0-SNAPSHOT.jar to /var/lib/jenkins/workspace/HybridCosimulation_master-LDEVB56LP46DTRNYHQSCKMS3FR4JD6RBBK6S2LPONMGDZRBJQH3A/.repository/be/uantwerpen/ansymo/semanticadaptation/be.uantwerpen.ansymo.semanticadaptation.ui/1.0.0-SNAPSHOT/be.uantwerpen.ansymo.semanticadaptation.ui-1.0.0-SNAPSHOT.jar
[INFO] Installing /var/lib/jenkins/workspace/HybridCosimulation_master-LDEVB56LP46DTRNYHQSCKMS3FR4JD6RBBK6S2LPONMGDZRBJQH3A/DSL_SemanticAdaptation/be.uantwerpen.ansymo.semanticadaptation.ui/pom.xml to /var/lib/jenkins/workspace/HybridCosimulation_master-LDEVB56LP46DTRNYHQSCKMS3FR4JD6RBBK6S2LPONMGDZRBJQH3A/.repository/be/uantwerpen/ansymo/semanticadaptation/be.uantwerpen.ansymo.semanticadaptation.ui/1.0.0-SNAPSHOT/be.uantwerpen.ansymo.semanticadaptation.ui-1.0.0-SNAPSHOT.pom
[INFO] Installing /var/lib/jenkins/workspace/HybridCosimulation_master-LDEVB56LP46DTRNYHQSCKMS3FR4JD6RBBK6S2LPONMGDZRBJQH3A/DSL_SemanticAdaptation/be.uantwerpen.ansymo.semanticadaptation.ui/target/p2content.xml to /var/lib/jenkins/workspace/HybridCosimulation_master-LDEVB56LP46DTRNYHQSCKMS3FR4JD6RBBK6S2LPONMGDZRBJQH3A/.repository/be/uantwerpen/ansymo/semanticadaptation/be.uantwerpen.ansymo.semanticadaptation.ui/1.0.0-SNAPSHOT/be.uantwerpen.ansymo.semanticadaptation.ui-1.0.0-SNAPSHOT-p2metadata.xml
[INFO] Installing /var/lib/jenkins/workspace/HybridCosimulation_master-LDEVB56LP46DTRNYHQSCKMS3FR4JD6RBBK6S2LPONMGDZRBJQH3A/DSL_SemanticAdaptation/be.uantwerpen.ansymo.semanticadaptation.ui/target/p2artifacts.xml to /var/lib/jenkins/workspace/HybridCosimulation_master-LDEVB56LP46DTRNYHQSCKMS3FR4JD6RBBK6S2LPONMGDZRBJQH3A/.repository/be/uantwerpen/ansymo/semanticadaptation/be.uantwerpen.ansymo.semanticadaptation.ui/1.0.0-SNAPSHOT/be.uantwerpen.ansymo.semanticadaptation.ui-1.0.0-SNAPSHOT-p2artifacts.xml
[INFO] 
[INFO] --- tycho-p2-plugin:1.0.0:update-local-index (default-update-local-index) @ be.uantwerpen.ansymo.semanticadaptation.ui ---
[INFO]                                                                         
[INFO] ------------------------------------------------------------------------
[INFO] Building be.uantwerpen.ansymo.semanticadaptation Code Generation to C++ Tests 1.0.0-SNAPSHOT
[INFO] ------------------------------------------------------------------------
[INFO] 
[INFO] --- tycho-packaging-plugin:1.0.0:build-qualifier (default-build-qualifier) @ be.uantwerpen.ansymo.semanticadaptation.cg.cpp.tests ---
[INFO] The project's OSGi version is 1.0.0.201808160830
[INFO] 
[INFO] --- tycho-packaging-plugin:1.0.0:validate-id (default-validate-id) @ be.uantwerpen.ansymo.semanticadaptation.cg.cpp.tests ---
[INFO] 
[INFO] --- tycho-packaging-plugin:1.0.0:validate-version (default-validate-version) @ be.uantwerpen.ansymo.semanticadaptation.cg.cpp.tests ---
[INFO] 
[INFO] --- xtend-maven-plugin:2.14.0:compile (default) @ be.uantwerpen.ansymo.semanticadaptation.cg.cpp.tests ---
[WARNING] 
WARNING: 	CgCppBasicTest.xtend - /var/lib/jenkins/workspace/HybridCosimulation_master-LDEVB56LP46DTRNYHQSCKMS3FR4JD6RBBK6S2LPONMGDZRBJQH3A/DSL_SemanticAdaptation/be.uantwerpen.ansymo.semanticadaptation.cg.cpp.tests/src/be/uantwerpen/ansymo/semanticadaptation/cg/cpp/tests/CgCppBasicTest.xtend
115: The value of the local variable ctxt is not used
[WARNING] 
WARNING: 	CgCppBasicTest.xtend - /var/lib/jenkins/workspace/HybridCosimulation_master-LDEVB56LP46DTRNYHQSCKMS3FR4JD6RBBK6S2LPONMGDZRBJQH3A/DSL_SemanticAdaptation/be.uantwerpen.ansymo.semanticadaptation.cg.cpp.tests/src/be/uantwerpen/ansymo/semanticadaptation/cg/cpp/tests/CgCppBasicTest.xtend
165: The value of the local variable ctxt is not used
[WARNING] 
WARNING: 	CgCppAutoTest.xtend - /var/lib/jenkins/workspace/HybridCosimulation_master-LDEVB56LP46DTRNYHQSCKMS3FR4JD6RBBK6S2LPONMGDZRBJQH3A/DSL_SemanticAdaptation/be.uantwerpen.ansymo.semanticadaptation.cg.cpp.tests/src/be/uantwerpen/ansymo/semanticadaptation/cg/cpp/tests/CgCppAutoTest.xtend
19: The import 'org.eclipse.xtext.generator.IGeneratorContext' is never used.
[INFO] 
[INFO] --- maven-resources-plugin:2.7:resources (default-resources) @ be.uantwerpen.ansymo.semanticadaptation.cg.cpp.tests ---
[INFO] Using 'UTF-8' encoding to copy filtered resources.
[INFO] skip non existing resourceDirectory /var/lib/jenkins/workspace/HybridCosimulation_master-LDEVB56LP46DTRNYHQSCKMS3FR4JD6RBBK6S2LPONMGDZRBJQH3A/DSL_SemanticAdaptation/be.uantwerpen.ansymo.semanticadaptation.cg.cpp.tests/src/main/resources
[INFO] 
[INFO] --- tycho-compiler-plugin:1.0.0:compile (default-compile) @ be.uantwerpen.ansymo.semanticadaptation.cg.cpp.tests ---
[WARNING] Parameter 'useProjectSettings' is set to true, but preferences file '/var/lib/jenkins/workspace/HybridCosimulation_master-LDEVB56LP46DTRNYHQSCKMS3FR4JD6RBBK6S2LPONMGDZRBJQH3A/DSL_SemanticAdaptation/be.uantwerpen.ansymo.semanticadaptation.cg.cpp.tests/.settings/org.eclipse.jdt.core.prefs' could not be found!
[INFO] Compiling 4 source files to /var/lib/jenkins/workspace/HybridCosimulation_master-LDEVB56LP46DTRNYHQSCKMS3FR4JD6RBBK6S2LPONMGDZRBJQH3A/DSL_SemanticAdaptation/be.uantwerpen.ansymo.semanticadaptation.cg.cpp.tests/target/classes
[WARNING] Source directory /var/lib/jenkins/workspace/HybridCosimulation_master-LDEVB56LP46DTRNYHQSCKMS3FR4JD6RBBK6S2LPONMGDZRBJQH3A/DSL_SemanticAdaptation/be.uantwerpen.ansymo.semanticadaptation.cg.cpp.tests/src-gen does not exist
[INFO] 
[INFO] --- xtend-maven-plugin:2.14.0:xtend-install-debug-info (default) @ be.uantwerpen.ansymo.semanticadaptation.cg.cpp.tests ---
[WARNING] Directory /var/lib/jenkins/workspace/HybridCosimulation_master-LDEVB56LP46DTRNYHQSCKMS3FR4JD6RBBK6S2LPONMGDZRBJQH3A/DSL_SemanticAdaptation/be.uantwerpen.ansymo.semanticadaptation.cg.cpp.tests/src/main/java is empty. Can't process.
[WARNING] Directory /var/lib/jenkins/workspace/HybridCosimulation_master-LDEVB56LP46DTRNYHQSCKMS3FR4JD6RBBK6S2LPONMGDZRBJQH3A/DSL_SemanticAdaptation/be.uantwerpen.ansymo.semanticadaptation.cg.cpp.tests/src-gen is empty. Can't process.
[INFO] Installing Xtend files into 3 class files as primary debug sources in: /var/lib/jenkins/workspace/HybridCosimulation_master-LDEVB56LP46DTRNYHQSCKMS3FR4JD6RBBK6S2LPONMGDZRBJQH3A/DSL_SemanticAdaptation/be.uantwerpen.ansymo.semanticadaptation.cg.cpp.tests/target/classes
[INFO] 
[INFO] --- xtend-maven-plugin:2.14.0:testCompile (default) @ be.uantwerpen.ansymo.semanticadaptation.cg.cpp.tests ---
[INFO] skip compiling sources because the configured directory '[/var/lib/jenkins/workspace/HybridCosimulation_master-LDEVB56LP46DTRNYHQSCKMS3FR4JD6RBBK6S2LPONMGDZRBJQH3A/DSL_SemanticAdaptation/be.uantwerpen.ansymo.semanticadaptation.cg.cpp.tests/src/test/java]' does not exist.
[INFO] 
[INFO] --- maven-resources-plugin:2.7:testResources (default-testResources) @ be.uantwerpen.ansymo.semanticadaptation.cg.cpp.tests ---
[INFO] Using 'UTF-8' encoding to copy filtered resources.
[INFO] skip non existing resourceDirectory /var/lib/jenkins/workspace/HybridCosimulation_master-LDEVB56LP46DTRNYHQSCKMS3FR4JD6RBBK6S2LPONMGDZRBJQH3A/DSL_SemanticAdaptation/be.uantwerpen.ansymo.semanticadaptation.cg.cpp.tests/src/test/resources
[INFO] 
[INFO] --- xtend-maven-plugin:2.14.0:xtend-test-install-debug-info (default) @ be.uantwerpen.ansymo.semanticadaptation.cg.cpp.tests ---
[WARNING] Directory /var/lib/jenkins/workspace/HybridCosimulation_master-LDEVB56LP46DTRNYHQSCKMS3FR4JD6RBBK6S2LPONMGDZRBJQH3A/DSL_SemanticAdaptation/be.uantwerpen.ansymo.semanticadaptation.cg.cpp.tests/src/test/java is empty. Can't process.
[WARNING] Directory /var/lib/jenkins/workspace/HybridCosimulation_master-LDEVB56LP46DTRNYHQSCKMS3FR4JD6RBBK6S2LPONMGDZRBJQH3A/DSL_SemanticAdaptation/be.uantwerpen.ansymo.semanticadaptation.cg.cpp.tests/target/xtend-gen/test is empty. Can't process.
[INFO] Installing Xtend files into 0 class files as primary debug sources in: /var/lib/jenkins/workspace/HybridCosimulation_master-LDEVB56LP46DTRNYHQSCKMS3FR4JD6RBBK6S2LPONMGDZRBJQH3A/DSL_SemanticAdaptation/be.uantwerpen.ansymo.semanticadaptation.cg.cpp.tests/target/test-classes
[INFO] 
[INFO] --- target-platform-configuration:1.0.0:target-platform (default-target-platform) @ be.uantwerpen.ansymo.semanticadaptation.cg.cpp.tests ---
[INFO] 
[INFO] --- tycho-packaging-plugin:1.0.0:package-plugin (default-package-plugin) @ be.uantwerpen.ansymo.semanticadaptation.cg.cpp.tests ---
[INFO] Building jar: /var/lib/jenkins/workspace/HybridCosimulation_master-LDEVB56LP46DTRNYHQSCKMS3FR4JD6RBBK6S2LPONMGDZRBJQH3A/DSL_SemanticAdaptation/be.uantwerpen.ansymo.semanticadaptation.cg.cpp.tests/target/be.uantwerpen.ansymo.semanticadaptation.cg.cpp.tests-1.0.0-SNAPSHOT.jar
[INFO] 
[INFO] --- tycho-p2-plugin:1.0.0:p2-metadata-default (default-p2-metadata-default) @ be.uantwerpen.ansymo.semanticadaptation.cg.cpp.tests ---
[INFO] 
[INFO] --- maven-javadoc-plugin:2.9:jar (attach-javadocs) @ be.uantwerpen.ansymo.semanticadaptation.cg.cpp.tests ---
[INFO] Skipping javadoc generation
[INFO] 
[INFO] --- maven-jarsigner-plugin:1.4:sign (sign) @ be.uantwerpen.ansymo.semanticadaptation.cg.cpp.tests ---
[WARNING] Picked up JAVA_TOOL_OPTIONS: -Dmaven.ext.class.path="/var/lib/jenkins/workspace/HybridCosimulation_master-LDEVB56LP46DTRNYHQSCKMS3FR4JD6RBBK6S2LPONMGDZRBJQH3A@tmp/withMavend05bce59/pipeline-maven-spy.jar" -Dorg.jenkinsci.plugins.pipeline.maven.reportsFolder="/var/lib/jenkins/workspace/HybridCosimulation_master-LDEVB56LP46DTRNYHQSCKMS3FR4JD6RBBK6S2LPONMGDZRBJQH3A@tmp/withMavend05bce59" 
[INFO] 1 archive(s) processed
[INFO] 
[INFO] --- tycho-surefire-plugin:1.0.0:test (default-test) @ be.uantwerpen.ansymo.semanticadaptation.cg.cpp.tests ---
[INFO] Expected eclipse log file: /var/lib/jenkins/workspace/HybridCosimulation_master-LDEVB56LP46DTRNYHQSCKMS3FR4JD6RBBK6S2LPONMGDZRBJQH3A/DSL_SemanticAdaptation/be.uantwerpen.ansymo.semanticadaptation.cg.cpp.tests/target/work/data/.metadata/.log
[INFO] Command line:
	[/usr/lib/jvm/java-8-oracle/jre/bin/java, -Dosgi.noShutdown=false, -Dosgi.os=linux, -Dosgi.ws=gtk, -Dosgi.arch=x86_64, -Dosgi.clean=true, -jar, /var/lib/jenkins/workspace/HybridCosimulation_master-LDEVB56LP46DTRNYHQSCKMS3FR4JD6RBBK6S2LPONMGDZRBJQH3A/.repository/p2/osgi/bundle/org.eclipse.equinox.launcher/1.3.201.v20161025-1711/org.eclipse.equinox.launcher-1.3.201.v20161025-1711.jar, -data, /var/lib/jenkins/workspace/HybridCosimulation_master-LDEVB56LP46DTRNYHQSCKMS3FR4JD6RBBK6S2LPONMGDZRBJQH3A/DSL_SemanticAdaptation/be.uantwerpen.ansymo.semanticadaptation.cg.cpp.tests/target/work/data, -install, /var/lib/jenkins/workspace/HybridCosimulation_master-LDEVB56LP46DTRNYHQSCKMS3FR4JD6RBBK6S2LPONMGDZRBJQH3A/DSL_SemanticAdaptation/be.uantwerpen.ansymo.semanticadaptation.cg.cpp.tests/target/work, -configuration, /var/lib/jenkins/workspace/HybridCosimulation_master-LDEVB56LP46DTRNYHQSCKMS3FR4JD6RBBK6S2LPONMGDZRBJQH3A/DSL_SemanticAdaptation/be.uantwerpen.ansymo.semanticadaptation.cg.cpp.tests/target/work/configuration, -application, org.eclipse.tycho.surefire.osgibooter.headlesstest, -testproperties, /var/lib/jenkins/workspace/HybridCosimulation_master-LDEVB56LP46DTRNYHQSCKMS3FR4JD6RBBK6S2LPONMGDZRBJQH3A/DSL_SemanticAdaptation/be.uantwerpen.ansymo.semanticadaptation.cg.cpp.tests/target/surefire.properties]
Picked up JAVA_TOOL_OPTIONS: -Dmaven.ext.class.path="/var/lib/jenkins/workspace/HybridCosimulation_master-LDEVB56LP46DTRNYHQSCKMS3FR4JD6RBBK6S2LPONMGDZRBJQH3A@tmp/withMavend05bce59/pipeline-maven-spy.jar" -Dorg.jenkinsci.plugins.pipeline.maven.reportsFolder="/var/lib/jenkins/workspace/HybridCosimulation_master-LDEVB56LP46DTRNYHQSCKMS3FR4JD6RBBK6S2LPONMGDZRBJQH3A@tmp/withMavend05bce59" 

-------------------------------------------------------
 T E S T S
-------------------------------------------------------
Running be.uantwerpen.ansymo.semanticadaptation.cg.cpp.tests.CgCppBasicTest
Tests run: 9, Failures: 0, Errors: 0, Skipped: 9, Time elapsed: 0.05 sec - in be.uantwerpen.ansymo.semanticadaptation.cg.cpp.tests.CgCppBasicTest
lazy_canonical(be.uantwerpen.ansymo.semanticadaptation.cg.cpp.tests.CgCppBasicTest) skipped
getSetState_sa(be.uantwerpen.ansymo.semanticadaptation.cg.cpp.tests.CgCppBasicTest) skipped
window_sa_canonical_new(be.uantwerpen.ansymo.semanticadaptation.cg.cpp.tests.CgCppBasicTest) skipped
rollback_test(be.uantwerpen.ansymo.semanticadaptation.cg.cpp.tests.CgCppBasicTest) skipped
controller_test(be.uantwerpen.ansymo.semanticadaptation.cg.cpp.tests.CgCppBasicTest) skipped
loop(be.uantwerpen.ansymo.semanticadaptation.cg.cpp.tests.CgCppBasicTest) skipped
rate(be.uantwerpen.ansymo.semanticadaptation.cg.cpp.tests.CgCppBasicTest) skipped
power(be.uantwerpen.ansymo.semanticadaptation.cg.cpp.tests.CgCppBasicTest) skipped
rate_canonical(be.uantwerpen.ansymo.semanticadaptation.cg.cpp.tests.CgCppBasicTest) skipped
Running be.uantwerpen.ansymo.semanticadaptation.cg.cpp.tests.CgCppAutoTest
Tests run: 1, Failures: 0, Errors: 0, Skipped: 1, Time elapsed: 0.016 sec - in be.uantwerpen.ansymo.semanticadaptation.cg.cpp.tests.CgCppAutoTest
allSemanticAdaptations[0](be.uantwerpen.ansymo.semanticadaptation.cg.cpp.tests.CgCppAutoTest) skipped

Results :

Tests run: 10, Failures: 0, Errors: 0, Skipped: 10

[INFO] All tests passed!
[INFO] 
[INFO] --- maven-install-plugin:2.3.1:install (default-install) @ be.uantwerpen.ansymo.semanticadaptation.cg.cpp.tests ---
[INFO] Installing /var/lib/jenkins/workspace/HybridCosimulation_master-LDEVB56LP46DTRNYHQSCKMS3FR4JD6RBBK6S2LPONMGDZRBJQH3A/DSL_SemanticAdaptation/be.uantwerpen.ansymo.semanticadaptation.cg.cpp.tests/target/be.uantwerpen.ansymo.semanticadaptation.cg.cpp.tests-1.0.0-SNAPSHOT.jar to /var/lib/jenkins/workspace/HybridCosimulation_master-LDEVB56LP46DTRNYHQSCKMS3FR4JD6RBBK6S2LPONMGDZRBJQH3A/.repository/be/uantwerpen/ansymo/semanticadaptation/be.uantwerpen.ansymo.semanticadaptation.cg.cpp.tests/1.0.0-SNAPSHOT/be.uantwerpen.ansymo.semanticadaptation.cg.cpp.tests-1.0.0-SNAPSHOT.jar
[INFO] Installing /var/lib/jenkins/workspace/HybridCosimulation_master-LDEVB56LP46DTRNYHQSCKMS3FR4JD6RBBK6S2LPONMGDZRBJQH3A/DSL_SemanticAdaptation/be.uantwerpen.ansymo.semanticadaptation.cg.cpp.tests/pom.xml to /var/lib/jenkins/workspace/HybridCosimulation_master-LDEVB56LP46DTRNYHQSCKMS3FR4JD6RBBK6S2LPONMGDZRBJQH3A/.repository/be/uantwerpen/ansymo/semanticadaptation/be.uantwerpen.ansymo.semanticadaptation.cg.cpp.tests/1.0.0-SNAPSHOT/be.uantwerpen.ansymo.semanticadaptation.cg.cpp.tests-1.0.0-SNAPSHOT.pom
[INFO] Installing /var/lib/jenkins/workspace/HybridCosimulation_master-LDEVB56LP46DTRNYHQSCKMS3FR4JD6RBBK6S2LPONMGDZRBJQH3A/DSL_SemanticAdaptation/be.uantwerpen.ansymo.semanticadaptation.cg.cpp.tests/target/p2content.xml to /var/lib/jenkins/workspace/HybridCosimulation_master-LDEVB56LP46DTRNYHQSCKMS3FR4JD6RBBK6S2LPONMGDZRBJQH3A/.repository/be/uantwerpen/ansymo/semanticadaptation/be.uantwerpen.ansymo.semanticadaptation.cg.cpp.tests/1.0.0-SNAPSHOT/be.uantwerpen.ansymo.semanticadaptation.cg.cpp.tests-1.0.0-SNAPSHOT-p2metadata.xml
[INFO] Installing /var/lib/jenkins/workspace/HybridCosimulation_master-LDEVB56LP46DTRNYHQSCKMS3FR4JD6RBBK6S2LPONMGDZRBJQH3A/DSL_SemanticAdaptation/be.uantwerpen.ansymo.semanticadaptation.cg.cpp.tests/target/p2artifacts.xml to /var/lib/jenkins/workspace/HybridCosimulation_master-LDEVB56LP46DTRNYHQSCKMS3FR4JD6RBBK6S2LPONMGDZRBJQH3A/.repository/be/uantwerpen/ansymo/semanticadaptation/be.uantwerpen.ansymo.semanticadaptation.cg.cpp.tests/1.0.0-SNAPSHOT/be.uantwerpen.ansymo.semanticadaptation.cg.cpp.tests-1.0.0-SNAPSHOT-p2artifacts.xml
[INFO] 
[INFO] --- tycho-p2-plugin:1.0.0:update-local-index (default-update-local-index) @ be.uantwerpen.ansymo.semanticadaptation.cg.cpp.tests ---
[INFO]                                                                         
[INFO] ------------------------------------------------------------------------
[INFO] Building be.uantwerpen.ansymo.semanticadaptation Code Generation to C++ Tests 1.0.0-SNAPSHOT
[INFO] ------------------------------------------------------------------------
[INFO] 
[INFO] --- tycho-packaging-plugin:1.0.0:build-qualifier (default-build-qualifier) @ be.uantwerpen.ansymo.semanticadaptation.cg.canonical.tests ---
[INFO] The project's OSGi version is 1.0.0.201808160830
[INFO] 
[INFO] --- tycho-packaging-plugin:1.0.0:validate-id (default-validate-id) @ be.uantwerpen.ansymo.semanticadaptation.cg.canonical.tests ---
[INFO] 
[INFO] --- tycho-packaging-plugin:1.0.0:validate-version (default-validate-version) @ be.uantwerpen.ansymo.semanticadaptation.cg.canonical.tests ---
[INFO] 
[INFO] --- xtend-maven-plugin:2.14.0:compile (default) @ be.uantwerpen.ansymo.semanticadaptation.cg.canonical.tests ---
[WARNING] 
WARNING: 	SemanticAdaptationGeneratorTest.xtend - /var/lib/jenkins/workspace/HybridCosimulation_master-LDEVB56LP46DTRNYHQSCKMS3FR4JD6RBBK6S2LPONMGDZRBJQH3A/DSL_SemanticAdaptation/be.uantwerpen.ansymo.semanticadaptation.cg.canonical.tests/src/be/uantwerpen/ansymo/semanticadaptation/cg/canonical/tests/SemanticAdaptationGeneratorTest.xtend
98: Unnecessary cast from Variable to Variable
[INFO] 
[INFO] --- maven-resources-plugin:2.7:resources (default-resources) @ be.uantwerpen.ansymo.semanticadaptation.cg.canonical.tests ---
[INFO] Using 'UTF-8' encoding to copy filtered resources.
[INFO] skip non existing resourceDirectory /var/lib/jenkins/workspace/HybridCosimulation_master-LDEVB56LP46DTRNYHQSCKMS3FR4JD6RBBK6S2LPONMGDZRBJQH3A/DSL_SemanticAdaptation/be.uantwerpen.ansymo.semanticadaptation.cg.canonical.tests/src/main/resources
[INFO] 
[INFO] --- tycho-compiler-plugin:1.0.0:compile (default-compile) @ be.uantwerpen.ansymo.semanticadaptation.cg.canonical.tests ---
[WARNING] Parameter 'useProjectSettings' is set to true, but preferences file '/var/lib/jenkins/workspace/HybridCosimulation_master-LDEVB56LP46DTRNYHQSCKMS3FR4JD6RBBK6S2LPONMGDZRBJQH3A/DSL_SemanticAdaptation/be.uantwerpen.ansymo.semanticadaptation.cg.canonical.tests/.settings/org.eclipse.jdt.core.prefs' could not be found!
[INFO] Compiling 1 source file to /var/lib/jenkins/workspace/HybridCosimulation_master-LDEVB56LP46DTRNYHQSCKMS3FR4JD6RBBK6S2LPONMGDZRBJQH3A/DSL_SemanticAdaptation/be.uantwerpen.ansymo.semanticadaptation.cg.canonical.tests/target/classes
[WARNING] Source directory /var/lib/jenkins/workspace/HybridCosimulation_master-LDEVB56LP46DTRNYHQSCKMS3FR4JD6RBBK6S2LPONMGDZRBJQH3A/DSL_SemanticAdaptation/be.uantwerpen.ansymo.semanticadaptation.cg.canonical.tests/src-gen does not exist
[INFO] 
[INFO] --- xtend-maven-plugin:2.14.0:xtend-install-debug-info (default) @ be.uantwerpen.ansymo.semanticadaptation.cg.canonical.tests ---
[WARNING] Directory /var/lib/jenkins/workspace/HybridCosimulation_master-LDEVB56LP46DTRNYHQSCKMS3FR4JD6RBBK6S2LPONMGDZRBJQH3A/DSL_SemanticAdaptation/be.uantwerpen.ansymo.semanticadaptation.cg.canonical.tests/src/main/java is empty. Can't process.
[WARNING] Directory /var/lib/jenkins/workspace/HybridCosimulation_master-LDEVB56LP46DTRNYHQSCKMS3FR4JD6RBBK6S2LPONMGDZRBJQH3A/DSL_SemanticAdaptation/be.uantwerpen.ansymo.semanticadaptation.cg.canonical.tests/src-gen is empty. Can't process.
[INFO] Installing Xtend files into 57 class files as primary debug sources in: /var/lib/jenkins/workspace/HybridCosimulation_master-LDEVB56LP46DTRNYHQSCKMS3FR4JD6RBBK6S2LPONMGDZRBJQH3A/DSL_SemanticAdaptation/be.uantwerpen.ansymo.semanticadaptation.cg.canonical.tests/target/classes
[INFO] 
[INFO] --- xtend-maven-plugin:2.14.0:testCompile (default) @ be.uantwerpen.ansymo.semanticadaptation.cg.canonical.tests ---
[INFO] skip compiling sources because the configured directory '[/var/lib/jenkins/workspace/HybridCosimulation_master-LDEVB56LP46DTRNYHQSCKMS3FR4JD6RBBK6S2LPONMGDZRBJQH3A/DSL_SemanticAdaptation/be.uantwerpen.ansymo.semanticadaptation.cg.canonical.tests/src/test/java]' does not exist.
[INFO] 
[INFO] --- maven-resources-plugin:2.7:testResources (default-testResources) @ be.uantwerpen.ansymo.semanticadaptation.cg.canonical.tests ---
[INFO] Using 'UTF-8' encoding to copy filtered resources.
[INFO] skip non existing resourceDirectory /var/lib/jenkins/workspace/HybridCosimulation_master-LDEVB56LP46DTRNYHQSCKMS3FR4JD6RBBK6S2LPONMGDZRBJQH3A/DSL_SemanticAdaptation/be.uantwerpen.ansymo.semanticadaptation.cg.canonical.tests/src/test/resources
[INFO] 
[INFO] --- xtend-maven-plugin:2.14.0:xtend-test-install-debug-info (default) @ be.uantwerpen.ansymo.semanticadaptation.cg.canonical.tests ---
[WARNING] Directory /var/lib/jenkins/workspace/HybridCosimulation_master-LDEVB56LP46DTRNYHQSCKMS3FR4JD6RBBK6S2LPONMGDZRBJQH3A/DSL_SemanticAdaptation/be.uantwerpen.ansymo.semanticadaptation.cg.canonical.tests/src/test/java is empty. Can't process.
[WARNING] Directory /var/lib/jenkins/workspace/HybridCosimulation_master-LDEVB56LP46DTRNYHQSCKMS3FR4JD6RBBK6S2LPONMGDZRBJQH3A/DSL_SemanticAdaptation/be.uantwerpen.ansymo.semanticadaptation.cg.canonical.tests/target/xtend-gen/test is empty. Can't process.
[INFO] Installing Xtend files into 0 class files as primary debug sources in: /var/lib/jenkins/workspace/HybridCosimulation_master-LDEVB56LP46DTRNYHQSCKMS3FR4JD6RBBK6S2LPONMGDZRBJQH3A/DSL_SemanticAdaptation/be.uantwerpen.ansymo.semanticadaptation.cg.canonical.tests/target/test-classes
[INFO] 
[INFO] --- target-platform-configuration:1.0.0:target-platform (default-target-platform) @ be.uantwerpen.ansymo.semanticadaptation.cg.canonical.tests ---
[INFO] 
[INFO] --- tycho-packaging-plugin:1.0.0:package-plugin (default-package-plugin) @ be.uantwerpen.ansymo.semanticadaptation.cg.canonical.tests ---
[INFO] Building jar: /var/lib/jenkins/workspace/HybridCosimulation_master-LDEVB56LP46DTRNYHQSCKMS3FR4JD6RBBK6S2LPONMGDZRBJQH3A/DSL_SemanticAdaptation/be.uantwerpen.ansymo.semanticadaptation.cg.canonical.tests/target/be.uantwerpen.ansymo.semanticadaptation.cg.canonical.tests-1.0.0-SNAPSHOT.jar
[INFO] 
[INFO] --- tycho-p2-plugin:1.0.0:p2-metadata-default (default-p2-metadata-default) @ be.uantwerpen.ansymo.semanticadaptation.cg.canonical.tests ---
[INFO] 
[INFO] --- maven-javadoc-plugin:2.9:jar (attach-javadocs) @ be.uantwerpen.ansymo.semanticadaptation.cg.canonical.tests ---
[INFO] Skipping javadoc generation
[INFO] 
[INFO] --- maven-jarsigner-plugin:1.4:sign (sign) @ be.uantwerpen.ansymo.semanticadaptation.cg.canonical.tests ---
[WARNING] Picked up JAVA_TOOL_OPTIONS: -Dmaven.ext.class.path="/var/lib/jenkins/workspace/HybridCosimulation_master-LDEVB56LP46DTRNYHQSCKMS3FR4JD6RBBK6S2LPONMGDZRBJQH3A@tmp/withMavend05bce59/pipeline-maven-spy.jar" -Dorg.jenkinsci.plugins.pipeline.maven.reportsFolder="/var/lib/jenkins/workspace/HybridCosimulation_master-LDEVB56LP46DTRNYHQSCKMS3FR4JD6RBBK6S2LPONMGDZRBJQH3A@tmp/withMavend05bce59" 
[INFO] 1 archive(s) processed
[INFO] 
[INFO] --- tycho-surefire-plugin:1.0.0:test (default-test) @ be.uantwerpen.ansymo.semanticadaptation.cg.canonical.tests ---
[INFO] Expected eclipse log file: /var/lib/jenkins/workspace/HybridCosimulation_master-LDEVB56LP46DTRNYHQSCKMS3FR4JD6RBBK6S2LPONMGDZRBJQH3A/DSL_SemanticAdaptation/be.uantwerpen.ansymo.semanticadaptation.cg.canonical.tests/target/work/data/.metadata/.log
[INFO] Command line:
	[/usr/lib/jvm/java-8-oracle/jre/bin/java, -Dosgi.noShutdown=false, -Dosgi.os=linux, -Dosgi.ws=gtk, -Dosgi.arch=x86_64, -Dosgi.clean=true, -jar, /var/lib/jenkins/workspace/HybridCosimulation_master-LDEVB56LP46DTRNYHQSCKMS3FR4JD6RBBK6S2LPONMGDZRBJQH3A/.repository/p2/osgi/bundle/org.eclipse.equinox.launcher/1.3.201.v20161025-1711/org.eclipse.equinox.launcher-1.3.201.v20161025-1711.jar, -data, /var/lib/jenkins/workspace/HybridCosimulation_master-LDEVB56LP46DTRNYHQSCKMS3FR4JD6RBBK6S2LPONMGDZRBJQH3A/DSL_SemanticAdaptation/be.uantwerpen.ansymo.semanticadaptation.cg.canonical.tests/target/work/data, -install, /var/lib/jenkins/workspace/HybridCosimulation_master-LDEVB56LP46DTRNYHQSCKMS3FR4JD6RBBK6S2LPONMGDZRBJQH3A/DSL_SemanticAdaptation/be.uantwerpen.ansymo.semanticadaptation.cg.canonical.tests/target/work, -configuration, /var/lib/jenkins/workspace/HybridCosimulation_master-LDEVB56LP46DTRNYHQSCKMS3FR4JD6RBBK6S2LPONMGDZRBJQH3A/DSL_SemanticAdaptation/be.uantwerpen.ansymo.semanticadaptation.cg.canonical.tests/target/work/configuration, -application, org.eclipse.tycho.surefire.osgibooter.headlesstest, -testproperties, /var/lib/jenkins/workspace/HybridCosimulation_master-LDEVB56LP46DTRNYHQSCKMS3FR4JD6RBBK6S2LPONMGDZRBJQH3A/DSL_SemanticAdaptation/be.uantwerpen.ansymo.semanticadaptation.cg.canonical.tests/target/surefire.properties]
Picked up JAVA_TOOL_OPTIONS: -Dmaven.ext.class.path="/var/lib/jenkins/workspace/HybridCosimulation_master-LDEVB56LP46DTRNYHQSCKMS3FR4JD6RBBK6S2LPONMGDZRBJQH3A@tmp/withMavend05bce59/pipeline-maven-spy.jar" -Dorg.jenkinsci.plugins.pipeline.maven.reportsFolder="/var/lib/jenkins/workspace/HybridCosimulation_master-LDEVB56LP46DTRNYHQSCKMS3FR4JD6RBBK6S2LPONMGDZRBJQH3A@tmp/withMavend05bce59" 

-------------------------------------------------------
 T E S T S
-------------------------------------------------------
Running be.uantwerpen.ansymo.semanticadaptation.cg.canonical.tests.SemanticAdaptationGeneratorTest
log4j:WARN No appenders could be found for logger (org.eclipse.xtext.parser.antlr.AbstractInternalAntlrParser).
log4j:WARN Please initialize the log4j system properly.
2018-08-16 10:32:31,612 [INFO] Logger initialized.
2018-08-16 10:32:31,612 [INFO] >Generating canonical semantic adaptation for file...
2018-08-16 10:32:32,352 [DEBUG] Parsing took: 3 ms
2018-08-16 10:32:32,353 [DEBUG] beforeModelLinked took: 0ms
2018-08-16 10:32:32,353 [DEBUG] doLinkModel took: 0ms
2018-08-16 10:32:32,353 [DEBUG] afterModelLinked took: 0ms
2018-08-16 10:32:32,353 [INFO]  >Generating canonical semantic adaptation for file...
2018-08-16 10:32:32,382 [DEBUG] Parsing took: 2 ms
2018-08-16 10:32:32,382 [DEBUG] beforeModelLinked took: 0ms
2018-08-16 10:32:32,382 [DEBUG] doLinkModel took: 0ms
2018-08-16 10:32:32,382 [DEBUG] afterModelLinked took: 0ms
2018-08-16 10:32:32,382 [INFO]   >Generating canonical semantic adaptation for file...
2018-08-16 10:32:32,400 [DEBUG] Parsing took: 3 ms
2018-08-16 10:32:32,400 [DEBUG] beforeModelLinked took: 0ms
2018-08-16 10:32:32,400 [DEBUG] doLinkModel took: 0ms
2018-08-16 10:32:32,400 [DEBUG] afterModelLinked took: 0ms
2018-08-16 10:32:32,400 [INFO]    >Generating canonical semantic adaptation for file...
2018-08-16 10:32:32,415 [DEBUG] Parsing took: 2 ms
2018-08-16 10:32:32,415 [DEBUG] beforeModelLinked took: 0ms
2018-08-16 10:32:32,415 [DEBUG] doLinkModel took: 0ms
2018-08-16 10:32:32,415 [DEBUG] afterModelLinked took: 0ms
2018-08-16 10:32:32,415 [INFO]     >Generating canonical semantic adaptation for file...
2018-08-16 10:32:32,445 [DEBUG] Parsing took: 2 ms
2018-08-16 10:32:32,445 [DEBUG] beforeModelLinked took: 0ms
2018-08-16 10:32:32,446 [DEBUG] doLinkModel took: 1ms
2018-08-16 10:32:32,446 [DEBUG] afterModelLinked took: 0ms
2018-08-16 10:32:32,446 [INFO]      >Generating canonical semantic adaptation for file...
2018-08-16 10:32:32,463 [DEBUG] Parsing took: 2 ms
2018-08-16 10:32:32,463 [DEBUG] beforeModelLinked took: 0ms
2018-08-16 10:32:32,463 [DEBUG] doLinkModel took: 0ms
2018-08-16 10:32:32,463 [DEBUG] afterModelLinked took: 0ms
2018-08-16 10:32:32,463 [INFO]       >Generating canonical semantic adaptation for file...
2018-08-16 10:32:32,478 [DEBUG] Parsing took: 2 ms
2018-08-16 10:32:32,478 [DEBUG] beforeModelLinked took: 0ms
2018-08-16 10:32:32,478 [DEBUG] doLinkModel took: 0ms
2018-08-16 10:32:32,478 [DEBUG] afterModelLinked took: 0ms
2018-08-16 10:32:32,478 [INFO]        >Generating canonical semantic adaptation for file...
2018-08-16 10:32:32,493 [DEBUG] Parsing took: 2 ms
2018-08-16 10:32:32,493 [DEBUG] beforeModelLinked took: 0ms
2018-08-16 10:32:32,493 [DEBUG] doLinkModel took: 0ms
2018-08-16 10:32:32,493 [DEBUG] afterModelLinked took: 0ms
2018-08-16 10:32:32,493 [INFO]         >Generating canonical semantic adaptation for file...
2018-08-16 10:32:32,508 [DEBUG] Parsing took: 3 ms
2018-08-16 10:32:32,508 [DEBUG] beforeModelLinked took: 0ms
2018-08-16 10:32:32,508 [DEBUG] doLinkModel took: 0ms
2018-08-16 10:32:32,508 [DEBUG] afterModelLinked took: 0ms
2018-08-16 10:32:32,508 [INFO]          >Generating canonical semantic adaptation for file...
2018-08-16 10:32:32,522 [DEBUG] Parsing took: 2 ms
2018-08-16 10:32:32,523 [DEBUG] beforeModelLinked took: 0ms
2018-08-16 10:32:32,523 [DEBUG] doLinkModel took: 0ms
2018-08-16 10:32:32,523 [DEBUG] afterModelLinked took: 0ms
2018-08-16 10:32:32,523 [INFO]           >Generating canonical semantic adaptation for file...
2018-08-16 10:32:32,537 [DEBUG] Parsing took: 2 ms
2018-08-16 10:32:32,537 [DEBUG] beforeModelLinked took: 0ms
2018-08-16 10:32:32,537 [DEBUG] doLinkModel took: 0ms
2018-08-16 10:32:32,538 [DEBUG] afterModelLinked took: 0ms
2018-08-16 10:32:32,538 [INFO]            >Generating canonical semantic adaptation for file...
2018-08-16 10:32:32,551 [DEBUG] Parsing took: 2 ms
2018-08-16 10:32:32,551 [DEBUG] beforeModelLinked took: 0ms
2018-08-16 10:32:32,551 [DEBUG] doLinkModel took: 0ms
2018-08-16 10:32:32,551 [DEBUG] afterModelLinked took: 0ms
2018-08-16 10:32:32,551 [INFO]             >Generating canonical semantic adaptation for file...
2018-08-16 10:32:32,570 [DEBUG] Parsing took: 4 ms
2018-08-16 10:32:32,570 [DEBUG] beforeModelLinked took: 0ms
2018-08-16 10:32:32,570 [DEBUG] doLinkModel took: 0ms
2018-08-16 10:32:32,570 [DEBUG] afterModelLinked took: 0ms
2018-08-16 10:32:32,570 [INFO]              >Generating canonical semantic adaptation for file...
2018-08-16 10:32:32,585 [DEBUG] Parsing took: 2 ms
2018-08-16 10:32:32,585 [DEBUG] beforeModelLinked took: 0ms
2018-08-16 10:32:32,585 [DEBUG] doLinkModel took: 0ms
2018-08-16 10:32:32,585 [DEBUG] afterModelLinked took: 0ms
2018-08-16 10:32:32,585 [INFO]               >Generating canonical semantic adaptation for file...
2018-08-16 10:32:32,603 [DEBUG] Parsing took: 3 ms
2018-08-16 10:32:32,604 [DEBUG] beforeModelLinked took: 1ms
2018-08-16 10:32:32,604 [DEBUG] doLinkModel took: 0ms
2018-08-16 10:32:32,604 [DEBUG] afterModelLinked took: 0ms
2018-08-16 10:32:32,604 [INFO]                >Generating canonical semantic adaptation for file...
2018-08-16 10:32:32,618 [DEBUG] Parsing took: 2 ms
2018-08-16 10:32:32,618 [DEBUG] beforeModelLinked took: 0ms
2018-08-16 10:32:32,619 [DEBUG] doLinkModel took: 1ms
2018-08-16 10:32:32,619 [DEBUG] afterModelLinked took: 0ms
2018-08-16 10:32:32,619 [INFO]                 >Generating canonical semantic adaptation for file...
2018-08-16 10:32:32,646 [DEBUG] Parsing took: 3 ms
2018-08-16 10:32:32,646 [DEBUG] beforeModelLinked took: 0ms
2018-08-16 10:32:32,647 [DEBUG] doLinkModel took: 1ms
2018-08-16 10:32:32,647 [DEBUG] afterModelLinked took: 0ms
2018-08-16 10:32:32,647 [INFO]                  >Generating canonical semantic adaptation for file...
2018-08-16 10:32:32,668 [DEBUG] Parsing took: 3 ms
2018-08-16 10:32:32,668 [DEBUG] beforeModelLinked took: 0ms
2018-08-16 10:32:32,668 [DEBUG] doLinkModel took: 0ms
2018-08-16 10:32:32,668 [DEBUG] afterModelLinked took: 0ms
2018-08-16 10:32:32,668 [INFO]                   >Generating canonical semantic adaptation for file...
2018-08-16 10:32:32,686 [DEBUG] Parsing took: 2 ms
2018-08-16 10:32:32,687 [DEBUG] beforeModelLinked took: 0ms
2018-08-16 10:32:32,687 [DEBUG] doLinkModel took: 0ms
2018-08-16 10:32:32,687 [DEBUG] afterModelLinked took: 0ms
2018-08-16 10:32:32,687 [INFO]                    >Generating canonical semantic adaptation for file...
Tests run: 22, Failures: 0, Errors: 20, Skipped: 2, Time elapsed: 2.204 sec <<< FAILURE! - in be.uantwerpen.ansymo.semanticadaptation.cg.canonical.tests.SemanticAdaptationGeneratorTest
lazy_SA_parseNoExceptions(be.uantwerpen.ansymo.semanticadaptation.cg.canonical.tests.SemanticAdaptationGeneratorTest)  Time elapsed: 1.145 sec  <<< ERROR!
java.lang.RuntimeException: Could not serialize AdaptationWithSpecificMaster:
FMU.path is required to have a value, but it does not.
Adaptation.inner is required to have a value, but it does not.
Semantic Object: SemanticAdaptation.elements[0]->AdaptationWithSpecificMaster'lazy_sa'
URI: __synthetic0.sa
Context: Component returns AdaptationWithSpecificMaster
	at org.eclipse.xtext.serializer.diagnostic.ISerializationDiagnostic$ExceptionThrowingAcceptor.accept(ISerializationDiagnostic.java:131)
	at org.eclipse.xtext.serializer.sequencer.BacktrackingSemanticSequencer.createSequence(BacktrackingSemanticSequencer.java:513)
	at be.uantwerpen.ansymo.semanticadaptation.serializer.SemanticAdaptationSemanticSequencer.sequence_Adaptation(SemanticAdaptationSemanticSequencer.java:618)
	at be.uantwerpen.ansymo.semanticadaptation.serializer.SemanticAdaptationSemanticSequencer.sequence(SemanticAdaptationSemanticSequencer.java:161)
	at org.eclipse.xtext.serializer.sequencer.AbstractSemanticSequencer.createSequence(AbstractSemanticSequencer.java:67)
	at org.eclipse.xtext.serializer.acceptor.SequenceFeeder.acceptEObjectRuleCall(SequenceFeeder.java:325)
	at org.eclipse.xtext.serializer.acceptor.SequenceFeeder.acceptRuleCall(SequenceFeeder.java:352)
	at org.eclipse.xtext.serializer.acceptor.SequenceFeeder.accept(SequenceFeeder.java:263)
	at org.eclipse.xtext.serializer.sequencer.BacktrackingSemanticSequencer.accept(BacktrackingSemanticSequencer.java:444)
	at org.eclipse.xtext.serializer.sequencer.BacktrackingSemanticSequencer.createSequence(BacktrackingSemanticSequencer.java:511)
	at be.uantwerpen.ansymo.semanticadaptation.serializer.SemanticAdaptationSemanticSequencer.sequence_SemanticAdaptation(SemanticAdaptationSemanticSequencer.java:3450)
	at be.uantwerpen.ansymo.semanticadaptation.serializer.SemanticAdaptationSemanticSequencer.sequence(SemanticAdaptationSemanticSequencer.java:522)
	at org.eclipse.xtext.serializer.sequencer.AbstractSemanticSequencer.createSequence(AbstractSemanticSequencer.java:67)
	at org.eclipse.xtext.serializer.impl.Serializer.serialize(Serializer.java:118)
	at org.eclipse.xtext.serializer.impl.Serializer.serializeToRegions(Serializer.java:140)
	at org.eclipse.xtext.serializer.impl.Serializer.serialize(Serializer.java:146)
	at org.eclipse.xtext.serializer.impl.Serializer.serialize(Serializer.java:198)
	at org.eclipse.xtext.resource.XtextResource.doSave(XtextResource.java:386)
	at org.eclipse.emf.ecore.resource.impl.ResourceImpl.save(ResourceImpl.java:1430)
	at be.uantwerpen.ansymo.semanticadaptation.cg.canonical.SemanticAdaptationCanonicalGenerator.prettyprint_model(SemanticAdaptationCanonicalGenerator.xtend:101)
	at be.uantwerpen.ansymo.semanticadaptation.cg.canonical.SemanticAdaptationCanonicalGenerator.doGenerate(SemanticAdaptationCanonicalGenerator.xtend:69)
	at be.uantwerpen.ansymo.semanticadaptation.cg.canonical.tests.SemanticAdaptationGeneratorTest.__generate(SemanticAdaptationGeneratorTest.xtend:246)
	at be.uantwerpen.ansymo.semanticadaptation.cg.canonical.tests.SemanticAdaptationGeneratorTest.lazy_SA_parseNoExceptions(SemanticAdaptationGeneratorTest.xtend:224)

test_addInputPorts_sample1(be.uantwerpen.ansymo.semanticadaptation.cg.canonical.tests.SemanticAdaptationGeneratorTest)  Time elapsed: 0.026 sec  <<< ERROR!
java.lang.RuntimeException: Could not serialize AdaptationWithSpecificMaster:
FMU.path is required to have a value, but it does not.
Adaptation.inner is required to have a value, but it does not.
Semantic Object: SemanticAdaptation.elements[0]->AdaptationWithSpecificMaster'outerFMU'
URI: __synthetic0.sa
Context: Component returns AdaptationWithSpecificMaster
	at org.eclipse.xtext.serializer.diagnostic.ISerializationDiagnostic$ExceptionThrowingAcceptor.accept(ISerializationDiagnostic.java:131)
	at org.eclipse.xtext.serializer.sequencer.BacktrackingSemanticSequencer.createSequence(BacktrackingSemanticSequencer.java:513)
	at be.uantwerpen.ansymo.semanticadaptation.serializer.SemanticAdaptationSemanticSequencer.sequence_Adaptation(SemanticAdaptationSemanticSequencer.java:618)
	at be.uantwerpen.ansymo.semanticadaptation.serializer.SemanticAdaptationSemanticSequencer.sequence(SemanticAdaptationSemanticSequencer.java:161)
	at org.eclipse.xtext.serializer.sequencer.AbstractSemanticSequencer.createSequence(AbstractSemanticSequencer.java:67)
	at org.eclipse.xtext.serializer.acceptor.SequenceFeeder.acceptEObjectRuleCall(SequenceFeeder.java:325)
	at org.eclipse.xtext.serializer.acceptor.SequenceFeeder.acceptRuleCall(SequenceFeeder.java:352)
	at org.eclipse.xtext.serializer.acceptor.SequenceFeeder.accept(SequenceFeeder.java:263)
	at org.eclipse.xtext.serializer.sequencer.BacktrackingSemanticSequencer.accept(BacktrackingSemanticSequencer.java:444)
	at org.eclipse.xtext.serializer.sequencer.BacktrackingSemanticSequencer.createSequence(BacktrackingSemanticSequencer.java:511)
	at be.uantwerpen.ansymo.semanticadaptation.serializer.SemanticAdaptationSemanticSequencer.sequence_SemanticAdaptation(SemanticAdaptationSemanticSequencer.java:3450)
	at be.uantwerpen.ansymo.semanticadaptation.serializer.SemanticAdaptationSemanticSequencer.sequence(SemanticAdaptationSemanticSequencer.java:522)
	at org.eclipse.xtext.serializer.sequencer.AbstractSemanticSequencer.createSequence(AbstractSemanticSequencer.java:67)
	at org.eclipse.xtext.serializer.impl.Serializer.serialize(Serializer.java:118)
	at org.eclipse.xtext.serializer.impl.Serializer.serializeToRegions(Serializer.java:140)
	at org.eclipse.xtext.serializer.impl.Serializer.serialize(Serializer.java:146)
	at org.eclipse.xtext.serializer.impl.Serializer.serialize(Serializer.java:198)
	at org.eclipse.xtext.resource.XtextResource.doSave(XtextResource.java:386)
	at org.eclipse.emf.ecore.resource.impl.ResourceImpl.save(ResourceImpl.java:1430)
	at be.uantwerpen.ansymo.semanticadaptation.cg.canonical.SemanticAdaptationCanonicalGenerator.prettyprint_model(SemanticAdaptationCanonicalGenerator.xtend:101)
	at be.uantwerpen.ansymo.semanticadaptation.cg.canonical.SemanticAdaptationCanonicalGenerator.doGenerate(SemanticAdaptationCanonicalGenerator.xtend:69)
	at be.uantwerpen.ansymo.semanticadaptation.cg.canonical.tests.SemanticAdaptationGeneratorTest.__generate(SemanticAdaptationGeneratorTest.xtend:246)
	at be.uantwerpen.ansymo.semanticadaptation.cg.canonical.tests.SemanticAdaptationGeneratorTest.test_addInputPorts_sample1(SemanticAdaptationGeneratorTest.xtend:59)

window_SA_parseNoExceptions(be.uantwerpen.ansymo.semanticadaptation.cg.canonical.tests.SemanticAdaptationGeneratorTest)  Time elapsed: 0.023 sec  <<< ERROR!
java.lang.RuntimeException: Could not serialize AdaptationWithSpecificMaster:
FMU.path is required to have a value, but it does not.
Adaptation.inner is required to have a value, but it does not.
Semantic Object: SemanticAdaptation.elements[0]->AdaptationWithSpecificMaster'windowSA'
URI: __synthetic0.sa
Context: Component returns AdaptationWithSpecificMaster
	at org.eclipse.xtext.serializer.diagnostic.ISerializationDiagnostic$ExceptionThrowingAcceptor.accept(ISerializationDiagnostic.java:131)
	at org.eclipse.xtext.serializer.sequencer.BacktrackingSemanticSequencer.createSequence(BacktrackingSemanticSequencer.java:513)
	at be.uantwerpen.ansymo.semanticadaptation.serializer.SemanticAdaptationSemanticSequencer.sequence_Adaptation(SemanticAdaptationSemanticSequencer.java:618)
	at be.uantwerpen.ansymo.semanticadaptation.serializer.SemanticAdaptationSemanticSequencer.sequence(SemanticAdaptationSemanticSequencer.java:161)
	at org.eclipse.xtext.serializer.sequencer.AbstractSemanticSequencer.createSequence(AbstractSemanticSequencer.java:67)
	at org.eclipse.xtext.serializer.acceptor.SequenceFeeder.acceptEObjectRuleCall(SequenceFeeder.java:325)
	at org.eclipse.xtext.serializer.acceptor.SequenceFeeder.acceptRuleCall(SequenceFeeder.java:352)
	at org.eclipse.xtext.serializer.acceptor.SequenceFeeder.accept(SequenceFeeder.java:263)
	at org.eclipse.xtext.serializer.sequencer.BacktrackingSemanticSequencer.accept(BacktrackingSemanticSequencer.java:444)
	at org.eclipse.xtext.serializer.sequencer.BacktrackingSemanticSequencer.createSequence(BacktrackingSemanticSequencer.java:511)
	at be.uantwerpen.ansymo.semanticadaptation.serializer.SemanticAdaptationSemanticSequencer.sequence_SemanticAdaptation(SemanticAdaptationSemanticSequencer.java:3450)
	at be.uantwerpen.ansymo.semanticadaptation.serializer.SemanticAdaptationSemanticSequencer.sequence(SemanticAdaptationSemanticSequencer.java:522)
	at org.eclipse.xtext.serializer.sequencer.AbstractSemanticSequencer.createSequence(AbstractSemanticSequencer.java:67)
	at org.eclipse.xtext.serializer.impl.Serializer.serialize(Serializer.java:118)
	at org.eclipse.xtext.serializer.impl.Serializer.serializeToRegions(Serializer.java:140)
	at org.eclipse.xtext.serializer.impl.Serializer.serialize(Serializer.java:146)
	at org.eclipse.xtext.serializer.impl.Serializer.serialize(Serializer.java:198)
	at org.eclipse.xtext.resource.XtextResource.doSave(XtextResource.java:386)
	at org.eclipse.emf.ecore.resource.impl.ResourceImpl.save(ResourceImpl.java:1430)
	at be.uantwerpen.ansymo.semanticadaptation.cg.canonical.SemanticAdaptationCanonicalGenerator.prettyprint_model(SemanticAdaptationCanonicalGenerator.xtend:101)
	at be.uantwerpen.ansymo.semanticadaptation.cg.canonical.SemanticAdaptationCanonicalGenerator.doGenerate(SemanticAdaptationCanonicalGenerator.xtend:69)
	at be.uantwerpen.ansymo.semanticadaptation.cg.canonical.tests.SemanticAdaptationGeneratorTest.__generate(SemanticAdaptationGeneratorTest.xtend:246)
	at be.uantwerpen.ansymo.semanticadaptation.cg.canonical.tests.SemanticAdaptationGeneratorTest.window_SA_parseNoExceptions(SemanticAdaptationGeneratorTest.xtend:216)

power_base_SA_parseNoExceptions(be.uantwerpen.ansymo.semanticadaptation.cg.canonical.tests.SemanticAdaptationGeneratorTest) skipped
test_createCoSimStepInstructions_sample2(be.uantwerpen.ansymo.semanticadaptation.cg.canonical.tests.SemanticAdaptationGeneratorTest)  Time elapsed: 0.016 sec  <<< ERROR!
java.lang.RuntimeException: Could not serialize AdaptationWithSpecificMaster:
FMU.path is required to have a value, but it does not.
Adaptation.inner is required to have a value, but it does not.
Semantic Object: SemanticAdaptation.elements[0]->AdaptationWithSpecificMaster'outerFMU'
URI: __synthetic0.sa
Context: Component returns AdaptationWithSpecificMaster
	at org.eclipse.xtext.serializer.diagnostic.ISerializationDiagnostic$ExceptionThrowingAcceptor.accept(ISerializationDiagnostic.java:131)
	at org.eclipse.xtext.serializer.sequencer.BacktrackingSemanticSequencer.createSequence(BacktrackingSemanticSequencer.java:513)
	at be.uantwerpen.ansymo.semanticadaptation.serializer.SemanticAdaptationSemanticSequencer.sequence_Adaptation(SemanticAdaptationSemanticSequencer.java:618)
	at be.uantwerpen.ansymo.semanticadaptation.serializer.SemanticAdaptationSemanticSequencer.sequence(SemanticAdaptationSemanticSequencer.java:161)
	at org.eclipse.xtext.serializer.sequencer.AbstractSemanticSequencer.createSequence(AbstractSemanticSequencer.java:67)
	at org.eclipse.xtext.serializer.acceptor.SequenceFeeder.acceptEObjectRuleCall(SequenceFeeder.java:325)
	at org.eclipse.xtext.serializer.acceptor.SequenceFeeder.acceptRuleCall(SequenceFeeder.java:352)
	at org.eclipse.xtext.serializer.acceptor.SequenceFeeder.accept(SequenceFeeder.java:263)
	at org.eclipse.xtext.serializer.sequencer.BacktrackingSemanticSequencer.accept(BacktrackingSemanticSequencer.java:444)
	at org.eclipse.xtext.serializer.sequencer.BacktrackingSemanticSequencer.createSequence(BacktrackingSemanticSequencer.java:511)
	at be.uantwerpen.ansymo.semanticadaptation.serializer.SemanticAdaptationSemanticSequencer.sequence_SemanticAdaptation(SemanticAdaptationSemanticSequencer.java:3450)
	at be.uantwerpen.ansymo.semanticadaptation.serializer.SemanticAdaptationSemanticSequencer.sequence(SemanticAdaptationSemanticSequencer.java:522)
	at org.eclipse.xtext.serializer.sequencer.AbstractSemanticSequencer.createSequence(AbstractSemanticSequencer.java:67)
	at org.eclipse.xtext.serializer.impl.Serializer.serialize(Serializer.java:118)
	at org.eclipse.xtext.serializer.impl.Serializer.serializeToRegions(Serializer.java:140)
	at org.eclipse.xtext.serializer.impl.Serializer.serialize(Serializer.java:146)
	at org.eclipse.xtext.serializer.impl.Serializer.serialize(Serializer.java:198)
	at org.eclipse.xtext.resource.XtextResource.doSave(XtextResource.java:386)
	at org.eclipse.emf.ecore.resource.impl.ResourceImpl.save(ResourceImpl.java:1430)
	at be.uantwerpen.ansymo.semanticadaptation.cg.canonical.SemanticAdaptationCanonicalGenerator.prettyprint_model(SemanticAdaptationCanonicalGenerator.xtend:101)
	at be.uantwerpen.ansymo.semanticadaptation.cg.canonical.SemanticAdaptationCanonicalGenerator.doGenerate(SemanticAdaptationCanonicalGenerator.xtend:69)
	at be.uantwerpen.ansymo.semanticadaptation.cg.canonical.tests.SemanticAdaptationGeneratorTest.__generate(SemanticAdaptationGeneratorTest.xtend:246)
	at be.uantwerpen.ansymo.semanticadaptation.cg.canonical.tests.SemanticAdaptationGeneratorTest.test_createCoSimStepInstructions_sample2(SemanticAdaptationGeneratorTest.xtend:157)

test_createInternalBindingAssignments_sample2(be.uantwerpen.ansymo.semanticadaptation.cg.canonical.tests.SemanticAdaptationGeneratorTest)  Time elapsed: 0.029 sec  <<< ERROR!
java.lang.RuntimeException: Could not serialize AdaptationWithSpecificMaster:
FMU.path is required to have a value, but it does not.
Adaptation.inner is required to have a value, but it does not.
Semantic Object: SemanticAdaptation.elements[0]->AdaptationWithSpecificMaster'outerFMU'
URI: __synthetic0.sa
Context: Component returns AdaptationWithSpecificMaster
	at org.eclipse.xtext.serializer.diagnostic.ISerializationDiagnostic$ExceptionThrowingAcceptor.accept(ISerializationDiagnostic.java:131)
	at org.eclipse.xtext.serializer.sequencer.BacktrackingSemanticSequencer.createSequence(BacktrackingSemanticSequencer.java:513)
	at be.uantwerpen.ansymo.semanticadaptation.serializer.SemanticAdaptationSemanticSequencer.sequence_Adaptation(SemanticAdaptationSemanticSequencer.java:618)
	at be.uantwerpen.ansymo.semanticadaptation.serializer.SemanticAdaptationSemanticSequencer.sequence(SemanticAdaptationSemanticSequencer.java:161)
	at org.eclipse.xtext.serializer.sequencer.AbstractSemanticSequencer.createSequence(AbstractSemanticSequencer.java:67)
	at org.eclipse.xtext.serializer.acceptor.SequenceFeeder.acceptEObjectRuleCall(SequenceFeeder.java:325)
	at org.eclipse.xtext.serializer.acceptor.SequenceFeeder.acceptRuleCall(SequenceFeeder.java:352)
	at org.eclipse.xtext.serializer.acceptor.SequenceFeeder.accept(SequenceFeeder.java:263)
	at org.eclipse.xtext.serializer.sequencer.BacktrackingSemanticSequencer.accept(BacktrackingSemanticSequencer.java:444)
	at org.eclipse.xtext.serializer.sequencer.BacktrackingSemanticSequencer.createSequence(BacktrackingSemanticSequencer.java:511)
	at be.uantwerpen.ansymo.semanticadaptation.serializer.SemanticAdaptationSemanticSequencer.sequence_SemanticAdaptation(SemanticAdaptationSemanticSequencer.java:3450)
	at be.uantwerpen.ansymo.semanticadaptation.serializer.SemanticAdaptationSemanticSequencer.sequence(SemanticAdaptationSemanticSequencer.java:522)
	at org.eclipse.xtext.serializer.sequencer.AbstractSemanticSequencer.createSequence(AbstractSemanticSequencer.java:67)
	at org.eclipse.xtext.serializer.impl.Serializer.serialize(Serializer.java:118)
	at org.eclipse.xtext.serializer.impl.Serializer.serializeToRegions(Serializer.java:140)
	at org.eclipse.xtext.serializer.impl.Serializer.serialize(Serializer.java:146)
	at org.eclipse.xtext.serializer.impl.Serializer.serialize(Serializer.java:198)
	at org.eclipse.xtext.resource.XtextResource.doSave(XtextResource.java:386)
	at org.eclipse.emf.ecore.resource.impl.ResourceImpl.save(ResourceImpl.java:1430)
	at be.uantwerpen.ansymo.semanticadaptation.cg.canonical.SemanticAdaptationCanonicalGenerator.prettyprint_model(SemanticAdaptationCanonicalGenerator.xtend:101)
	at be.uantwerpen.ansymo.semanticadaptation.cg.canonical.SemanticAdaptationCanonicalGenerator.doGenerate(SemanticAdaptationCanonicalGenerator.xtend:69)
	at be.uantwerpen.ansymo.semanticadaptation.cg.canonical.tests.SemanticAdaptationGeneratorTest.__generate(SemanticAdaptationGeneratorTest.xtend:246)
	at be.uantwerpen.ansymo.semanticadaptation.cg.canonical.tests.SemanticAdaptationGeneratorTest.test_createInternalBindingAssignments_sample2(SemanticAdaptationGeneratorTest.xtend:164)

test_removeOutBindings_sample1(be.uantwerpen.ansymo.semanticadaptation.cg.canonical.tests.SemanticAdaptationGeneratorTest)  Time elapsed: 0.017 sec  <<< ERROR!
java.lang.RuntimeException: Could not serialize AdaptationWithSpecificMaster:
FMU.path is required to have a value, but it does not.
Adaptation.inner is required to have a value, but it does not.
Semantic Object: SemanticAdaptation.elements[0]->AdaptationWithSpecificMaster'outerFMU'
URI: __synthetic0.sa
Context: Component returns AdaptationWithSpecificMaster
	at org.eclipse.xtext.serializer.diagnostic.ISerializationDiagnostic$ExceptionThrowingAcceptor.accept(ISerializationDiagnostic.java:131)
	at org.eclipse.xtext.serializer.sequencer.BacktrackingSemanticSequencer.createSequence(BacktrackingSemanticSequencer.java:513)
	at be.uantwerpen.ansymo.semanticadaptation.serializer.SemanticAdaptationSemanticSequencer.sequence_Adaptation(SemanticAdaptationSemanticSequencer.java:618)
	at be.uantwerpen.ansymo.semanticadaptation.serializer.SemanticAdaptationSemanticSequencer.sequence(SemanticAdaptationSemanticSequencer.java:161)
	at org.eclipse.xtext.serializer.sequencer.AbstractSemanticSequencer.createSequence(AbstractSemanticSequencer.java:67)
	at org.eclipse.xtext.serializer.acceptor.SequenceFeeder.acceptEObjectRuleCall(SequenceFeeder.java:325)
	at org.eclipse.xtext.serializer.acceptor.SequenceFeeder.acceptRuleCall(SequenceFeeder.java:352)
	at org.eclipse.xtext.serializer.acceptor.SequenceFeeder.accept(SequenceFeeder.java:263)
	at org.eclipse.xtext.serializer.sequencer.BacktrackingSemanticSequencer.accept(BacktrackingSemanticSequencer.java:444)
	at org.eclipse.xtext.serializer.sequencer.BacktrackingSemanticSequencer.createSequence(BacktrackingSemanticSequencer.java:511)
	at be.uantwerpen.ansymo.semanticadaptation.serializer.SemanticAdaptationSemanticSequencer.sequence_SemanticAdaptation(SemanticAdaptationSemanticSequencer.java:3450)
	at be.uantwerpen.ansymo.semanticadaptation.serializer.SemanticAdaptationSemanticSequencer.sequence(SemanticAdaptationSemanticSequencer.java:522)
	at org.eclipse.xtext.serializer.sequencer.AbstractSemanticSequencer.createSequence(AbstractSemanticSequencer.java:67)
	at org.eclipse.xtext.serializer.impl.Serializer.serialize(Serializer.java:118)
	at org.eclipse.xtext.serializer.impl.Serializer.serializeToRegions(Serializer.java:140)
	at org.eclipse.xtext.serializer.impl.Serializer.serialize(Serializer.java:146)
	at org.eclipse.xtext.serializer.impl.Serializer.serialize(Serializer.java:198)
	at org.eclipse.xtext.resource.XtextResource.doSave(XtextResource.java:386)
	at org.eclipse.emf.ecore.resource.impl.ResourceImpl.save(ResourceImpl.java:1430)
	at be.uantwerpen.ansymo.semanticadaptation.cg.canonical.SemanticAdaptationCanonicalGenerator.prettyprint_model(SemanticAdaptationCanonicalGenerator.xtend:101)
	at be.uantwerpen.ansymo.semanticadaptation.cg.canonical.SemanticAdaptationCanonicalGenerator.doGenerate(SemanticAdaptationCanonicalGenerator.xtend:69)
	at be.uantwerpen.ansymo.semanticadaptation.cg.canonical.tests.SemanticAdaptationGeneratorTest.__generate(SemanticAdaptationGeneratorTest.xtend:246)
	at be.uantwerpen.ansymo.semanticadaptation.cg.canonical.tests.SemanticAdaptationGeneratorTest.test_removeOutBindings_sample1(SemanticAdaptationGeneratorTest.xtend:142)

test_ReplacePortRefs_windowsa(be.uantwerpen.ansymo.semanticadaptation.cg.canonical.tests.SemanticAdaptationGeneratorTest)  Time elapsed: 0.013 sec  <<< ERROR!
java.lang.RuntimeException: Could not serialize AdaptationWithSpecificMaster:
FMU.path is required to have a value, but it does not.
Adaptation.inner is required to have a value, but it does not.
Semantic Object: SemanticAdaptation.elements[0]->AdaptationWithSpecificMaster'windowSA'
URI: __synthetic0.sa
Context: Component returns AdaptationWithSpecificMaster
	at org.eclipse.xtext.serializer.diagnostic.ISerializationDiagnostic$ExceptionThrowingAcceptor.accept(ISerializationDiagnostic.java:131)
	at org.eclipse.xtext.serializer.sequencer.BacktrackingSemanticSequencer.createSequence(BacktrackingSemanticSequencer.java:513)
	at be.uantwerpen.ansymo.semanticadaptation.serializer.SemanticAdaptationSemanticSequencer.sequence_Adaptation(SemanticAdaptationSemanticSequencer.java:618)
	at be.uantwerpen.ansymo.semanticadaptation.serializer.SemanticAdaptationSemanticSequencer.sequence(SemanticAdaptationSemanticSequencer.java:161)
	at org.eclipse.xtext.serializer.sequencer.AbstractSemanticSequencer.createSequence(AbstractSemanticSequencer.java:67)
	at org.eclipse.xtext.serializer.acceptor.SequenceFeeder.acceptEObjectRuleCall(SequenceFeeder.java:325)
	at org.eclipse.xtext.serializer.acceptor.SequenceFeeder.acceptRuleCall(SequenceFeeder.java:352)
	at org.eclipse.xtext.serializer.acceptor.SequenceFeeder.accept(SequenceFeeder.java:263)
	at org.eclipse.xtext.serializer.sequencer.BacktrackingSemanticSequencer.accept(BacktrackingSemanticSequencer.java:444)
	at org.eclipse.xtext.serializer.sequencer.BacktrackingSemanticSequencer.createSequence(BacktrackingSemanticSequencer.java:511)
	at be.uantwerpen.ansymo.semanticadaptation.serializer.SemanticAdaptationSemanticSequencer.sequence_SemanticAdaptation(SemanticAdaptationSemanticSequencer.java:3450)
	at be.uantwerpen.ansymo.semanticadaptation.serializer.SemanticAdaptationSemanticSequencer.sequence(SemanticAdaptationSemanticSequencer.java:522)
	at org.eclipse.xtext.serializer.sequencer.AbstractSemanticSequencer.createSequence(AbstractSemanticSequencer.java:67)
	at org.eclipse.xtext.serializer.impl.Serializer.serialize(Serializer.java:118)
	at org.eclipse.xtext.serializer.impl.Serializer.serializeToRegions(Serializer.java:140)
	at org.eclipse.xtext.serializer.impl.Serializer.serialize(Serializer.java:146)
	at org.eclipse.xtext.serializer.impl.Serializer.serialize(Serializer.java:198)
	at org.eclipse.xtext.resource.XtextResource.doSave(XtextResource.java:386)
	at org.eclipse.emf.ecore.resource.impl.ResourceImpl.save(ResourceImpl.java:1430)
	at be.uantwerpen.ansymo.semanticadaptation.cg.canonical.SemanticAdaptationCanonicalGenerator.prettyprint_model(SemanticAdaptationCanonicalGenerator.xtend:101)
	at be.uantwerpen.ansymo.semanticadaptation.cg.canonical.SemanticAdaptationCanonicalGenerator.doGenerate(SemanticAdaptationCanonicalGenerator.xtend:69)
	at be.uantwerpen.ansymo.semanticadaptation.cg.canonical.tests.SemanticAdaptationGeneratorTest.__generate(SemanticAdaptationGeneratorTest.xtend:246)
	at be.uantwerpen.ansymo.semanticadaptation.cg.canonical.tests.SemanticAdaptationGeneratorTest.test_ReplacePortRefs_windowsa(SemanticAdaptationGeneratorTest.xtend:178)

test_ReplacePortRefs_sample1(be.uantwerpen.ansymo.semanticadaptation.cg.canonical.tests.SemanticAdaptationGeneratorTest)  Time elapsed: 0.015 sec  <<< ERROR!
java.lang.RuntimeException: Could not serialize AdaptationWithSpecificMaster:
FMU.path is required to have a value, but it does not.
Adaptation.inner is required to have a value, but it does not.
Semantic Object: SemanticAdaptation.elements[0]->AdaptationWithSpecificMaster'outerFMU'
URI: __synthetic0.sa
Context: Component returns AdaptationWithSpecificMaster
	at org.eclipse.xtext.serializer.diagnostic.ISerializationDiagnostic$ExceptionThrowingAcceptor.accept(ISerializationDiagnostic.java:131)
	at org.eclipse.xtext.serializer.sequencer.BacktrackingSemanticSequencer.createSequence(BacktrackingSemanticSequencer.java:513)
	at be.uantwerpen.ansymo.semanticadaptation.serializer.SemanticAdaptationSemanticSequencer.sequence_Adaptation(SemanticAdaptationSemanticSequencer.java:618)
	at be.uantwerpen.ansymo.semanticadaptation.serializer.SemanticAdaptationSemanticSequencer.sequence(SemanticAdaptationSemanticSequencer.java:161)
	at org.eclipse.xtext.serializer.sequencer.AbstractSemanticSequencer.createSequence(AbstractSemanticSequencer.java:67)
	at org.eclipse.xtext.serializer.acceptor.SequenceFeeder.acceptEObjectRuleCall(SequenceFeeder.java:325)
	at org.eclipse.xtext.serializer.acceptor.SequenceFeeder.acceptRuleCall(SequenceFeeder.java:352)
	at org.eclipse.xtext.serializer.acceptor.SequenceFeeder.accept(SequenceFeeder.java:263)
	at org.eclipse.xtext.serializer.sequencer.BacktrackingSemanticSequencer.accept(BacktrackingSemanticSequencer.java:444)
	at org.eclipse.xtext.serializer.sequencer.BacktrackingSemanticSequencer.createSequence(BacktrackingSemanticSequencer.java:511)
	at be.uantwerpen.ansymo.semanticadaptation.serializer.SemanticAdaptationSemanticSequencer.sequence_SemanticAdaptation(SemanticAdaptationSemanticSequencer.java:3450)
	at be.uantwerpen.ansymo.semanticadaptation.serializer.SemanticAdaptationSemanticSequencer.sequence(SemanticAdaptationSemanticSequencer.java:522)
	at org.eclipse.xtext.serializer.sequencer.AbstractSemanticSequencer.createSequence(AbstractSemanticSequencer.java:67)
	at org.eclipse.xtext.serializer.impl.Serializer.serialize(Serializer.java:118)
	at org.eclipse.xtext.serializer.impl.Serializer.serializeToRegions(Serializer.java:140)
	at org.eclipse.xtext.serializer.impl.Serializer.serialize(Serializer.java:146)
	at org.eclipse.xtext.serializer.impl.Serializer.serialize(Serializer.java:198)
	at org.eclipse.xtext.resource.XtextResource.doSave(XtextResource.java:386)
	at org.eclipse.emf.ecore.resource.impl.ResourceImpl.save(ResourceImpl.java:1430)
	at be.uantwerpen.ansymo.semanticadaptation.cg.canonical.SemanticAdaptationCanonicalGenerator.prettyprint_model(SemanticAdaptationCanonicalGenerator.xtend:101)
	at be.uantwerpen.ansymo.semanticadaptation.cg.canonical.SemanticAdaptationCanonicalGenerator.doGenerate(SemanticAdaptationCanonicalGenerator.xtend:69)
	at be.uantwerpen.ansymo.semanticadaptation.cg.canonical.tests.SemanticAdaptationGeneratorTest.__generate(SemanticAdaptationGeneratorTest.xtend:246)
	at be.uantwerpen.ansymo.semanticadaptation.cg.canonical.tests.SemanticAdaptationGeneratorTest.test_ReplacePortRefs_sample1(SemanticAdaptationGeneratorTest.xtend:171)

test_ReplacePortRefs_sample2(be.uantwerpen.ansymo.semanticadaptation.cg.canonical.tests.SemanticAdaptationGeneratorTest)  Time elapsed: 0.014 sec  <<< ERROR!
java.lang.RuntimeException: Could not serialize AdaptationWithSpecificMaster:
FMU.path is required to have a value, but it does not.
Adaptation.inner is required to have a value, but it does not.
Semantic Object: SemanticAdaptation.elements[0]->AdaptationWithSpecificMaster'outerFMU'
URI: __synthetic0.sa
Context: Component returns AdaptationWithSpecificMaster
	at org.eclipse.xtext.serializer.diagnostic.ISerializationDiagnostic$ExceptionThrowingAcceptor.accept(ISerializationDiagnostic.java:131)
	at org.eclipse.xtext.serializer.sequencer.BacktrackingSemanticSequencer.createSequence(BacktrackingSemanticSequencer.java:513)
	at be.uantwerpen.ansymo.semanticadaptation.serializer.SemanticAdaptationSemanticSequencer.sequence_Adaptation(SemanticAdaptationSemanticSequencer.java:618)
	at be.uantwerpen.ansymo.semanticadaptation.serializer.SemanticAdaptationSemanticSequencer.sequence(SemanticAdaptationSemanticSequencer.java:161)
	at org.eclipse.xtext.serializer.sequencer.AbstractSemanticSequencer.createSequence(AbstractSemanticSequencer.java:67)
	at org.eclipse.xtext.serializer.acceptor.SequenceFeeder.acceptEObjectRuleCall(SequenceFeeder.java:325)
	at org.eclipse.xtext.serializer.acceptor.SequenceFeeder.acceptRuleCall(SequenceFeeder.java:352)
	at org.eclipse.xtext.serializer.acceptor.SequenceFeeder.accept(SequenceFeeder.java:263)
	at org.eclipse.xtext.serializer.sequencer.BacktrackingSemanticSequencer.accept(BacktrackingSemanticSequencer.java:444)
	at org.eclipse.xtext.serializer.sequencer.BacktrackingSemanticSequencer.createSequence(BacktrackingSemanticSequencer.java:511)
	at be.uantwerpen.ansymo.semanticadaptation.serializer.SemanticAdaptationSemanticSequencer.sequence_SemanticAdaptation(SemanticAdaptationSemanticSequencer.java:3450)
	at be.uantwerpen.ansymo.semanticadaptation.serializer.SemanticAdaptationSemanticSequencer.sequence(SemanticAdaptationSemanticSequencer.java:522)
	at org.eclipse.xtext.serializer.sequencer.AbstractSemanticSequencer.createSequence(AbstractSemanticSequencer.java:67)
	at org.eclipse.xtext.serializer.impl.Serializer.serialize(Serializer.java:118)
	at org.eclipse.xtext.serializer.impl.Serializer.serializeToRegions(Serializer.java:140)
	at org.eclipse.xtext.serializer.impl.Serializer.serialize(Serializer.java:146)
	at org.eclipse.xtext.serializer.impl.Serializer.serialize(Serializer.java:198)
	at org.eclipse.xtext.resource.XtextResource.doSave(XtextResource.java:386)
	at org.eclipse.emf.ecore.resource.impl.ResourceImpl.save(ResourceImpl.java:1430)
	at be.uantwerpen.ansymo.semanticadaptation.cg.canonical.SemanticAdaptationCanonicalGenerator.prettyprint_model(SemanticAdaptationCanonicalGenerator.xtend:101)
	at be.uantwerpen.ansymo.semanticadaptation.cg.canonical.SemanticAdaptationCanonicalGenerator.doGenerate(SemanticAdaptationCanonicalGenerator.xtend:69)
	at be.uantwerpen.ansymo.semanticadaptation.cg.canonical.tests.SemanticAdaptationGeneratorTest.__generate(SemanticAdaptationGeneratorTest.xtend:246)
	at be.uantwerpen.ansymo.semanticadaptation.cg.canonical.tests.SemanticAdaptationGeneratorTest.test_ReplacePortRefs_sample2(SemanticAdaptationGeneratorTest.xtend:209)

test_addInRules_External2Internal_Assignments_sample1(be.uantwerpen.ansymo.semanticadaptation.cg.canonical.tests.SemanticAdaptationGeneratorTest)  Time elapsed: 0.014 sec  <<< ERROR!
java.lang.RuntimeException: Could not serialize AdaptationWithSpecificMaster:
FMU.path is required to have a value, but it does not.
Adaptation.inner is required to have a value, but it does not.
Semantic Object: SemanticAdaptation.elements[0]->AdaptationWithSpecificMaster'outerFMU'
URI: __synthetic0.sa
Context: Component returns AdaptationWithSpecificMaster
	at org.eclipse.xtext.serializer.diagnostic.ISerializationDiagnostic$ExceptionThrowingAcceptor.accept(ISerializationDiagnostic.java:131)
	at org.eclipse.xtext.serializer.sequencer.BacktrackingSemanticSequencer.createSequence(BacktrackingSemanticSequencer.java:513)
	at be.uantwerpen.ansymo.semanticadaptation.serializer.SemanticAdaptationSemanticSequencer.sequence_Adaptation(SemanticAdaptationSemanticSequencer.java:618)
	at be.uantwerpen.ansymo.semanticadaptation.serializer.SemanticAdaptationSemanticSequencer.sequence(SemanticAdaptationSemanticSequencer.java:161)
	at org.eclipse.xtext.serializer.sequencer.AbstractSemanticSequencer.createSequence(AbstractSemanticSequencer.java:67)
	at org.eclipse.xtext.serializer.acceptor.SequenceFeeder.acceptEObjectRuleCall(SequenceFeeder.java:325)
	at org.eclipse.xtext.serializer.acceptor.SequenceFeeder.acceptRuleCall(SequenceFeeder.java:352)
	at org.eclipse.xtext.serializer.acceptor.SequenceFeeder.accept(SequenceFeeder.java:263)
	at org.eclipse.xtext.serializer.sequencer.BacktrackingSemanticSequencer.accept(BacktrackingSemanticSequencer.java:444)
	at org.eclipse.xtext.serializer.sequencer.BacktrackingSemanticSequencer.createSequence(BacktrackingSemanticSequencer.java:511)
	at be.uantwerpen.ansymo.semanticadaptation.serializer.SemanticAdaptationSemanticSequencer.sequence_SemanticAdaptation(SemanticAdaptationSemanticSequencer.java:3450)
	at be.uantwerpen.ansymo.semanticadaptation.serializer.SemanticAdaptationSemanticSequencer.sequence(SemanticAdaptationSemanticSequencer.java:522)
	at org.eclipse.xtext.serializer.sequencer.AbstractSemanticSequencer.createSequence(AbstractSemanticSequencer.java:67)
	at org.eclipse.xtext.serializer.impl.Serializer.serialize(Serializer.java:118)
	at org.eclipse.xtext.serializer.impl.Serializer.serializeToRegions(Serializer.java:140)
	at org.eclipse.xtext.serializer.impl.Serializer.serialize(Serializer.java:146)
	at org.eclipse.xtext.serializer.impl.Serializer.serialize(Serializer.java:198)
	at org.eclipse.xtext.resource.XtextResource.doSave(XtextResource.java:386)
	at org.eclipse.emf.ecore.resource.impl.ResourceImpl.save(ResourceImpl.java:1430)
	at be.uantwerpen.ansymo.semanticadaptation.cg.canonical.SemanticAdaptationCanonicalGenerator.prettyprint_model(SemanticAdaptationCanonicalGenerator.xtend:101)
	at be.uantwerpen.ansymo.semanticadaptation.cg.canonical.SemanticAdaptationCanonicalGenerator.doGenerate(SemanticAdaptationCanonicalGenerator.xtend:69)
	at be.uantwerpen.ansymo.semanticadaptation.cg.canonical.tests.SemanticAdaptationGeneratorTest.__generate(SemanticAdaptationGeneratorTest.xtend:246)
	at be.uantwerpen.ansymo.semanticadaptation.cg.canonical.tests.SemanticAdaptationGeneratorTest.test_addInRules_External2Internal_Assignments_sample1(SemanticAdaptationGeneratorTest.xtend:112)

test_addExternal2InputPortStoredAssignments_sample1(be.uantwerpen.ansymo.semanticadaptation.cg.canonical.tests.SemanticAdaptationGeneratorTest)  Time elapsed: 0.014 sec  <<< ERROR!
java.lang.RuntimeException: Could not serialize AdaptationWithSpecificMaster:
FMU.path is required to have a value, but it does not.
Adaptation.inner is required to have a value, but it does not.
Semantic Object: SemanticAdaptation.elements[0]->AdaptationWithSpecificMaster'outerFMU'
URI: __synthetic0.sa
Context: Component returns AdaptationWithSpecificMaster
	at org.eclipse.xtext.serializer.diagnostic.ISerializationDiagnostic$ExceptionThrowingAcceptor.accept(ISerializationDiagnostic.java:131)
	at org.eclipse.xtext.serializer.sequencer.BacktrackingSemanticSequencer.createSequence(BacktrackingSemanticSequencer.java:513)
	at be.uantwerpen.ansymo.semanticadaptation.serializer.SemanticAdaptationSemanticSequencer.sequence_Adaptation(SemanticAdaptationSemanticSequencer.java:618)
	at be.uantwerpen.ansymo.semanticadaptation.serializer.SemanticAdaptationSemanticSequencer.sequence(SemanticAdaptationSemanticSequencer.java:161)
	at org.eclipse.xtext.serializer.sequencer.AbstractSemanticSequencer.createSequence(AbstractSemanticSequencer.java:67)
	at org.eclipse.xtext.serializer.acceptor.SequenceFeeder.acceptEObjectRuleCall(SequenceFeeder.java:325)
	at org.eclipse.xtext.serializer.acceptor.SequenceFeeder.acceptRuleCall(SequenceFeeder.java:352)
	at org.eclipse.xtext.serializer.acceptor.SequenceFeeder.accept(SequenceFeeder.java:263)
	at org.eclipse.xtext.serializer.sequencer.BacktrackingSemanticSequencer.accept(BacktrackingSemanticSequencer.java:444)
	at org.eclipse.xtext.serializer.sequencer.BacktrackingSemanticSequencer.createSequence(BacktrackingSemanticSequencer.java:511)
	at be.uantwerpen.ansymo.semanticadaptation.serializer.SemanticAdaptationSemanticSequencer.sequence_SemanticAdaptation(SemanticAdaptationSemanticSequencer.java:3450)
	at be.uantwerpen.ansymo.semanticadaptation.serializer.SemanticAdaptationSemanticSequencer.sequence(SemanticAdaptationSemanticSequencer.java:522)
	at org.eclipse.xtext.serializer.sequencer.AbstractSemanticSequencer.createSequence(AbstractSemanticSequencer.java:67)
	at org.eclipse.xtext.serializer.impl.Serializer.serialize(Serializer.java:118)
	at org.eclipse.xtext.serializer.impl.Serializer.serializeToRegions(Serializer.java:140)
	at org.eclipse.xtext.serializer.impl.Serializer.serialize(Serializer.java:146)
	at org.eclipse.xtext.serializer.impl.Serializer.serialize(Serializer.java:198)
	at org.eclipse.xtext.resource.XtextResource.doSave(XtextResource.java:386)
	at org.eclipse.emf.ecore.resource.impl.ResourceImpl.save(ResourceImpl.java:1430)
	at be.uantwerpen.ansymo.semanticadaptation.cg.canonical.SemanticAdaptationCanonicalGenerator.prettyprint_model(SemanticAdaptationCanonicalGenerator.xtend:101)
	at be.uantwerpen.ansymo.semanticadaptation.cg.canonical.SemanticAdaptationCanonicalGenerator.doGenerate(SemanticAdaptationCanonicalGenerator.xtend:69)
	at be.uantwerpen.ansymo.semanticadaptation.cg.canonical.tests.SemanticAdaptationGeneratorTest.__generate(SemanticAdaptationGeneratorTest.xtend:246)
	at be.uantwerpen.ansymo.semanticadaptation.cg.canonical.tests.SemanticAdaptationGeneratorTest.test_addExternal2InputPortStoredAssignments_sample1(SemanticAdaptationGeneratorTest.xtend:94)

test_addOutVars_sample1(be.uantwerpen.ansymo.semanticadaptation.cg.canonical.tests.SemanticAdaptationGeneratorTest)  Time elapsed: 0.013 sec  <<< ERROR!
java.lang.RuntimeException: Could not serialize AdaptationWithSpecificMaster:
FMU.path is required to have a value, but it does not.
Adaptation.inner is required to have a value, but it does not.
Semantic Object: SemanticAdaptation.elements[0]->AdaptationWithSpecificMaster'outerFMU'
URI: __synthetic0.sa
Context: Component returns AdaptationWithSpecificMaster
	at org.eclipse.xtext.serializer.diagnostic.ISerializationDiagnostic$ExceptionThrowingAcceptor.accept(ISerializationDiagnostic.java:131)
	at org.eclipse.xtext.serializer.sequencer.BacktrackingSemanticSequencer.createSequence(BacktrackingSemanticSequencer.java:513)
	at be.uantwerpen.ansymo.semanticadaptation.serializer.SemanticAdaptationSemanticSequencer.sequence_Adaptation(SemanticAdaptationSemanticSequencer.java:618)
	at be.uantwerpen.ansymo.semanticadaptation.serializer.SemanticAdaptationSemanticSequencer.sequence(SemanticAdaptationSemanticSequencer.java:161)
	at org.eclipse.xtext.serializer.sequencer.AbstractSemanticSequencer.createSequence(AbstractSemanticSequencer.java:67)
	at org.eclipse.xtext.serializer.acceptor.SequenceFeeder.acceptEObjectRuleCall(SequenceFeeder.java:325)
	at org.eclipse.xtext.serializer.acceptor.SequenceFeeder.acceptRuleCall(SequenceFeeder.java:352)
	at org.eclipse.xtext.serializer.acceptor.SequenceFeeder.accept(SequenceFeeder.java:263)
	at org.eclipse.xtext.serializer.sequencer.BacktrackingSemanticSequencer.accept(BacktrackingSemanticSequencer.java:444)
	at org.eclipse.xtext.serializer.sequencer.BacktrackingSemanticSequencer.createSequence(BacktrackingSemanticSequencer.java:511)
	at be.uantwerpen.ansymo.semanticadaptation.serializer.SemanticAdaptationSemanticSequencer.sequence_SemanticAdaptation(SemanticAdaptationSemanticSequencer.java:3450)
	at be.uantwerpen.ansymo.semanticadaptation.serializer.SemanticAdaptationSemanticSequencer.sequence(SemanticAdaptationSemanticSequencer.java:522)
	at org.eclipse.xtext.serializer.sequencer.AbstractSemanticSequencer.createSequence(AbstractSemanticSequencer.java:67)
	at org.eclipse.xtext.serializer.impl.Serializer.serialize(Serializer.java:118)
	at org.eclipse.xtext.serializer.impl.Serializer.serializeToRegions(Serializer.java:140)
	at org.eclipse.xtext.serializer.impl.Serializer.serialize(Serializer.java:146)
	at org.eclipse.xtext.serializer.impl.Serializer.serialize(Serializer.java:198)
	at org.eclipse.xtext.resource.XtextResource.doSave(XtextResource.java:386)
	at org.eclipse.emf.ecore.resource.impl.ResourceImpl.save(ResourceImpl.java:1430)
	at be.uantwerpen.ansymo.semanticadaptation.cg.canonical.SemanticAdaptationCanonicalGenerator.prettyprint_model(SemanticAdaptationCanonicalGenerator.xtend:101)
	at be.uantwerpen.ansymo.semanticadaptation.cg.canonical.SemanticAdaptationCanonicalGenerator.doGenerate(SemanticAdaptationCanonicalGenerator.xtend:69)
	at be.uantwerpen.ansymo.semanticadaptation.cg.canonical.tests.SemanticAdaptationGeneratorTest.__generate(SemanticAdaptationGeneratorTest.xtend:246)
	at be.uantwerpen.ansymo.semanticadaptation.cg.canonical.tests.SemanticAdaptationGeneratorTest.test_addOutVars_sample1(SemanticAdaptationGeneratorTest.xtend:87)

test_addInVars_sample1(be.uantwerpen.ansymo.semanticadaptation.cg.canonical.tests.SemanticAdaptationGeneratorTest)  Time elapsed: 0.013 sec  <<< ERROR!
java.lang.RuntimeException: Could not serialize AdaptationWithSpecificMaster:
FMU.path is required to have a value, but it does not.
Adaptation.inner is required to have a value, but it does not.
Semantic Object: SemanticAdaptation.elements[0]->AdaptationWithSpecificMaster'outerFMU'
URI: __synthetic0.sa
Context: Component returns AdaptationWithSpecificMaster
	at org.eclipse.xtext.serializer.diagnostic.ISerializationDiagnostic$ExceptionThrowingAcceptor.accept(ISerializationDiagnostic.java:131)
	at org.eclipse.xtext.serializer.sequencer.BacktrackingSemanticSequencer.createSequence(BacktrackingSemanticSequencer.java:513)
	at be.uantwerpen.ansymo.semanticadaptation.serializer.SemanticAdaptationSemanticSequencer.sequence_Adaptation(SemanticAdaptationSemanticSequencer.java:618)
	at be.uantwerpen.ansymo.semanticadaptation.serializer.SemanticAdaptationSemanticSequencer.sequence(SemanticAdaptationSemanticSequencer.java:161)
	at org.eclipse.xtext.serializer.sequencer.AbstractSemanticSequencer.createSequence(AbstractSemanticSequencer.java:67)
	at org.eclipse.xtext.serializer.acceptor.SequenceFeeder.acceptEObjectRuleCall(SequenceFeeder.java:325)
	at org.eclipse.xtext.serializer.acceptor.SequenceFeeder.acceptRuleCall(SequenceFeeder.java:352)
	at org.eclipse.xtext.serializer.acceptor.SequenceFeeder.accept(SequenceFeeder.java:263)
	at org.eclipse.xtext.serializer.sequencer.BacktrackingSemanticSequencer.accept(BacktrackingSemanticSequencer.java:444)
	at org.eclipse.xtext.serializer.sequencer.BacktrackingSemanticSequencer.createSequence(BacktrackingSemanticSequencer.java:511)
	at be.uantwerpen.ansymo.semanticadaptation.serializer.SemanticAdaptationSemanticSequencer.sequence_SemanticAdaptation(SemanticAdaptationSemanticSequencer.java:3450)
	at be.uantwerpen.ansymo.semanticadaptation.serializer.SemanticAdaptationSemanticSequencer.sequence(SemanticAdaptationSemanticSequencer.java:522)
	at org.eclipse.xtext.serializer.sequencer.AbstractSemanticSequencer.createSequence(AbstractSemanticSequencer.java:67)
	at org.eclipse.xtext.serializer.impl.Serializer.serialize(Serializer.java:118)
	at org.eclipse.xtext.serializer.impl.Serializer.serializeToRegions(Serializer.java:140)
	at org.eclipse.xtext.serializer.impl.Serializer.serialize(Serializer.java:146)
	at org.eclipse.xtext.serializer.impl.Serializer.serialize(Serializer.java:198)
	at org.eclipse.xtext.resource.XtextResource.doSave(XtextResource.java:386)
	at org.eclipse.emf.ecore.resource.impl.ResourceImpl.save(ResourceImpl.java:1430)
	at be.uantwerpen.ansymo.semanticadaptation.cg.canonical.SemanticAdaptationCanonicalGenerator.prettyprint_model(SemanticAdaptationCanonicalGenerator.xtend:101)
	at be.uantwerpen.ansymo.semanticadaptation.cg.canonical.SemanticAdaptationCanonicalGenerator.doGenerate(SemanticAdaptationCanonicalGenerator.xtend:69)
	at be.uantwerpen.ansymo.semanticadaptation.cg.canonical.tests.SemanticAdaptationGeneratorTest.__generate(SemanticAdaptationGeneratorTest.xtend:246)
	at be.uantwerpen.ansymo.semanticadaptation.cg.canonical.tests.SemanticAdaptationGeneratorTest.test_addInVars_sample1(SemanticAdaptationGeneratorTest.xtend:79)

window_SA_parseNoExceptions2(be.uantwerpen.ansymo.semanticadaptation.cg.canonical.tests.SemanticAdaptationGeneratorTest)  Time elapsed: 0.018 sec  <<< ERROR!
java.lang.RuntimeException: Could not serialize AdaptationWithSpecificMaster:
FMU.path is required to have a value, but it does not.
Adaptation.inner is required to have a value, but it does not.
Semantic Object: SemanticAdaptation.elements[0]->AdaptationWithSpecificMaster'windowSA'
URI: __synthetic0.sa
Context: Component returns AdaptationWithSpecificMaster
	at org.eclipse.xtext.serializer.diagnostic.ISerializationDiagnostic$ExceptionThrowingAcceptor.accept(ISerializationDiagnostic.java:131)
	at org.eclipse.xtext.serializer.sequencer.BacktrackingSemanticSequencer.createSequence(BacktrackingSemanticSequencer.java:513)
	at be.uantwerpen.ansymo.semanticadaptation.serializer.SemanticAdaptationSemanticSequencer.sequence_Adaptation(SemanticAdaptationSemanticSequencer.java:618)
	at be.uantwerpen.ansymo.semanticadaptation.serializer.SemanticAdaptationSemanticSequencer.sequence(SemanticAdaptationSemanticSequencer.java:161)
	at org.eclipse.xtext.serializer.sequencer.AbstractSemanticSequencer.createSequence(AbstractSemanticSequencer.java:67)
	at org.eclipse.xtext.serializer.acceptor.SequenceFeeder.acceptEObjectRuleCall(SequenceFeeder.java:325)
	at org.eclipse.xtext.serializer.acceptor.SequenceFeeder.acceptRuleCall(SequenceFeeder.java:352)
	at org.eclipse.xtext.serializer.acceptor.SequenceFeeder.accept(SequenceFeeder.java:263)
	at org.eclipse.xtext.serializer.sequencer.BacktrackingSemanticSequencer.accept(BacktrackingSemanticSequencer.java:444)
	at org.eclipse.xtext.serializer.sequencer.BacktrackingSemanticSequencer.createSequence(BacktrackingSemanticSequencer.java:511)
	at be.uantwerpen.ansymo.semanticadaptation.serializer.SemanticAdaptationSemanticSequencer.sequence_SemanticAdaptation(SemanticAdaptationSemanticSequencer.java:3450)
	at be.uantwerpen.ansymo.semanticadaptation.serializer.SemanticAdaptationSemanticSequencer.sequence(SemanticAdaptationSemanticSequencer.java:522)
	at org.eclipse.xtext.serializer.sequencer.AbstractSemanticSequencer.createSequence(AbstractSemanticSequencer.java:67)
	at org.eclipse.xtext.serializer.impl.Serializer.serialize(Serializer.java:118)
	at org.eclipse.xtext.serializer.impl.Serializer.serializeToRegions(Serializer.java:140)
	at org.eclipse.xtext.serializer.impl.Serializer.serialize(Serializer.java:146)
	at org.eclipse.xtext.serializer.impl.Serializer.serialize(Serializer.java:198)
	at org.eclipse.xtext.resource.XtextResource.doSave(XtextResource.java:386)
	at org.eclipse.emf.ecore.resource.impl.ResourceImpl.save(ResourceImpl.java:1430)
	at be.uantwerpen.ansymo.semanticadaptation.cg.canonical.SemanticAdaptationCanonicalGenerator.prettyprint_model(SemanticAdaptationCanonicalGenerator.xtend:101)
	at be.uantwerpen.ansymo.semanticadaptation.cg.canonical.SemanticAdaptationCanonicalGenerator.doGenerate(SemanticAdaptationCanonicalGenerator.xtend:69)
	at be.uantwerpen.ansymo.semanticadaptation.cg.canonical.tests.SemanticAdaptationGeneratorTest.__generate(SemanticAdaptationGeneratorTest.xtend:246)
	at be.uantwerpen.ansymo.semanticadaptation.cg.canonical.tests.SemanticAdaptationGeneratorTest.window_SA_parseNoExceptions2(SemanticAdaptationGeneratorTest.xtend:220)

test_inferTypesAndUnits_sample1(be.uantwerpen.ansymo.semanticadaptation.cg.canonical.tests.SemanticAdaptationGeneratorTest)  Time elapsed: 0.014 sec  <<< ERROR!
java.lang.RuntimeException: Could not serialize AdaptationWithSpecificMaster:
FMU.path is required to have a value, but it does not.
Adaptation.inner is required to have a value, but it does not.
Semantic Object: SemanticAdaptation.elements[0]->AdaptationWithSpecificMaster'outerFMU'
URI: __synthetic0.sa
Context: Component returns AdaptationWithSpecificMaster
	at org.eclipse.xtext.serializer.diagnostic.ISerializationDiagnostic$ExceptionThrowingAcceptor.accept(ISerializationDiagnostic.java:131)
	at org.eclipse.xtext.serializer.sequencer.BacktrackingSemanticSequencer.createSequence(BacktrackingSemanticSequencer.java:513)
	at be.uantwerpen.ansymo.semanticadaptation.serializer.SemanticAdaptationSemanticSequencer.sequence_Adaptation(SemanticAdaptationSemanticSequencer.java:618)
	at be.uantwerpen.ansymo.semanticadaptation.serializer.SemanticAdaptationSemanticSequencer.sequence(SemanticAdaptationSemanticSequencer.java:161)
	at org.eclipse.xtext.serializer.sequencer.AbstractSemanticSequencer.createSequence(AbstractSemanticSequencer.java:67)
	at org.eclipse.xtext.serializer.acceptor.SequenceFeeder.acceptEObjectRuleCall(SequenceFeeder.java:325)
	at org.eclipse.xtext.serializer.acceptor.SequenceFeeder.acceptRuleCall(SequenceFeeder.java:352)
	at org.eclipse.xtext.serializer.acceptor.SequenceFeeder.accept(SequenceFeeder.java:263)
	at org.eclipse.xtext.serializer.sequencer.BacktrackingSemanticSequencer.accept(BacktrackingSemanticSequencer.java:444)
	at org.eclipse.xtext.serializer.sequencer.BacktrackingSemanticSequencer.createSequence(BacktrackingSemanticSequencer.java:511)
	at be.uantwerpen.ansymo.semanticadaptation.serializer.SemanticAdaptationSemanticSequencer.sequence_SemanticAdaptation(SemanticAdaptationSemanticSequencer.java:3450)
	at be.uantwerpen.ansymo.semanticadaptation.serializer.SemanticAdaptationSemanticSequencer.sequence(SemanticAdaptationSemanticSequencer.java:522)
	at org.eclipse.xtext.serializer.sequencer.AbstractSemanticSequencer.createSequence(AbstractSemanticSequencer.java:67)
	at org.eclipse.xtext.serializer.impl.Serializer.serialize(Serializer.java:118)
	at org.eclipse.xtext.serializer.impl.Serializer.serializeToRegions(Serializer.java:140)
	at org.eclipse.xtext.serializer.impl.Serializer.serialize(Serializer.java:146)
	at org.eclipse.xtext.serializer.impl.Serializer.serialize(Serializer.java:198)
	at org.eclipse.xtext.resource.XtextResource.doSave(XtextResource.java:386)
	at org.eclipse.emf.ecore.resource.impl.ResourceImpl.save(ResourceImpl.java:1430)
	at be.uantwerpen.ansymo.semanticadaptation.cg.canonical.SemanticAdaptationCanonicalGenerator.prettyprint_model(SemanticAdaptationCanonicalGenerator.xtend:101)
	at be.uantwerpen.ansymo.semanticadaptation.cg.canonical.SemanticAdaptationCanonicalGenerator.doGenerate(SemanticAdaptationCanonicalGenerator.xtend:69)
	at be.uantwerpen.ansymo.semanticadaptation.cg.canonical.tests.SemanticAdaptationGeneratorTest.__generate(SemanticAdaptationGeneratorTest.xtend:246)
	at be.uantwerpen.ansymo.semanticadaptation.cg.canonical.tests.SemanticAdaptationGeneratorTest.test_inferTypesAndUnits_sample1(SemanticAdaptationGeneratorTest.xtend:44)

test_addInternal2OutputPortStoredAssignments_sample1(be.uantwerpen.ansymo.semanticadaptation.cg.canonical.tests.SemanticAdaptationGeneratorTest)  Time elapsed: 0.017 sec  <<< ERROR!
java.lang.RuntimeException: Could not serialize AdaptationWithSpecificMaster:
FMU.path is required to have a value, but it does not.
Adaptation.inner is required to have a value, but it does not.
Semantic Object: SemanticAdaptation.elements[0]->AdaptationWithSpecificMaster'outerFMU'
URI: __synthetic0.sa
Context: Component returns AdaptationWithSpecificMaster
	at org.eclipse.xtext.serializer.diagnostic.ISerializationDiagnostic$ExceptionThrowingAcceptor.accept(ISerializationDiagnostic.java:131)
	at org.eclipse.xtext.serializer.sequencer.BacktrackingSemanticSequencer.createSequence(BacktrackingSemanticSequencer.java:513)
	at be.uantwerpen.ansymo.semanticadaptation.serializer.SemanticAdaptationSemanticSequencer.sequence_Adaptation(SemanticAdaptationSemanticSequencer.java:618)
	at be.uantwerpen.ansymo.semanticadaptation.serializer.SemanticAdaptationSemanticSequencer.sequence(SemanticAdaptationSemanticSequencer.java:161)
	at org.eclipse.xtext.serializer.sequencer.AbstractSemanticSequencer.createSequence(AbstractSemanticSequencer.java:67)
	at org.eclipse.xtext.serializer.acceptor.SequenceFeeder.acceptEObjectRuleCall(SequenceFeeder.java:325)
	at org.eclipse.xtext.serializer.acceptor.SequenceFeeder.acceptRuleCall(SequenceFeeder.java:352)
	at org.eclipse.xtext.serializer.acceptor.SequenceFeeder.accept(SequenceFeeder.java:263)
	at org.eclipse.xtext.serializer.sequencer.BacktrackingSemanticSequencer.accept(BacktrackingSemanticSequencer.java:444)
	at org.eclipse.xtext.serializer.sequencer.BacktrackingSemanticSequencer.createSequence(BacktrackingSemanticSequencer.java:511)
	at be.uantwerpen.ansymo.semanticadaptation.serializer.SemanticAdaptationSemanticSequencer.sequence_SemanticAdaptation(SemanticAdaptationSemanticSequencer.java:3450)
	at be.uantwerpen.ansymo.semanticadaptation.serializer.SemanticAdaptationSemanticSequencer.sequence(SemanticAdaptationSemanticSequencer.java:522)
	at org.eclipse.xtext.serializer.sequencer.AbstractSemanticSequencer.createSequence(AbstractSemanticSequencer.java:67)
	at org.eclipse.xtext.serializer.impl.Serializer.serialize(Serializer.java:118)
	at org.eclipse.xtext.serializer.impl.Serializer.serializeToRegions(Serializer.java:140)
	at org.eclipse.xtext.serializer.impl.Serializer.serialize(Serializer.java:146)
	at org.eclipse.xtext.serializer.impl.Serializer.serialize(Serializer.java:198)
	at org.eclipse.xtext.resource.XtextResource.doSave(XtextResource.java:386)
	at org.eclipse.emf.ecore.resource.impl.ResourceImpl.save(ResourceImpl.java:1430)
	at be.uantwerpen.ansymo.semanticadaptation.cg.canonical.SemanticAdaptationCanonicalGenerator.prettyprint_model(SemanticAdaptationCanonicalGenerator.xtend:101)
	at be.uantwerpen.ansymo.semanticadaptation.cg.canonical.SemanticAdaptationCanonicalGenerator.doGenerate(SemanticAdaptationCanonicalGenerator.xtend:69)
	at be.uantwerpen.ansymo.semanticadaptation.cg.canonical.tests.SemanticAdaptationGeneratorTest.__generate(SemanticAdaptationGeneratorTest.xtend:246)
	at be.uantwerpen.ansymo.semanticadaptation.cg.canonical.tests.SemanticAdaptationGeneratorTest.test_addInternal2OutputPortStoredAssignments_sample1(SemanticAdaptationGeneratorTest.xtend:104)

test_addOutParams_sample1(be.uantwerpen.ansymo.semanticadaptation.cg.canonical.tests.SemanticAdaptationGeneratorTest)  Time elapsed: 0.025 sec  <<< ERROR!
java.lang.RuntimeException: Could not serialize AdaptationWithSpecificMaster:
FMU.path is required to have a value, but it does not.
Adaptation.inner is required to have a value, but it does not.
Semantic Object: SemanticAdaptation.elements[0]->AdaptationWithSpecificMaster'outerFMU'
URI: __synthetic0.sa
Context: Component returns AdaptationWithSpecificMaster
	at org.eclipse.xtext.serializer.diagnostic.ISerializationDiagnostic$ExceptionThrowingAcceptor.accept(ISerializationDiagnostic.java:131)
	at org.eclipse.xtext.serializer.sequencer.BacktrackingSemanticSequencer.createSequence(BacktrackingSemanticSequencer.java:513)
	at be.uantwerpen.ansymo.semanticadaptation.serializer.SemanticAdaptationSemanticSequencer.sequence_Adaptation(SemanticAdaptationSemanticSequencer.java:618)
	at be.uantwerpen.ansymo.semanticadaptation.serializer.SemanticAdaptationSemanticSequencer.sequence(SemanticAdaptationSemanticSequencer.java:161)
	at org.eclipse.xtext.serializer.sequencer.AbstractSemanticSequencer.createSequence(AbstractSemanticSequencer.java:67)
	at org.eclipse.xtext.serializer.acceptor.SequenceFeeder.acceptEObjectRuleCall(SequenceFeeder.java:325)
	at org.eclipse.xtext.serializer.acceptor.SequenceFeeder.acceptRuleCall(SequenceFeeder.java:352)
	at org.eclipse.xtext.serializer.acceptor.SequenceFeeder.accept(SequenceFeeder.java:263)
	at org.eclipse.xtext.serializer.sequencer.BacktrackingSemanticSequencer.accept(BacktrackingSemanticSequencer.java:444)
	at org.eclipse.xtext.serializer.sequencer.BacktrackingSemanticSequencer.createSequence(BacktrackingSemanticSequencer.java:511)
	at be.uantwerpen.ansymo.semanticadaptation.serializer.SemanticAdaptationSemanticSequencer.sequence_SemanticAdaptation(SemanticAdaptationSemanticSequencer.java:3450)
	at be.uantwerpen.ansymo.semanticadaptation.serializer.SemanticAdaptationSemanticSequencer.sequence(SemanticAdaptationSemanticSequencer.java:522)
	at org.eclipse.xtext.serializer.sequencer.AbstractSemanticSequencer.createSequence(AbstractSemanticSequencer.java:67)
	at org.eclipse.xtext.serializer.impl.Serializer.serialize(Serializer.java:118)
	at org.eclipse.xtext.serializer.impl.Serializer.serializeToRegions(Serializer.java:140)
	at org.eclipse.xtext.serializer.impl.Serializer.serialize(Serializer.java:146)
	at org.eclipse.xtext.serializer.impl.Serializer.serialize(Serializer.java:198)
	at org.eclipse.xtext.resource.XtextResource.doSave(XtextResource.java:386)
	at org.eclipse.emf.ecore.resource.impl.ResourceImpl.save(ResourceImpl.java:1430)
	at be.uantwerpen.ansymo.semanticadaptation.cg.canonical.SemanticAdaptationCanonicalGenerator.prettyprint_model(SemanticAdaptationCanonicalGenerator.xtend:101)
	at be.uantwerpen.ansymo.semanticadaptation.cg.canonical.SemanticAdaptationCanonicalGenerator.doGenerate(SemanticAdaptationCanonicalGenerator.xtend:69)
	at be.uantwerpen.ansymo.semanticadaptation.cg.canonical.tests.SemanticAdaptationGeneratorTest.__generate(SemanticAdaptationGeneratorTest.xtend:246)
	at be.uantwerpen.ansymo.semanticadaptation.cg.canonical.tests.SemanticAdaptationGeneratorTest.test_addOutParams_sample1(SemanticAdaptationGeneratorTest.xtend:149)

test_addParams_sample1(be.uantwerpen.ansymo.semanticadaptation.cg.canonical.tests.SemanticAdaptationGeneratorTest)  Time elapsed: 0.021 sec  <<< ERROR!
java.lang.RuntimeException: Could not serialize AdaptationWithSpecificMaster:
FMU.path is required to have a value, but it does not.
Adaptation.inner is required to have a value, but it does not.
Semantic Object: SemanticAdaptation.elements[0]->AdaptationWithSpecificMaster'outerFMU'
URI: __synthetic0.sa
Context: Component returns AdaptationWithSpecificMaster
	at org.eclipse.xtext.serializer.diagnostic.ISerializationDiagnostic$ExceptionThrowingAcceptor.accept(ISerializationDiagnostic.java:131)
	at org.eclipse.xtext.serializer.sequencer.BacktrackingSemanticSequencer.createSequence(BacktrackingSemanticSequencer.java:513)
	at be.uantwerpen.ansymo.semanticadaptation.serializer.SemanticAdaptationSemanticSequencer.sequence_Adaptation(SemanticAdaptationSemanticSequencer.java:618)
	at be.uantwerpen.ansymo.semanticadaptation.serializer.SemanticAdaptationSemanticSequencer.sequence(SemanticAdaptationSemanticSequencer.java:161)
	at org.eclipse.xtext.serializer.sequencer.AbstractSemanticSequencer.createSequence(AbstractSemanticSequencer.java:67)
	at org.eclipse.xtext.serializer.acceptor.SequenceFeeder.acceptEObjectRuleCall(SequenceFeeder.java:325)
	at org.eclipse.xtext.serializer.acceptor.SequenceFeeder.acceptRuleCall(SequenceFeeder.java:352)
	at org.eclipse.xtext.serializer.acceptor.SequenceFeeder.accept(SequenceFeeder.java:263)
	at org.eclipse.xtext.serializer.sequencer.BacktrackingSemanticSequencer.accept(BacktrackingSemanticSequencer.java:444)
	at org.eclipse.xtext.serializer.sequencer.BacktrackingSemanticSequencer.createSequence(BacktrackingSemanticSequencer.java:511)
	at be.uantwerpen.ansymo.semanticadaptation.serializer.SemanticAdaptationSemanticSequencer.sequence_SemanticAdaptation(SemanticAdaptationSemanticSequencer.java:3450)
	at be.uantwerpen.ansymo.semanticadaptation.serializer.SemanticAdaptationSemanticSequencer.sequence(SemanticAdaptationSemanticSequencer.java:522)
	at org.eclipse.xtext.serializer.sequencer.AbstractSemanticSequencer.createSequence(AbstractSemanticSequencer.java:67)
	at org.eclipse.xtext.serializer.impl.Serializer.serialize(Serializer.java:118)
	at org.eclipse.xtext.serializer.impl.Serializer.serializeToRegions(Serializer.java:140)
	at org.eclipse.xtext.serializer.impl.Serializer.serialize(Serializer.java:146)
	at org.eclipse.xtext.serializer.impl.Serializer.serialize(Serializer.java:198)
	at org.eclipse.xtext.resource.XtextResource.doSave(XtextResource.java:386)
	at org.eclipse.emf.ecore.resource.impl.ResourceImpl.save(ResourceImpl.java:1430)
	at be.uantwerpen.ansymo.semanticadaptation.cg.canonical.SemanticAdaptationCanonicalGenerator.prettyprint_model(SemanticAdaptationCanonicalGenerator.xtend:101)
	at be.uantwerpen.ansymo.semanticadaptation.cg.canonical.SemanticAdaptationCanonicalGenerator.doGenerate(SemanticAdaptationCanonicalGenerator.xtend:69)
	at be.uantwerpen.ansymo.semanticadaptation.cg.canonical.tests.SemanticAdaptationGeneratorTest.__generate(SemanticAdaptationGeneratorTest.xtend:246)
	at be.uantwerpen.ansymo.semanticadaptation.cg.canonical.tests.SemanticAdaptationGeneratorTest.test_addParams_sample1(SemanticAdaptationGeneratorTest.xtend:71)

rate_SA_parseNoExceptions(be.uantwerpen.ansymo.semanticadaptation.cg.canonical.tests.SemanticAdaptationGeneratorTest) skipped
test_addOutRules_Internal2External_Assignments_sample1(be.uantwerpen.ansymo.semanticadaptation.cg.canonical.tests.SemanticAdaptationGeneratorTest)  Time elapsed: 0.019 sec  <<< ERROR!
java.lang.RuntimeException: Could not serialize AdaptationWithSpecificMaster:
FMU.path is required to have a value, but it does not.
Adaptation.inner is required to have a value, but it does not.
Semantic Object: SemanticAdaptation.elements[0]->AdaptationWithSpecificMaster'outerFMU'
URI: __synthetic0.sa
Context: Component returns AdaptationWithSpecificMaster
	at org.eclipse.xtext.serializer.diagnostic.ISerializationDiagnostic$ExceptionThrowingAcceptor.accept(ISerializationDiagnostic.java:131)
	at org.eclipse.xtext.serializer.sequencer.BacktrackingSemanticSequencer.createSequence(BacktrackingSemanticSequencer.java:513)
	at be.uantwerpen.ansymo.semanticadaptation.serializer.SemanticAdaptationSemanticSequencer.sequence_Adaptation(SemanticAdaptationSemanticSequencer.java:618)
	at be.uantwerpen.ansymo.semanticadaptation.serializer.SemanticAdaptationSemanticSequencer.sequence(SemanticAdaptationSemanticSequencer.java:161)
	at org.eclipse.xtext.serializer.sequencer.AbstractSemanticSequencer.createSequence(AbstractSemanticSequencer.java:67)
	at org.eclipse.xtext.serializer.acceptor.SequenceFeeder.acceptEObjectRuleCall(SequenceFeeder.java:325)
	at org.eclipse.xtext.serializer.acceptor.SequenceFeeder.acceptRuleCall(SequenceFeeder.java:352)
	at org.eclipse.xtext.serializer.acceptor.SequenceFeeder.accept(SequenceFeeder.java:263)
	at org.eclipse.xtext.serializer.sequencer.BacktrackingSemanticSequencer.accept(BacktrackingSemanticSequencer.java:444)
	at org.eclipse.xtext.serializer.sequencer.BacktrackingSemanticSequencer.createSequence(BacktrackingSemanticSequencer.java:511)
	at be.uantwerpen.ansymo.semanticadaptation.serializer.SemanticAdaptationSemanticSequencer.sequence_SemanticAdaptation(SemanticAdaptationSemanticSequencer.java:3450)
	at be.uantwerpen.ansymo.semanticadaptation.serializer.SemanticAdaptationSemanticSequencer.sequence(SemanticAdaptationSemanticSequencer.java:522)
	at org.eclipse.xtext.serializer.sequencer.AbstractSemanticSequencer.createSequence(AbstractSemanticSequencer.java:67)
	at org.eclipse.xtext.serializer.impl.Serializer.serialize(Serializer.java:118)
	at org.eclipse.xtext.serializer.impl.Serializer.serializeToRegions(Serializer.java:140)
	at org.eclipse.xtext.serializer.impl.Serializer.serialize(Serializer.java:146)
	at org.eclipse.xtext.serializer.impl.Serializer.serialize(Serializer.java:198)
	at org.eclipse.xtext.resource.XtextResource.doSave(XtextResource.java:386)
	at org.eclipse.emf.ecore.resource.impl.ResourceImpl.save(ResourceImpl.java:1430)
	at be.uantwerpen.ansymo.semanticadaptation.cg.canonical.SemanticAdaptationCanonicalGenerator.prettyprint_model(SemanticAdaptationCanonicalGenerator.xtend:101)
	at be.uantwerpen.ansymo.semanticadaptation.cg.canonical.SemanticAdaptationCanonicalGenerator.doGenerate(SemanticAdaptationCanonicalGenerator.xtend:69)
	at be.uantwerpen.ansymo.semanticadaptation.cg.canonical.tests.SemanticAdaptationGeneratorTest.__generate(SemanticAdaptationGeneratorTest.xtend:246)
	at be.uantwerpen.ansymo.semanticadaptation.cg.canonical.tests.SemanticAdaptationGeneratorTest.test_addOutRules_Internal2External_Assignments_sample1(SemanticAdaptationGeneratorTest.xtend:125)

test_removeInBindings_sample1(be.uantwerpen.ansymo.semanticadaptation.cg.canonical.tests.SemanticAdaptationGeneratorTest)  Time elapsed: 0.016 sec  <<< ERROR!
java.lang.RuntimeException: Could not serialize AdaptationWithSpecificMaster:
FMU.path is required to have a value, but it does not.
Adaptation.inner is required to have a value, but it does not.
Semantic Object: SemanticAdaptation.elements[0]->AdaptationWithSpecificMaster'outerFMU'
URI: __synthetic0.sa
Context: Component returns AdaptationWithSpecificMaster
	at org.eclipse.xtext.serializer.diagnostic.ISerializationDiagnostic$ExceptionThrowingAcceptor.accept(ISerializationDiagnostic.java:131)
	at org.eclipse.xtext.serializer.sequencer.BacktrackingSemanticSequencer.createSequence(BacktrackingSemanticSequencer.java:513)
	at be.uantwerpen.ansymo.semanticadaptation.serializer.SemanticAdaptationSemanticSequencer.sequence_Adaptation(SemanticAdaptationSemanticSequencer.java:618)
	at be.uantwerpen.ansymo.semanticadaptation.serializer.SemanticAdaptationSemanticSequencer.sequence(SemanticAdaptationSemanticSequencer.java:161)
	at org.eclipse.xtext.serializer.sequencer.AbstractSemanticSequencer.createSequence(AbstractSemanticSequencer.java:67)
	at org.eclipse.xtext.serializer.acceptor.SequenceFeeder.acceptEObjectRuleCall(SequenceFeeder.java:325)
	at org.eclipse.xtext.serializer.acceptor.SequenceFeeder.acceptRuleCall(SequenceFeeder.java:352)
	at org.eclipse.xtext.serializer.acceptor.SequenceFeeder.accept(SequenceFeeder.java:263)
	at org.eclipse.xtext.serializer.sequencer.BacktrackingSemanticSequencer.accept(BacktrackingSemanticSequencer.java:444)
	at org.eclipse.xtext.serializer.sequencer.BacktrackingSemanticSequencer.createSequence(BacktrackingSemanticSequencer.java:511)
	at be.uantwerpen.ansymo.semanticadaptation.serializer.SemanticAdaptationSemanticSequencer.sequence_SemanticAdaptation(SemanticAdaptationSemanticSequencer.java:3450)
	at be.uantwerpen.ansymo.semanticadaptation.serializer.SemanticAdaptationSemanticSequencer.sequence(SemanticAdaptationSemanticSequencer.java:522)
	at org.eclipse.xtext.serializer.sequencer.AbstractSemanticSequencer.createSequence(AbstractSemanticSequencer.java:67)
	at org.eclipse.xtext.serializer.impl.Serializer.serialize(Serializer.java:118)
	at org.eclipse.xtext.serializer.impl.Serializer.serializeToRegions(Serializer.java:140)
	at org.eclipse.xtext.serializer.impl.Serializer.serialize(Serializer.java:146)
	at org.eclipse.xtext.serializer.impl.Serializer.serialize(Serializer.java:198)
	at org.eclipse.xtext.resource.XtextResource.doSave(XtextResource.java:386)
	at org.eclipse.emf.ecore.resource.impl.ResourceImpl.save(ResourceImpl.java:1430)
	at be.uantwerpen.ansymo.semanticadaptation.cg.canonical.SemanticAdaptationCanonicalGenerator.prettyprint_model(SemanticAdaptationCanonicalGenerator.xtend:101)
	at be.uantwerpen.ansymo.semanticadaptation.cg.canonical.SemanticAdaptationCanonicalGenerator.doGenerate(SemanticAdaptationCanonicalGenerator.xtend:69)
	at be.uantwerpen.ansymo.semanticadaptation.cg.canonical.tests.SemanticAdaptationGeneratorTest.__generate(SemanticAdaptationGeneratorTest.xtend:246)
	at be.uantwerpen.ansymo.semanticadaptation.cg.canonical.tests.SemanticAdaptationGeneratorTest.test_removeInBindings_sample1(SemanticAdaptationGeneratorTest.xtend:135)


Results :

Tests in error: 
  SemanticAdaptationGeneratorTest.lazy_SA_parseNoExceptions:224->__generate:246 » Runtime
  SemanticAdaptationGeneratorTest.test_addInputPorts_sample1:59->__generate:246 » Runtime
  SemanticAdaptationGeneratorTest.window_SA_parseNoExceptions:216->__generate:246 » Runtime
  SemanticAdaptationGeneratorTest.test_createCoSimStepInstructions_sample2:157->__generate:246 » Runtime
  SemanticAdaptationGeneratorTest.test_createInternalBindingAssignments_sample2:164->__generate:246 » Runtime
  SemanticAdaptationGeneratorTest.test_removeOutBindings_sample1:142->__generate:246 » Runtime
  SemanticAdaptationGeneratorTest.test_ReplacePortRefs_windowsa:178->__generate:246 » Runtime
  SemanticAdaptationGeneratorTest.test_ReplacePortRefs_sample1:171->__generate:246 » Runtime
  SemanticAdaptationGeneratorTest.test_ReplacePortRefs_sample2:209->__generate:246 » Runtime
  SemanticAdaptationGeneratorTest.test_addInRules_External2Internal_Assignments_sample1:112->__generate:246 » Runtime
  SemanticAdaptationGeneratorTest.test_addExternal2InputPortStoredAssignments_sample1:94->__generate:246 » Runtime
  SemanticAdaptationGeneratorTest.test_addOutVars_sample1:87->__generate:246 » Runtime
  SemanticAdaptationGeneratorTest.test_addInVars_sample1:79->__generate:246 » Runtime
  SemanticAdaptationGeneratorTest.window_SA_parseNoExceptions2:220->__generate:246 » Runtime
  SemanticAdaptationGeneratorTest.test_inferTypesAndUnits_sample1:44->__generate:246 » Runtime
  SemanticAdaptationGeneratorTest.test_addInternal2OutputPortStoredAssignments_sample1:104->__generate:246 » Runtime
  SemanticAdaptationGeneratorTest.test_addOutParams_sample1:149->__generate:246 » Runtime
  SemanticAdaptationGeneratorTest.test_addParams_sample1:71->__generate:246 » Runtime
  SemanticAdaptationGeneratorTest.test_addOutRules_Internal2External_Assignments_sample1:125->__generate:246 » Runtime
  SemanticAdaptationGeneratorTest.test_removeInBindings_sample1:135->__generate:246 » Runtime

Tests run: 22, Failures: 0, Errors: 20, Skipped: 2

[INFO] ------------------------------------------------------------------------
[INFO] Reactor Summary:
[INFO] 
[INFO] Semantics Adaptation Root .......................... SUCCESS [  1.018 s]
[INFO] be.uantwerpen.ansymo.semanticadaptation Testframework SUCCESS [ 10.523 s]
[INFO] be.uantwerpen.ansymo.semanticadaptation Logger ..... SUCCESS [  1.295 s]
[INFO] be.uantwerpen.ansymo.semanticadaptation Language Core SUCCESS [ 27.527 s]
[INFO] be.uantwerpen.ansymo.semanticadaptation Canonical Generator SUCCESS [  3.675 s]
[INFO] be.uantwerpen.ansymo.semanticadaptation Code Generation to C++ SUCCESS [  4.300 s]
[INFO] be.uantwerpen.ansymo.semanticadaptation Code Generator SUCCESS [  1.064 s]
[INFO] be.uantwerpen.ansymo.semanticadaptation Language Tests SUCCESS [  9.964 s]
[INFO] be.uantwerpen.ansymo.semanticadaptation.ide ........ SUCCESS [  1.674 s]
[INFO] be.uantwerpen.ansymo.semanticadaptation.ui Language UI SUCCESS [  2.695 s]
[INFO] be.uantwerpen.ansymo.semanticadaptation Code Generation to C++ Tests SUCCESS [  8.527 s]
[INFO] be.uantwerpen.ansymo.semanticadaptation Code Generation to C++ Tests FAILURE [  9.720 s]
[INFO] Feature ............................................ SKIPPED
[INFO] be.uantwerpen.ansymo.semanticadaptation.ide.platform SKIPPED
[INFO] Core ............................................... SKIPPED
[INFO] Semantics Adaptation IDE Eclipse repository ........ SKIPPED
[INFO] SA IDE Standalone Product .......................... SKIPPED
[INFO] ------------------------------------------------------------------------
[INFO] BUILD FAILURE
[INFO] ------------------------------------------------------------------------
[INFO] Total time: 02:32 min
[INFO] Finished at: 2018-08-16T10:32:33+02:00
[INFO] Final Memory: 196M/873M
[INFO] ------------------------------------------------------------------------
[jenkins-maven-event-spy] INFO generated /var/lib/jenkins/workspace/HybridCosimulation_master-LDEVB56LP46DTRNYHQSCKMS3FR4JD6RBBK6S2LPONMGDZRBJQH3A@tmp/withMavend05bce59/maven-spy-20180816-103000-7582205899808991651304.log
[ERROR] Failed to execute goal org.eclipse.tycho:tycho-surefire-plugin:1.0.0:test (default-test) on project be.uantwerpen.ansymo.semanticadaptation.cg.canonical.tests: There are test failures.
[ERROR] 
[ERROR] Please refer to /var/lib/jenkins/workspace/HybridCosimulation_master-LDEVB56LP46DTRNYHQSCKMS3FR4JD6RBBK6S2LPONMGDZRBJQH3A/DSL_SemanticAdaptation/be.uantwerpen.ansymo.semanticadaptation.cg.canonical.tests/target/surefire-reports for the individual test results.
[ERROR] -> [Help 1]
[ERROR] 
[ERROR] To see the full stack trace of the errors, re-run Maven with the -e switch.
[ERROR] Re-run Maven using the -X switch to enable full debug logging.
[ERROR] 
[ERROR] For more information about the errors and possible solutions, please read the following articles:
[ERROR] [Help 1] http://cwiki.apache.org/confluence/display/MAVEN/MojoFailureException
[ERROR] 
[ERROR] After correcting the problems, you can resume the build with the command
[ERROR]   mvn <goals> -rf :be.uantwerpen.ansymo.semanticadaptation.cg.canonical.tests
[Pipeline] }
[withMaven] artifactsPublisher - Archive artifact DSL_SemanticAdaptation/pom.xml under be/uantwerpen/ansymo/semanticadaptation/parent/1.0.0-SNAPSHOT/parent-1.0.0-SNAPSHOT.pom
[withMaven] artifactsPublisher - Archive artifact DSL_SemanticAdaptation/be.uantwerpen.ansymo.semanticadaptation.testframework/pom.xml under be/uantwerpen/ansymo/semanticadaptation/be.uantwerpen.ansymo.semanticadaptation.testframework/1.0.0-SNAPSHOT/be.uantwerpen.ansymo.semanticadaptation.testframework-1.0.0-SNAPSHOT.pom
[withMaven] artifactsPublisher - Archive artifact DSL_SemanticAdaptation/be.uantwerpen.ansymo.semanticadaptation.testframework/target/be.uantwerpen.ansymo.semanticadaptation.testframework-1.0.0-SNAPSHOT.jar under be/uantwerpen/ansymo/semanticadaptation/be.uantwerpen.ansymo.semanticadaptation.testframework/1.0.0-SNAPSHOT/be.uantwerpen.ansymo.semanticadaptation.testframework-1.0.0-SNAPSHOT.jar
[withMaven] artifactsPublisher - Archive artifact DSL_SemanticAdaptation/be.uantwerpen.ansymo.semanticadaptation.log/pom.xml under be/uantwerpen/ansymo/semanticadaptation/be.uantwerpen.ansymo.semanticadaptation.log/1.0.0-SNAPSHOT/be.uantwerpen.ansymo.semanticadaptation.log-1.0.0-SNAPSHOT.pom
[withMaven] artifactsPublisher - Archive artifact DSL_SemanticAdaptation/be.uantwerpen.ansymo.semanticadaptation.log/target/be.uantwerpen.ansymo.semanticadaptation.log-1.0.0-SNAPSHOT.jar under be/uantwerpen/ansymo/semanticadaptation/be.uantwerpen.ansymo.semanticadaptation.log/1.0.0-SNAPSHOT/be.uantwerpen.ansymo.semanticadaptation.log-1.0.0-SNAPSHOT.jar
[withMaven] artifactsPublisher - Archive artifact DSL_SemanticAdaptation/be.uantwerpen.ansymo.semanticadaptation/pom.xml under be/uantwerpen/ansymo/semanticadaptation/be.uantwerpen.ansymo.semanticadaptation/1.0.0-SNAPSHOT/be.uantwerpen.ansymo.semanticadaptation-1.0.0-SNAPSHOT.pom
[withMaven] artifactsPublisher - Archive artifact DSL_SemanticAdaptation/be.uantwerpen.ansymo.semanticadaptation/target/be.uantwerpen.ansymo.semanticadaptation-1.0.0-SNAPSHOT.jar under be/uantwerpen/ansymo/semanticadaptation/be.uantwerpen.ansymo.semanticadaptation/1.0.0-SNAPSHOT/be.uantwerpen.ansymo.semanticadaptation-1.0.0-SNAPSHOT.jar
[withMaven] artifactsPublisher - Archive artifact DSL_SemanticAdaptation/be.uantwerpen.ansymo.semanticadaptation.cg.canonical/pom.xml under be/uantwerpen/ansymo/semanticadaptation/be.uantwerpen.ansymo.semanticadaptation.cg.canonical/1.0.0-SNAPSHOT/be.uantwerpen.ansymo.semanticadaptation.cg.canonical-1.0.0-SNAPSHOT.pom
[withMaven] artifactsPublisher - Archive artifact DSL_SemanticAdaptation/be.uantwerpen.ansymo.semanticadaptation.cg.canonical/target/be.uantwerpen.ansymo.semanticadaptation.cg.canonical-1.0.0-SNAPSHOT.jar under be/uantwerpen/ansymo/semanticadaptation/be.uantwerpen.ansymo.semanticadaptation.cg.canonical/1.0.0-SNAPSHOT/be.uantwerpen.ansymo.semanticadaptation.cg.canonical-1.0.0-SNAPSHOT.jar
[withMaven] artifactsPublisher - Archive artifact DSL_SemanticAdaptation/be.uantwerpen.ansymo.semanticadaptation.cg.cpp/pom.xml under be/uantwerpen/ansymo/semanticadaptation/be.uantwerpen.ansymo.semanticadaptation.cg.cpp/1.0.0-SNAPSHOT/be.uantwerpen.ansymo.semanticadaptation.cg.cpp-1.0.0-SNAPSHOT.pom
[withMaven] artifactsPublisher - Archive artifact DSL_SemanticAdaptation/be.uantwerpen.ansymo.semanticadaptation.cg.cpp/target/be.uantwerpen.ansymo.semanticadaptation.cg.cpp-1.0.0-SNAPSHOT.jar under be/uantwerpen/ansymo/semanticadaptation/be.uantwerpen.ansymo.semanticadaptation.cg.cpp/1.0.0-SNAPSHOT/be.uantwerpen.ansymo.semanticadaptation.cg.cpp-1.0.0-SNAPSHOT.jar
[withMaven] artifactsPublisher - Archive artifact DSL_SemanticAdaptation/be.uantwerpen.ansymo.semanticadaptation.cg.chain/pom.xml under be/uantwerpen/ansymo/semanticadaptation/be.uantwerpen.ansymo.semanticadaptation.cg.chain/1.0.0-SNAPSHOT/be.uantwerpen.ansymo.semanticadaptation.cg.chain-1.0.0-SNAPSHOT.pom
[withMaven] artifactsPublisher - Archive artifact DSL_SemanticAdaptation/be.uantwerpen.ansymo.semanticadaptation.cg.chain/target/be.uantwerpen.ansymo.semanticadaptation.cg.chain-1.0.0-SNAPSHOT.jar under be/uantwerpen/ansymo/semanticadaptation/be.uantwerpen.ansymo.semanticadaptation.cg.chain/1.0.0-SNAPSHOT/be.uantwerpen.ansymo.semanticadaptation.cg.chain-1.0.0-SNAPSHOT.jar
[withMaven] artifactsPublisher - Archive artifact DSL_SemanticAdaptation/be.uantwerpen.ansymo.semanticadaptation.tests/pom.xml under be/uantwerpen/ansymo/semanticadaptation/be.uantwerpen.ansymo.semanticadaptation.tests/1.0.0-SNAPSHOT/be.uantwerpen.ansymo.semanticadaptation.tests-1.0.0-SNAPSHOT.pom
[withMaven] artifactsPublisher - Archive artifact DSL_SemanticAdaptation/be.uantwerpen.ansymo.semanticadaptation.tests/target/be.uantwerpen.ansymo.semanticadaptation.tests-1.0.0-SNAPSHOT.jar under be/uantwerpen/ansymo/semanticadaptation/be.uantwerpen.ansymo.semanticadaptation.tests/1.0.0-SNAPSHOT/be.uantwerpen.ansymo.semanticadaptation.tests-1.0.0-SNAPSHOT.jar
[withMaven] artifactsPublisher - Archive artifact DSL_SemanticAdaptation/be.uantwerpen.ansymo.semanticadaptation.ide/pom.xml under be/uantwerpen/ansymo/semanticadaptation/be.uantwerpen.ansymo.semanticadaptation.ide/1.0.0-SNAPSHOT/be.uantwerpen.ansymo.semanticadaptation.ide-1.0.0-SNAPSHOT.pom
[withMaven] artifactsPublisher - Archive artifact DSL_SemanticAdaptation/be.uantwerpen.ansymo.semanticadaptation.ide/target/be.uantwerpen.ansymo.semanticadaptation.ide-1.0.0-SNAPSHOT.jar under be/uantwerpen/ansymo/semanticadaptation/be.uantwerpen.ansymo.semanticadaptation.ide/1.0.0-SNAPSHOT/be.uantwerpen.ansymo.semanticadaptation.ide-1.0.0-SNAPSHOT.jar
[withMaven] artifactsPublisher - Archive artifact DSL_SemanticAdaptation/be.uantwerpen.ansymo.semanticadaptation.ui/pom.xml under be/uantwerpen/ansymo/semanticadaptation/be.uantwerpen.ansymo.semanticadaptation.ui/1.0.0-SNAPSHOT/be.uantwerpen.ansymo.semanticadaptation.ui-1.0.0-SNAPSHOT.pom
[withMaven] artifactsPublisher - Archive artifact DSL_SemanticAdaptation/be.uantwerpen.ansymo.semanticadaptation.ui/target/be.uantwerpen.ansymo.semanticadaptation.ui-1.0.0-SNAPSHOT.jar under be/uantwerpen/ansymo/semanticadaptation/be.uantwerpen.ansymo.semanticadaptation.ui/1.0.0-SNAPSHOT/be.uantwerpen.ansymo.semanticadaptation.ui-1.0.0-SNAPSHOT.jar
[withMaven] artifactsPublisher - Archive artifact DSL_SemanticAdaptation/be.uantwerpen.ansymo.semanticadaptation.cg.cpp.tests/pom.xml under be/uantwerpen/ansymo/semanticadaptation/be.uantwerpen.ansymo.semanticadaptation.cg.cpp.tests/1.0.0-SNAPSHOT/be.uantwerpen.ansymo.semanticadaptation.cg.cpp.tests-1.0.0-SNAPSHOT.pom
[withMaven] artifactsPublisher - Archive artifact DSL_SemanticAdaptation/be.uantwerpen.ansymo.semanticadaptation.cg.cpp.tests/target/be.uantwerpen.ansymo.semanticadaptation.cg.cpp.tests-1.0.0-SNAPSHOT.jar under be/uantwerpen/ansymo/semanticadaptation/be.uantwerpen.ansymo.semanticadaptation.cg.cpp.tests/1.0.0-SNAPSHOT/be.uantwerpen.ansymo.semanticadaptation.cg.cpp.tests-1.0.0-SNAPSHOT.jar
[withMaven] artifactsPublisher - Archive artifact DSL_SemanticAdaptation/be.uantwerpen.ansymo.semanticadaptation.testframework/target/p2content.xml under be/uantwerpen/ansymo/semanticadaptation/be.uantwerpen.ansymo.semanticadaptation.testframework/1.0.0-SNAPSHOT/be.uantwerpen.ansymo.semanticadaptation.testframework-1.0.0-SNAPSHOT-p2metadata.xml
[withMaven] artifactsPublisher - Archive artifact DSL_SemanticAdaptation/be.uantwerpen.ansymo.semanticadaptation.testframework/target/p2artifacts.xml under be/uantwerpen/ansymo/semanticadaptation/be.uantwerpen.ansymo.semanticadaptation.testframework/1.0.0-SNAPSHOT/be.uantwerpen.ansymo.semanticadaptation.testframework-1.0.0-SNAPSHOT-p2artifacts.xml
[withMaven] artifactsPublisher - Archive artifact DSL_SemanticAdaptation/be.uantwerpen.ansymo.semanticadaptation.log/target/p2content.xml under be/uantwerpen/ansymo/semanticadaptation/be.uantwerpen.ansymo.semanticadaptation.log/1.0.0-SNAPSHOT/be.uantwerpen.ansymo.semanticadaptation.log-1.0.0-SNAPSHOT-p2metadata.xml
[withMaven] artifactsPublisher - Archive artifact DSL_SemanticAdaptation/be.uantwerpen.ansymo.semanticadaptation.log/target/p2artifacts.xml under be/uantwerpen/ansymo/semanticadaptation/be.uantwerpen.ansymo.semanticadaptation.log/1.0.0-SNAPSHOT/be.uantwerpen.ansymo.semanticadaptation.log-1.0.0-SNAPSHOT-p2artifacts.xml
[withMaven] artifactsPublisher - Archive artifact DSL_SemanticAdaptation/be.uantwerpen.ansymo.semanticadaptation/target/p2content.xml under be/uantwerpen/ansymo/semanticadaptation/be.uantwerpen.ansymo.semanticadaptation/1.0.0-SNAPSHOT/be.uantwerpen.ansymo.semanticadaptation-1.0.0-SNAPSHOT-p2metadata.xml
[withMaven] artifactsPublisher - Archive artifact DSL_SemanticAdaptation/be.uantwerpen.ansymo.semanticadaptation/target/p2artifacts.xml under be/uantwerpen/ansymo/semanticadaptation/be.uantwerpen.ansymo.semanticadaptation/1.0.0-SNAPSHOT/be.uantwerpen.ansymo.semanticadaptation-1.0.0-SNAPSHOT-p2artifacts.xml
[withMaven] artifactsPublisher - Archive artifact DSL_SemanticAdaptation/be.uantwerpen.ansymo.semanticadaptation.cg.canonical/target/p2content.xml under be/uantwerpen/ansymo/semanticadaptation/be.uantwerpen.ansymo.semanticadaptation.cg.canonical/1.0.0-SNAPSHOT/be.uantwerpen.ansymo.semanticadaptation.cg.canonical-1.0.0-SNAPSHOT-p2metadata.xml
[withMaven] artifactsPublisher - Archive artifact DSL_SemanticAdaptation/be.uantwerpen.ansymo.semanticadaptation.cg.canonical/target/p2artifacts.xml under be/uantwerpen/ansymo/semanticadaptation/be.uantwerpen.ansymo.semanticadaptation.cg.canonical/1.0.0-SNAPSHOT/be.uantwerpen.ansymo.semanticadaptation.cg.canonical-1.0.0-SNAPSHOT-p2artifacts.xml
[withMaven] artifactsPublisher - Archive artifact DSL_SemanticAdaptation/be.uantwerpen.ansymo.semanticadaptation.cg.cpp/target/p2content.xml under be/uantwerpen/ansymo/semanticadaptation/be.uantwerpen.ansymo.semanticadaptation.cg.cpp/1.0.0-SNAPSHOT/be.uantwerpen.ansymo.semanticadaptation.cg.cpp-1.0.0-SNAPSHOT-p2metadata.xml
[withMaven] artifactsPublisher - Archive artifact DSL_SemanticAdaptation/be.uantwerpen.ansymo.semanticadaptation.cg.cpp/target/p2artifacts.xml under be/uantwerpen/ansymo/semanticadaptation/be.uantwerpen.ansymo.semanticadaptation.cg.cpp/1.0.0-SNAPSHOT/be.uantwerpen.ansymo.semanticadaptation.cg.cpp-1.0.0-SNAPSHOT-p2artifacts.xml
[withMaven] artifactsPublisher - Archive artifact DSL_SemanticAdaptation/be.uantwerpen.ansymo.semanticadaptation.cg.chain/target/p2content.xml under be/uantwerpen/ansymo/semanticadaptation/be.uantwerpen.ansymo.semanticadaptation.cg.chain/1.0.0-SNAPSHOT/be.uantwerpen.ansymo.semanticadaptation.cg.chain-1.0.0-SNAPSHOT-p2metadata.xml
[withMaven] artifactsPublisher - Archive artifact DSL_SemanticAdaptation/be.uantwerpen.ansymo.semanticadaptation.cg.chain/target/p2artifacts.xml under be/uantwerpen/ansymo/semanticadaptation/be.uantwerpen.ansymo.semanticadaptation.cg.chain/1.0.0-SNAPSHOT/be.uantwerpen.ansymo.semanticadaptation.cg.chain-1.0.0-SNAPSHOT-p2artifacts.xml
[withMaven] artifactsPublisher - Archive artifact DSL_SemanticAdaptation/be.uantwerpen.ansymo.semanticadaptation.tests/target/p2content.xml under be/uantwerpen/ansymo/semanticadaptation/be.uantwerpen.ansymo.semanticadaptation.tests/1.0.0-SNAPSHOT/be.uantwerpen.ansymo.semanticadaptation.tests-1.0.0-SNAPSHOT-p2metadata.xml
[withMaven] artifactsPublisher - Archive artifact DSL_SemanticAdaptation/be.uantwerpen.ansymo.semanticadaptation.tests/target/p2artifacts.xml under be/uantwerpen/ansymo/semanticadaptation/be.uantwerpen.ansymo.semanticadaptation.tests/1.0.0-SNAPSHOT/be.uantwerpen.ansymo.semanticadaptation.tests-1.0.0-SNAPSHOT-p2artifacts.xml
[withMaven] artifactsPublisher - Archive artifact DSL_SemanticAdaptation/be.uantwerpen.ansymo.semanticadaptation.ide/target/p2content.xml under be/uantwerpen/ansymo/semanticadaptation/be.uantwerpen.ansymo.semanticadaptation.ide/1.0.0-SNAPSHOT/be.uantwerpen.ansymo.semanticadaptation.ide-1.0.0-SNAPSHOT-p2metadata.xml
[withMaven] artifactsPublisher - Archive artifact DSL_SemanticAdaptation/be.uantwerpen.ansymo.semanticadaptation.ide/target/p2artifacts.xml under be/uantwerpen/ansymo/semanticadaptation/be.uantwerpen.ansymo.semanticadaptation.ide/1.0.0-SNAPSHOT/be.uantwerpen.ansymo.semanticadaptation.ide-1.0.0-SNAPSHOT-p2artifacts.xml
[withMaven] artifactsPublisher - Archive artifact DSL_SemanticAdaptation/be.uantwerpen.ansymo.semanticadaptation.ui/target/p2content.xml under be/uantwerpen/ansymo/semanticadaptation/be.uantwerpen.ansymo.semanticadaptation.ui/1.0.0-SNAPSHOT/be.uantwerpen.ansymo.semanticadaptation.ui-1.0.0-SNAPSHOT-p2metadata.xml
[withMaven] artifactsPublisher - Archive artifact DSL_SemanticAdaptation/be.uantwerpen.ansymo.semanticadaptation.ui/target/p2artifacts.xml under be/uantwerpen/ansymo/semanticadaptation/be.uantwerpen.ansymo.semanticadaptation.ui/1.0.0-SNAPSHOT/be.uantwerpen.ansymo.semanticadaptation.ui-1.0.0-SNAPSHOT-p2artifacts.xml
[withMaven] artifactsPublisher - Archive artifact DSL_SemanticAdaptation/be.uantwerpen.ansymo.semanticadaptation.cg.cpp.tests/target/p2content.xml under be/uantwerpen/ansymo/semanticadaptation/be.uantwerpen.ansymo.semanticadaptation.cg.cpp.tests/1.0.0-SNAPSHOT/be.uantwerpen.ansymo.semanticadaptation.cg.cpp.tests-1.0.0-SNAPSHOT-p2metadata.xml
[withMaven] artifactsPublisher - Archive artifact DSL_SemanticAdaptation/be.uantwerpen.ansymo.semanticadaptation.cg.cpp.tests/target/p2artifacts.xml under be/uantwerpen/ansymo/semanticadaptation/be.uantwerpen.ansymo.semanticadaptation.cg.cpp.tests/1.0.0-SNAPSHOT/be.uantwerpen.ansymo.semanticadaptation.cg.cpp.tests-1.0.0-SNAPSHOT-p2artifacts.xml
[TASKS] Scanning folder '/var/lib/jenkins/workspace/HybridCosimulation_master-LDEVB56LP46DTRNYHQSCKMS3FR4JD6RBBK6S2LPONMGDZRBJQH3A' for files matching the pattern '**/*.java' - excludes: null
[TASKS] Found 431 files to scan for tasks
[TASKS] Found 27 open tasks.
Skipping warnings blame since pipelines do not have an SCM link.%n
[TASKS] Computing warning deltas based on reference build #159
[Pipeline] // withMaven
[Pipeline] }
[Pipeline] // stage
[Pipeline] stage
[Pipeline] { (Reporting)
[Pipeline] emailextrecipients
Not sending mail to user cla.gms@gmail.com with no permission to view HybridCosimulation » master #162[Pipeline] emailext
An attempt to send an e-mail to empty list of recipients, ignored.
[Pipeline] }
[Pipeline] // stage
[Pipeline] }
[Pipeline] // node
[Pipeline] End of Pipeline
ERROR: script returned exit code 1
Finished: FAILURE