FailedConsole Output

Skipping 780 KB.. Full Log
top, driver_up, driver_down, driver_stop, u, d, obj_detected, passenger_up, passenger_down, passenger_stop, driver_up, driver_down, driver_stop, up, down, stop, RTOL, ATOL, T, INIT_V, c, p_v, step_size, aux_obj_detected, crossedTooFar, negative_value, positive_value, f_v] -> NULLSCOPE
2018-09-11 10:54:39,286 [DEBUG] after getLinkedObjects: node: 'ATOL' result: ATOL
2018-09-11 10:54:39,287 [DEBUG] before getLinkedObjects: node: 'f_v'
2018-09-11 10:54:39,287 [INFO]     >Getting scope for ref within context class be.uantwerpen.ansymo.semanticadaptation.semanticAdaptation.impl.VariableImpl
2018-09-11 10:54:39,287 [INFO]     <Scope found:SimpleScope[armature_current, passenger_up, passenger_down, passenger_stop, driver_up, driver_down, driver_stop, u, d, obj_detected, passenger_up, passenger_down, passenger_stop, driver_up, driver_down, driver_stop, up, down, stop, RTOL, ATOL, T, INIT_V, c, p_v, step_size, aux_obj_detected, crossedTooFar, negative_value, positive_value, f_v] -> NULLSCOPE
2018-09-11 10:54:39,287 [DEBUG] after getLinkedObjects: node: 'f_v' result: f_v
2018-09-11 10:54:39,287 [DEBUG] before getLinkedObjects: node: 'T'
2018-09-11 10:54:39,287 [INFO]     >Getting scope for ref within context class be.uantwerpen.ansymo.semanticadaptation.semanticAdaptation.impl.VariableImpl
2018-09-11 10:54:39,287 [INFO]     <Scope found:SimpleScope[armature_current, passenger_up, passenger_down, passenger_stop, driver_up, driver_down, driver_stop, u, d, obj_detected, passenger_up, passenger_down, passenger_stop, driver_up, driver_down, driver_stop, up, down, stop, RTOL, ATOL, T, INIT_V, c, p_v, step_size, aux_obj_detected, crossedTooFar, negative_value, positive_value, f_v] -> NULLSCOPE
2018-09-11 10:54:39,287 [DEBUG] after getLinkedObjects: node: 'T' result: T
2018-09-11 10:54:39,287 [DEBUG] before getLinkedObjects: node: 'crossedTooFar'
2018-09-11 10:54:39,287 [INFO]     >Getting scope for ref within context class be.uantwerpen.ansymo.semanticadaptation.semanticAdaptation.impl.VariableImpl
2018-09-11 10:54:39,287 [INFO]     <Scope found:SimpleScope[armature_current, passenger_up, passenger_down, passenger_stop, driver_up, driver_down, driver_stop, u, d, obj_detected, passenger_up, passenger_down, passenger_stop, driver_up, driver_down, driver_stop, up, down, stop, RTOL, ATOL, T, INIT_V, c, p_v, step_size, aux_obj_detected, crossedTooFar, negative_value, positive_value, f_v] -> NULLSCOPE
2018-09-11 10:54:39,288 [DEBUG] after getLinkedObjects: node: 'crossedTooFar' result: crossedTooFar
2018-09-11 10:54:39,288 [DEBUG] before getLinkedObjects: node: 'p_v'
2018-09-11 10:54:39,288 [INFO]     >Getting scope for ref within context class be.uantwerpen.ansymo.semanticadaptation.semanticAdaptation.impl.VariableImpl
2018-09-11 10:54:39,288 [INFO]     <Scope found:SimpleScope[armature_current, passenger_up, passenger_down, passenger_stop, driver_up, driver_down, driver_stop, u, d, obj_detected, passenger_up, passenger_down, passenger_stop, driver_up, driver_down, driver_stop, up, down, stop, RTOL, ATOL, T, INIT_V, c, p_v, step_size, aux_obj_detected, crossedTooFar, negative_value, positive_value, f_v] -> NULLSCOPE
2018-09-11 10:54:39,288 [DEBUG] after getLinkedObjects: node: 'p_v' result: p_v
2018-09-11 10:54:39,288 [DEBUG] before getLinkedObjects: node: 'T'
2018-09-11 10:54:39,288 [INFO]     >Getting scope for ref within context class be.uantwerpen.ansymo.semanticadaptation.semanticAdaptation.impl.VariableImpl
2018-09-11 10:54:39,288 [INFO]     <Scope found:SimpleScope[armature_current, passenger_up, passenger_down, passenger_stop, driver_up, driver_down, driver_stop, u, d, obj_detected, passenger_up, passenger_down, passenger_stop, driver_up, driver_down, driver_stop, up, down, stop, RTOL, ATOL, T, INIT_V, c, p_v, step_size, aux_obj_detected, crossedTooFar, negative_value, positive_value, f_v] -> NULLSCOPE
2018-09-11 10:54:39,288 [DEBUG] after getLinkedObjects: node: 'T' result: T
2018-09-11 10:54:39,288 [DEBUG] before getLinkedObjects: node: 'f_v'
2018-09-11 10:54:39,288 [INFO]     >Getting scope for ref within context class be.uantwerpen.ansymo.semanticadaptation.semanticAdaptation.impl.VariableImpl
2018-09-11 10:54:39,289 [INFO]     <Scope found:SimpleScope[armature_current, passenger_up, passenger_down, passenger_stop, driver_up, driver_down, driver_stop, u, d, obj_detected, passenger_up, passenger_down, passenger_stop, driver_up, driver_down, driver_stop, up, down, stop, RTOL, ATOL, T, INIT_V, c, p_v, step_size, aux_obj_detected, crossedTooFar, negative_value, positive_value, f_v] -> NULLSCOPE
2018-09-11 10:54:39,289 [DEBUG] after getLinkedObjects: node: 'f_v' result: f_v
2018-09-11 10:54:39,289 [DEBUG] before getLinkedObjects: node: 'T'
2018-09-11 10:54:39,289 [INFO]     >Getting scope for ref within context class be.uantwerpen.ansymo.semanticadaptation.semanticAdaptation.impl.VariableImpl
2018-09-11 10:54:39,289 [INFO]     <Scope found:SimpleScope[armature_current, passenger_up, passenger_down, passenger_stop, driver_up, driver_down, driver_stop, u, d, obj_detected, passenger_up, passenger_down, passenger_stop, driver_up, driver_down, driver_stop, up, down, stop, RTOL, ATOL, T, INIT_V, c, p_v, step_size, aux_obj_detected, crossedTooFar, negative_value, positive_value, f_v] -> NULLSCOPE
2018-09-11 10:54:39,289 [DEBUG] after getLinkedObjects: node: 'T' result: T
2018-09-11 10:54:39,289 [DEBUG] before getLinkedObjects: node: 'step_size'
2018-09-11 10:54:39,289 [INFO]     >Getting scope for ref within context class be.uantwerpen.ansymo.semanticadaptation.semanticAdaptation.impl.VariableImpl
2018-09-11 10:54:39,289 [INFO]     <Scope found:SimpleScope[armature_current, passenger_up, passenger_down, passenger_stop, driver_up, driver_down, driver_stop, u, d, obj_detected, passenger_up, passenger_down, passenger_stop, driver_up, driver_down, driver_stop, up, down, stop, RTOL, ATOL, T, INIT_V, c, p_v, step_size, aux_obj_detected, crossedTooFar, negative_value, positive_value, f_v] -> NULLSCOPE
2018-09-11 10:54:39,289 [DEBUG] after getLinkedObjects: node: 'step_size' result: step_size
2018-09-11 10:54:39,289 [DEBUG] before getLinkedObjects: node: 'negative_value'
2018-09-11 10:54:39,290 [INFO]     >Getting scope for ref within context class be.uantwerpen.ansymo.semanticadaptation.semanticAdaptation.impl.VariableImpl
2018-09-11 10:54:39,290 [INFO]     <Scope found:SimpleScope[armature_current, passenger_up, passenger_down, passenger_stop, driver_up, driver_down, driver_stop, u, d, obj_detected, passenger_up, passenger_down, passenger_stop, driver_up, driver_down, driver_stop, up, down, stop, RTOL, ATOL, T, INIT_V, c, p_v, step_size, aux_obj_detected, crossedTooFar, negative_value, positive_value, f_v] -> NULLSCOPE
2018-09-11 10:54:39,290 [DEBUG] after getLinkedObjects: node: 'negative_value' result: negative_value
2018-09-11 10:54:39,290 [DEBUG] before getLinkedObjects: node: 'positive_value'
2018-09-11 10:54:39,290 [INFO]     >Getting scope for ref within context class be.uantwerpen.ansymo.semanticadaptation.semanticAdaptation.impl.VariableImpl
2018-09-11 10:54:39,290 [INFO]     <Scope found:SimpleScope[armature_current, passenger_up, passenger_down, passenger_stop, driver_up, driver_down, driver_stop, u, d, obj_detected, passenger_up, passenger_down, passenger_stop, driver_up, driver_down, driver_stop, up, down, stop, RTOL, ATOL, T, INIT_V, c, p_v, step_size, aux_obj_detected, crossedTooFar, negative_value, positive_value, f_v] -> NULLSCOPE
2018-09-11 10:54:39,290 [DEBUG] after getLinkedObjects: node: 'positive_value' result: positive_value
2018-09-11 10:54:39,290 [DEBUG] before getLinkedObjects: node: 'negative_value'
2018-09-11 10:54:39,290 [INFO]     >Getting scope for ref within context class be.uantwerpen.ansymo.semanticadaptation.semanticAdaptation.impl.VariableImpl
2018-09-11 10:54:39,290 [INFO]     <Scope found:SimpleScope[armature_current, passenger_up, passenger_down, passenger_stop, driver_up, driver_down, driver_stop, u, d, obj_detected, passenger_up, passenger_down, passenger_stop, driver_up, driver_down, driver_stop, up, down, stop, RTOL, ATOL, T, INIT_V, c, p_v, step_size, aux_obj_detected, crossedTooFar, negative_value, positive_value, f_v] -> NULLSCOPE
2018-09-11 10:54:39,291 [DEBUG] after getLinkedObjects: node: 'negative_value' result: negative_value
2018-09-11 10:54:39,291 [DEBUG] before getLinkedObjects: node: 'p_v'
2018-09-11 10:54:39,291 [INFO]     >Getting scope for ref within context class be.uantwerpen.ansymo.semanticadaptation.semanticAdaptation.impl.VariableImpl
2018-09-11 10:54:39,291 [INFO]     <Scope found:SimpleScope[armature_current, passenger_up, passenger_down, passenger_stop, driver_up, driver_down, driver_stop, u, d, obj_detected, passenger_up, passenger_down, passenger_stop, driver_up, driver_down, driver_stop, up, down, stop, RTOL, ATOL, T, INIT_V, c, p_v, step_size, aux_obj_detected, crossedTooFar, negative_value, positive_value, f_v] -> NULLSCOPE
2018-09-11 10:54:39,291 [DEBUG] after getLinkedObjects: node: 'p_v' result: p_v
2018-09-11 10:54:39,291 [DEBUG] before getLinkedObjects: node: 'T'
2018-09-11 10:54:39,291 [INFO]     >Getting scope for ref within context class be.uantwerpen.ansymo.semanticadaptation.semanticAdaptation.impl.VariableImpl
2018-09-11 10:54:39,291 [INFO]     <Scope found:SimpleScope[armature_current, passenger_up, passenger_down, passenger_stop, driver_up, driver_down, driver_stop, u, d, obj_detected, passenger_up, passenger_down, passenger_stop, driver_up, driver_down, driver_stop, up, down, stop, RTOL, ATOL, T, INIT_V, c, p_v, step_size, aux_obj_detected, crossedTooFar, negative_value, positive_value, f_v] -> NULLSCOPE
2018-09-11 10:54:39,291 [DEBUG] after getLinkedObjects: node: 'T' result: T
2018-09-11 10:54:39,291 [DEBUG] before getLinkedObjects: node: 'RTOL'
2018-09-11 10:54:39,291 [INFO]     >Getting scope for ref within context class be.uantwerpen.ansymo.semanticadaptation.semanticAdaptation.impl.VariableImpl
2018-09-11 10:54:39,292 [INFO]     <Scope found:SimpleScope[armature_current, passenger_up, passenger_down, passenger_stop, driver_up, driver_down, driver_stop, u, d, obj_detected, passenger_up, passenger_down, passenger_stop, driver_up, driver_down, driver_stop, up, down, stop, RTOL, ATOL, T, INIT_V, c, p_v, step_size, aux_obj_detected, crossedTooFar, negative_value, positive_value, f_v] -> NULLSCOPE
2018-09-11 10:54:39,292 [DEBUG] after getLinkedObjects: node: 'RTOL' result: RTOL
2018-09-11 10:54:39,292 [DEBUG] before getLinkedObjects: node: 'ATOL'
2018-09-11 10:54:39,292 [INFO]     >Getting scope for ref within context class be.uantwerpen.ansymo.semanticadaptation.semanticAdaptation.impl.VariableImpl
2018-09-11 10:54:39,292 [INFO]     <Scope found:SimpleScope[armature_current, passenger_up, passenger_down, passenger_stop, driver_up, driver_down, driver_stop, u, d, obj_detected, passenger_up, passenger_down, passenger_stop, driver_up, driver_down, driver_stop, up, down, stop, RTOL, ATOL, T, INIT_V, c, p_v, step_size, aux_obj_detected, crossedTooFar, negative_value, positive_value, f_v] -> NULLSCOPE
2018-09-11 10:54:39,292 [DEBUG] after getLinkedObjects: node: 'ATOL' result: ATOL
2018-09-11 10:54:39,292 [DEBUG] before getLinkedObjects: node: 'p_v'
2018-09-11 10:54:39,292 [INFO]     >Getting scope for ref within context class be.uantwerpen.ansymo.semanticadaptation.semanticAdaptation.impl.VariableImpl
2018-09-11 10:54:39,292 [INFO]     <Scope found:SimpleScope[armature_current, passenger_up, passenger_down, passenger_stop, driver_up, driver_down, driver_stop, u, d, obj_detected, passenger_up, passenger_down, passenger_stop, driver_up, driver_down, driver_stop, up, down, stop, RTOL, ATOL, T, INIT_V, c, p_v, step_size, aux_obj_detected, crossedTooFar, negative_value, positive_value, f_v] -> NULLSCOPE
2018-09-11 10:54:39,292 [DEBUG] after getLinkedObjects: node: 'p_v' result: p_v
2018-09-11 10:54:39,292 [DEBUG] before getLinkedObjects: node: 'T'
2018-09-11 10:54:39,292 [INFO]     >Getting scope for ref within context class be.uantwerpen.ansymo.semanticadaptation.semanticAdaptation.impl.VariableImpl
2018-09-11 10:54:39,293 [INFO]     <Scope found:SimpleScope[armature_current, passenger_up, passenger_down, passenger_stop, driver_up, driver_down, driver_stop, u, d, obj_detected, passenger_up, passenger_down, passenger_stop, driver_up, driver_down, driver_stop, up, down, stop, RTOL, ATOL, T, INIT_V, c, p_v, step_size, aux_obj_detected, crossedTooFar, negative_value, positive_value, f_v] -> NULLSCOPE
2018-09-11 10:54:39,293 [DEBUG] after getLinkedObjects: node: 'T' result: T
2018-09-11 10:54:39,293 [DEBUG] before getLinkedObjects: node: 'f_v'
2018-09-11 10:54:39,293 [INFO]     >Getting scope for ref within context class be.uantwerpen.ansymo.semanticadaptation.semanticAdaptation.impl.VariableImpl
2018-09-11 10:54:39,293 [INFO]     <Scope found:SimpleScope[armature_current, passenger_up, passenger_down, passenger_stop, driver_up, driver_down, driver_stop, u, d, obj_detected, passenger_up, passenger_down, passenger_stop, driver_up, driver_down, driver_stop, up, down, stop, RTOL, ATOL, T, INIT_V, c, p_v, step_size, aux_obj_detected, crossedTooFar, negative_value, positive_value, f_v] -> NULLSCOPE
2018-09-11 10:54:39,293 [DEBUG] after getLinkedObjects: node: 'f_v' result: f_v
2018-09-11 10:54:39,293 [DEBUG] before getLinkedObjects: node: 'T'
2018-09-11 10:54:39,293 [INFO]     >Getting scope for ref within context class be.uantwerpen.ansymo.semanticadaptation.semanticAdaptation.impl.VariableImpl
2018-09-11 10:54:39,293 [INFO]     <Scope found:SimpleScope[armature_current, passenger_up, passenger_down, passenger_stop, driver_up, driver_down, driver_stop, u, d, obj_detected, passenger_up, passenger_down, passenger_stop, driver_up, driver_down, driver_stop, up, down, stop, RTOL, ATOL, T, INIT_V, c, p_v, step_size, aux_obj_detected, crossedTooFar, negative_value, positive_value, f_v] -> NULLSCOPE
2018-09-11 10:54:39,293 [DEBUG] after getLinkedObjects: node: 'T' result: T
2018-09-11 10:54:39,293 [DEBUG] before getLinkedObjects: node: 'RTOL'
2018-09-11 10:54:39,293 [INFO]     >Getting scope for ref within context class be.uantwerpen.ansymo.semanticadaptation.semanticAdaptation.impl.VariableImpl
2018-09-11 10:54:39,294 [INFO]     <Scope found:SimpleScope[armature_current, passenger_up, passenger_down, passenger_stop, driver_up, driver_down, driver_stop, u, d, obj_detected, passenger_up, passenger_down, passenger_stop, driver_up, driver_down, driver_stop, up, down, stop, RTOL, ATOL, T, INIT_V, c, p_v, step_size, aux_obj_detected, crossedTooFar, negative_value, positive_value, f_v] -> NULLSCOPE
2018-09-11 10:54:39,294 [DEBUG] after getLinkedObjects: node: 'RTOL' result: RTOL
2018-09-11 10:54:39,294 [DEBUG] before getLinkedObjects: node: 'ATOL'
2018-09-11 10:54:39,294 [INFO]     >Getting scope for ref within context class be.uantwerpen.ansymo.semanticadaptation.semanticAdaptation.impl.VariableImpl
2018-09-11 10:54:39,294 [INFO]     <Scope found:SimpleScope[armature_current, passenger_up, passenger_down, passenger_stop, driver_up, driver_down, driver_stop, u, d, obj_detected, passenger_up, passenger_down, passenger_stop, driver_up, driver_down, driver_stop, up, down, stop, RTOL, ATOL, T, INIT_V, c, p_v, step_size, aux_obj_detected, crossedTooFar, negative_value, positive_value, f_v] -> NULLSCOPE
2018-09-11 10:54:39,294 [DEBUG] after getLinkedObjects: node: 'ATOL' result: ATOL
2018-09-11 10:54:39,294 [DEBUG] before getLinkedObjects: node: 'c'
2018-09-11 10:54:39,294 [INFO]     >Getting scope for ref within context class be.uantwerpen.ansymo.semanticadaptation.semanticAdaptation.impl.VariableImpl
2018-09-11 10:54:39,294 [INFO]     <Scope found:SimpleScope[armature_current, passenger_up, passenger_down, passenger_stop, driver_up, driver_down, driver_stop, u, d, obj_detected, passenger_up, passenger_down, passenger_stop, driver_up, driver_down, driver_stop, up, down, stop, RTOL, ATOL, T, INIT_V, c, p_v, step_size, aux_obj_detected, crossedTooFar, negative_value, positive_value, f_v] -> NULLSCOPE
2018-09-11 10:54:39,294 [DEBUG] after getLinkedObjects: node: 'c' result: c
2018-09-11 10:54:39,294 [DEBUG] before getLinkedObjects: node: 'crossedTooFar'
2018-09-11 10:54:39,295 [INFO]     >Getting scope for ref within context class be.uantwerpen.ansymo.semanticadaptation.semanticAdaptation.impl.VariableImpl
2018-09-11 10:54:39,295 [INFO]     <Scope found:SimpleScope[armature_current, passenger_up, passenger_down, passenger_stop, driver_up, driver_down, driver_stop, u, d, obj_detected, passenger_up, passenger_down, passenger_stop, driver_up, driver_down, driver_stop, up, down, stop, RTOL, ATOL, T, INIT_V, c, p_v, step_size, aux_obj_detected, crossedTooFar, negative_value, positive_value, f_v] -> NULLSCOPE
2018-09-11 10:54:39,295 [DEBUG] after getLinkedObjects: node: 'crossedTooFar' result: crossedTooFar
2018-09-11 10:54:39,295 [DEBUG] before getLinkedObjects: node: 'step_size'
2018-09-11 10:54:39,295 [INFO]     >Getting scope for ref within context class be.uantwerpen.ansymo.semanticadaptation.semanticAdaptation.impl.VariableImpl
2018-09-11 10:54:39,295 [INFO]     <Scope found:SimpleScope[armature_current, passenger_up, passenger_down, passenger_stop, driver_up, driver_down, driver_stop, u, d, obj_detected, passenger_up, passenger_down, passenger_stop, driver_up, driver_down, driver_stop, up, down, stop, RTOL, ATOL, T, INIT_V, c, p_v, step_size, aux_obj_detected, crossedTooFar, negative_value, positive_value, f_v] -> NULLSCOPE
2018-09-11 10:54:39,295 [DEBUG] after getLinkedObjects: node: 'step_size' result: step_size
2018-09-11 10:54:39,295 [DEBUG] before getLinkedObjects: node: 'lazy'
2018-09-11 10:54:39,295 [INFO]     >Getting scope for fmu within context class be.uantwerpen.ansymo.semanticadaptation.semanticAdaptation.impl.DoStepFunImpl
2018-09-11 10:54:39,295 [INFO]      Delegating scope discovery to super class...
2018-09-11 10:54:39,296 [INFO]     <Scope found:ImportScope[controller_sa.*] imports from org.eclipse.xtext.scoping.impl.MultimapBasedSelectable@404eca05 for type FMU
2018-09-11 10:54:39,296 [DEBUG] after getLinkedObjects: node: 'lazy' result: lazy
2018-09-11 10:54:39,296 [DEBUG] before getLinkedObjects: node: 'step_size'
2018-09-11 10:54:39,296 [INFO]     >Getting scope for ref within context class be.uantwerpen.ansymo.semanticadaptation.semanticAdaptation.impl.VariableImpl
2018-09-11 10:54:39,296 [INFO]     <Scope found:SimpleScope[armature_current, passenger_up, passenger_down, passenger_stop, driver_up, driver_down, driver_stop, u, d, obj_detected, passenger_up, passenger_down, passenger_stop, driver_up, driver_down, driver_stop, up, down, stop, RTOL, ATOL, T, INIT_V, c, p_v, step_size, aux_obj_detected, crossedTooFar, negative_value, positive_value, f_v] -> NULLSCOPE
2018-09-11 10:54:39,296 [DEBUG] after getLinkedObjects: node: 'step_size' result: step_size
2018-09-11 10:54:39,296 [DEBUG] before getLinkedObjects: node: 'RTOL'
2018-09-11 10:54:39,296 [INFO]     >Getting scope for ref within context class be.uantwerpen.ansymo.semanticadaptation.semanticAdaptation.impl.VariableImpl
2018-09-11 10:54:39,296 [INFO]     <Scope found:SimpleScope[armature_current, passenger_up, passenger_down, passenger_stop, driver_up, driver_down, driver_stop, u, d, obj_detected, passenger_up, passenger_down, passenger_stop, driver_up, driver_down, driver_stop, up, down, stop, RTOL, ATOL, T, INIT_V, c, p_v, step_size, aux_obj_detected, crossedTooFar, negative_value, positive_value, f_v] -> NULLSCOPE
2018-09-11 10:54:39,296 [DEBUG] after getLinkedObjects: node: 'RTOL' result: RTOL
2018-09-11 10:54:39,296 [DEBUG] before getLinkedObjects: node: 'ATOL'
2018-09-11 10:54:39,296 [INFO]     >Getting scope for ref within context class be.uantwerpen.ansymo.semanticadaptation.semanticAdaptation.impl.VariableImpl
2018-09-11 10:54:39,297 [INFO]     <Scope found:SimpleScope[armature_current, passenger_up, passenger_down, passenger_stop, driver_up, driver_down, driver_stop, u, d, obj_detected, passenger_up, passenger_down, passenger_stop, driver_up, driver_down, driver_stop, up, down, stop, RTOL, ATOL, T, INIT_V, c, p_v, step_size, aux_obj_detected, crossedTooFar, negative_value, positive_value, f_v] -> NULLSCOPE
2018-09-11 10:54:39,297 [DEBUG] after getLinkedObjects: node: 'ATOL' result: ATOL
2018-09-11 10:54:39,297 [DEBUG] before getLinkedObjects: node: 'p_v'
2018-09-11 10:54:39,297 [INFO]     >Getting scope for ref within context class be.uantwerpen.ansymo.semanticadaptation.semanticAdaptation.impl.VariableImpl
2018-09-11 10:54:39,297 [INFO]     <Scope found:SimpleScope[armature_current, passenger_up, passenger_down, passenger_stop, driver_up, driver_down, driver_stop, u, d, obj_detected, passenger_up, passenger_down, passenger_stop, driver_up, driver_down, driver_stop, up, down, stop, RTOL, ATOL, T, INIT_V, c, p_v, step_size, aux_obj_detected, crossedTooFar, negative_value, positive_value, f_v] -> NULLSCOPE
2018-09-11 10:54:39,297 [DEBUG] after getLinkedObjects: node: 'p_v' result: p_v
2018-09-11 10:54:39,297 [DEBUG] before getLinkedObjects: node: 'f_v'
2018-09-11 10:54:39,297 [INFO]     >Getting scope for ref within context class be.uantwerpen.ansymo.semanticadaptation.semanticAdaptation.impl.VariableImpl
2018-09-11 10:54:39,297 [INFO]     <Scope found:SimpleScope[armature_current, passenger_up, passenger_down, passenger_stop, driver_up, driver_down, driver_stop, u, d, obj_detected, passenger_up, passenger_down, passenger_stop, driver_up, driver_down, driver_stop, up, down, stop, RTOL, ATOL, T, INIT_V, c, p_v, step_size, aux_obj_detected, crossedTooFar, negative_value, positive_value, f_v] -> NULLSCOPE
2018-09-11 10:54:39,297 [DEBUG] after getLinkedObjects: node: 'f_v' result: f_v
2018-09-11 10:54:39,297 [DEBUG] before getLinkedObjects: node: 'step_size'
2018-09-11 10:54:39,297 [INFO]     >Getting scope for ref within context class be.uantwerpen.ansymo.semanticadaptation.semanticAdaptation.impl.VariableImpl
2018-09-11 10:54:39,298 [INFO]     <Scope found:SimpleScope[armature_current, passenger_up, passenger_down, passenger_stop, driver_up, driver_down, driver_stop, u, d, obj_detected, passenger_up, passenger_down, passenger_stop, driver_up, driver_down, driver_stop, up, down, stop, RTOL, ATOL, T, INIT_V, c, p_v, step_size, aux_obj_detected, crossedTooFar, negative_value, positive_value, f_v] -> NULLSCOPE
2018-09-11 10:54:39,298 [DEBUG] after getLinkedObjects: node: 'step_size' result: step_size
2018-09-11 10:54:39,298 [DEBUG] before getLinkedObjects: node: 'f_v'
2018-09-11 10:54:39,298 [INFO]     >Getting scope for ref within context class be.uantwerpen.ansymo.semanticadaptation.semanticAdaptation.impl.VariableImpl
2018-09-11 10:54:39,298 [INFO]     <Scope found:SimpleScope[armature_current, passenger_up, passenger_down, passenger_stop, driver_up, driver_down, driver_stop, u, d, obj_detected, passenger_up, passenger_down, passenger_stop, driver_up, driver_down, driver_stop, up, down, stop, RTOL, ATOL, T, INIT_V, c, p_v, step_size, aux_obj_detected, crossedTooFar, negative_value, positive_value, f_v] -> NULLSCOPE
2018-09-11 10:54:39,298 [DEBUG] after getLinkedObjects: node: 'f_v' result: f_v
2018-09-11 10:54:39,298 [DEBUG] before getLinkedObjects: node: 'controller_sa'
2018-09-11 10:54:39,298 [INFO]     >Getting scope for owner within context class be.uantwerpen.ansymo.semanticadaptation.semanticAdaptation.impl.VariableImpl
2018-09-11 10:54:39,298 [INFO]      Delegating scope discovery to super class...
2018-09-11 10:54:39,298 [INFO]     <Scope found:ImportScope[controller_sa.*] imports from org.eclipse.xtext.scoping.impl.MultimapBasedSelectable@404eca05 for type FMU
2018-09-11 10:54:39,299 [DEBUG] after getLinkedObjects: node: 'controller_sa' result: controller_sa
2018-09-11 10:54:39,299 [DEBUG] before getLinkedObjects: node: 'armature_current'
2018-09-11 10:54:39,299 [INFO]     >Getting scope for ref within context class be.uantwerpen.ansymo.semanticadaptation.semanticAdaptation.impl.VariableImpl
2018-09-11 10:54:39,299 [INFO]      Getting scope within FMU: controller_sa
2018-09-11 10:54:39,299 [INFO]     <Scope found:SimpleScope[armature_current, passenger_up, passenger_down, passenger_stop, driver_up, driver_down, driver_stop, u, d, obj_detected, passenger_up, passenger_down, passenger_stop, driver_up, driver_down, driver_stop, up, down, stop] -> NULLSCOPE
2018-09-11 10:54:39,299 [DEBUG] after getLinkedObjects: node: 'armature_current' result: armature_current
2018-09-11 10:54:39,299 [DEBUG] before getLinkedObjects: node: 'lazy'
2018-09-11 10:54:39,299 [INFO]     >Getting scope for owner within context class be.uantwerpen.ansymo.semanticadaptation.semanticAdaptation.impl.VariableImpl
2018-09-11 10:54:39,299 [INFO]      Delegating scope discovery to super class...
2018-09-11 10:54:39,299 [INFO]     <Scope found:ImportScope[controller_sa.*] imports from org.eclipse.xtext.scoping.impl.MultimapBasedSelectable@404eca05 for type FMU
2018-09-11 10:54:39,299 [DEBUG] after getLinkedObjects: node: 'lazy' result: lazy
2018-09-11 10:54:39,299 [DEBUG] before getLinkedObjects: node: 'obj_detected'
2018-09-11 10:54:39,299 [INFO]     >Getting scope for ref within context class be.uantwerpen.ansymo.semanticadaptation.semanticAdaptation.impl.VariableImpl
2018-09-11 10:54:39,299 [INFO]      Getting scope within FMU: lazy
2018-09-11 10:54:39,300 [INFO]     <Scope found:SimpleScope[obj_detected, passenger_up, passenger_down, passenger_stop, driver_up, driver_down, driver_stop, up, down, stop] -> NULLSCOPE
2018-09-11 10:54:39,300 [DEBUG] after getLinkedObjects: node: 'obj_detected' result: obj_detected
2018-09-11 10:54:39,300 [DEBUG] before getLinkedObjects: node: 'c'
2018-09-11 10:54:39,300 [INFO]     >Getting scope for ref within context class be.uantwerpen.ansymo.semanticadaptation.semanticAdaptation.impl.VariableImpl
2018-09-11 10:54:39,300 [INFO]     <Scope found:SimpleScope[armature_current, passenger_up, passenger_down, passenger_stop, driver_up, driver_down, driver_stop, u, d, obj_detected, passenger_up, passenger_down, passenger_stop, driver_up, driver_down, driver_stop, up, down, stop, RTOL, ATOL, T, INIT_V, c, p_v, step_size, aux_obj_detected, crossedTooFar, negative_value, positive_value, f_v] -> NULLSCOPE
2018-09-11 10:54:39,300 [DEBUG] after getLinkedObjects: node: 'c' result: c
2018-09-11 10:54:39,300 [DEBUG] before getLinkedObjects: node: 'INIT_V'
2018-09-11 10:54:39,300 [INFO]     >Getting scope for ref within context class be.uantwerpen.ansymo.semanticadaptation.semanticAdaptation.impl.VariableImpl
2018-09-11 10:54:39,300 [INFO]     <Scope found:SimpleScope[armature_current, passenger_up, passenger_down, passenger_stop, driver_up, driver_down, driver_stop, u, d, obj_detected, passenger_up, passenger_down, passenger_stop, driver_up, driver_down, driver_stop, up, down, stop, RTOL, ATOL, T, INIT_V, c, p_v, step_size, aux_obj_detected, crossedTooFar, negative_value, positive_value, f_v] -> NULLSCOPE
2018-09-11 10:54:39,300 [DEBUG] after getLinkedObjects: node: 'INIT_V' result: INIT_V
2018-09-11 10:54:39,300 [DEBUG] before getLinkedObjects: node: 'lazy'
2018-09-11 10:54:39,300 [INFO]     >Getting scope for owner within context class be.uantwerpen.ansymo.semanticadaptation.semanticAdaptation.impl.VariableImpl
2018-09-11 10:54:39,300 [INFO]      Delegating scope discovery to super class...
2018-09-11 10:54:39,301 [INFO]     <Scope found:ImportScope[controller_sa.*] imports from org.eclipse.xtext.scoping.impl.MultimapBasedSelectable@404eca05 for type FMU
2018-09-11 10:54:39,301 [DEBUG] after getLinkedObjects: node: 'lazy' result: lazy
2018-09-11 10:54:39,301 [DEBUG] before getLinkedObjects: node: 'up'
2018-09-11 10:54:39,301 [INFO]     >Getting scope for ref within context class be.uantwerpen.ansymo.semanticadaptation.semanticAdaptation.impl.VariableImpl
2018-09-11 10:54:39,301 [INFO]      Getting scope within FMU: lazy
2018-09-11 10:54:39,301 [INFO]     <Scope found:SimpleScope[obj_detected, passenger_up, passenger_down, passenger_stop, driver_up, driver_down, driver_stop, up, down, stop] -> NULLSCOPE
2018-09-11 10:54:39,301 [DEBUG] after getLinkedObjects: node: 'up' result: up
2018-09-11 10:54:39,301 [DEBUG] before getLinkedObjects: node: 'controller_sa'
2018-09-11 10:54:39,301 [INFO]     >Getting scope for owner within context class be.uantwerpen.ansymo.semanticadaptation.semanticAdaptation.impl.VariableImpl
2018-09-11 10:54:39,301 [INFO]      Delegating scope discovery to super class...
2018-09-11 10:54:39,301 [INFO]     <Scope found:ImportScope[controller_sa.*] imports from org.eclipse.xtext.scoping.impl.MultimapBasedSelectable@404eca05 for type FMU
2018-09-11 10:54:39,301 [DEBUG] after getLinkedObjects: node: 'controller_sa' result: controller_sa
2018-09-11 10:54:39,302 [DEBUG] before getLinkedObjects: node: 'u'
2018-09-11 10:54:39,302 [INFO]     >Getting scope for ref within context class be.uantwerpen.ansymo.semanticadaptation.semanticAdaptation.impl.VariableImpl
2018-09-11 10:54:39,302 [INFO]      Getting scope within FMU: controller_sa
2018-09-11 10:54:39,302 [INFO]     <Scope found:SimpleScope[armature_current, passenger_up, passenger_down, passenger_stop, driver_up, driver_down, driver_stop, u, d, obj_detected, passenger_up, passenger_down, passenger_stop, driver_up, driver_down, driver_stop, up, down, stop] -> NULLSCOPE
2018-09-11 10:54:39,302 [DEBUG] after getLinkedObjects: node: 'u' result: u
2018-09-11 10:54:39,302 [DEBUG] before getLinkedObjects: node: 'lazy'
2018-09-11 10:54:39,302 [INFO]     >Getting scope for owner within context class be.uantwerpen.ansymo.semanticadaptation.semanticAdaptation.impl.VariableImpl
2018-09-11 10:54:39,302 [INFO]      Delegating scope discovery to super class...
2018-09-11 10:54:39,302 [INFO]     <Scope found:ImportScope[controller_sa.*] imports from org.eclipse.xtext.scoping.impl.MultimapBasedSelectable@404eca05 for type FMU
2018-09-11 10:54:39,302 [DEBUG] after getLinkedObjects: node: 'lazy' result: lazy
2018-09-11 10:54:39,302 [DEBUG] before getLinkedObjects: node: 'up'
2018-09-11 10:54:39,302 [INFO]     >Getting scope for ref within context class be.uantwerpen.ansymo.semanticadaptation.semanticAdaptation.impl.VariableImpl
2018-09-11 10:54:39,302 [INFO]      Getting scope within FMU: lazy
2018-09-11 10:54:39,302 [INFO]     <Scope found:SimpleScope[obj_detected, passenger_up, passenger_down, passenger_stop, driver_up, driver_down, driver_stop, up, down, stop] -> NULLSCOPE
2018-09-11 10:54:39,303 [DEBUG] after getLinkedObjects: node: 'up' result: up
2018-09-11 10:54:39,303 [DEBUG] before getLinkedObjects: node: 'controller_sa'
2018-09-11 10:54:39,303 [INFO]     >Getting scope for owner within context class be.uantwerpen.ansymo.semanticadaptation.semanticAdaptation.impl.VariableImpl
2018-09-11 10:54:39,303 [INFO]      Delegating scope discovery to super class...
2018-09-11 10:54:39,303 [INFO]     <Scope found:ImportScope[controller_sa.*] imports from org.eclipse.xtext.scoping.impl.MultimapBasedSelectable@404eca05 for type FMU
2018-09-11 10:54:39,303 [DEBUG] after getLinkedObjects: node: 'controller_sa' result: controller_sa
2018-09-11 10:54:39,303 [DEBUG] before getLinkedObjects: node: 'u'
2018-09-11 10:54:39,303 [INFO]     >Getting scope for ref within context class be.uantwerpen.ansymo.semanticadaptation.semanticAdaptation.impl.VariableImpl
2018-09-11 10:54:39,303 [INFO]      Getting scope within FMU: controller_sa
2018-09-11 10:54:39,303 [INFO]     <Scope found:SimpleScope[armature_current, passenger_up, passenger_down, passenger_stop, driver_up, driver_down, driver_stop, u, d, obj_detected, passenger_up, passenger_down, passenger_stop, driver_up, driver_down, driver_stop, up, down, stop] -> NULLSCOPE
2018-09-11 10:54:39,303 [DEBUG] after getLinkedObjects: node: 'u' result: u
2018-09-11 10:54:39,303 [DEBUG] before getLinkedObjects: node: 'lazy'
2018-09-11 10:54:39,303 [INFO]     >Getting scope for owner within context class be.uantwerpen.ansymo.semanticadaptation.semanticAdaptation.impl.VariableImpl
2018-09-11 10:54:39,303 [INFO]      Delegating scope discovery to super class...
2018-09-11 10:54:39,304 [INFO]     <Scope found:ImportScope[controller_sa.*] imports from org.eclipse.xtext.scoping.impl.MultimapBasedSelectable@404eca05 for type FMU
2018-09-11 10:54:39,304 [DEBUG] after getLinkedObjects: node: 'lazy' result: lazy
2018-09-11 10:54:39,304 [DEBUG] before getLinkedObjects: node: 'down'
2018-09-11 10:54:39,304 [INFO]     >Getting scope for ref within context class be.uantwerpen.ansymo.semanticadaptation.semanticAdaptation.impl.VariableImpl
2018-09-11 10:54:39,304 [INFO]      Getting scope within FMU: lazy
2018-09-11 10:54:39,304 [INFO]     <Scope found:SimpleScope[obj_detected, passenger_up, passenger_down, passenger_stop, driver_up, driver_down, driver_stop, up, down, stop] -> NULLSCOPE
2018-09-11 10:54:39,304 [DEBUG] after getLinkedObjects: node: 'down' result: down
2018-09-11 10:54:39,304 [DEBUG] before getLinkedObjects: node: 'controller_sa'
2018-09-11 10:54:39,304 [INFO]     >Getting scope for owner within context class be.uantwerpen.ansymo.semanticadaptation.semanticAdaptation.impl.VariableImpl
2018-09-11 10:54:39,304 [INFO]      Delegating scope discovery to super class...
2018-09-11 10:54:39,304 [INFO]     <Scope found:ImportScope[controller_sa.*] imports from org.eclipse.xtext.scoping.impl.MultimapBasedSelectable@404eca05 for type FMU
2018-09-11 10:54:39,304 [DEBUG] after getLinkedObjects: node: 'controller_sa' result: controller_sa
2018-09-11 10:54:39,304 [DEBUG] before getLinkedObjects: node: 'd'
2018-09-11 10:54:39,304 [INFO]     >Getting scope for ref within context class be.uantwerpen.ansymo.semanticadaptation.semanticAdaptation.impl.VariableImpl
2018-09-11 10:54:39,304 [INFO]      Getting scope within FMU: controller_sa
2018-09-11 10:54:39,305 [INFO]     <Scope found:SimpleScope[armature_current, passenger_up, passenger_down, passenger_stop, driver_up, driver_down, driver_stop, u, d, obj_detected, passenger_up, passenger_down, passenger_stop, driver_up, driver_down, driver_stop, up, down, stop] -> NULLSCOPE
2018-09-11 10:54:39,305 [DEBUG] after getLinkedObjects: node: 'd' result: d
2018-09-11 10:54:39,305 [DEBUG] before getLinkedObjects: node: 'lazy'
2018-09-11 10:54:39,305 [INFO]     >Getting scope for owner within context class be.uantwerpen.ansymo.semanticadaptation.semanticAdaptation.impl.VariableImpl
2018-09-11 10:54:39,305 [INFO]      Delegating scope discovery to super class...
2018-09-11 10:54:39,305 [INFO]     <Scope found:ImportScope[controller_sa.*] imports from org.eclipse.xtext.scoping.impl.MultimapBasedSelectable@404eca05 for type FMU
2018-09-11 10:54:39,305 [DEBUG] after getLinkedObjects: node: 'lazy' result: lazy
2018-09-11 10:54:39,305 [DEBUG] before getLinkedObjects: node: 'down'
2018-09-11 10:54:39,305 [INFO]     >Getting scope for ref within context class be.uantwerpen.ansymo.semanticadaptation.semanticAdaptation.impl.VariableImpl
2018-09-11 10:54:39,305 [INFO]      Getting scope within FMU: lazy
2018-09-11 10:54:39,305 [INFO]     <Scope found:SimpleScope[obj_detected, passenger_up, passenger_down, passenger_stop, driver_up, driver_down, driver_stop, up, down, stop] -> NULLSCOPE
2018-09-11 10:54:39,305 [DEBUG] after getLinkedObjects: node: 'down' result: down
2018-09-11 10:54:39,305 [DEBUG] before getLinkedObjects: node: 'controller_sa'
2018-09-11 10:54:39,305 [INFO]     >Getting scope for owner within context class be.uantwerpen.ansymo.semanticadaptation.semanticAdaptation.impl.VariableImpl
2018-09-11 10:54:39,305 [INFO]      Delegating scope discovery to super class...
2018-09-11 10:54:39,306 [INFO]     <Scope found:ImportScope[controller_sa.*] imports from org.eclipse.xtext.scoping.impl.MultimapBasedSelectable@404eca05 for type FMU
2018-09-11 10:54:39,306 [DEBUG] after getLinkedObjects: node: 'controller_sa' result: controller_sa
2018-09-11 10:54:39,306 [DEBUG] before getLinkedObjects: node: 'd'
2018-09-11 10:54:39,306 [INFO]     >Getting scope for ref within context class be.uantwerpen.ansymo.semanticadaptation.semanticAdaptation.impl.VariableImpl
2018-09-11 10:54:39,306 [INFO]      Getting scope within FMU: controller_sa
2018-09-11 10:54:39,306 [INFO]     <Scope found:SimpleScope[armature_current, passenger_up, passenger_down, passenger_stop, driver_up, driver_down, driver_stop, u, d, obj_detected, passenger_up, passenger_down, passenger_stop, driver_up, driver_down, driver_stop, up, down, stop] -> NULLSCOPE
2018-09-11 10:54:39,306 [DEBUG] after getLinkedObjects: node: 'd' result: d
2018-09-11 10:54:39,306 [DEBUG] before getLinkedObjects: node: 'lazy'
2018-09-11 10:54:39,306 [INFO]     >Getting scope for owner within context class be.uantwerpen.ansymo.semanticadaptation.semanticAdaptation.impl.VariableImpl
2018-09-11 10:54:39,306 [INFO]      Delegating scope discovery to super class...
2018-09-11 10:54:39,307 [INFO]     <Scope found:ImportScope[controller_sa.*] imports from org.eclipse.xtext.scoping.impl.MultimapBasedSelectable@404eca05 for type FMU
2018-09-11 10:54:39,307 [DEBUG] after getLinkedObjects: node: 'lazy' result: lazy
2018-09-11 10:54:39,307 [DEBUG] before getLinkedObjects: node: 'stop'
2018-09-11 10:54:39,307 [INFO]     >Getting scope for ref within context class be.uantwerpen.ansymo.semanticadaptation.semanticAdaptation.impl.VariableImpl
2018-09-11 10:54:39,307 [INFO]      Getting scope within FMU: lazy
2018-09-11 10:54:39,307 [INFO]     <Scope found:SimpleScope[obj_detected, passenger_up, passenger_down, passenger_stop, driver_up, driver_down, driver_stop, up, down, stop] -> NULLSCOPE
2018-09-11 10:54:39,307 [DEBUG] after getLinkedObjects: node: 'stop' result: stop
2018-09-11 10:54:39,307 [DEBUG] before getLinkedObjects: node: 'controller_sa'
2018-09-11 10:54:39,307 [INFO]     >Getting scope for owner within context class be.uantwerpen.ansymo.semanticadaptation.semanticAdaptation.impl.VariableImpl
2018-09-11 10:54:39,307 [INFO]      Delegating scope discovery to super class...
2018-09-11 10:54:39,308 [INFO]     <Scope found:ImportScope[controller_sa.*] imports from org.eclipse.xtext.scoping.impl.MultimapBasedSelectable@404eca05 for type FMU
2018-09-11 10:54:39,308 [DEBUG] after getLinkedObjects: node: 'controller_sa' result: controller_sa
2018-09-11 10:54:39,308 [DEBUG] before getLinkedObjects: node: 'u'
2018-09-11 10:54:39,308 [INFO]     >Getting scope for ref within context class be.uantwerpen.ansymo.semanticadaptation.semanticAdaptation.impl.VariableImpl
2018-09-11 10:54:39,308 [INFO]      Getting scope within FMU: controller_sa
2018-09-11 10:54:39,308 [INFO]     <Scope found:SimpleScope[armature_current, passenger_up, passenger_down, passenger_stop, driver_up, driver_down, driver_stop, u, d, obj_detected, passenger_up, passenger_down, passenger_stop, driver_up, driver_down, driver_stop, up, down, stop] -> NULLSCOPE
2018-09-11 10:54:39,308 [DEBUG] after getLinkedObjects: node: 'u' result: u
2018-09-11 10:54:39,308 [DEBUG] before getLinkedObjects: node: 'controller_sa'
2018-09-11 10:54:39,308 [INFO]     >Getting scope for owner within context class be.uantwerpen.ansymo.semanticadaptation.semanticAdaptation.impl.VariableImpl
2018-09-11 10:54:39,308 [INFO]      Delegating scope discovery to super class...
2018-09-11 10:54:39,308 [INFO]     <Scope found:ImportScope[controller_sa.*] imports from org.eclipse.xtext.scoping.impl.MultimapBasedSelectable@404eca05 for type FMU
2018-09-11 10:54:39,308 [DEBUG] after getLinkedObjects: node: 'controller_sa' result: controller_sa
2018-09-11 10:54:39,308 [DEBUG] before getLinkedObjects: node: 'd'
2018-09-11 10:54:39,308 [INFO]     >Getting scope for ref within context class be.uantwerpen.ansymo.semanticadaptation.semanticAdaptation.impl.VariableImpl
2018-09-11 10:54:39,308 [INFO]      Getting scope within FMU: controller_sa
2018-09-11 10:54:39,309 [INFO]     <Scope found:SimpleScope[armature_current, passenger_up, passenger_down, passenger_stop, driver_up, driver_down, driver_stop, u, d, obj_detected, passenger_up, passenger_down, passenger_stop, driver_up, driver_down, driver_stop, up, down, stop] -> NULLSCOPE
2018-09-11 10:54:39,309 [DEBUG] after getLinkedObjects: node: 'd' result: d
2018-09-11 10:54:39,309 [DEBUG] Syntax check OK! Resource: __synthetic0.sa
2018-09-11 10:54:39,314 [INFO]     >CppGenerator.doGenerate /var/lib/jenkins/workspace/HybridCosimulation_master-LDEVB56LP46DTRNYHQSCKMS3FR4JD6RBBK6S2LPONMGDZRBJQH3A/DSL_SemanticAdaptation/be.uantwerpen.ansymo.semanticadaptation.cg.cpp.tests/target/test-classes/single_folder_spec/controller
2018-09-11 10:54:39,314 [INFO]      >Loading fmu "./LazySA.fmu"
2018-09-11 10:54:39,314 [INFO]       Current working dir: /var/lib/jenkins/workspace/HybridCosimulation_master-LDEVB56LP46DTRNYHQSCKMS3FR4JD6RBBK6S2LPONMGDZRBJQH3A/DSL_SemanticAdaptation/be.uantwerpen.ansymo.semanticadaptation.cg.cpp.tests/target/test-classes/single_folder_spec/controller
2018-09-11 10:54:39,314 [INFO]       Resolved Current working dir: /var/lib/jenkins/workspace/HybridCosimulation_master-LDEVB56LP46DTRNYHQSCKMS3FR4JD6RBBK6S2LPONMGDZRBJQH3A/DSL_SemanticAdaptation/be.uantwerpen.ansymo.semanticadaptation.cg.cpp.tests/target/test-classes/single_folder_spec/controller
2018-09-11 10:54:39,314 [INFO]       Resolved fmu path: /var/lib/jenkins/workspace/HybridCosimulation_master-LDEVB56LP46DTRNYHQSCKMS3FR4JD6RBBK6S2LPONMGDZRBJQH3A/DSL_SemanticAdaptation/be.uantwerpen.ansymo.semanticadaptation.cg.cpp.tests/target/test-classes/single_folder_spec/controller/./LazySA.fmu
2018-09-11 10:54:39,320 [INFO]       >Loading fmu variables
2018-09-11 10:54:39,320 [INFO]        Variable obj_detected declared.
2018-09-11 10:54:39,320 [INFO]        Variable passenger_up declared.
2018-09-11 10:54:39,320 [INFO]        Variable passenger_down declared.
2018-09-11 10:54:39,320 [INFO]        Variable passenger_stop declared.
2018-09-11 10:54:39,320 [INFO]        Variable driver_up declared.
2018-09-11 10:54:39,320 [INFO]        Variable driver_down declared.
2018-09-11 10:54:39,320 [INFO]        Variable driver_stop declared.
2018-09-11 10:54:39,320 [INFO]        Variable up declared.
2018-09-11 10:54:39,321 [INFO]        Variable down declared.
2018-09-11 10:54:39,321 [INFO]        Variable stop declared.
2018-09-11 10:54:39,321 [INFO]       <Loading fmu variables
2018-09-11 10:54:39,331 [INFO]      <CppGenerator.doGenerate/var/lib/jenkins/workspace/HybridCosimulation_master-LDEVB56LP46DTRNYHQSCKMS3FR4JD6RBBK6S2LPONMGDZRBJQH3A/DSL_SemanticAdaptation/be.uantwerpen.ansymo.semanticadaptation.cg.cpp.tests/target/test-classes/single_folder_spec/controller
Stored file: target/test-classes/single_folder_spec/controller/controller/CMakeLists.txt
Stored file: target/test-classes/single_folder_spec/controller/controller/sources/Controller_sa.cpp
Stored file: target/test-classes/single_folder_spec/controller/controller/sources/Controller_sa.h
Stored file: target/test-classes/single_folder_spec/controller/controller/sources/Fmu.cpp
Stored file: target/test-classes/single_folder_spec/controller/controller/modelDescription.xml
Stored file: target/test-classes/single_folder_spec/controller/controller/msys-toolchain.cmake
Stored file: target/test-classes/single_folder_spec/controller/controller/sources/main.cpp
Copied file to: target/test-classes/single_folder_spec/controller/controller/resources/LazySA.fmu
-- The C compiler identification is GNU 5.4.0
-- The CXX compiler identification is GNU 5.4.0
-- Check for working C compiler: /usr/bin/cc
-- Check for working C compiler: /usr/bin/cc -- works
-- Detecting C compiler ABI info
-- Detecting C compiler ABI info - done
-- Detecting C compile features
-- Detecting C compile features - done
-- Check for working CXX compiler: /usr/bin/c++
-- Check for working CXX compiler: /usr/bin/c++ -- works
-- Detecting CXX compiler ABI info
-- Detecting CXX compiler ABI info - done
-- Detecting CXX compile features
-- Detecting CXX compile features - done
Already up-to-date.
-- Performing Test COMPILER_SUPPORTS_CXX11
-- Performing Test COMPILER_SUPPORTS_CXX11 - Success
-- Performing Test COMPILER_SUPPORTS_CXX0X
-- Performing Test COMPILER_SUPPORTS_CXX0X - Success
-- Found ZLIB: /usr/lib/x86_64-linux-gnu/libz.so (found version "1.2.8") 
-- Configuring done
-- Generating done
-- Build files have been written to: /var/lib/jenkins/workspace/HybridCosimulation_master-LDEVB56LP46DTRNYHQSCKMS3FR4JD6RBBK6S2LPONMGDZRBJQH3A/DSL_SemanticAdaptation/be.uantwerpen.ansymo.semanticadaptation.cg.cpp.tests/target/test-classes/single_folder_spec/controller/controller
Scanning dependencies of target minizip
[  4%] Building C object hcf/semantic-adaptation/third_party/into-cpp-fmi/thrird_party/projects/minizip/CMakeFiles/minizip.dir/miniunz.c.o
[  9%] Building C object hcf/semantic-adaptation/third_party/into-cpp-fmi/thrird_party/projects/minizip/CMakeFiles/minizip.dir/__/__/zlib/contrib/minizip/ioapi.c.o
[ 14%] Building C object hcf/semantic-adaptation/third_party/into-cpp-fmi/thrird_party/projects/minizip/CMakeFiles/minizip.dir/__/__/zlib/contrib/minizip/mztools.c.o
[ 19%] Building C object hcf/semantic-adaptation/third_party/into-cpp-fmi/thrird_party/projects/minizip/CMakeFiles/minizip.dir/__/__/zlib/contrib/minizip/unzip.c.o
[ 23%] Building C object hcf/semantic-adaptation/third_party/into-cpp-fmi/thrird_party/projects/minizip/CMakeFiles/minizip.dir/__/__/zlib/contrib/minizip/zip.c.o
[ 28%] Linking C static library libminizipd.a
/usr/bin/ar qc libminizipd.a  CMakeFiles/minizip.dir/__/__/zlib/contrib/minizip/ioapi.c.o CMakeFiles/minizip.dir/miniunz.c.o CMakeFiles/minizip.dir/__/__/zlib/contrib/minizip/mztools.c.o CMakeFiles/minizip.dir/__/__/zlib/contrib/minizip/unzip.c.o CMakeFiles/minizip.dir/__/__/zlib/contrib/minizip/zip.c.o
/usr/bin/ranlib libminizipd.a
[ 28%] Built target minizip
Scanning dependencies of target intocppfmi
[ 33%] Building CXX object hcf/semantic-adaptation/third_party/into-cpp-fmi/CMakeFiles/intocppfmi.dir/src/FilesystemUtil.cpp.o
[ 38%] Building C object hcf/semantic-adaptation/third_party/into-cpp-fmi/CMakeFiles/intocppfmi.dir/src/FmuLoader.c.o
[ 42%] Building C object hcf/semantic-adaptation/third_party/into-cpp-fmi/CMakeFiles/intocppfmi.dir/src/uri.c.o
[ 47%] Building CXX object hcf/semantic-adaptation/third_party/into-cpp-fmi/CMakeFiles/intocppfmi.dir/src/Fmu.cpp.o
[ 52%] Linking CXX static library libintocppfmi.a
/usr/bin/ar qc libintocppfmi.a  CMakeFiles/intocppfmi.dir/src/FmuLoader.c.o CMakeFiles/intocppfmi.dir/src/uri.c.o CMakeFiles/intocppfmi.dir/src/FilesystemUtil.cpp.o CMakeFiles/intocppfmi.dir/src/Fmu.cpp.o
/usr/bin/ranlib libintocppfmi.a
[ 52%] Built target intocppfmi
Scanning dependencies of target hcf
[ 57%] Building CXX object hcf/semantic-adaptation/CMakeFiles/hcf.dir/src/Empty.cpp.o
[ 61%] Building CXX object hcf/semantic-adaptation/CMakeFiles/hcf.dir/src/HyfMath.cpp.o
[ 66%] Linking CXX static library libhcf.a
/usr/bin/ar qc libhcf.a  CMakeFiles/hcf.dir/src/Empty.cpp.o CMakeFiles/hcf.dir/src/HyfMath.cpp.o
/usr/bin/ranlib libhcf.a
[ 66%] Built target hcf
Scanning dependencies of target controller_sa
Scanning dependencies of target controller_sa_main
[ 71%] Building CXX object CMakeFiles/controller_sa.dir/sources/Controller_sa.cpp.o
[ 76%] Building CXX object CMakeFiles/controller_sa.dir/sources/Fmu.cpp.o
[ 80%] Building CXX object CMakeFiles/controller_sa_main.dir/sources/main.cpp.o
[ 85%] Building CXX object CMakeFiles/controller_sa_main.dir/sources/Controller_sa.cpp.o
[ 90%] Building CXX object CMakeFiles/controller_sa_main.dir/sources/Fmu.cpp.o
[ 95%] Linking CXX shared library binaries/linux64/controller_sa.so
[ 95%] Built target controller_sa
[100%] Linking CXX executable controller_sa_main
[100%] Built target controller_sa_main
Scanning dependencies of target pack
modelDescription.xml
resources
resources/LazySA.fmu
binaries/linux64
binaries/linux64/controller_sa.so
Built target pack
saGenRootTempDir=/var/lib/jenkins/workspace/HybridCosimulation_master-LDEVB56LP46DTRNYHQSCKMS3FR4JD6RBBK6S2LPONMGDZRBJQH3A/DSL_SemanticAdaptation/be.uantwerpen.ansymo.semanticadaptation.cg.cpp.tests/target/test-classes/single_folder_spec/emptyctrlrules/PlantMR
absFileName=/var/lib/jenkins/workspace/HybridCosimulation_master-LDEVB56LP46DTRNYHQSCKMS3FR4JD6RBBK6S2LPONMGDZRBJQH3A/DSL_SemanticAdaptation/be.uantwerpen.ansymo.semanticadaptation.cg.cpp.tests/target/test-classes/single_folder_spec/emptyctrlrules/plantmr.sa
2018-09-11 10:54:49,441 [DEBUG] Parsing took: 11 ms
2018-09-11 10:54:49,442 [DEBUG] beforeModelLinked took: 0ms
2018-09-11 10:54:49,442 [DEBUG] doLinkModel took: 0ms
2018-09-11 10:54:49,442 [DEBUG] afterModelLinked took: 0ms
2018-09-11 10:54:49,443 [DEBUG] Syntax check OK! Resource: __synthetic0.sa
2018-09-11 10:54:49,445 [INFO]      >CppGenerator.doGenerate /var/lib/jenkins/workspace/HybridCosimulation_master-LDEVB56LP46DTRNYHQSCKMS3FR4JD6RBBK6S2LPONMGDZRBJQH3A/DSL_SemanticAdaptation/be.uantwerpen.ansymo.semanticadaptation.cg.cpp.tests/target/test-classes/single_folder_spec/emptyctrlrules
2018-09-11 10:54:49,445 [INFO]       >Loading fmu "./EMAPlantNoLoad_FixedEuler_1Em6.fmu"
2018-09-11 10:54:49,445 [INFO]        Current working dir: /var/lib/jenkins/workspace/HybridCosimulation_master-LDEVB56LP46DTRNYHQSCKMS3FR4JD6RBBK6S2LPONMGDZRBJQH3A/DSL_SemanticAdaptation/be.uantwerpen.ansymo.semanticadaptation.cg.cpp.tests/target/test-classes/single_folder_spec/emptyctrlrules
2018-09-11 10:54:49,445 [INFO]        Resolved Current working dir: /var/lib/jenkins/workspace/HybridCosimulation_master-LDEVB56LP46DTRNYHQSCKMS3FR4JD6RBBK6S2LPONMGDZRBJQH3A/DSL_SemanticAdaptation/be.uantwerpen.ansymo.semanticadaptation.cg.cpp.tests/target/test-classes/single_folder_spec/emptyctrlrules
2018-09-11 10:54:49,446 [INFO]        Resolved fmu path: /var/lib/jenkins/workspace/HybridCosimulation_master-LDEVB56LP46DTRNYHQSCKMS3FR4JD6RBBK6S2LPONMGDZRBJQH3A/DSL_SemanticAdaptation/be.uantwerpen.ansymo.semanticadaptation.cg.cpp.tests/target/test-classes/single_folder_spec/emptyctrlrules/./EMAPlantNoLoad_FixedEuler_1Em6.fmu
2018-09-11 10:54:49,523 [INFO]        >Loading fmu variables
2018-09-11 10:54:49,523 [INFO]         Variable I1@3_ports_electrical_node_1 undeclared.
2018-09-11 10:54:49,523 [INFO]         Variable V1@potential_reference_1 undeclared.
2018-09-11 10:54:49,524 [INFO]         Variable V1@3_ports_electrical_node_1 undeclared.
2018-09-11 10:54:49,524 [INFO]         Variable I1@controlled_voltagesource_1 undeclared.
2018-09-11 10:54:49,524 [INFO]         Variable I2@3_ports_electrical_node_1 undeclared.
2018-09-11 10:54:49,524 [INFO]         Variable V1@controlled_voltagesource_1 undeclared.
2018-09-11 10:54:49,524 [INFO]         Variable V2@3_ports_electrical_node_1 undeclared.
2018-09-11 10:54:49,524 [INFO]         Variable Iup@powersensor_elect_3 undeclared.
2018-09-11 10:54:49,524 [INFO]         Variable I3@3_ports_electrical_node_1 undeclared.
2018-09-11 10:54:49,524 [INFO]         Variable V@powersensor_elect_3 undeclared.
2018-09-11 10:54:49,524 [INFO]         Variable V3@3_ports_electrical_node_1 undeclared.
2018-09-11 10:54:49,524 [INFO]         Variable V@powersensor_elect_2 undeclared.
2018-09-11 10:54:49,524 [INFO]         Variable V2@controlled_voltagesource_1 undeclared.
2018-09-11 10:54:49,524 [INFO]         Variable I2@controlled_voltagesource_1 undeclared.
2018-09-11 10:54:49,524 [INFO]         Variable Iup@powersensor_elect_2 undeclared.
2018-09-11 10:54:49,524 [INFO]         Variable input3@control01_4 undeclared.
2018-09-11 10:54:49,524 [INFO]         Variable output@powersensor_elect_2 undeclared.
2018-09-11 10:54:49,524 [INFO]         Variable I3@elec2signal2_1 undeclared.
2018-09-11 10:54:49,524 [INFO]         Variable I@powersensor_elect_2 undeclared.
2018-09-11 10:54:49,524 [INFO]         Variable Vup@powersensor_elect_2 undeclared.
2018-09-11 10:54:49,524 [INFO]         Variable V3@elec2signal2_1 undeclared.
2018-09-11 10:54:49,524 [INFO]         Variable P@powersensor_elect_2 undeclared.
2018-09-11 10:54:49,524 [INFO]         Variable Ppos@powersensor_elect_2 undeclared.
2018-09-11 10:54:49,524 [INFO]         Variable Pneg@powersensor_elect_2 undeclared.
2018-09-11 10:54:49,524 [INFO]         Variable output@powersensor_elect_3 undeclared.
2018-09-11 10:54:49,524 [INFO]         Variable input1@control01_4 undeclared.
2018-09-11 10:54:49,524 [INFO]         Variable I@powersensor_elect_3 undeclared.
2018-09-11 10:54:49,524 [INFO]         Variable I3@elec2signal2 undeclared.
2018-09-11 10:54:49,524 [INFO]         Variable V3@elec2signal2 undeclared.
2018-09-11 10:54:49,524 [INFO]         Variable Vup@powersensor_elect_3 undeclared.
2018-09-11 10:54:49,524 [INFO]         Variable P@powersensor_elect_3 undeclared.
2018-09-11 10:54:49,524 [INFO]         Variable Ppos@powersensor_elect_3 undeclared.
2018-09-11 10:54:49,524 [INFO]         Variable Pneg@powersensor_elect_3 undeclared.
2018-09-11 10:54:49,524 [INFO]         Variable sink@signalsink_2 undeclared.
2018-09-11 10:54:49,524 [INFO]         Variable output@control01_4 undeclared.
2018-09-11 10:54:49,524 [INFO]         Variable S3@controlled_voltagesource_1 undeclared.
2018-09-11 10:54:49,524 [INFO]         Variable U@controlled_voltagesource_1 undeclared.
2018-09-11 10:54:49,524 [INFO]         Variable I@controlled_voltagesource_1 undeclared.
2018-09-11 10:54:49,524 [INFO]         Variable usig1@elec2signal2 undeclared.
2018-09-11 10:54:49,524 [INFO]         Variable usig1@elec2signal1 undeclared.
2018-09-11 10:54:49,524 [INFO]         Variable isig2@elec2signal2 undeclared.
2018-09-11 10:54:49,524 [INFO]         Variable psig2@elec2signal1 undeclared.
2018-09-11 10:54:49,524 [INFO]         Variable usig1@elec2signal1_1 undeclared.
2018-09-11 10:54:49,524 [INFO]         Variable usig1@elec2signal2_1 undeclared.
2018-09-11 10:54:49,524 [INFO]         Variable psig2@elec2signal1_1 undeclared.
2018-09-11 10:54:49,524 [INFO]         Variable isig2@elec2signal2_1 undeclared.
2018-09-11 10:54:49,525 [INFO]         Variable dh@emd_TableMachine undeclared.
2018-09-11 10:54:49,525 [INFO]         Variable Temp@emd_TableMachine undeclared.
2018-09-11 10:54:49,525 [INFO]         Variable t1@th_temperature_source_2 undeclared.
2018-09-11 10:54:49,525 [INFO]         Variable torqstat@emd_TableMachine undeclared.
2018-09-11 10:54:49,525 [INFO]         Variable wstat@emd_TableMachine undeclared.
2018-09-11 10:54:49,525 [INFO]         Variable wzero@zeroomegasource_1 undeclared.
2018-09-11 10:54:49,525 [INFO]         Variable theta@zeroomegasource_1 undeclared.
2018-09-11 10:54:49,525 [INFO]         Variable q3@elec2signal1_1 undeclared.
2018-09-11 10:54:49,525 [INFO]         Variable V1@emd_TableMachine undeclared.
2018-09-11 10:54:49,525 [INFO]         Variable I3@elec2signal1_1 undeclared.
2018-09-11 10:54:49,525 [INFO]         Variable I1@emd_TableMachine undeclared.
2018-09-11 10:54:49,525 [INFO]         Variable V2@emd_TableMachine undeclared.
2018-09-11 10:54:49,525 [INFO]         Variable q3@elec2signal1 undeclared.
2018-09-11 10:54:49,525 [INFO]         Variable I3@elec2signal1 undeclared.
2018-09-11 10:54:49,525 [INFO]         Variable I2@emd_TableMachine undeclared.
2018-09-11 10:54:49,525 [INFO]         Variable wout@rotary2signal1 undeclared.
2018-09-11 10:54:49,525 [INFO]         Variable wrot@emd_TableMachine undeclared.
2018-09-11 10:54:49,525 [INFO]         Variable torqrot@emd_TableMachine undeclared.
2018-09-11 10:54:49,525 [INFO]         Variable tin@rotary2signal1 undeclared.
2018-09-11 10:54:49,525 [INFO]         Variable tsignal@emd_TableMachine undeclared.
2018-09-11 10:54:49,525 [INFO]         Variable U@emd_TableMachine undeclared.
2018-09-11 10:54:49,525 [INFO]         Variable I@emd_TableMachine undeclared.
2018-09-11 10:54:49,525 [INFO]         Variable wdif@emd_TableMachine undeclared.
2018-09-11 10:54:49,525 [INFO]         Variable torque@emd_TableMachine undeclared.
2018-09-11 10:54:49,525 [INFO]         Variable Tmaxgenerator@emd_TableMachine undeclared.
2018-09-11 10:54:49,525 [INFO]         Variable Tmaxmotor@emd_TableMachine undeclared.
2018-09-11 10:54:49,525 [INFO]         Variable Tmax@emd_TableMachine undeclared.
2018-09-11 10:54:49,525 [INFO]         Variable Tmin@emd_TableMachine undeclared.
2018-09-11 10:54:49,525 [INFO]         Variable effCalcul@emd_TableMachine undeclared.
2018-09-11 10:54:49,525 [INFO]         Variable wout@rotary2signal2 undeclared.
2018-09-11 10:54:49,525 [INFO]         Variable win@rotary2signal1 undeclared.
2018-09-11 10:54:49,525 [INFO]         Variable tin@rotary2signal2 undeclared.
2018-09-11 10:54:49,525 [INFO]         Variable tout@rotary2signal1 undeclared.
2018-09-11 10:54:49,525 [INFO]         Variable t1@reducer_1 undeclared.
2018-09-11 10:54:49,525 [INFO]         Variable tordup@rotaryspeedsensor2 undeclared.
2018-09-11 10:54:49,525 [INFO]         Variable w1@reducer_1 undeclared.
2018-09-11 10:54:49,525 [INFO]         Variable w@rotaryspeedsensor2 undeclared.
2018-09-11 10:54:49,525 [INFO]         Variable wdup@powersensor_rotary_1 undeclared.
2018-09-11 10:54:49,525 [INFO]         Variable w2@reducer_1 undeclared.
2018-09-11 10:54:49,525 [INFO]         Variable torque@powersensor_rotary_1 undeclared.
2018-09-11 10:54:49,525 [INFO]         Variable t2@reducer_1 undeclared.
2018-09-11 10:54:49,525 [INFO]         Variable w@rottotransmtf undeclared.
2018-09-11 10:54:49,525 [INFO]         Variable w@powersensor_rotary_1 undeclared.
2018-09-11 10:54:49,525 [INFO]         Variable tq@rottotransmtf undeclared.
2018-09-11 10:54:49,525 [INFO]         Variable tordup@powersensor_rotary_1 undeclared.
2018-09-11 10:54:49,526 [INFO]         Variable sink@signalsink_6 undeclared.
2018-09-11 10:54:49,526 [INFO]         Variable output@powersensor_rotary_1 undeclared.
2018-09-11 10:54:49,526 [INFO]         Variable P@powersensor_rotary_1 undeclared.
2018-09-11 10:54:49,526 [INFO]         Variable Ppos@powersensor_rotary_1 undeclared.
2018-09-11 10:54:49,526 [INFO]         Variable Pneg@powersensor_rotary_1 undeclared.
2018-09-11 10:54:49,526 [INFO]         Variable wsig@rotaryspeedsensor2 undeclared.
2018-09-11 10:54:49,526 [INFO]         Variable tout@rotary2signal2 undeclared.
2018-09-11 10:54:49,526 [INFO]         Variable torque@rotaryspeedsensor2 undeclared.
2018-09-11 10:54:49,526 [INFO]         Variable win@rotary2signal2 undeclared.
2018-09-11 10:54:49,526 [INFO]         Variable wdup@rotaryspeedsensor2 undeclared.
2018-09-11 10:54:49,526 [INFO]         Variable v@rottotransmtf undeclared.
2018-09-11 10:54:49,526 [INFO]         Variable v4@linear2signal3 undeclared.
2018-09-11 10:54:49,526 [INFO]         Variable x4@linear2signal3 undeclared.
2018-09-11 10:54:49,526 [INFO]         Variable f@rottotransmtf undeclared.
2018-09-11 10:54:49,526 [INFO]         Variable f4@linear2signal3 undeclared.
2018-09-11 10:54:49,526 [INFO]         Variable out@constant undeclared.
2018-09-11 10:54:49,526 [INFO]         Variable x@rottotransmtf undeclared.
2018-09-11 10:54:49,526 [INFO]         Variable vsig@linear2signal3 undeclared.
2018-09-11 10:54:49,526 [INFO]         Variable xsig@linear2signal3 undeclared.
2018-09-11 10:54:49,526 [INFO]         Variable torque_input@expseu_ declared.
2018-09-11 10:54:49,526 [INFO]         Variable psu_vol_input_v@expseu_ declared.
2018-09-11 10:54:49,526 [INFO]         Variable V_IN@expseu_ declared.
2018-09-11 10:54:49,527 [INFO]         Variable X_IN@expseu_ declared.
2018-09-11 10:54:49,527 [INFO]         Variable ang_vel_out_rpm@expseu_ declared.
2018-09-11 10:54:49,527 [INFO]         Variable F_OUT@expseu_ declared.
2018-09-11 10:54:49,527 [INFO]         Variable maxTimeStep undeclared.
2018-09-11 10:54:49,527 [INFO]         Variable tolerance undeclared.
2018-09-11 10:54:49,527 [INFO]         Variable fixedh undeclared.
2018-09-11 10:54:49,527 [INFO]         Variable errCtrl undeclared.
2018-09-11 10:54:49,527 [INFO]         Variable writeLevel undeclared.
2018-09-11 10:54:49,527 [INFO]         Variable extraDisconPrints undeclared.
2018-09-11 10:54:49,527 [INFO]         Variable runStats undeclared.
2018-09-11 10:54:49,527 [INFO]         Variable runType undeclared.
2018-09-11 10:54:49,527 [INFO]         Variable theSolverType undeclared.
2018-09-11 10:54:49,527 [INFO]         Variable fixedorder undeclared.
2018-09-11 10:54:49,527 [INFO]         Variable #V1@potential_reference_1 undeclared.
2018-09-11 10:54:49,527 [INFO]         Variable offsetp@powersensor_elect_2 undeclared.
2018-09-11 10:54:49,527 [INFO]         Variable gainp@powersensor_elect_2 undeclared.
2018-09-11 10:54:49,527 [INFO]         Variable offsete@powersensor_elect_2 undeclared.
2018-09-11 10:54:49,527 [INFO]         Variable gaine@powersensor_elect_2 undeclared.
2018-09-11 10:54:49,527 [INFO]         Variable offseta@powersensor_elect_2 undeclared.
2018-09-11 10:54:49,527 [INFO]         Variable gaina@powersensor_elect_2 undeclared.
2018-09-11 10:54:49,527 [INFO]         Variable comp@powersensor_elect_2 undeclared.
2018-09-11 10:54:49,527 [INFO]         Variable conv@powersensor_elect_2 undeclared.
2018-09-11 10:54:49,527 [INFO]         Variable offsetp@powersensor_elect_3 undeclared.
2018-09-11 10:54:49,527 [INFO]         Variable gainp@powersensor_elect_3 undeclared.
2018-09-11 10:54:49,527 [INFO]         Variable offsete@powersensor_elect_3 undeclared.
2018-09-11 10:54:49,527 [INFO]         Variable gaine@powersensor_elect_3 undeclared.
2018-09-11 10:54:49,527 [INFO]         Variable offseta@powersensor_elect_3 undeclared.
2018-09-11 10:54:49,527 [INFO]         Variable gaina@powersensor_elect_3 undeclared.
2018-09-11 10:54:49,527 [INFO]         Variable comp@powersensor_elect_3 undeclared.
2018-09-11 10:54:49,527 [INFO]         Variable conv@powersensor_elect_3 undeclared.
2018-09-11 10:54:49,527 [INFO]         Variable #t1@th_temperature_source_2 undeclared.
2018-09-11 10:54:49,527 [INFO]         Variable #wzero@zeroomegasource_1 undeclared.
2018-09-11 10:54:49,527 [INFO]         Variable #theta@zeroomegasource_1 undeclared.
2018-09-11 10:54:49,527 [INFO]         Variable effConst@emd_TableMachine undeclared.
2018-09-11 10:54:49,527 [INFO]         Variable maxT@emd_TableMachine undeclared.
2018-09-11 10:54:49,527 [INFO]         Variable maxP@emd_TableMachine undeclared.
2018-09-11 10:54:49,527 [INFO]         Variable maxW@emd_TableMachine undeclared.
2018-09-11 10:54:49,527 [INFO]         Variable tau@emd_TableMachine undeclared.
2018-09-11 10:54:49,527 [INFO]         Variable wmin@emd_TableMachine undeclared.
2018-09-11 10:54:49,527 [INFO]         Variable Umin@emd_TableMachine undeclared.
2018-09-11 10:54:49,527 [INFO]         Variable minP@emd_TableMachine undeclared.
2018-09-11 10:54:49,527 [INFO]         Variable charType@emd_TableMachine undeclared.
2018-09-11 10:54:49,527 [INFO]         Variable axisOrder@emd_TableMachine undeclared.
2018-09-11 10:54:49,527 [INFO]         Variable Tfunct@emd_TableMachine undeclared.
2018-09-11 10:54:49,527 [INFO]         Variable TfunctWToUTe@emd_TableMachine undeclared.
2018-09-11 10:54:49,528 [INFO]         Variable Lossesfunct@emd_TableMachine undeclared.
2018-09-11 10:54:49,528 [INFO]         Variable LossesfunctWToUTe@emd_TableMachine undeclared.
2018-09-11 10:54:49,528 [INFO]         Variable intltype@emd_TableMachine undeclared.
2018-09-11 10:54:49,528 [INFO]         Variable lmode@emd_TableMachine undeclared.
2018-09-11 10:54:49,528 [INFO]         Variable disc@emd_TableMachine undeclared.
2018-09-11 10:54:49,528 [INFO]         Variable cmode@emd_TableMachine undeclared.
2018-09-11 10:54:49,528 [INFO]         Variable mgTransType@emd_TableMachine undeclared.
2018-09-11 10:54:49,528 [INFO]         Variable TmaxFile@emd_TableMachine undeclared.
2018-09-11 10:54:49,528 [INFO]         Variable TminFile@emd_TableMachine undeclared.
2018-09-11 10:54:49,528 [INFO]         Variable TmaxFileU@emd_TableMachine undeclared.
2018-09-11 10:54:49,528 [INFO]         Variable TminFileU@emd_TableMachine undeclared.
2018-09-11 10:54:49,528 [INFO]         Variable TmaxFileTemp@emd_TableMachine undeclared.
2018-09-11 10:54:49,528 [INFO]         Variable TminFileTemp@emd_TableMachine undeclared.
2018-09-11 10:54:49,528 [INFO]         Variable TmaxFileUTemp@emd_TableMachine undeclared.
2018-09-11 10:54:49,528 [INFO]         Variable TminFileUTemp@emd_TableMachine undeclared.
2018-09-11 10:54:49,528 [INFO]         Variable TmaxFileWU@emd_TableMachine undeclared.
2018-09-11 10:54:49,528 [INFO]         Variable TminFileWU@emd_TableMachine undeclared.
2018-09-11 10:54:49,528 [INFO]         Variable TmaxFileWUTemp@emd_TableMachine undeclared.
2018-09-11 10:54:49,528 [INFO]         Variable TminFileWUTemp@emd_TableMachine undeclared.
2018-09-11 10:54:49,528 [INFO]         Variable LossesFile@emd_TableMachine undeclared.
2018-09-11 10:54:49,528 [INFO]         Variable LossesFileU@emd_TableMachine undeclared.
2018-09-11 10:54:49,528 [INFO]         Variable LossesFileTemp@emd_TableMachine undeclared.
2018-09-11 10:54:49,528 [INFO]         Variable LossesFileUTemp@emd_TableMachine undeclared.
2018-09-11 10:54:49,528 [INFO]         Variable LossesFileWT@emd_TableMachine undeclared.
2018-09-11 10:54:49,528 [INFO]         Variable LossesFileWTU@emd_TableMachine undeclared.
2018-09-11 10:54:49,528 [INFO]         Variable LossesFileWTTemp@emd_TableMachine undeclared.
2018-09-11 10:54:49,528 [INFO]         Variable LossesFileWTUTemp@emd_TableMachine undeclared.
2018-09-11 10:54:49,528 [INFO]         Variable #torque@emd_TableMachine undeclared.
2018-09-11 10:54:49,528 [INFO]         Variable alpha@reducer_1 undeclared.
2018-09-11 10:54:49,528 [INFO]         Variable offsetp@powersensor_rotary_1 undeclared.
2018-09-11 10:54:49,528 [INFO]         Variable gainp@powersensor_rotary_1 undeclared.
2018-09-11 10:54:49,528 [INFO]         Variable offsete@powersensor_rotary_1 undeclared.
2018-09-11 10:54:49,528 [INFO]         Variable gaine@powersensor_rotary_1 undeclared.
2018-09-11 10:54:49,528 [INFO]         Variable offseta@powersensor_rotary_1 undeclared.
2018-09-11 10:54:49,528 [INFO]         Variable gaina@powersensor_rotary_1 undeclared.
2018-09-11 10:54:49,528 [INFO]         Variable comp@powersensor_rotary_1 undeclared.
2018-09-11 10:54:49,528 [INFO]         Variable offset@rotaryspeedsensor2 undeclared.
2018-09-11 10:54:49,528 [INFO]         Variable gain@rotaryspeedsensor2 undeclared.
2018-09-11 10:54:49,528 [INFO]         Variable conv@rotaryspeedsensor2 undeclared.
2018-09-11 10:54:49,528 [INFO]         Variable k@constant undeclared.
2018-09-11 10:54:49,528 [INFO]         Variable dm undeclared.
2018-09-11 10:54:49,528 [INFO]         Variable pitch undeclared.
2018-09-11 10:54:49,528 [INFO]         Variable mu undeclared.
2018-09-11 10:54:49,528 [INFO]         Variable mu1 undeclared.
2018-09-11 10:54:49,529 [INFO]         Variable pitch1 undeclared.
2018-09-11 10:54:49,529 [INFO]         Variable dm1 undeclared.
2018-09-11 10:54:49,529 [INFO]        <Loading fmu variables
2018-09-11 10:54:49,533 [INFO]       <CppGenerator.doGenerate/var/lib/jenkins/workspace/HybridCosimulation_master-LDEVB56LP46DTRNYHQSCKMS3FR4JD6RBBK6S2LPONMGDZRBJQH3A/DSL_SemanticAdaptation/be.uantwerpen.ansymo.semanticadaptation.cg.cpp.tests/target/test-classes/single_folder_spec/emptyctrlrules
Stored file: target/test-classes/single_folder_spec/emptyctrlrules/PlantMR/CMakeLists.txt
Stored file: target/test-classes/single_folder_spec/emptyctrlrules/PlantMR/sources/Fmu.cpp
Stored file: target/test-classes/single_folder_spec/emptyctrlrules/PlantMR/sources/PlantMultiRate.cpp
Stored file: target/test-classes/single_folder_spec/emptyctrlrules/PlantMR/sources/PlantMultiRate.h
Stored file: target/test-classes/single_folder_spec/emptyctrlrules/PlantMR/modelDescription.xml
Stored file: target/test-classes/single_folder_spec/emptyctrlrules/PlantMR/msys-toolchain.cmake
Stored file: target/test-classes/single_folder_spec/emptyctrlrules/PlantMR/sources/main.cpp
Copied file to: target/test-classes/single_folder_spec/emptyctrlrules/PlantMR/resources/EMAPlantNoLoad_FixedEuler_1Em6.fmu
-- The C compiler identification is GNU 5.4.0
-- The CXX compiler identification is GNU 5.4.0
-- Check for working C compiler: /usr/bin/cc
-- Check for working C compiler: /usr/bin/cc -- works
-- Detecting C compiler ABI info
-- Detecting C compiler ABI info - done
-- Detecting C compile features
-- Detecting C compile features - done
-- Check for working CXX compiler: /usr/bin/c++
-- Check for working CXX compiler: /usr/bin/c++ -- works
-- Detecting CXX compiler ABI info
-- Detecting CXX compiler ABI info - done
-- Detecting CXX compile features
-- Detecting CXX compile features - done
Already up-to-date.
-- Performing Test COMPILER_SUPPORTS_CXX11
-- Performing Test COMPILER_SUPPORTS_CXX11 - Success
-- Performing Test COMPILER_SUPPORTS_CXX0X
-- Performing Test COMPILER_SUPPORTS_CXX0X - Success
-- Found ZLIB: /usr/lib/x86_64-linux-gnu/libz.so (found version "1.2.8") 
-- Configuring done
-- Generating done
-- Build files have been written to: /var/lib/jenkins/workspace/HybridCosimulation_master-LDEVB56LP46DTRNYHQSCKMS3FR4JD6RBBK6S2LPONMGDZRBJQH3A/DSL_SemanticAdaptation/be.uantwerpen.ansymo.semanticadaptation.cg.cpp.tests/target/test-classes/single_folder_spec/emptyctrlrules/PlantMR
Scanning dependencies of target minizip
[  4%] Building C object hcf/semantic-adaptation/third_party/into-cpp-fmi/thrird_party/projects/minizip/CMakeFiles/minizip.dir/__/__/zlib/contrib/minizip/ioapi.c.o
[  9%] Building C object hcf/semantic-adaptation/third_party/into-cpp-fmi/thrird_party/projects/minizip/CMakeFiles/minizip.dir/miniunz.c.o
[ 14%] Building C object hcf/semantic-adaptation/third_party/into-cpp-fmi/thrird_party/projects/minizip/CMakeFiles/minizip.dir/__/__/zlib/contrib/minizip/mztools.c.o
[ 19%] Building C object hcf/semantic-adaptation/third_party/into-cpp-fmi/thrird_party/projects/minizip/CMakeFiles/minizip.dir/__/__/zlib/contrib/minizip/unzip.c.o
[ 23%] Building C object hcf/semantic-adaptation/third_party/into-cpp-fmi/thrird_party/projects/minizip/CMakeFiles/minizip.dir/__/__/zlib/contrib/minizip/zip.c.o
[ 28%] Linking C static library libminizipd.a
/usr/bin/ar qc libminizipd.a  CMakeFiles/minizip.dir/__/__/zlib/contrib/minizip/ioapi.c.o CMakeFiles/minizip.dir/miniunz.c.o CMakeFiles/minizip.dir/__/__/zlib/contrib/minizip/mztools.c.o CMakeFiles/minizip.dir/__/__/zlib/contrib/minizip/unzip.c.o CMakeFiles/minizip.dir/__/__/zlib/contrib/minizip/zip.c.o
/usr/bin/ranlib libminizipd.a
[ 28%] Built target minizip
Scanning dependencies of target intocppfmi
[ 33%] Building C object hcf/semantic-adaptation/third_party/into-cpp-fmi/CMakeFiles/intocppfmi.dir/src/FmuLoader.c.o
[ 38%] Building CXX object hcf/semantic-adaptation/third_party/into-cpp-fmi/CMakeFiles/intocppfmi.dir/src/FilesystemUtil.cpp.o
[ 42%] Building C object hcf/semantic-adaptation/third_party/into-cpp-fmi/CMakeFiles/intocppfmi.dir/src/uri.c.o
[ 47%] Building CXX object hcf/semantic-adaptation/third_party/into-cpp-fmi/CMakeFiles/intocppfmi.dir/src/Fmu.cpp.o
[ 52%] Linking CXX static library libintocppfmi.a
/usr/bin/ar qc libintocppfmi.a  CMakeFiles/intocppfmi.dir/src/FmuLoader.c.o CMakeFiles/intocppfmi.dir/src/uri.c.o CMakeFiles/intocppfmi.dir/src/FilesystemUtil.cpp.o CMakeFiles/intocppfmi.dir/src/Fmu.cpp.o
/usr/bin/ranlib libintocppfmi.a
[ 52%] Built target intocppfmi
Scanning dependencies of target hcf
[ 57%] Building CXX object hcf/semantic-adaptation/CMakeFiles/hcf.dir/src/Empty.cpp.o
[ 61%] Building CXX object hcf/semantic-adaptation/CMakeFiles/hcf.dir/src/HyfMath.cpp.o
[ 66%] Linking CXX static library libhcf.a
/usr/bin/ar qc libhcf.a  CMakeFiles/hcf.dir/src/Empty.cpp.o CMakeFiles/hcf.dir/src/HyfMath.cpp.o
/usr/bin/ranlib libhcf.a
[ 66%] Built target hcf
Scanning dependencies of target PlantMultiRate
Scanning dependencies of target PlantMultiRate_main
[ 71%] Building CXX object CMakeFiles/PlantMultiRate_main.dir/sources/main.cpp.o
[ 76%] Building CXX object CMakeFiles/PlantMultiRate.dir/sources/Fmu.cpp.o
[ 80%] Building CXX object CMakeFiles/PlantMultiRate.dir/sources/PlantMultiRate.cpp.o
[ 85%] Building CXX object CMakeFiles/PlantMultiRate_main.dir/sources/Fmu.cpp.o
[ 90%] Building CXX object CMakeFiles/PlantMultiRate_main.dir/sources/PlantMultiRate.cpp.o
[ 95%] Linking CXX shared library binaries/linux64/PlantMultiRate.so
[ 95%] Built target PlantMultiRate
[100%] Linking CXX executable PlantMultiRate_main
[100%] Built target PlantMultiRate_main
Scanning dependencies of target pack
modelDescription.xml
resources
resources/EMAPlantNoLoad_FixedEuler_1Em6.fmu
binaries/linux64
binaries/linux64/PlantMultiRate.so
Built target pack
saGenRootTempDir=/var/lib/jenkins/workspace/HybridCosimulation_master-LDEVB56LP46DTRNYHQSCKMS3FR4JD6RBBK6S2LPONMGDZRBJQH3A/DSL_SemanticAdaptation/be.uantwerpen.ansymo.semanticadaptation.cg.cpp.tests/target/test-classes/single_folder_spec/rate/rate
absFileName=/var/lib/jenkins/workspace/HybridCosimulation_master-LDEVB56LP46DTRNYHQSCKMS3FR4JD6RBBK6S2LPONMGDZRBJQH3A/DSL_SemanticAdaptation/be.uantwerpen.ansymo.semanticadaptation.cg.cpp.tests/target/test-classes/single_folder_spec/rate/rate.sa
2018-09-11 10:54:59,388 [DEBUG] Parsing took: 16 ms
2018-09-11 10:54:59,388 [DEBUG] beforeModelLinked took: 0ms
2018-09-11 10:54:59,391 [DEBUG] doLinkModel took: 3ms
2018-09-11 10:54:59,391 [DEBUG] afterModelLinked took: 0ms
2018-09-11 10:54:59,393 [DEBUG] before getLinkedObjects: node: 'loop_sa'
2018-09-11 10:54:59,394 [INFO]       >Getting scope for owner within context class be.uantwerpen.ansymo.semanticadaptation.semanticAdaptation.impl.SpecifiedPortImpl
2018-09-11 10:54:59,394 [INFO]        Delegating scope discovery to super class...
2018-09-11 10:54:59,394 [DEBUG] No explicit container state set. Falling back to default.
2018-09-11 10:54:59,394 [DEBUG] No explicit container state set. Falling back to default.
2018-09-11 10:54:59,394 [DEBUG] No explicit container state set. Falling back to default.
2018-09-11 10:54:59,397 [INFO]       <Scope found:ImportScope[rate_sa.tau.*] imports from org.eclipse.xtext.scoping.impl.MultimapBasedSelectable@55651434 for type FMU
2018-09-11 10:54:59,397 [DEBUG] after getLinkedObjects: node: 'loop_sa' result: loop_sa
2018-09-11 10:54:59,397 [DEBUG] before getLinkedObjects: node: 'tau'
2018-09-11 10:54:59,397 [INFO]       >Getting scope for port within context class be.uantwerpen.ansymo.semanticadaptation.semanticAdaptation.impl.SpecifiedPortImpl
2018-09-11 10:54:59,397 [INFO]        Getting scope within FMU: loop_sa
2018-09-11 10:54:59,397 [INFO]       <Scope found:SimpleScope[displacement, speed, tau] -> NULLSCOPE
2018-09-11 10:54:59,398 [DEBUG] after getLinkedObjects: node: 'tau' result: tau
2018-09-11 10:54:59,398 [DEBUG] before getLinkedObjects: node: 'RATE'
2018-09-11 10:54:59,398 [INFO]       >Getting scope for ref within context class be.uantwerpen.ansymo.semanticadaptation.semanticAdaptation.impl.VariableImpl
2018-09-11 10:54:59,398 [INFO]       <Scope found:SimpleScope[speed, tau, displacement, speed, tau, RATE, previous_speed, micro_step, inner_time, iter, current_speed] -> NULLSCOPE
2018-09-11 10:54:59,398 [DEBUG] after getLinkedObjects: node: 'RATE' result: RATE
2018-09-11 10:54:59,398 [DEBUG] before getLinkedObjects: node: 'RATE'
2018-09-11 10:54:59,398 [INFO]       >Getting scope for ref within context class be.uantwerpen.ansymo.semanticadaptation.semanticAdaptation.impl.VariableImpl
2018-09-11 10:54:59,398 [INFO]       <Scope found:SimpleScope[speed, tau, displacement, speed, tau, RATE, previous_speed, micro_step, inner_time, iter, current_speed] -> NULLSCOPE
2018-09-11 10:54:59,398 [DEBUG] after getLinkedObjects: node: 'RATE' result: RATE
2018-09-11 10:54:59,398 [DEBUG] before getLinkedObjects: node: 'loop_sa'
2018-09-11 10:54:59,398 [INFO]       >Getting scope for fmu within context class be.uantwerpen.ansymo.semanticadaptation.semanticAdaptation.impl.DoStepImpl
2018-09-11 10:54:59,398 [INFO]        Delegating scope discovery to super class...
2018-09-11 10:54:59,399 [INFO]       <Scope found:ImportScope[rate_sa.*] imports from org.eclipse.xtext.scoping.impl.MultimapBasedSelectable@55651434 for type FMU
2018-09-11 10:54:59,399 [DEBUG] after getLinkedObjects: node: 'loop_sa' result: loop_sa
2018-09-11 10:54:59,399 [DEBUG] before getLinkedObjects: node: 'inner_time'
2018-09-11 10:54:59,399 [INFO]       >Getting scope for ref within context class be.uantwerpen.ansymo.semanticadaptation.semanticAdaptation.impl.VariableImpl
2018-09-11 10:54:59,399 [INFO]       <Scope found:SimpleScope[speed, tau, displacement, speed, tau, RATE, previous_speed, micro_step, inner_time, iter, current_speed] -> NULLSCOPE
2018-09-11 10:54:59,399 [DEBUG] after getLinkedObjects: node: 'inner_time' result: inner_time
2018-09-11 10:54:59,399 [DEBUG] before getLinkedObjects: node: 'micro_step'
2018-09-11 10:54:59,399 [INFO]       >Getting scope for ref within context class be.uantwerpen.ansymo.semanticadaptation.semanticAdaptation.impl.VariableImpl
2018-09-11 10:54:59,399 [INFO]       <Scope found:SimpleScope[speed, tau, displacement, speed, tau, RATE, previous_speed, micro_step, inner_time, iter, current_speed] -> NULLSCOPE
2018-09-11 10:54:59,399 [DEBUG] after getLinkedObjects: node: 'micro_step' result: micro_step
2018-09-11 10:54:59,399 [DEBUG] before getLinkedObjects: node: 'inner_time'
2018-09-11 10:54:59,399 [INFO]       >Getting scope for ref within context class be.uantwerpen.ansymo.semanticadaptation.semanticAdaptation.impl.VariableImpl
2018-09-11 10:54:59,400 [INFO]       <Scope found:SimpleScope[speed, tau, displacement, speed, tau, RATE, previous_speed, micro_step, inner_time, iter, current_speed] -> NULLSCOPE
2018-09-11 10:54:59,400 [DEBUG] after getLinkedObjects: node: 'inner_time' result: inner_time
2018-09-11 10:54:59,400 [DEBUG] before getLinkedObjects: node: 'inner_time'
2018-09-11 10:54:59,400 [INFO]       >Getting scope for ref within context class be.uantwerpen.ansymo.semanticadaptation.semanticAdaptation.impl.VariableImpl
2018-09-11 10:54:59,400 [INFO]       <Scope found:SimpleScope[speed, tau, displacement, speed, tau, RATE, previous_speed, micro_step, inner_time, iter, current_speed] -> NULLSCOPE
2018-09-11 10:54:59,400 [DEBUG] after getLinkedObjects: node: 'inner_time' result: inner_time
2018-09-11 10:54:59,400 [DEBUG] before getLinkedObjects: node: 'micro_step'
2018-09-11 10:54:59,400 [INFO]       >Getting scope for ref within context class be.uantwerpen.ansymo.semanticadaptation.semanticAdaptation.impl.VariableImpl
2018-09-11 10:54:59,400 [INFO]       <Scope found:SimpleScope[speed, tau, displacement, speed, tau, RATE, previous_speed, micro_step, inner_time, iter, current_speed] -> NULLSCOPE
2018-09-11 10:54:59,400 [DEBUG] after getLinkedObjects: node: 'micro_step' result: micro_step
2018-09-11 10:54:59,400 [DEBUG] before getLinkedObjects: node: 'previous_speed'
2018-09-11 10:54:59,400 [INFO]       >Getting scope for ref within context class be.uantwerpen.ansymo.semanticadaptation.semanticAdaptation.impl.VariableImpl
2018-09-11 10:54:59,400 [INFO]       <Scope found:SimpleScope[speed, tau, displacement, speed, tau, RATE, previous_speed, micro_step, inner_time, iter, current_speed] -> NULLSCOPE
2018-09-11 10:54:59,400 [DEBUG] after getLinkedObjects: node: 'previous_speed' result: previous_speed
2018-09-11 10:54:59,400 [DEBUG] before getLinkedObjects: node: 'current_speed'
2018-09-11 10:54:59,400 [INFO]       >Getting scope for ref within context class be.uantwerpen.ansymo.semanticadaptation.semanticAdaptation.impl.VariableImpl
2018-09-11 10:54:59,401 [INFO]       <Scope found:SimpleScope[speed, tau, displacement, speed, tau, RATE, previous_speed, micro_step, inner_time, iter, current_speed] -> NULLSCOPE
2018-09-11 10:54:59,401 [DEBUG] after getLinkedObjects: node: 'current_speed' result: current_speed
2018-09-11 10:54:59,401 [DEBUG] before getLinkedObjects: node: 'current_speed'
2018-09-11 10:54:59,401 [INFO]       >Getting scope for ref within context class be.uantwerpen.ansymo.semanticadaptation.semanticAdaptation.impl.VariableImpl
2018-09-11 10:54:59,401 [INFO]       <Scope found:SimpleScope[speed, tau, displacement, speed, tau, RATE, previous_speed, micro_step, inner_time, iter, current_speed] -> NULLSCOPE
2018-09-11 10:54:59,401 [DEBUG] after getLinkedObjects: node: 'current_speed' result: current_speed
2018-09-11 10:54:59,401 [DEBUG] before getLinkedObjects: node: 'speed'
2018-09-11 10:54:59,401 [INFO]       >Getting scope for ref within context class be.uantwerpen.ansymo.semanticadaptation.semanticAdaptation.impl.VariableImpl
2018-09-11 10:54:59,401 [INFO]       <Scope found:SimpleScope[speed, tau, displacement, speed, tau, RATE, previous_speed, micro_step, inner_time, iter, current_speed] -> NULLSCOPE
2018-09-11 10:54:59,401 [DEBUG] after getLinkedObjects: node: 'speed' result: speed
2018-09-11 10:54:59,401 [DEBUG] before getLinkedObjects: node: 'loop_sa'
2018-09-11 10:54:59,401 [INFO]       >Getting scope for owner within context class be.uantwerpen.ansymo.semanticadaptation.semanticAdaptation.impl.VariableImpl
2018-09-11 10:54:59,401 [INFO]        Delegating scope discovery to super class...
2018-09-11 10:54:59,401 [INFO]       <Scope found:ImportScope[rate_sa.*] imports from org.eclipse.xtext.scoping.impl.MultimapBasedSelectable@55651434 for type FMU
2018-09-11 10:54:59,401 [DEBUG] after getLinkedObjects: node: 'loop_sa' result: loop_sa
2018-09-11 10:54:59,401 [DEBUG] before getLinkedObjects: node: 'speed'
2018-09-11 10:54:59,402 [INFO]       >Getting scope for ref within context class be.uantwerpen.ansymo.semanticadaptation.semanticAdaptation.impl.VariableImpl
2018-09-11 10:54:59,402 [INFO]        Getting scope within FMU: loop_sa
2018-09-11 10:54:59,402 [INFO]       <Scope found:SimpleScope[displacement, speed, tau] -> NULLSCOPE
2018-09-11 10:54:59,402 [DEBUG] after getLinkedObjects: node: 'speed' result: speed
2018-09-11 10:54:59,402 [DEBUG] before getLinkedObjects: node: 'previous_speed'
2018-09-11 10:54:59,402 [INFO]       >Getting scope for ref within context class be.uantwerpen.ansymo.semanticadaptation.semanticAdaptation.impl.VariableImpl
2018-09-11 10:54:59,402 [INFO]       <Scope found:SimpleScope[speed, tau, displacement, speed, tau, RATE, previous_speed, micro_step, inner_time, iter, current_speed] -> NULLSCOPE
2018-09-11 10:54:59,402 [DEBUG] after getLinkedObjects: node: 'previous_speed' result: previous_speed
2018-09-11 10:54:59,402 [DEBUG] before getLinkedObjects: node: 'current_speed'
2018-09-11 10:54:59,402 [INFO]       >Getting scope for ref within context class be.uantwerpen.ansymo.semanticadaptation.semanticAdaptation.impl.VariableImpl
2018-09-11 10:54:59,402 [INFO]       <Scope found:SimpleScope[speed, tau, displacement, speed, tau, RATE, previous_speed, micro_step, inner_time, iter, current_speed] -> NULLSCOPE
2018-09-11 10:54:59,402 [DEBUG] after getLinkedObjects: node: 'current_speed' result: current_speed
2018-09-11 10:54:59,402 [DEBUG] before getLinkedObjects: node: 'previous_speed'
2018-09-11 10:54:59,402 [INFO]       >Getting scope for ref within context class be.uantwerpen.ansymo.semanticadaptation.semanticAdaptation.impl.VariableImpl
2018-09-11 10:54:59,402 [INFO]       <Scope found:SimpleScope[speed, tau, displacement, speed, tau, RATE, previous_speed, micro_step, inner_time, iter, current_speed] -> NULLSCOPE
2018-09-11 10:54:59,402 [DEBUG] after getLinkedObjects: node: 'previous_speed' result: previous_speed
2018-09-11 10:54:59,402 [DEBUG] Syntax check OK! Resource: __synthetic0.sa
2018-09-11 10:54:59,405 [INFO]       >CppGenerator.doGenerate /var/lib/jenkins/workspace/HybridCosimulation_master-LDEVB56LP46DTRNYHQSCKMS3FR4JD6RBBK6S2LPONMGDZRBJQH3A/DSL_SemanticAdaptation/be.uantwerpen.ansymo.semanticadaptation.cg.cpp.tests/target/test-classes/single_folder_spec/rate
2018-09-11 10:54:59,405 [INFO]        >Loading fmu "./LoopSA.fmu"
2018-09-11 10:54:59,405 [INFO]         Current working dir: /var/lib/jenkins/workspace/HybridCosimulation_master-LDEVB56LP46DTRNYHQSCKMS3FR4JD6RBBK6S2LPONMGDZRBJQH3A/DSL_SemanticAdaptation/be.uantwerpen.ansymo.semanticadaptation.cg.cpp.tests/target/test-classes/single_folder_spec/rate
2018-09-11 10:54:59,405 [INFO]         Resolved Current working dir: /var/lib/jenkins/workspace/HybridCosimulation_master-LDEVB56LP46DTRNYHQSCKMS3FR4JD6RBBK6S2LPONMGDZRBJQH3A/DSL_SemanticAdaptation/be.uantwerpen.ansymo.semanticadaptation.cg.cpp.tests/target/test-classes/single_folder_spec/rate
2018-09-11 10:54:59,405 [INFO]         Resolved fmu path: /var/lib/jenkins/workspace/HybridCosimulation_master-LDEVB56LP46DTRNYHQSCKMS3FR4JD6RBBK6S2LPONMGDZRBJQH3A/DSL_SemanticAdaptation/be.uantwerpen.ansymo.semanticadaptation.cg.cpp.tests/target/test-classes/single_folder_spec/rate/./LoopSA.fmu
2018-09-11 10:54:59,410 [INFO]         >Loading fmu variables
2018-09-11 10:54:59,410 [INFO]          Variable displacement declared.
2018-09-11 10:54:59,411 [INFO]          Variable speed declared.
2018-09-11 10:54:59,411 [INFO]          Variable tau declared.
2018-09-11 10:54:59,411 [INFO]         <Loading fmu variables
2018-09-11 10:54:59,416 [INFO]        <CppGenerator.doGenerate/var/lib/jenkins/workspace/HybridCosimulation_master-LDEVB56LP46DTRNYHQSCKMS3FR4JD6RBBK6S2LPONMGDZRBJQH3A/DSL_SemanticAdaptation/be.uantwerpen.ansymo.semanticadaptation.cg.cpp.tests/target/test-classes/single_folder_spec/rate
Stored file: target/test-classes/single_folder_spec/rate/rate/CMakeLists.txt
Stored file: target/test-classes/single_folder_spec/rate/rate/sources/Fmu.cpp
Stored file: target/test-classes/single_folder_spec/rate/rate/sources/Rate_sa.cpp
Stored file: target/test-classes/single_folder_spec/rate/rate/sources/Rate_sa.h
Stored file: target/test-classes/single_folder_spec/rate/rate/modelDescription.xml
Stored file: target/test-classes/single_folder_spec/rate/rate/msys-toolchain.cmake
Stored file: target/test-classes/single_folder_spec/rate/rate/sources/main.cpp
Copied file to: target/test-classes/single_folder_spec/rate/rate/resources/LoopSA.fmu
-- The C compiler identification is GNU 5.4.0
-- The CXX compiler identification is GNU 5.4.0
-- Check for working C compiler: /usr/bin/cc
-- Check for working C compiler: /usr/bin/cc -- works
-- Detecting C compiler ABI info
-- Detecting C compiler ABI info - done
-- Detecting C compile features
-- Detecting C compile features - done
-- Check for working CXX compiler: /usr/bin/c++
-- Check for working CXX compiler: /usr/bin/c++ -- works
-- Detecting CXX compiler ABI info
-- Detecting CXX compiler ABI info - done
-- Detecting CXX compile features
-- Detecting CXX compile features - done
Already up-to-date.
-- Performing Test COMPILER_SUPPORTS_CXX11
-- Performing Test COMPILER_SUPPORTS_CXX11 - Success
-- Performing Test COMPILER_SUPPORTS_CXX0X
-- Performing Test COMPILER_SUPPORTS_CXX0X - Success
-- Found ZLIB: /usr/lib/x86_64-linux-gnu/libz.so (found version "1.2.8") 
-- Configuring done
-- Generating done
-- Build files have been written to: /var/lib/jenkins/workspace/HybridCosimulation_master-LDEVB56LP46DTRNYHQSCKMS3FR4JD6RBBK6S2LPONMGDZRBJQH3A/DSL_SemanticAdaptation/be.uantwerpen.ansymo.semanticadaptation.cg.cpp.tests/target/test-classes/single_folder_spec/rate/rate
Scanning dependencies of target minizip
[  4%] Building C object hcf/semantic-adaptation/third_party/into-cpp-fmi/thrird_party/projects/minizip/CMakeFiles/minizip.dir/miniunz.c.o
[  9%] Building C object hcf/semantic-adaptation/third_party/into-cpp-fmi/thrird_party/projects/minizip/CMakeFiles/minizip.dir/__/__/zlib/contrib/minizip/ioapi.c.o
[ 14%] Building C object hcf/semantic-adaptation/third_party/into-cpp-fmi/thrird_party/projects/minizip/CMakeFiles/minizip.dir/__/__/zlib/contrib/minizip/mztools.c.o
[ 19%] Building C object hcf/semantic-adaptation/third_party/into-cpp-fmi/thrird_party/projects/minizip/CMakeFiles/minizip.dir/__/__/zlib/contrib/minizip/unzip.c.o
[ 23%] Building C object hcf/semantic-adaptation/third_party/into-cpp-fmi/thrird_party/projects/minizip/CMakeFiles/minizip.dir/__/__/zlib/contrib/minizip/zip.c.o
[ 28%] Linking C static library libminizipd.a
/usr/bin/ar qc libminizipd.a  CMakeFiles/minizip.dir/__/__/zlib/contrib/minizip/ioapi.c.o CMakeFiles/minizip.dir/miniunz.c.o CMakeFiles/minizip.dir/__/__/zlib/contrib/minizip/mztools.c.o CMakeFiles/minizip.dir/__/__/zlib/contrib/minizip/unzip.c.o CMakeFiles/minizip.dir/__/__/zlib/contrib/minizip/zip.c.o
/usr/bin/ranlib libminizipd.a
[ 28%] Built target minizip
Scanning dependencies of target intocppfmi
[ 33%] Building CXX object hcf/semantic-adaptation/third_party/into-cpp-fmi/CMakeFiles/intocppfmi.dir/src/FilesystemUtil.cpp.o
[ 38%] Building C object hcf/semantic-adaptation/third_party/into-cpp-fmi/CMakeFiles/intocppfmi.dir/src/FmuLoader.c.o
[ 42%] Building C object hcf/semantic-adaptation/third_party/into-cpp-fmi/CMakeFiles/intocppfmi.dir/src/uri.c.o
[ 47%] Building CXX object hcf/semantic-adaptation/third_party/into-cpp-fmi/CMakeFiles/intocppfmi.dir/src/Fmu.cpp.o
[ 52%] Linking CXX static library libintocppfmi.a
/usr/bin/ar qc libintocppfmi.a  CMakeFiles/intocppfmi.dir/src/FmuLoader.c.o CMakeFiles/intocppfmi.dir/src/uri.c.o CMakeFiles/intocppfmi.dir/src/FilesystemUtil.cpp.o CMakeFiles/intocppfmi.dir/src/Fmu.cpp.o
/usr/bin/ranlib libintocppfmi.a
[ 52%] Built target intocppfmi
Scanning dependencies of target hcf
[ 57%] Building CXX object hcf/semantic-adaptation/CMakeFiles/hcf.dir/src/HyfMath.cpp.o
[ 61%] Building CXX object hcf/semantic-adaptation/CMakeFiles/hcf.dir/src/Empty.cpp.o
[ 66%] Linking CXX static library libhcf.a
/usr/bin/ar qc libhcf.a  CMakeFiles/hcf.dir/src/Empty.cpp.o CMakeFiles/hcf.dir/src/HyfMath.cpp.o
/usr/bin/ranlib libhcf.a
[ 66%] Built target hcf
Scanning dependencies of target rate_sa
Scanning dependencies of target rate_sa_main
[ 71%] Building CXX object CMakeFiles/rate_sa.dir/sources/Fmu.cpp.o
[ 76%] Building CXX object CMakeFiles/rate_sa_main.dir/sources/main.cpp.o
[ 80%] Building CXX object CMakeFiles/rate_sa.dir/sources/Rate_sa.cpp.o
[ 85%] Building CXX object CMakeFiles/rate_sa_main.dir/sources/Fmu.cpp.o
[ 90%] Building CXX object CMakeFiles/rate_sa_main.dir/sources/Rate_sa.cpp.o
[ 95%] Linking CXX shared library binaries/linux64/rate_sa.so
[ 95%] Built target rate_sa
[100%] Linking CXX executable rate_sa_main
[100%] Built target rate_sa_main
Scanning dependencies of target pack
modelDescription.xml
resources
resources/LoopSA.fmu
binaries/linux64
binaries/linux64/rate_sa.so
Built target pack
saGenRootTempDir=/var/lib/jenkins/workspace/HybridCosimulation_master-LDEVB56LP46DTRNYHQSCKMS3FR4JD6RBBK6S2LPONMGDZRBJQH3A/DSL_SemanticAdaptation/be.uantwerpen.ansymo.semanticadaptation.cg.cpp.tests/target/test-classes/single_folder_spec/power/power
absFileName=/var/lib/jenkins/workspace/HybridCosimulation_master-LDEVB56LP46DTRNYHQSCKMS3FR4JD6RBBK6S2LPONMGDZRBJQH3A/DSL_SemanticAdaptation/be.uantwerpen.ansymo.semanticadaptation.cg.cpp.tests/target/test-classes/single_folder_spec/power/power.BASE.sa
2018-09-11 10:55:12,490 [DEBUG] Parsing took: 7 ms
2018-09-11 10:55:12,490 [DEBUG] beforeModelLinked took: 0ms
2018-09-11 10:55:12,492 [DEBUG] doLinkModel took: 2ms
2018-09-11 10:55:12,492 [DEBUG] afterModelLinked took: 0ms
2018-09-11 10:55:12,497 [DEBUG] before getLinkedObjects: node: 'power'
2018-09-11 10:55:12,497 [INFO]        >Getting scope for owner within context class be.uantwerpen.ansymo.semanticadaptation.semanticAdaptation.impl.SpecifiedPortImpl
2018-09-11 10:55:12,497 [INFO]         Delegating scope discovery to super class...
2018-09-11 10:55:12,498 [DEBUG] No explicit container state set. Falling back to default.
2018-09-11 10:55:12,498 [DEBUG] No explicit container state set. Falling back to default.
2018-09-11 10:55:12,498 [DEBUG] No explicit container state set. Falling back to default.
2018-09-11 10:55:12,501 [INFO]        <Scope found:ImportScope[power_sa.u.*] imports from org.eclipse.xtext.scoping.impl.MultimapBasedSelectable@73971965 for type FMU
2018-09-11 10:55:12,501 [DEBUG] after getLinkedObjects: node: 'power' result: power
2018-09-11 10:55:12,501 [DEBUG] before getLinkedObjects: node: 'u'
2018-09-11 10:55:12,501 [INFO]        >Getting scope for port within context class be.uantwerpen.ansymo.semanticadaptation.semanticAdaptation.impl.SpecifiedPortImpl
2018-09-11 10:55:12,501 [INFO]         Getting scope within FMU: power
2018-09-11 10:55:12,501 [INFO]        <Scope found:SimpleScope[u, d, tau, armature_current, speed, displacement] -> NULLSCOPE
2018-09-11 10:55:12,502 [DEBUG] after getLinkedObjects: node: 'u' result: u
2018-09-11 10:55:12,502 [DEBUG] before getLinkedObjects: node: 'power'
2018-09-11 10:55:12,502 [INFO]        >Getting scope for owner within context class be.uantwerpen.ansymo.semanticadaptation.semanticAdaptation.impl.SpecifiedPortImpl
2018-09-11 10:55:12,502 [INFO]         Delegating scope discovery to super class...
2018-09-11 10:55:12,502 [INFO]        <Scope found:ImportScope[power_sa.d.*] imports from org.eclipse.xtext.scoping.impl.MultimapBasedSelectable@73971965 for type FMU
2018-09-11 10:55:12,502 [DEBUG] after getLinkedObjects: node: 'power' result: power
2018-09-11 10:55:12,502 [DEBUG] before getLinkedObjects: node: 'd'
2018-09-11 10:55:12,502 [INFO]        >Getting scope for port within context class be.uantwerpen.ansymo.semanticadaptation.semanticAdaptation.impl.SpecifiedPortImpl
2018-09-11 10:55:12,502 [INFO]         Getting scope within FMU: power
2018-09-11 10:55:12,502 [INFO]        <Scope found:SimpleScope[u, d, tau, armature_current, speed, displacement] -> NULLSCOPE
2018-09-11 10:55:12,502 [DEBUG] after getLinkedObjects: node: 'd' result: d
2018-09-11 10:55:12,503 [DEBUG] before getLinkedObjects: node: 'power'
2018-09-11 10:55:12,503 [INFO]        >Getting scope for owner within context class be.uantwerpen.ansymo.semanticadaptation.semanticAdaptation.impl.SpecifiedPortImpl
2018-09-11 10:55:12,503 [INFO]         Delegating scope discovery to super class...
2018-09-11 10:55:12,503 [INFO]        <Scope found:ImportScope[power_sa.tau.*] imports from org.eclipse.xtext.scoping.impl.MultimapBasedSelectable@73971965 for type FMU
2018-09-11 10:55:12,503 [DEBUG] after getLinkedObjects: node: 'power' result: power
2018-09-11 10:55:12,503 [DEBUG] before getLinkedObjects: node: 'tau'
2018-09-11 10:55:12,503 [INFO]        >Getting scope for port within context class be.uantwerpen.ansymo.semanticadaptation.semanticAdaptation.impl.SpecifiedPortImpl
2018-09-11 10:55:12,503 [INFO]         Getting scope within FMU: power
2018-09-11 10:55:12,503 [INFO]        <Scope found:SimpleScope[u, d, tau, armature_current, speed, displacement] -> NULLSCOPE
2018-09-11 10:55:12,503 [DEBUG] after getLinkedObjects: node: 'tau' result: tau
2018-09-11 10:55:12,503 [DEBUG] before getLinkedObjects: node: 'power'
2018-09-11 10:55:12,503 [INFO]        >Getting scope for owner within context class be.uantwerpen.ansymo.semanticadaptation.semanticAdaptation.impl.SpecifiedPortImpl
2018-09-11 10:55:12,503 [INFO]         Delegating scope discovery to super class...
2018-09-11 10:55:12,504 [INFO]        <Scope found:ImportScope[power_sa.armature_current.*] imports from org.eclipse.xtext.scoping.impl.MultimapBasedSelectable@73971965 for type FMU
2018-09-11 10:55:12,504 [DEBUG] after getLinkedObjects: node: 'power' result: power
2018-09-11 10:55:12,504 [DEBUG] before getLinkedObjects: node: 'armature_current'
2018-09-11 10:55:12,504 [INFO]        >Getting scope for port within context class be.uantwerpen.ansymo.semanticadaptation.semanticAdaptation.impl.SpecifiedPortImpl
2018-09-11 10:55:12,504 [INFO]         Getting scope within FMU: power
2018-09-11 10:55:12,504 [INFO]        <Scope found:SimpleScope[u, d, tau, armature_current, speed, displacement] -> NULLSCOPE
2018-09-11 10:55:12,504 [DEBUG] after getLinkedObjects: node: 'armature_current' result: armature_current
2018-09-11 10:55:12,504 [DEBUG] before getLinkedObjects: node: 'power'
2018-09-11 10:55:12,504 [INFO]        >Getting scope for owner within context class be.uantwerpen.ansymo.semanticadaptation.semanticAdaptation.impl.SpecifiedPortImpl
2018-09-11 10:55:12,504 [INFO]         Delegating scope discovery to super class...
2018-09-11 10:55:12,505 [INFO]        <Scope found:ImportScope[power_sa.speed.*] imports from org.eclipse.xtext.scoping.impl.MultimapBasedSelectable@73971965 for type FMU
2018-09-11 10:55:12,505 [DEBUG] after getLinkedObjects: node: 'power' result: power
2018-09-11 10:55:12,505 [DEBUG] before getLinkedObjects: node: 'speed'
2018-09-11 10:55:12,505 [INFO]        >Getting scope for port within context class be.uantwerpen.ansymo.semanticadaptation.semanticAdaptation.impl.SpecifiedPortImpl
2018-09-11 10:55:12,505 [INFO]         Getting scope within FMU: power
2018-09-11 10:55:12,505 [INFO]        <Scope found:SimpleScope[u, d, tau, armature_current, speed, displacement] -> NULLSCOPE
2018-09-11 10:55:12,505 [DEBUG] after getLinkedObjects: node: 'speed' result: speed
2018-09-11 10:55:12,505 [DEBUG] before getLinkedObjects: node: 'power'
2018-09-11 10:55:12,505 [INFO]        >Getting scope for owner within context class be.uantwerpen.ansymo.semanticadaptation.semanticAdaptation.impl.SpecifiedPortImpl
2018-09-11 10:55:12,505 [INFO]         Delegating scope discovery to super class...
2018-09-11 10:55:12,505 [INFO]        <Scope found:ImportScope[power_sa.displacement.*] imports from org.eclipse.xtext.scoping.impl.MultimapBasedSelectable@73971965 for type FMU
2018-09-11 10:55:12,506 [DEBUG] after getLinkedObjects: node: 'power' result: power
2018-09-11 10:55:12,506 [DEBUG] before getLinkedObjects: node: 'displacement'
2018-09-11 10:55:12,506 [INFO]        >Getting scope for port within context class be.uantwerpen.ansymo.semanticadaptation.semanticAdaptation.impl.SpecifiedPortImpl
2018-09-11 10:55:12,506 [INFO]         Getting scope within FMU: power
2018-09-11 10:55:12,506 [INFO]        <Scope found:SimpleScope[u, d, tau, armature_current, speed, displacement] -> NULLSCOPE
2018-09-11 10:55:12,506 [DEBUG] after getLinkedObjects: node: 'displacement' result: displacement
2018-09-11 10:55:12,506 [DEBUG] Syntax check OK! Resource: __synthetic0.sa
2018-09-11 10:55:12,509 [INFO]        >CppGenerator.doGenerate /var/lib/jenkins/workspace/HybridCosimulation_master-LDEVB56LP46DTRNYHQSCKMS3FR4JD6RBBK6S2LPONMGDZRBJQH3A/DSL_SemanticAdaptation/be.uantwerpen.ansymo.semanticadaptation.cg.cpp.tests/target/test-classes/single_folder_spec/power
2018-09-11 10:55:12,509 [INFO]         >Loading fmu "./Power.fmu"
2018-09-11 10:55:12,509 [INFO]          Current working dir: /var/lib/jenkins/workspace/HybridCosimulation_master-LDEVB56LP46DTRNYHQSCKMS3FR4JD6RBBK6S2LPONMGDZRBJQH3A/DSL_SemanticAdaptation/be.uantwerpen.ansymo.semanticadaptation.cg.cpp.tests/target/test-classes/single_folder_spec/power
2018-09-11 10:55:12,509 [INFO]          Resolved Current working dir: /var/lib/jenkins/workspace/HybridCosimulation_master-LDEVB56LP46DTRNYHQSCKMS3FR4JD6RBBK6S2LPONMGDZRBJQH3A/DSL_SemanticAdaptation/be.uantwerpen.ansymo.semanticadaptation.cg.cpp.tests/target/test-classes/single_folder_spec/power
2018-09-11 10:55:12,509 [INFO]          Resolved fmu path: /var/lib/jenkins/workspace/HybridCosimulation_master-LDEVB56LP46DTRNYHQSCKMS3FR4JD6RBBK6S2LPONMGDZRBJQH3A/DSL_SemanticAdaptation/be.uantwerpen.ansymo.semanticadaptation.cg.cpp.tests/target/test-classes/single_folder_spec/power/./Power.fmu
2018-09-11 10:55:12,518 [INFO]          >Loading fmu variables
2018-09-11 10:55:12,518 [INFO]           Variable armature_current declared.
2018-09-11 10:55:12,518 [INFO]           Variable displacement declared.
2018-09-11 10:55:12,518 [INFO]           Variable speed declared.
2018-09-11 10:55:12,518 [INFO]           Variable der(armature_current) undeclared.
2018-09-11 10:55:12,518 [INFO]           Variable der(displacement) undeclared.
2018-09-11 10:55:12,518 [INFO]           Variable der(speed) undeclared.
2018-09-11 10:55:12,518 [INFO]           Variable V undeclared.
2018-09-11 10:55:12,518 [INFO]           Variable d declared.
2018-09-11 10:55:12,518 [INFO]           Variable tau declared.
2018-09-11 10:55:12,518 [INFO]           Variable u declared.
2018-09-11 10:55:12,518 [INFO]           Variable J undeclared.
2018-09-11 10:55:12,518 [INFO]           Variable K undeclared.
2018-09-11 10:55:12,518 [INFO]           Variable L undeclared.
2018-09-11 10:55:12,518 [INFO]           Variable R undeclared.
2018-09-11 10:55:12,518 [INFO]           Variable V_abs undeclared.
2018-09-11 10:55:12,518 [INFO]           Variable b undeclared.
2018-09-11 10:55:12,518 [INFO]          <Loading fmu variables
2018-09-11 10:55:12,525 [INFO]         <CppGenerator.doGenerate/var/lib/jenkins/workspace/HybridCosimulation_master-LDEVB56LP46DTRNYHQSCKMS3FR4JD6RBBK6S2LPONMGDZRBJQH3A/DSL_SemanticAdaptation/be.uantwerpen.ansymo.semanticadaptation.cg.cpp.tests/target/test-classes/single_folder_spec/power
Stored file: target/test-classes/single_folder_spec/power/power/CMakeLists.txt
Stored file: target/test-classes/single_folder_spec/power/power/sources/Fmu.cpp
Stored file: target/test-classes/single_folder_spec/power/power/sources/Power_sa.cpp
Stored file: target/test-classes/single_folder_spec/power/power/sources/Power_sa.h
Stored file: target/test-classes/single_folder_spec/power/power/modelDescription.xml
Stored file: target/test-classes/single_folder_spec/power/power/msys-toolchain.cmake
Stored file: target/test-classes/single_folder_spec/power/power/sources/main.cpp
Copied file to: target/test-classes/single_folder_spec/power/power/resources/Power.fmu
-- The C compiler identification is GNU 5.4.0
-- The CXX compiler identification is GNU 5.4.0
-- Check for working C compiler: /usr/bin/cc
-- Check for working C compiler: /usr/bin/cc -- works
-- Detecting C compiler ABI info
-- Detecting C compiler ABI info - done
-- Detecting C compile features
-- Detecting C compile features - done
-- Check for working CXX compiler: /usr/bin/c++
-- Check for working CXX compiler: /usr/bin/c++ -- works
-- Detecting CXX compiler ABI info
-- Detecting CXX compiler ABI info - done
-- Detecting CXX compile features
-- Detecting CXX compile features - done
Already up-to-date.
-- Performing Test COMPILER_SUPPORTS_CXX11
-- Performing Test COMPILER_SUPPORTS_CXX11 - Success
-- Performing Test COMPILER_SUPPORTS_CXX0X
-- Performing Test COMPILER_SUPPORTS_CXX0X - Success
-- Found ZLIB: /usr/lib/x86_64-linux-gnu/libz.so (found version "1.2.8") 
-- Configuring done
-- Generating done
-- Build files have been written to: /var/lib/jenkins/workspace/HybridCosimulation_master-LDEVB56LP46DTRNYHQSCKMS3FR4JD6RBBK6S2LPONMGDZRBJQH3A/DSL_SemanticAdaptation/be.uantwerpen.ansymo.semanticadaptation.cg.cpp.tests/target/test-classes/single_folder_spec/power/power
Scanning dependencies of target minizip
[  4%] Building C object hcf/semantic-adaptation/third_party/into-cpp-fmi/thrird_party/projects/minizip/CMakeFiles/minizip.dir/miniunz.c.o
[  9%] Building C object hcf/semantic-adaptation/third_party/into-cpp-fmi/thrird_party/projects/minizip/CMakeFiles/minizip.dir/__/__/zlib/contrib/minizip/ioapi.c.o
[ 14%] Building C object hcf/semantic-adaptation/third_party/into-cpp-fmi/thrird_party/projects/minizip/CMakeFiles/minizip.dir/__/__/zlib/contrib/minizip/mztools.c.o
[ 19%] Building C object hcf/semantic-adaptation/third_party/into-cpp-fmi/thrird_party/projects/minizip/CMakeFiles/minizip.dir/__/__/zlib/contrib/minizip/unzip.c.o
[ 23%] Building C object hcf/semantic-adaptation/third_party/into-cpp-fmi/thrird_party/projects/minizip/CMakeFiles/minizip.dir/__/__/zlib/contrib/minizip/zip.c.o
[ 28%] Linking C static library libminizipd.a
/usr/bin/ar qc libminizipd.a  CMakeFiles/minizip.dir/__/__/zlib/contrib/minizip/ioapi.c.o CMakeFiles/minizip.dir/miniunz.c.o CMakeFiles/minizip.dir/__/__/zlib/contrib/minizip/mztools.c.o CMakeFiles/minizip.dir/__/__/zlib/contrib/minizip/unzip.c.o CMakeFiles/minizip.dir/__/__/zlib/contrib/minizip/zip.c.o
/usr/bin/ranlib libminizipd.a
[ 28%] Built target minizip
Scanning dependencies of target intocppfmi
[ 33%] Building C object hcf/semantic-adaptation/third_party/into-cpp-fmi/CMakeFiles/intocppfmi.dir/src/uri.c.o
[ 38%] Building CXX object hcf/semantic-adaptation/third_party/into-cpp-fmi/CMakeFiles/intocppfmi.dir/src/FilesystemUtil.cpp.o
[ 42%] Building C object hcf/semantic-adaptation/third_party/into-cpp-fmi/CMakeFiles/intocppfmi.dir/src/FmuLoader.c.o
[ 47%] Building CXX object hcf/semantic-adaptation/third_party/into-cpp-fmi/CMakeFiles/intocppfmi.dir/src/Fmu.cpp.o
[ 52%] Linking CXX static library libintocppfmi.a
/usr/bin/ar qc libintocppfmi.a  CMakeFiles/intocppfmi.dir/src/FmuLoader.c.o CMakeFiles/intocppfmi.dir/src/uri.c.o CMakeFiles/intocppfmi.dir/src/FilesystemUtil.cpp.o CMakeFiles/intocppfmi.dir/src/Fmu.cpp.o
/usr/bin/ranlib libintocppfmi.a
[ 52%] Built target intocppfmi
Scanning dependencies of target hcf
[ 57%] Building CXX object hcf/semantic-adaptation/CMakeFiles/hcf.dir/src/HyfMath.cpp.o
[ 61%] Building CXX object hcf/semantic-adaptation/CMakeFiles/hcf.dir/src/Empty.cpp.o
[ 66%] Linking CXX static library libhcf.a
/usr/bin/ar qc libhcf.a  CMakeFiles/hcf.dir/src/Empty.cpp.o CMakeFiles/hcf.dir/src/HyfMath.cpp.o
/usr/bin/ranlib libhcf.a
[ 66%] Built target hcf
Scanning dependencies of target power_sa
Scanning dependencies of target power_sa_main
[ 71%] Building CXX object CMakeFiles/power_sa.dir/sources/Fmu.cpp.o
[ 76%] Building CXX object CMakeFiles/power_sa_main.dir/sources/main.cpp.o
[ 80%] Building CXX object CMakeFiles/power_sa.dir/sources/Power_sa.cpp.o
[ 85%] Building CXX object CMakeFiles/power_sa_main.dir/sources/Fmu.cpp.o
[ 90%] Building CXX object CMakeFiles/power_sa_main.dir/sources/Power_sa.cpp.o
[ 95%] Linking CXX shared library binaries/linux64/power_sa.so
[ 95%] Built target power_sa
[100%] Linking CXX executable power_sa_main
[100%] Built target power_sa_main
Scanning dependencies of target pack
modelDescription.xml
resources
resources/Power.fmu
binaries/linux64
binaries/linux64/power_sa.so
Built target pack
saGenRootTempDir=/var/lib/jenkins/workspace/HybridCosimulation_master-LDEVB56LP46DTRNYHQSCKMS3FR4JD6RBBK6S2LPONMGDZRBJQH3A/DSL_SemanticAdaptation/be.uantwerpen.ansymo.semanticadaptation.cg.cpp.tests/target/test-classes/single_folder_spec/rate/rate_canonical
absFileName=/var/lib/jenkins/workspace/HybridCosimulation_master-LDEVB56LP46DTRNYHQSCKMS3FR4JD6RBBK6S2LPONMGDZRBJQH3A/DSL_SemanticAdaptation/be.uantwerpen.ansymo.semanticadaptation.cg.cpp.tests/target/test-classes/single_folder_spec/rate/rate_canonical.sa
2018-09-11 10:55:24,826 [DEBUG] Parsing took: 13 ms
2018-09-11 10:55:24,826 [DEBUG] beforeModelLinked took: 0ms
2018-09-11 10:55:24,829 [DEBUG] doLinkModel took: 3ms
2018-09-11 10:55:24,829 [DEBUG] afterModelLinked took: 0ms
2018-09-11 10:55:24,832 [DEBUG] before getLinkedObjects: node: 'RATE'
2018-09-11 10:55:24,832 [INFO]         >Getting scope for ref within context class be.uantwerpen.ansymo.semanticadaptation.semanticAdaptation.impl.VariableImpl
2018-09-11 10:55:24,833 [INFO]         <Scope found:SimpleScope[speed, tau, displacement, speed, tau, RATE, previous_speed, micro_step, inner_time, iter, current_speed, stored_loop_sa_tau] -> NULLSCOPE
2018-09-11 10:55:24,833 [DEBUG] after getLinkedObjects: node: 'RATE' result: RATE
2018-09-11 10:55:24,833 [DEBUG] before getLinkedObjects: node: 'RATE'
2018-09-11 10:55:24,833 [INFO]         >Getting scope for ref within context class be.uantwerpen.ansymo.semanticadaptation.semanticAdaptation.impl.VariableImpl
2018-09-11 10:55:24,833 [INFO]         <Scope found:SimpleScope[speed, tau, displacement, speed, tau, RATE, previous_speed, micro_step, inner_time, iter, current_speed, stored_loop_sa_tau] -> NULLSCOPE
2018-09-11 10:55:24,833 [DEBUG] after getLinkedObjects: node: 'RATE' result: RATE
2018-09-11 10:55:24,834 [DEBUG] before getLinkedObjects: node: 'loop_sa'
2018-09-11 10:55:24,834 [INFO]         >Getting scope for fmu within context class be.uantwerpen.ansymo.semanticadaptation.semanticAdaptation.impl.DoStepImpl
2018-09-11 10:55:24,834 [INFO]          Delegating scope discovery to super class...
2018-09-11 10:55:24,834 [DEBUG] No explicit container state set. Falling back to default.
2018-09-11 10:55:24,834 [DEBUG] No explicit container state set. Falling back to default.
2018-09-11 10:55:24,834 [DEBUG] No explicit container state set. Falling back to default.
2018-09-11 10:55:24,836 [INFO]         <Scope found:ImportScope[rate_sa.*] imports from org.eclipse.xtext.scoping.impl.MultimapBasedSelectable@b0a1231 for type FMU
2018-09-11 10:55:24,837 [DEBUG] after getLinkedObjects: node: 'loop_sa' result: loop_sa
2018-09-11 10:55:24,837 [DEBUG] before getLinkedObjects: node: 'inner_time'
2018-09-11 10:55:24,837 [INFO]         >Getting scope for ref within context class be.uantwerpen.ansymo.semanticadaptation.semanticAdaptation.impl.VariableImpl
2018-09-11 10:55:24,837 [INFO]         <Scope found:SimpleScope[speed, tau, displacement, speed, tau, RATE, previous_speed, micro_step, inner_time, iter, current_speed, stored_loop_sa_tau] -> NULLSCOPE
2018-09-11 10:55:24,837 [DEBUG] after getLinkedObjects: node: 'inner_time' result: inner_time
2018-09-11 10:55:24,837 [DEBUG] before getLinkedObjects: node: 'micro_step'
2018-09-11 10:55:24,837 [INFO]         >Getting scope for ref within context class be.uantwerpen.ansymo.semanticadaptation.semanticAdaptation.impl.VariableImpl
2018-09-11 10:55:24,837 [INFO]         <Scope found:SimpleScope[speed, tau, displacement, speed, tau, RATE, previous_speed, micro_step, inner_time, iter, current_speed, stored_loop_sa_tau] -> NULLSCOPE
2018-09-11 10:55:24,837 [DEBUG] after getLinkedObjects: node: 'micro_step' result: micro_step
2018-09-11 10:55:24,837 [DEBUG] before getLinkedObjects: node: 'inner_time'
2018-09-11 10:55:24,837 [INFO]         >Getting scope for ref within context class be.uantwerpen.ansymo.semanticadaptation.semanticAdaptation.impl.VariableImpl
2018-09-11 10:55:24,838 [INFO]         <Scope found:SimpleScope[speed, tau, displacement, speed, tau, RATE, previous_speed, micro_step, inner_time, iter, current_speed, stored_loop_sa_tau] -> NULLSCOPE
2018-09-11 10:55:24,838 [DEBUG] after getLinkedObjects: node: 'inner_time' result: inner_time
2018-09-11 10:55:24,838 [DEBUG] before getLinkedObjects: node: 'inner_time'
2018-09-11 10:55:24,838 [INFO]         >Getting scope for ref within context class be.uantwerpen.ansymo.semanticadaptation.semanticAdaptation.impl.VariableImpl
2018-09-11 10:55:24,838 [INFO]         <Scope found:SimpleScope[speed, tau, displacement, speed, tau, RATE, previous_speed, micro_step, inner_time, iter, current_speed, stored_loop_sa_tau] -> NULLSCOPE
2018-09-11 10:55:24,838 [DEBUG] after getLinkedObjects: node: 'inner_time' result: inner_time
2018-09-11 10:55:24,838 [DEBUG] before getLinkedObjects: node: 'micro_step'
2018-09-11 10:55:24,838 [INFO]         >Getting scope for ref within context class be.uantwerpen.ansymo.semanticadaptation.semanticAdaptation.impl.VariableImpl
2018-09-11 10:55:24,838 [INFO]         <Scope found:SimpleScope[speed, tau, displacement, speed, tau, RATE, previous_speed, micro_step, inner_time, iter, current_speed, stored_loop_sa_tau] -> NULLSCOPE
2018-09-11 10:55:24,838 [DEBUG] after getLinkedObjects: node: 'micro_step' result: micro_step
2018-09-11 10:55:24,838 [DEBUG] before getLinkedObjects: node: 'previous_speed'
2018-09-11 10:55:24,838 [INFO]         >Getting scope for ref within context class be.uantwerpen.ansymo.semanticadaptation.semanticAdaptation.impl.VariableImpl
2018-09-11 10:55:24,839 [INFO]         <Scope found:SimpleScope[speed, tau, displacement, speed, tau, RATE, previous_speed, micro_step, inner_time, iter, current_speed, stored_loop_sa_tau] -> NULLSCOPE
2018-09-11 10:55:24,839 [DEBUG] after getLinkedObjects: node: 'previous_speed' result: previous_speed
2018-09-11 10:55:24,839 [DEBUG] before getLinkedObjects: node: 'current_speed'
2018-09-11 10:55:24,839 [INFO]         >Getting scope for ref within context class be.uantwerpen.ansymo.semanticadaptation.semanticAdaptation.impl.VariableImpl
2018-09-11 10:55:24,839 [INFO]         <Scope found:SimpleScope[speed, tau, displacement, speed, tau, RATE, previous_speed, micro_step, inner_time, iter, current_speed, stored_loop_sa_tau] -> NULLSCOPE
2018-09-11 10:55:24,839 [DEBUG] after getLinkedObjects: node: 'current_speed' result: current_speed
2018-09-11 10:55:24,839 [DEBUG] before getLinkedObjects: node: 'current_speed'
2018-09-11 10:55:24,839 [INFO]         >Getting scope for ref within context class be.uantwerpen.ansymo.semanticadaptation.semanticAdaptation.impl.VariableImpl
2018-09-11 10:55:24,839 [INFO]         <Scope found:SimpleScope[speed, tau, displacement, speed, tau, RATE, previous_speed, micro_step, inner_time, iter, current_speed, stored_loop_sa_tau] -> NULLSCOPE
2018-09-11 10:55:24,839 [DEBUG] after getLinkedObjects: node: 'current_speed' result: current_speed
2018-09-11 10:55:24,839 [DEBUG] before getLinkedObjects: node: 'speed'
2018-09-11 10:55:24,839 [INFO]         >Getting scope for ref within context class be.uantwerpen.ansymo.semanticadaptation.semanticAdaptation.impl.VariableImpl
2018-09-11 10:55:24,839 [INFO]         <Scope found:SimpleScope[speed, tau, displacement, speed, tau, RATE, previous_speed, micro_step, inner_time, iter, current_speed, stored_loop_sa_tau] -> NULLSCOPE
2018-09-11 10:55:24,840 [DEBUG] after getLinkedObjects: node: 'speed' result: speed
2018-09-11 10:55:24,840 [DEBUG] before getLinkedObjects: node: 'loop_sa'
2018-09-11 10:55:24,840 [INFO]         >Getting scope for owner within context class be.uantwerpen.ansymo.semanticadaptation.semanticAdaptation.impl.VariableImpl
2018-09-11 10:55:24,840 [INFO]          Delegating scope discovery to super class...
2018-09-11 10:55:24,840 [INFO]         <Scope found:ImportScope[rate_sa.*] imports from org.eclipse.xtext.scoping.impl.MultimapBasedSelectable@b0a1231 for type FMU
2018-09-11 10:55:24,840 [DEBUG] after getLinkedObjects: node: 'loop_sa' result: loop_sa
2018-09-11 10:55:24,840 [DEBUG] before getLinkedObjects: node: 'speed'
2018-09-11 10:55:24,840 [INFO]         >Getting scope for ref within context class be.uantwerpen.ansymo.semanticadaptation.semanticAdaptation.impl.VariableImpl
2018-09-11 10:55:24,840 [INFO]          Getting scope within FMU: loop_sa
2018-09-11 10:55:24,840 [INFO]         <Scope found:SimpleScope[displacement, speed, tau] -> NULLSCOPE
2018-09-11 10:55:24,840 [DEBUG] after getLinkedObjects: node: 'speed' result: speed
2018-09-11 10:55:24,840 [DEBUG] before getLinkedObjects: node: 'previous_speed'
2018-09-11 10:55:24,840 [INFO]         >Getting scope for ref within context class be.uantwerpen.ansymo.semanticadaptation.semanticAdaptation.impl.VariableImpl
2018-09-11 10:55:24,841 [INFO]         <Scope found:SimpleScope[speed, tau, displacement, speed, tau, RATE, previous_speed, micro_step, inner_time, iter, current_speed, stored_loop_sa_tau] -> NULLSCOPE
2018-09-11 10:55:24,841 [DEBUG] after getLinkedObjects: node: 'previous_speed' result: previous_speed
2018-09-11 10:55:24,841 [DEBUG] before getLinkedObjects: node: 'current_speed'
2018-09-11 10:55:24,841 [INFO]         >Getting scope for ref within context class be.uantwerpen.ansymo.semanticadaptation.semanticAdaptation.impl.VariableImpl
2018-09-11 10:55:24,844 [INFO]         <Scope found:SimpleScope[speed, tau, displacement, speed, tau, RATE, previous_speed, micro_step, inner_time, iter, current_speed, stored_loop_sa_tau] -> NULLSCOPE
2018-09-11 10:55:24,844 [DEBUG] after getLinkedObjects: node: 'current_speed' result: current_speed
2018-09-11 10:55:24,844 [DEBUG] before getLinkedObjects: node: 'previous_speed'
2018-09-11 10:55:24,844 [INFO]         >Getting scope for ref within context class be.uantwerpen.ansymo.semanticadaptation.semanticAdaptation.impl.VariableImpl
2018-09-11 10:55:24,845 [INFO]         <Scope found:SimpleScope[speed, tau, displacement, speed, tau, RATE, previous_speed, micro_step, inner_time, iter, current_speed, stored_loop_sa_tau] -> NULLSCOPE
2018-09-11 10:55:24,845 [DEBUG] after getLinkedObjects: node: 'previous_speed' result: previous_speed
2018-09-11 10:55:24,845 [DEBUG] before getLinkedObjects: node: 'stored_loop_sa_tau'
2018-09-11 10:55:24,845 [INFO]         >Getting scope for ref within context class be.uantwerpen.ansymo.semanticadaptation.semanticAdaptation.impl.VariableImpl
2018-09-11 10:55:24,845 [INFO]         <Scope found:SimpleScope[speed, tau, displacement, speed, tau, RATE, previous_speed, micro_step, inner_time, iter, current_speed, stored_loop_sa_tau] -> NULLSCOPE
2018-09-11 10:55:24,845 [DEBUG] after getLinkedObjects: node: 'stored_loop_sa_tau' result: stored_loop_sa_tau
2018-09-11 10:55:24,845 [DEBUG] before getLinkedObjects: node: 'loop_sa'
2018-09-11 10:55:24,845 [INFO]         >Getting scope for owner within context class be.uantwerpen.ansymo.semanticadaptation.semanticAdaptation.impl.VariableImpl
2018-09-11 10:55:24,845 [INFO]          Delegating scope discovery to super class...
2018-09-11 10:55:24,846 [INFO]         <Scope found:ImportScope[rate_sa.*] imports from org.eclipse.xtext.scoping.impl.MultimapBasedSelectable@b0a1231 for type FMU
2018-09-11 10:55:24,846 [DEBUG] after getLinkedObjects: node: 'loop_sa' result: loop_sa
2018-09-11 10:55:24,846 [DEBUG] before getLinkedObjects: node: 'tau'
2018-09-11 10:55:24,846 [INFO]         >Getting scope for ref within context class be.uantwerpen.ansymo.semanticadaptation.semanticAdaptation.impl.VariableImpl
2018-09-11 10:55:24,846 [INFO]          Getting scope within FMU: loop_sa
2018-09-11 10:55:24,846 [INFO]         <Scope found:SimpleScope[displacement, speed, tau] -> NULLSCOPE
2018-09-11 10:55:24,846 [DEBUG] after getLinkedObjects: node: 'tau' result: tau
2018-09-11 10:55:24,846 [DEBUG] before getLinkedObjects: node: 'rate_sa'
2018-09-11 10:55:24,846 [INFO]         >Getting scope for owner within context class be.uantwerpen.ansymo.semanticadaptation.semanticAdaptation.impl.VariableImpl
2018-09-11 10:55:24,846 [INFO]          Delegating scope discovery to super class...
2018-09-11 10:55:24,846 [INFO]         <Scope found:ImportScope[rate_sa.*] imports from org.eclipse.xtext.scoping.impl.MultimapBasedSelectable@b0a1231 for type FMU
2018-09-11 10:55:24,846 [DEBUG] after getLinkedObjects: node: 'rate_sa' result: rate_sa
2018-09-11 10:55:24,846 [DEBUG] before getLinkedObjects: node: 'tau'
2018-09-11 10:55:24,846 [INFO]         >Getting scope for ref within context class be.uantwerpen.ansymo.semanticadaptation.semanticAdaptation.impl.VariableImpl
2018-09-11 10:55:24,846 [INFO]          Getting scope within FMU: rate_sa
2018-09-11 10:55:24,847 [INFO]         <Scope found:SimpleScope[speed, tau, displacement, speed, tau] -> NULLSCOPE
2018-09-11 10:55:24,847 [DEBUG] after getLinkedObjects: node: 'tau' result: tau
2018-09-11 10:55:24,847 [DEBUG] before getLinkedObjects: node: 'stored_loop_sa_tau'
2018-09-11 10:55:24,847 [INFO]         >Getting scope for ref within context class be.uantwerpen.ansymo.semanticadaptation.semanticAdaptation.impl.VariableImpl
2018-09-11 10:55:24,847 [INFO]         <Scope found:SimpleScope[speed, tau, displacement, speed, tau, RATE, previous_speed, micro_step, inner_time, iter, current_speed, stored_loop_sa_tau] -> NULLSCOPE
2018-09-11 10:55:24,847 [DEBUG] after getLinkedObjects: node: 'stored_loop_sa_tau' result: stored_loop_sa_tau
2018-09-11 10:55:24,847 [DEBUG] Syntax check OK! Resource: __synthetic0.sa
2018-09-11 10:55:24,850 [INFO]         >CppGenerator.doGenerate /var/lib/jenkins/workspace/HybridCosimulation_master-LDEVB56LP46DTRNYHQSCKMS3FR4JD6RBBK6S2LPONMGDZRBJQH3A/DSL_SemanticAdaptation/be.uantwerpen.ansymo.semanticadaptation.cg.cpp.tests/target/test-classes/single_folder_spec/rate
2018-09-11 10:55:24,850 [INFO]          >Loading fmu "./LoopSA.fmu"
2018-09-11 10:55:24,850 [INFO]           Current working dir: /var/lib/jenkins/workspace/HybridCosimulation_master-LDEVB56LP46DTRNYHQSCKMS3FR4JD6RBBK6S2LPONMGDZRBJQH3A/DSL_SemanticAdaptation/be.uantwerpen.ansymo.semanticadaptation.cg.cpp.tests/target/test-classes/single_folder_spec/rate
2018-09-11 10:55:24,850 [INFO]           Resolved Current working dir: /var/lib/jenkins/workspace/HybridCosimulation_master-LDEVB56LP46DTRNYHQSCKMS3FR4JD6RBBK6S2LPONMGDZRBJQH3A/DSL_SemanticAdaptation/be.uantwerpen.ansymo.semanticadaptation.cg.cpp.tests/target/test-classes/single_folder_spec/rate
2018-09-11 10:55:24,850 [INFO]           Resolved fmu path: /var/lib/jenkins/workspace/HybridCosimulation_master-LDEVB56LP46DTRNYHQSCKMS3FR4JD6RBBK6S2LPONMGDZRBJQH3A/DSL_SemanticAdaptation/be.uantwerpen.ansymo.semanticadaptation.cg.cpp.tests/target/test-classes/single_folder_spec/rate/./LoopSA.fmu
2018-09-11 10:55:24,856 [INFO]           >Loading fmu variables
2018-09-11 10:55:24,856 [INFO]            Variable displacement declared.
2018-09-11 10:55:24,856 [INFO]            Variable speed declared.
2018-09-11 10:55:24,856 [INFO]            Variable tau declared.
2018-09-11 10:55:24,856 [INFO]           <Loading fmu variables
2018-09-11 10:55:24,861 [INFO]          <CppGenerator.doGenerate/var/lib/jenkins/workspace/HybridCosimulation_master-LDEVB56LP46DTRNYHQSCKMS3FR4JD6RBBK6S2LPONMGDZRBJQH3A/DSL_SemanticAdaptation/be.uantwerpen.ansymo.semanticadaptation.cg.cpp.tests/target/test-classes/single_folder_spec/rate
Stored file: target/test-classes/single_folder_spec/rate/rate_canonical/CMakeLists.txt
Stored file: target/test-classes/single_folder_spec/rate/rate_canonical/sources/Fmu.cpp
Stored file: target/test-classes/single_folder_spec/rate/rate_canonical/sources/Rate_sa.cpp
Stored file: target/test-classes/single_folder_spec/rate/rate_canonical/sources/Rate_sa.h
Stored file: target/test-classes/single_folder_spec/rate/rate_canonical/modelDescription.xml
Stored file: target/test-classes/single_folder_spec/rate/rate_canonical/msys-toolchain.cmake
Stored file: target/test-classes/single_folder_spec/rate/rate_canonical/sources/main.cpp
Copied file to: target/test-classes/single_folder_spec/rate/rate_canonical/resources/LoopSA.fmu
-- The C compiler identification is GNU 5.4.0
-- The CXX compiler identification is GNU 5.4.0
-- Check for working C compiler: /usr/bin/cc
-- Check for working C compiler: /usr/bin/cc -- works
-- Detecting C compiler ABI info
-- Detecting C compiler ABI info - done
-- Detecting C compile features
-- Detecting C compile features - done
-- Check for working CXX compiler: /usr/bin/c++
-- Check for working CXX compiler: /usr/bin/c++ -- works
-- Detecting CXX compiler ABI info
-- Detecting CXX compiler ABI info - done
-- Detecting CXX compile features
-- Detecting CXX compile features - done
Already up-to-date.
-- Performing Test COMPILER_SUPPORTS_CXX11
-- Performing Test COMPILER_SUPPORTS_CXX11 - Success
-- Performing Test COMPILER_SUPPORTS_CXX0X
-- Performing Test COMPILER_SUPPORTS_CXX0X - Success
-- Found ZLIB: /usr/lib/x86_64-linux-gnu/libz.so (found version "1.2.8") 
-- Configuring done
-- Generating done
-- Build files have been written to: /var/lib/jenkins/workspace/HybridCosimulation_master-LDEVB56LP46DTRNYHQSCKMS3FR4JD6RBBK6S2LPONMGDZRBJQH3A/DSL_SemanticAdaptation/be.uantwerpen.ansymo.semanticadaptation.cg.cpp.tests/target/test-classes/single_folder_spec/rate/rate_canonical
Scanning dependencies of target minizip
[  4%] Building C object hcf/semantic-adaptation/third_party/into-cpp-fmi/thrird_party/projects/minizip/CMakeFiles/minizip.dir/miniunz.c.o
[  9%] Building C object hcf/semantic-adaptation/third_party/into-cpp-fmi/thrird_party/projects/minizip/CMakeFiles/minizip.dir/__/__/zlib/contrib/minizip/ioapi.c.o
[ 14%] Building C object hcf/semantic-adaptation/third_party/into-cpp-fmi/thrird_party/projects/minizip/CMakeFiles/minizip.dir/__/__/zlib/contrib/minizip/mztools.c.o
[ 23%] Building C object hcf/semantic-adaptation/third_party/into-cpp-fmi/thrird_party/projects/minizip/CMakeFiles/minizip.dir/__/__/zlib/contrib/minizip/zip.c.o
[ 23%] Building C object hcf/semantic-adaptation/third_party/into-cpp-fmi/thrird_party/projects/minizip/CMakeFiles/minizip.dir/__/__/zlib/contrib/minizip/unzip.c.o
[ 28%] Linking C static library libminizipd.a
/usr/bin/ar qc libminizipd.a  CMakeFiles/minizip.dir/__/__/zlib/contrib/minizip/ioapi.c.o CMakeFiles/minizip.dir/miniunz.c.o CMakeFiles/minizip.dir/__/__/zlib/contrib/minizip/mztools.c.o CMakeFiles/minizip.dir/__/__/zlib/contrib/minizip/unzip.c.o CMakeFiles/minizip.dir/__/__/zlib/contrib/minizip/zip.c.o
/usr/bin/ranlib libminizipd.a
[ 28%] Built target minizip
Scanning dependencies of target intocppfmi
[ 33%] Building C object hcf/semantic-adaptation/third_party/into-cpp-fmi/CMakeFiles/intocppfmi.dir/src/FmuLoader.c.o
[ 38%] Building CXX object hcf/semantic-adaptation/third_party/into-cpp-fmi/CMakeFiles/intocppfmi.dir/src/FilesystemUtil.cpp.o
[ 42%] Building C object hcf/semantic-adaptation/third_party/into-cpp-fmi/CMakeFiles/intocppfmi.dir/src/uri.c.o
[ 47%] Building CXX object hcf/semantic-adaptation/third_party/into-cpp-fmi/CMakeFiles/intocppfmi.dir/src/Fmu.cpp.o
[ 52%] Linking CXX static library libintocppfmi.a
/usr/bin/ar qc libintocppfmi.a  CMakeFiles/intocppfmi.dir/src/FmuLoader.c.o CMakeFiles/intocppfmi.dir/src/uri.c.o CMakeFiles/intocppfmi.dir/src/FilesystemUtil.cpp.o CMakeFiles/intocppfmi.dir/src/Fmu.cpp.o
/usr/bin/ranlib libintocppfmi.a
[ 52%] Built target intocppfmi
Scanning dependencies of target hcf
[ 57%] Building CXX object hcf/semantic-adaptation/CMakeFiles/hcf.dir/src/HyfMath.cpp.o
[ 61%] Building CXX object hcf/semantic-adaptation/CMakeFiles/hcf.dir/src/Empty.cpp.o
[ 66%] Linking CXX static library libhcf.a
/usr/bin/ar qc libhcf.a  CMakeFiles/hcf.dir/src/Empty.cpp.o CMakeFiles/hcf.dir/src/HyfMath.cpp.o
/usr/bin/ranlib libhcf.a
[ 66%] Built target hcf
Scanning dependencies of target rate_sa
Scanning dependencies of target rate_sa_main
[ 71%] Building CXX object CMakeFiles/rate_sa.dir/sources/Rate_sa.cpp.o
[ 76%] Building CXX object CMakeFiles/rate_sa.dir/sources/Fmu.cpp.o
[ 80%] Building CXX object CMakeFiles/rate_sa_main.dir/sources/main.cpp.o
[ 85%] Building CXX object CMakeFiles/rate_sa_main.dir/sources/Fmu.cpp.o
[ 90%] Linking CXX shared library binaries/linux64/rate_sa.so
[ 95%] Building CXX object CMakeFiles/rate_sa_main.dir/sources/Rate_sa.cpp.o
[ 95%] Built target rate_sa
[100%] Linking CXX executable rate_sa_main
[100%] Built target rate_sa_main
Scanning dependencies of target pack
modelDescription.xml
resources
resources/LoopSA.fmu
binaries/linux64
binaries/linux64/rate_sa.so
Built target pack
Tests run: 10, Failures: 0, Errors: 0, Skipped: 1, Time elapsed: 118.767 sec - in be.uantwerpen.ansymo.semanticadaptation.cg.cpp.tests.CgCppBasicTest
lazy_canonical(be.uantwerpen.ansymo.semanticadaptation.cg.cpp.tests.CgCppBasicTest)  Time elapsed: 11.547 sec
getSetState_sa(be.uantwerpen.ansymo.semanticadaptation.cg.cpp.tests.CgCppBasicTest)  Time elapsed: 13.137 sec
window_sa_canonical_new(be.uantwerpen.ansymo.semanticadaptation.cg.cpp.tests.CgCppBasicTest)  Time elapsed: 11.519 sec
rollback_test(be.uantwerpen.ansymo.semanticadaptation.cg.cpp.tests.CgCppBasicTest)  Time elapsed: 10.56 sec
controller_test(be.uantwerpen.ansymo.semanticadaptation.cg.cpp.tests.CgCppBasicTest)  Time elapsed: 10.186 sec
empty_ctrl_rules(be.uantwerpen.ansymo.semanticadaptation.cg.cpp.tests.CgCppBasicTest)  Time elapsed: 9.94 sec
loop(be.uantwerpen.ansymo.semanticadaptation.cg.cpp.tests.CgCppBasicTest) skipped
rate(be.uantwerpen.ansymo.semanticadaptation.cg.cpp.tests.CgCppBasicTest)  Time elapsed: 13.107 sec
power(be.uantwerpen.ansymo.semanticadaptation.cg.cpp.tests.CgCppBasicTest)  Time elapsed: 12.329 sec
rate_canonical(be.uantwerpen.ansymo.semanticadaptation.cg.cpp.tests.CgCppBasicTest)  Time elapsed: 10.289 sec
Running be.uantwerpen.ansymo.semanticadaptation.cg.cpp.tests.SATest
Tests run: 1, Failures: 0, Errors: 1, Skipped: 0, Time elapsed: 0.008 sec <<< FAILURE! - in be.uantwerpen.ansymo.semanticadaptation.cg.cpp.tests.SATest
initializationError(be.uantwerpen.ansymo.semanticadaptation.cg.cpp.tests.SATest)  Time elapsed: 0.001 sec  <<< ERROR!
java.lang.Exception: No runnable methods
	at org.junit.runners.BlockJUnit4ClassRunner.validateInstanceMethods(BlockJUnit4ClassRunner.java:191)
	at org.junit.runners.BlockJUnit4ClassRunner.collectInitializationErrors(BlockJUnit4ClassRunner.java:128)
	at org.junit.runners.ParentRunner.validate(ParentRunner.java:416)
	at org.junit.runners.ParentRunner.<init>(ParentRunner.java:84)
	at org.junit.runners.BlockJUnit4ClassRunner.<init>(BlockJUnit4ClassRunner.java:65)
	at org.eclipse.xtext.testing.XtextRunner.<init>(XtextRunner.java:23)
	at sun.reflect.NativeConstructorAccessorImpl.newInstance0(Native Method)
	at sun.reflect.NativeConstructorAccessorImpl.newInstance(NativeConstructorAccessorImpl.java:62)
	at sun.reflect.DelegatingConstructorAccessorImpl.newInstance(DelegatingConstructorAccessorImpl.java:45)
	at java.lang.reflect.Constructor.newInstance(Constructor.java:423)
	at org.junit.internal.builders.AnnotatedBuilder.buildRunner(AnnotatedBuilder.java:104)
	at org.junit.internal.builders.AnnotatedBuilder.runnerForClass(AnnotatedBuilder.java:86)
	at org.junit.runners.model.RunnerBuilder.safeRunnerForClass(RunnerBuilder.java:59)
	at org.junit.internal.builders.AllDefaultPossibilitiesBuilder.runnerForClass(AllDefaultPossibilitiesBuilder.java:26)
	at org.junit.runners.model.RunnerBuilder.safeRunnerForClass(RunnerBuilder.java:59)
	at org.junit.internal.requests.ClassRequest.getRunner(ClassRequest.java:33)
	at org.apache.maven.surefire.junit4.JUnit4Provider.execute(JUnit4Provider.java:262)
	at org.apache.maven.surefire.junit4.JUnit4Provider.executeTestSet(JUnit4Provider.java:153)
	at org.apache.maven.surefire.junit4.JUnit4Provider.invoke(JUnit4Provider.java:124)
	at sun.reflect.NativeMethodAccessorImpl.invoke0(Native Method)
	at sun.reflect.NativeMethodAccessorImpl.invoke(NativeMethodAccessorImpl.java:62)
	at sun.reflect.DelegatingMethodAccessorImpl.invoke(DelegatingMethodAccessorImpl.java:43)
	at java.lang.reflect.Method.invoke(Method.java:498)
	at org.apache.maven.surefire.util.ReflectionUtils.invokeMethodWithArray2(ReflectionUtils.java:208)
	at org.apache.maven.surefire.booter.ProviderFactory$ProviderProxy.invoke(ProviderFactory.java:156)
	at org.apache.maven.surefire.booter.ProviderFactory.invokeProvider(ProviderFactory.java:82)
	at org.eclipse.tycho.surefire.osgibooter.OsgiSurefireBooter.run(OsgiSurefireBooter.java:95)
	at org.eclipse.tycho.surefire.osgibooter.HeadlessTestApplication.run(HeadlessTestApplication.java:21)
	at sun.reflect.NativeMethodAccessorImpl.invoke0(Native Method)
	at sun.reflect.NativeMethodAccessorImpl.invoke(NativeMethodAccessorImpl.java:62)
	at sun.reflect.DelegatingMethodAccessorImpl.invoke(DelegatingMethodAccessorImpl.java:43)
	at java.lang.reflect.Method.invoke(Method.java:498)
	at org.eclipse.equinox.internal.app.EclipseAppContainer.callMethodWithException(EclipseAppContainer.java:587)
	at org.eclipse.equinox.internal.app.EclipseAppHandle.run(EclipseAppHandle.java:198)
	at org.eclipse.core.runtime.internal.adaptor.EclipseAppLauncher.runApplication(EclipseAppLauncher.java:134)
	at org.eclipse.core.runtime.internal.adaptor.EclipseAppLauncher.start(EclipseAppLauncher.java:104)
	at org.eclipse.core.runtime.adaptor.EclipseStarter.run(EclipseStarter.java:388)
	at org.eclipse.core.runtime.adaptor.EclipseStarter.run(EclipseStarter.java:243)
	at sun.reflect.NativeMethodAccessorImpl.invoke0(Native Method)
	at sun.reflect.NativeMethodAccessorImpl.invoke(NativeMethodAccessorImpl.java:62)
	at sun.reflect.DelegatingMethodAccessorImpl.invoke(DelegatingMethodAccessorImpl.java:43)
	at java.lang.reflect.Method.invoke(Method.java:498)
	at org.eclipse.equinox.launcher.Main.invokeFramework(Main.java:673)
	at org.eclipse.equinox.launcher.Main.basicRun(Main.java:610)
	at org.eclipse.equinox.launcher.Main.run(Main.java:1519)
	at org.eclipse.equinox.launcher.Main.main(Main.java:1492)

Running be.uantwerpen.ansymo.semanticadaptation.cg.cpp.tests.CgCppAutoTest
Tests run: 1, Failures: 0, Errors: 0, Skipped: 1, Time elapsed: 0.006 sec - in be.uantwerpen.ansymo.semanticadaptation.cg.cpp.tests.CgCppAutoTest
allSemanticAdaptations[0](be.uantwerpen.ansymo.semanticadaptation.cg.cpp.tests.CgCppAutoTest) skipped

Results :

Tests in error: 
  SATest.initializationError »  No runnable methods

Tests run: 12, Failures: 0, Errors: 1, Skipped: 2

[INFO] ------------------------------------------------------------------------
[INFO] Reactor Summary:
[INFO] 
[INFO] Semantics Adaptation Root .......................... SUCCESS [  4.655 s]
[INFO] be.uantwerpen.ansymo.semanticadaptation Testframework SUCCESS [ 56.985 s]
[INFO] be.uantwerpen.ansymo.semanticadaptation Logger ..... SUCCESS [  1.102 s]
[INFO] be.uantwerpen.ansymo.semanticadaptation Language Core SUCCESS [ 41.838 s]
[INFO] be.uantwerpen.ansymo.semanticadaptation Canonical Generator SUCCESS [  3.790 s]
[INFO] be.uantwerpen.ansymo.semanticadaptation Code Generation to C++ SUCCESS [  4.401 s]
[INFO] be.uantwerpen.ansymo.semanticadaptation Code Generator SUCCESS [  1.258 s]
[INFO] be.uantwerpen.ansymo.semanticadaptation Language Tests SUCCESS [  9.863 s]
[INFO] be.uantwerpen.ansymo.semanticadaptation.ide ........ SUCCESS [  1.920 s]
[INFO] be.uantwerpen.ansymo.semanticadaptation.ui Language UI SUCCESS [  2.508 s]
[INFO] be.uantwerpen.ansymo.semanticadaptation Code Generation to C++ Tests FAILURE [02:07 min]
[INFO] be.uantwerpen.ansymo.semanticadaptation Code Generation to C++ Tests SKIPPED
[INFO] Feature ............................................ SKIPPED
[INFO] be.uantwerpen.ansymo.semanticadaptation.ide.platform SKIPPED
[INFO] Core ............................................... SKIPPED
[INFO] Semantics Adaptation IDE Eclipse repository ........ SKIPPED
[INFO] SA IDE Standalone Product .......................... SKIPPED
[INFO] ------------------------------------------------------------------------
[INFO] BUILD FAILURE
[INFO] ------------------------------------------------------------------------
[INFO] Total time: 09:09 min
[INFO] Finished at: 2018-09-11T10:55:35+02:00
[INFO] Final Memory: 253M/972M
[INFO] ------------------------------------------------------------------------
[jenkins-maven-event-spy] INFO generated /var/lib/jenkins/workspace/HybridCosimulation_master-LDEVB56LP46DTRNYHQSCKMS3FR4JD6RBBK6S2LPONMGDZRBJQH3A@tmp/withMavenc30beed8/maven-spy-20180911-104625-9558188122989921152100.log
[ERROR] Failed to execute goal org.eclipse.tycho:tycho-surefire-plugin:1.0.0:test (default-test) on project be.uantwerpen.ansymo.semanticadaptation.cg.cpp.tests: There are test failures.
[ERROR] 
[ERROR] Please refer to /var/lib/jenkins/workspace/HybridCosimulation_master-LDEVB56LP46DTRNYHQSCKMS3FR4JD6RBBK6S2LPONMGDZRBJQH3A/DSL_SemanticAdaptation/be.uantwerpen.ansymo.semanticadaptation.cg.cpp.tests/target/surefire-reports for the individual test results.
[ERROR] -> [Help 1]
[ERROR] 
[ERROR] To see the full stack trace of the errors, re-run Maven with the -e switch.
[ERROR] Re-run Maven using the -X switch to enable full debug logging.
[ERROR] 
[ERROR] For more information about the errors and possible solutions, please read the following articles:
[ERROR] [Help 1] http://cwiki.apache.org/confluence/display/MAVEN/MojoFailureException
[ERROR] 
[ERROR] After correcting the problems, you can resume the build with the command
[ERROR]   mvn <goals> -rf :be.uantwerpen.ansymo.semanticadaptation.cg.cpp.tests
[Pipeline] }
[withMaven] artifactsPublisher - Archive artifact DSL_SemanticAdaptation/pom.xml under be/uantwerpen/ansymo/semanticadaptation/parent/1.0.0-SNAPSHOT/parent-1.0.0-SNAPSHOT.pom
[withMaven] artifactsPublisher - Archive artifact DSL_SemanticAdaptation/be.uantwerpen.ansymo.semanticadaptation.testframework/pom.xml under be/uantwerpen/ansymo/semanticadaptation/be.uantwerpen.ansymo.semanticadaptation.testframework/1.0.0-SNAPSHOT/be.uantwerpen.ansymo.semanticadaptation.testframework-1.0.0-SNAPSHOT.pom
[withMaven] artifactsPublisher - Archive artifact DSL_SemanticAdaptation/be.uantwerpen.ansymo.semanticadaptation.testframework/target/be.uantwerpen.ansymo.semanticadaptation.testframework-1.0.0-SNAPSHOT.jar under be/uantwerpen/ansymo/semanticadaptation/be.uantwerpen.ansymo.semanticadaptation.testframework/1.0.0-SNAPSHOT/be.uantwerpen.ansymo.semanticadaptation.testframework-1.0.0-SNAPSHOT.jar
[withMaven] artifactsPublisher - Archive artifact DSL_SemanticAdaptation/be.uantwerpen.ansymo.semanticadaptation.log/pom.xml under be/uantwerpen/ansymo/semanticadaptation/be.uantwerpen.ansymo.semanticadaptation.log/1.0.0-SNAPSHOT/be.uantwerpen.ansymo.semanticadaptation.log-1.0.0-SNAPSHOT.pom
[withMaven] artifactsPublisher - Archive artifact DSL_SemanticAdaptation/be.uantwerpen.ansymo.semanticadaptation.log/target/be.uantwerpen.ansymo.semanticadaptation.log-1.0.0-SNAPSHOT.jar under be/uantwerpen/ansymo/semanticadaptation/be.uantwerpen.ansymo.semanticadaptation.log/1.0.0-SNAPSHOT/be.uantwerpen.ansymo.semanticadaptation.log-1.0.0-SNAPSHOT.jar
[withMaven] artifactsPublisher - Archive artifact DSL_SemanticAdaptation/be.uantwerpen.ansymo.semanticadaptation/pom.xml under be/uantwerpen/ansymo/semanticadaptation/be.uantwerpen.ansymo.semanticadaptation/1.0.0-SNAPSHOT/be.uantwerpen.ansymo.semanticadaptation-1.0.0-SNAPSHOT.pom
[withMaven] artifactsPublisher - Archive artifact DSL_SemanticAdaptation/be.uantwerpen.ansymo.semanticadaptation/target/be.uantwerpen.ansymo.semanticadaptation-1.0.0-SNAPSHOT.jar under be/uantwerpen/ansymo/semanticadaptation/be.uantwerpen.ansymo.semanticadaptation/1.0.0-SNAPSHOT/be.uantwerpen.ansymo.semanticadaptation-1.0.0-SNAPSHOT.jar
[withMaven] artifactsPublisher - Archive artifact DSL_SemanticAdaptation/be.uantwerpen.ansymo.semanticadaptation.cg.canonical/pom.xml under be/uantwerpen/ansymo/semanticadaptation/be.uantwerpen.ansymo.semanticadaptation.cg.canonical/1.0.0-SNAPSHOT/be.uantwerpen.ansymo.semanticadaptation.cg.canonical-1.0.0-SNAPSHOT.pom
[withMaven] artifactsPublisher - Archive artifact DSL_SemanticAdaptation/be.uantwerpen.ansymo.semanticadaptation.cg.canonical/target/be.uantwerpen.ansymo.semanticadaptation.cg.canonical-1.0.0-SNAPSHOT.jar under be/uantwerpen/ansymo/semanticadaptation/be.uantwerpen.ansymo.semanticadaptation.cg.canonical/1.0.0-SNAPSHOT/be.uantwerpen.ansymo.semanticadaptation.cg.canonical-1.0.0-SNAPSHOT.jar
[withMaven] artifactsPublisher - Archive artifact DSL_SemanticAdaptation/be.uantwerpen.ansymo.semanticadaptation.cg.cpp/pom.xml under be/uantwerpen/ansymo/semanticadaptation/be.uantwerpen.ansymo.semanticadaptation.cg.cpp/1.0.0-SNAPSHOT/be.uantwerpen.ansymo.semanticadaptation.cg.cpp-1.0.0-SNAPSHOT.pom
[withMaven] artifactsPublisher - Archive artifact DSL_SemanticAdaptation/be.uantwerpen.ansymo.semanticadaptation.cg.cpp/target/be.uantwerpen.ansymo.semanticadaptation.cg.cpp-1.0.0-SNAPSHOT.jar under be/uantwerpen/ansymo/semanticadaptation/be.uantwerpen.ansymo.semanticadaptation.cg.cpp/1.0.0-SNAPSHOT/be.uantwerpen.ansymo.semanticadaptation.cg.cpp-1.0.0-SNAPSHOT.jar
[withMaven] artifactsPublisher - Archive artifact DSL_SemanticAdaptation/be.uantwerpen.ansymo.semanticadaptation.cg.chain/pom.xml under be/uantwerpen/ansymo/semanticadaptation/be.uantwerpen.ansymo.semanticadaptation.cg.chain/1.0.0-SNAPSHOT/be.uantwerpen.ansymo.semanticadaptation.cg.chain-1.0.0-SNAPSHOT.pom
[withMaven] artifactsPublisher - Archive artifact DSL_SemanticAdaptation/be.uantwerpen.ansymo.semanticadaptation.cg.chain/target/be.uantwerpen.ansymo.semanticadaptation.cg.chain-1.0.0-SNAPSHOT.jar under be/uantwerpen/ansymo/semanticadaptation/be.uantwerpen.ansymo.semanticadaptation.cg.chain/1.0.0-SNAPSHOT/be.uantwerpen.ansymo.semanticadaptation.cg.chain-1.0.0-SNAPSHOT.jar
[withMaven] artifactsPublisher - Archive artifact DSL_SemanticAdaptation/be.uantwerpen.ansymo.semanticadaptation.tests/pom.xml under be/uantwerpen/ansymo/semanticadaptation/be.uantwerpen.ansymo.semanticadaptation.tests/1.0.0-SNAPSHOT/be.uantwerpen.ansymo.semanticadaptation.tests-1.0.0-SNAPSHOT.pom
[withMaven] artifactsPublisher - Archive artifact DSL_SemanticAdaptation/be.uantwerpen.ansymo.semanticadaptation.tests/target/be.uantwerpen.ansymo.semanticadaptation.tests-1.0.0-SNAPSHOT.jar under be/uantwerpen/ansymo/semanticadaptation/be.uantwerpen.ansymo.semanticadaptation.tests/1.0.0-SNAPSHOT/be.uantwerpen.ansymo.semanticadaptation.tests-1.0.0-SNAPSHOT.jar
[withMaven] artifactsPublisher - Archive artifact DSL_SemanticAdaptation/be.uantwerpen.ansymo.semanticadaptation.ide/pom.xml under be/uantwerpen/ansymo/semanticadaptation/be.uantwerpen.ansymo.semanticadaptation.ide/1.0.0-SNAPSHOT/be.uantwerpen.ansymo.semanticadaptation.ide-1.0.0-SNAPSHOT.pom
[withMaven] artifactsPublisher - Archive artifact DSL_SemanticAdaptation/be.uantwerpen.ansymo.semanticadaptation.ide/target/be.uantwerpen.ansymo.semanticadaptation.ide-1.0.0-SNAPSHOT.jar under be/uantwerpen/ansymo/semanticadaptation/be.uantwerpen.ansymo.semanticadaptation.ide/1.0.0-SNAPSHOT/be.uantwerpen.ansymo.semanticadaptation.ide-1.0.0-SNAPSHOT.jar
[withMaven] artifactsPublisher - Archive artifact DSL_SemanticAdaptation/be.uantwerpen.ansymo.semanticadaptation.ui/pom.xml under be/uantwerpen/ansymo/semanticadaptation/be.uantwerpen.ansymo.semanticadaptation.ui/1.0.0-SNAPSHOT/be.uantwerpen.ansymo.semanticadaptation.ui-1.0.0-SNAPSHOT.pom
[withMaven] artifactsPublisher - Archive artifact DSL_SemanticAdaptation/be.uantwerpen.ansymo.semanticadaptation.ui/target/be.uantwerpen.ansymo.semanticadaptation.ui-1.0.0-SNAPSHOT.jar under be/uantwerpen/ansymo/semanticadaptation/be.uantwerpen.ansymo.semanticadaptation.ui/1.0.0-SNAPSHOT/be.uantwerpen.ansymo.semanticadaptation.ui-1.0.0-SNAPSHOT.jar
[withMaven] artifactsPublisher - Archive artifact DSL_SemanticAdaptation/be.uantwerpen.ansymo.semanticadaptation.testframework/target/p2content.xml under be/uantwerpen/ansymo/semanticadaptation/be.uantwerpen.ansymo.semanticadaptation.testframework/1.0.0-SNAPSHOT/be.uantwerpen.ansymo.semanticadaptation.testframework-1.0.0-SNAPSHOT-p2metadata.xml
[withMaven] artifactsPublisher - Archive artifact DSL_SemanticAdaptation/be.uantwerpen.ansymo.semanticadaptation.testframework/target/p2artifacts.xml under be/uantwerpen/ansymo/semanticadaptation/be.uantwerpen.ansymo.semanticadaptation.testframework/1.0.0-SNAPSHOT/be.uantwerpen.ansymo.semanticadaptation.testframework-1.0.0-SNAPSHOT-p2artifacts.xml
[withMaven] artifactsPublisher - Archive artifact DSL_SemanticAdaptation/be.uantwerpen.ansymo.semanticadaptation.log/target/p2content.xml under be/uantwerpen/ansymo/semanticadaptation/be.uantwerpen.ansymo.semanticadaptation.log/1.0.0-SNAPSHOT/be.uantwerpen.ansymo.semanticadaptation.log-1.0.0-SNAPSHOT-p2metadata.xml
[withMaven] artifactsPublisher - Archive artifact DSL_SemanticAdaptation/be.uantwerpen.ansymo.semanticadaptation.log/target/p2artifacts.xml under be/uantwerpen/ansymo/semanticadaptation/be.uantwerpen.ansymo.semanticadaptation.log/1.0.0-SNAPSHOT/be.uantwerpen.ansymo.semanticadaptation.log-1.0.0-SNAPSHOT-p2artifacts.xml
[withMaven] artifactsPublisher - Archive artifact DSL_SemanticAdaptation/be.uantwerpen.ansymo.semanticadaptation/target/p2content.xml under be/uantwerpen/ansymo/semanticadaptation/be.uantwerpen.ansymo.semanticadaptation/1.0.0-SNAPSHOT/be.uantwerpen.ansymo.semanticadaptation-1.0.0-SNAPSHOT-p2metadata.xml
[withMaven] artifactsPublisher - Archive artifact DSL_SemanticAdaptation/be.uantwerpen.ansymo.semanticadaptation/target/p2artifacts.xml under be/uantwerpen/ansymo/semanticadaptation/be.uantwerpen.ansymo.semanticadaptation/1.0.0-SNAPSHOT/be.uantwerpen.ansymo.semanticadaptation-1.0.0-SNAPSHOT-p2artifacts.xml
[withMaven] artifactsPublisher - Archive artifact DSL_SemanticAdaptation/be.uantwerpen.ansymo.semanticadaptation.cg.canonical/target/p2content.xml under be/uantwerpen/ansymo/semanticadaptation/be.uantwerpen.ansymo.semanticadaptation.cg.canonical/1.0.0-SNAPSHOT/be.uantwerpen.ansymo.semanticadaptation.cg.canonical-1.0.0-SNAPSHOT-p2metadata.xml
[withMaven] artifactsPublisher - Archive artifact DSL_SemanticAdaptation/be.uantwerpen.ansymo.semanticadaptation.cg.canonical/target/p2artifacts.xml under be/uantwerpen/ansymo/semanticadaptation/be.uantwerpen.ansymo.semanticadaptation.cg.canonical/1.0.0-SNAPSHOT/be.uantwerpen.ansymo.semanticadaptation.cg.canonical-1.0.0-SNAPSHOT-p2artifacts.xml
[withMaven] artifactsPublisher - Archive artifact DSL_SemanticAdaptation/be.uantwerpen.ansymo.semanticadaptation.cg.cpp/target/p2content.xml under be/uantwerpen/ansymo/semanticadaptation/be.uantwerpen.ansymo.semanticadaptation.cg.cpp/1.0.0-SNAPSHOT/be.uantwerpen.ansymo.semanticadaptation.cg.cpp-1.0.0-SNAPSHOT-p2metadata.xml
[withMaven] artifactsPublisher - Archive artifact DSL_SemanticAdaptation/be.uantwerpen.ansymo.semanticadaptation.cg.cpp/target/p2artifacts.xml under be/uantwerpen/ansymo/semanticadaptation/be.uantwerpen.ansymo.semanticadaptation.cg.cpp/1.0.0-SNAPSHOT/be.uantwerpen.ansymo.semanticadaptation.cg.cpp-1.0.0-SNAPSHOT-p2artifacts.xml
[withMaven] artifactsPublisher - Archive artifact DSL_SemanticAdaptation/be.uantwerpen.ansymo.semanticadaptation.cg.chain/target/p2content.xml under be/uantwerpen/ansymo/semanticadaptation/be.uantwerpen.ansymo.semanticadaptation.cg.chain/1.0.0-SNAPSHOT/be.uantwerpen.ansymo.semanticadaptation.cg.chain-1.0.0-SNAPSHOT-p2metadata.xml
[withMaven] artifactsPublisher - Archive artifact DSL_SemanticAdaptation/be.uantwerpen.ansymo.semanticadaptation.cg.chain/target/p2artifacts.xml under be/uantwerpen/ansymo/semanticadaptation/be.uantwerpen.ansymo.semanticadaptation.cg.chain/1.0.0-SNAPSHOT/be.uantwerpen.ansymo.semanticadaptation.cg.chain-1.0.0-SNAPSHOT-p2artifacts.xml
[withMaven] artifactsPublisher - Archive artifact DSL_SemanticAdaptation/be.uantwerpen.ansymo.semanticadaptation.tests/target/p2content.xml under be/uantwerpen/ansymo/semanticadaptation/be.uantwerpen.ansymo.semanticadaptation.tests/1.0.0-SNAPSHOT/be.uantwerpen.ansymo.semanticadaptation.tests-1.0.0-SNAPSHOT-p2metadata.xml
[withMaven] artifactsPublisher - Archive artifact DSL_SemanticAdaptation/be.uantwerpen.ansymo.semanticadaptation.tests/target/p2artifacts.xml under be/uantwerpen/ansymo/semanticadaptation/be.uantwerpen.ansymo.semanticadaptation.tests/1.0.0-SNAPSHOT/be.uantwerpen.ansymo.semanticadaptation.tests-1.0.0-SNAPSHOT-p2artifacts.xml
[withMaven] artifactsPublisher - Archive artifact DSL_SemanticAdaptation/be.uantwerpen.ansymo.semanticadaptation.ide/target/p2content.xml under be/uantwerpen/ansymo/semanticadaptation/be.uantwerpen.ansymo.semanticadaptation.ide/1.0.0-SNAPSHOT/be.uantwerpen.ansymo.semanticadaptation.ide-1.0.0-SNAPSHOT-p2metadata.xml
[withMaven] artifactsPublisher - Archive artifact DSL_SemanticAdaptation/be.uantwerpen.ansymo.semanticadaptation.ide/target/p2artifacts.xml under be/uantwerpen/ansymo/semanticadaptation/be.uantwerpen.ansymo.semanticadaptation.ide/1.0.0-SNAPSHOT/be.uantwerpen.ansymo.semanticadaptation.ide-1.0.0-SNAPSHOT-p2artifacts.xml
[withMaven] artifactsPublisher - Archive artifact DSL_SemanticAdaptation/be.uantwerpen.ansymo.semanticadaptation.ui/target/p2content.xml under be/uantwerpen/ansymo/semanticadaptation/be.uantwerpen.ansymo.semanticadaptation.ui/1.0.0-SNAPSHOT/be.uantwerpen.ansymo.semanticadaptation.ui-1.0.0-SNAPSHOT-p2metadata.xml
[withMaven] artifactsPublisher - Archive artifact DSL_SemanticAdaptation/be.uantwerpen.ansymo.semanticadaptation.ui/target/p2artifacts.xml under be/uantwerpen/ansymo/semanticadaptation/be.uantwerpen.ansymo.semanticadaptation.ui/1.0.0-SNAPSHOT/be.uantwerpen.ansymo.semanticadaptation.ui-1.0.0-SNAPSHOT-p2artifacts.xml
[TASKS] Scanning folder '/var/lib/jenkins/workspace/HybridCosimulation_master-LDEVB56LP46DTRNYHQSCKMS3FR4JD6RBBK6S2LPONMGDZRBJQH3A' for files matching the pattern '**/*.java' - excludes: null
[TASKS] Found 433 files to scan for tasks
[TASKS] Found 27 open tasks.
Skipping warnings blame since pipelines do not have an SCM link.%n
[TASKS] Computing warning deltas based on reference build #171
[Pipeline] // withMaven
[Pipeline] }
[Pipeline] // stage
[Pipeline] stage
[Pipeline] { (Reporting)
[Pipeline] emailextrecipients
Not sending mail to user casper.thule@eng.au.dk with no permission to view HybridCosimulation » master #172Not sending mail to user cla.gms@gmail.com with no permission to view HybridCosimulation » master #172[Pipeline] emailext
An attempt to send an e-mail to empty list of recipients, ignored.
[Pipeline] }
[Pipeline] // stage
[Pipeline] }
[Pipeline] // node
[Pipeline] End of Pipeline
ERROR: script returned exit code 1
Finished: FAILURE