FailedConsole Output

Skipping 361 KB.. Full Log
xtension ---
[INFO] No tests to run.
[INFO] 
[INFO] --- maven-jar-plugin:2.4:jar (default-jar) @ xmlrpcserverextension ---
[INFO] Building jar: /var/lib/jenkins/workspace/scendo-pipeline_development-6SEXP6NOH4DPMHNIAG2YUHD7VUTTPKSFIJJHDCPNLS2367EFMSNQ/core/xmlrpcextensions/xmlrpcserverextension/target/xmlrpcserverextension-2.2.5-SNAPSHOT.jar
[INFO] 
[INFO] --- maven-install-plugin:2.5.2:install (default-install) @ xmlrpcserverextension ---
[INFO] Installing /var/lib/jenkins/workspace/scendo-pipeline_development-6SEXP6NOH4DPMHNIAG2YUHD7VUTTPKSFIJJHDCPNLS2367EFMSNQ/core/xmlrpcextensions/xmlrpcserverextension/target/xmlrpcserverextension-2.2.5-SNAPSHOT.jar to /var/lib/jenkins/workspace/scendo-pipeline_development-6SEXP6NOH4DPMHNIAG2YUHD7VUTTPKSFIJJHDCPNLS2367EFMSNQ/.repository/org/destecs/core/xmlrpcextensions/xmlrpcserverextension/2.2.5-SNAPSHOT/xmlrpcserverextension-2.2.5-SNAPSHOT.jar
[INFO] Installing /var/lib/jenkins/workspace/scendo-pipeline_development-6SEXP6NOH4DPMHNIAG2YUHD7VUTTPKSFIJJHDCPNLS2367EFMSNQ/core/xmlrpcextensions/xmlrpcserverextension/pom.xml to /var/lib/jenkins/workspace/scendo-pipeline_development-6SEXP6NOH4DPMHNIAG2YUHD7VUTTPKSFIJJHDCPNLS2367EFMSNQ/.repository/org/destecs/core/xmlrpcextensions/xmlrpcserverextension/2.2.5-SNAPSHOT/xmlrpcserverextension-2.2.5-SNAPSHOT.pom
[INFO]                                                                         
[INFO] ------------------------------------------------------------------------
[INFO] Building Co-Simulator for VDM 2.2.5-SNAPSHOT
[INFO] ------------------------------------------------------------------------
[INFO] Downloading: http://overture.au.dk/artifactory/remote-repos/org/overturetool/core/interpreter/2.5.2/interpreter-2.5.2.pom
[INFO] Downloaded: http://overture.au.dk/artifactory/remote-repos/org/overturetool/core/interpreter/2.5.2/interpreter-2.5.2.pom (3 KB at 100.5 KB/sec)
[INFO] Downloading: http://overture.au.dk/artifactory/remote-repos/org/overturetool/core/2.5.2/core-2.5.2.pom
[INFO] Downloaded: http://overture.au.dk/artifactory/remote-repos/org/overturetool/core/2.5.2/core-2.5.2.pom (2 KB at 87.7 KB/sec)
[INFO] Downloading: http://overture.au.dk/artifactory/remote-repos/org/overturetool/root/2.5.2/root-2.5.2.pom
[INFO] Downloaded: http://overture.au.dk/artifactory/remote-repos/org/overturetool/root/2.5.2/root-2.5.2.pom (14 KB at 821.3 KB/sec)
[INFO] Downloading: http://overture.au.dk/artifactory/remote-repos/org/sonatype/oss/oss-parent/7/oss-parent-7.pom
[INFO] Downloaded: http://overture.au.dk/artifactory/remote-repos/org/sonatype/oss/oss-parent/7/oss-parent-7.pom (5 KB at 225.9 KB/sec)
[INFO] Downloading: http://overture.au.dk/artifactory/remote-repos/org/overturetool/core/ast/2.5.2/ast-2.5.2.pom
[INFO] Downloaded: http://overture.au.dk/artifactory/remote-repos/org/overturetool/core/ast/2.5.2/ast-2.5.2.pom (5 KB at 226.4 KB/sec)
[INFO] Downloading: http://overture.au.dk/artifactory/remote-repos/org/overturetool/core/typechecker/2.5.2/typechecker-2.5.2.pom
[INFO] Downloaded: http://overture.au.dk/artifactory/remote-repos/org/overturetool/core/typechecker/2.5.2/typechecker-2.5.2.pom (3 KB at 149.9 KB/sec)
[INFO] Downloading: http://overture.au.dk/artifactory/remote-repos/junit/junit/4.11/junit-4.11.pom
[INFO] Downloaded: http://overture.au.dk/artifactory/remote-repos/junit/junit/4.11/junit-4.11.pom (3 KB at 127.2 KB/sec)
[INFO] Downloading: http://overture.au.dk/artifactory/remote-repos/org/hamcrest/hamcrest-core/1.3/hamcrest-core-1.3.pom
[INFO] Downloaded: http://overture.au.dk/artifactory/remote-repos/org/hamcrest/hamcrest-core/1.3/hamcrest-core-1.3.pom (766 B at 41.6 KB/sec)
[INFO] Downloading: http://overture.au.dk/artifactory/remote-repos/org/hamcrest/hamcrest-parent/1.3/hamcrest-parent-1.3.pom
[INFO] Downloaded: http://overture.au.dk/artifactory/remote-repos/org/hamcrest/hamcrest-parent/1.3/hamcrest-parent-1.3.pom (2 KB at 113.3 KB/sec)
[INFO] Downloading: http://overture.au.dk/artifactory/remote-repos/org/overturetool/core/parser/2.5.2/parser-2.5.2.pom
[INFO] Downloaded: http://overture.au.dk/artifactory/remote-repos/org/overturetool/core/parser/2.5.2/parser-2.5.2.pom (4 KB at 175.0 KB/sec)
[INFO] Downloading: http://overture.au.dk/artifactory/remote-repos/org/overturetool/core/testframework/2.5.2/testframework-2.5.2.pom
[INFO] Downloaded: http://overture.au.dk/artifactory/remote-repos/org/overturetool/core/testframework/2.5.2/testframework-2.5.2.pom (2 KB at 70.8 KB/sec)
[INFO] Downloading: http://overture.au.dk/artifactory/remote-repos/org/overturetool/core/pog/2.5.2/pog-2.5.2.pom
[INFO] Downloaded: http://overture.au.dk/artifactory/remote-repos/org/overturetool/core/pog/2.5.2/pog-2.5.2.pom (6 KB at 252.5 KB/sec)
[INFO] Downloading: http://overture.au.dk/artifactory/remote-repos/com/google/code/gson/gson/2.2.4/gson-2.2.4.pom
[INFO] Downloaded: http://overture.au.dk/artifactory/remote-repos/com/google/code/gson/gson/2.2.4/gson-2.2.4.pom (8 KB at 413.1 KB/sec)
[INFO] Downloading: http://overture.au.dk/artifactory/remote-repos/org/overturetool/core/prettyprinting/prettyprinter/2.5.2/prettyprinter-2.5.2.pom
[INFO] Downloaded: http://overture.au.dk/artifactory/remote-repos/org/overturetool/core/prettyprinting/prettyprinter/2.5.2/prettyprinter-2.5.2.pom (2 KB at 48.1 KB/sec)
[INFO] Downloading: http://overture.au.dk/artifactory/remote-repos/org/overturetool/core/prettyprinting/2.5.2/prettyprinting-2.5.2.pom
[INFO] Downloaded: http://overture.au.dk/artifactory/remote-repos/org/overturetool/core/prettyprinting/2.5.2/prettyprinting-2.5.2.pom (661 B at 43.0 KB/sec)
[INFO] Downloading: http://overture.au.dk/artifactory/remote-repos/org/apache/commons/commons-collections4/4.0/commons-collections4-4.0.pom
[INFO] Downloaded: http://overture.au.dk/artifactory/remote-repos/org/apache/commons/commons-collections4/4.0/commons-collections4-4.0.pom (20 KB at 1158.2 KB/sec)
[INFO] Downloading: http://overture.au.dk/artifactory/remote-repos/org/overturetool/core/typechecker/2.5.2/typechecker-2.5.2.jar
[INFO] Downloading: http://overture.au.dk/artifactory/remote-repos/org/overturetool/core/pog/2.5.2/pog-2.5.2.jar
[INFO] Downloading: http://overture.au.dk/artifactory/remote-repos/org/overturetool/core/interpreter/2.5.2/interpreter-2.5.2.jar
[INFO] Downloading: http://overture.au.dk/artifactory/remote-repos/org/overturetool/core/parser/2.5.2/parser-2.5.2.jar
[INFO] Downloading: http://overture.au.dk/artifactory/remote-repos/com/google/code/gson/gson/2.2.4/gson-2.2.4.jar
[INFO] Downloaded: http://overture.au.dk/artifactory/remote-repos/com/google/code/gson/gson/2.2.4/gson-2.2.4.jar (186 KB at 8453.1 KB/sec)
[INFO] Downloading: http://overture.au.dk/artifactory/remote-repos/org/overturetool/core/prettyprinting/prettyprinter/2.5.2/prettyprinter-2.5.2.jar
[INFO] Downloaded: http://overture.au.dk/artifactory/remote-repos/org/overturetool/core/parser/2.5.2/parser-2.5.2.jar (118 KB at 3012.9 KB/sec)
[INFO] Downloading: http://overture.au.dk/artifactory/remote-repos/org/apache/commons/commons-collections4/4.0/commons-collections4-4.0.jar
[INFO] Downloaded: http://overture.au.dk/artifactory/remote-repos/org/overturetool/core/prettyprinting/prettyprinter/2.5.2/prettyprinter-2.5.2.jar (12 KB at 323.0 KB/sec)
[INFO] Downloading: http://overture.au.dk/artifactory/remote-repos/org/overturetool/core/testframework/2.5.2/testframework-2.5.2.jar
[INFO] Downloaded: http://overture.au.dk/artifactory/remote-repos/org/overturetool/core/pog/2.5.2/pog-2.5.2.jar (268 KB at 5696.1 KB/sec)
[INFO] Downloading: http://overture.au.dk/artifactory/remote-repos/org/overturetool/core/ast/2.5.2/ast-2.5.2.jar
[INFO] Downloaded: http://overture.au.dk/artifactory/remote-repos/org/overturetool/core/interpreter/2.5.2/interpreter-2.5.2.jar (724 KB at 12066.6 KB/sec)
[INFO] Downloading: http://overture.au.dk/artifactory/remote-repos/junit/junit/4.11/junit-4.11.jar
[INFO] Downloaded: http://overture.au.dk/artifactory/remote-repos/org/overturetool/core/typechecker/2.5.2/typechecker-2.5.2.jar (417 KB at 7186.8 KB/sec)
[INFO] Downloading: http://overture.au.dk/artifactory/remote-repos/org/hamcrest/hamcrest-core/1.3/hamcrest-core-1.3.jar
[INFO] Downloaded: http://overture.au.dk/artifactory/remote-repos/org/overturetool/core/testframework/2.5.2/testframework-2.5.2.jar (37 KB at 648.5 KB/sec)
[INFO] Downloaded: http://overture.au.dk/artifactory/remote-repos/org/hamcrest/hamcrest-core/1.3/hamcrest-core-1.3.jar (44 KB at 602.3 KB/sec)
[INFO] Downloaded: http://overture.au.dk/artifactory/remote-repos/junit/junit/4.11/junit-4.11.jar (240 KB at 2991.2 KB/sec)
[INFO] Downloaded: http://overture.au.dk/artifactory/remote-repos/org/apache/commons/commons-collections4/4.0/commons-collections4-4.0.jar (596 KB at 6850.1 KB/sec)
[INFO] Downloaded: http://overture.au.dk/artifactory/remote-repos/org/overturetool/core/ast/2.5.2/ast-2.5.2.jar (1336 KB at 6712.5 KB/sec)
[INFO] 
[INFO] --- maven-resources-plugin:2.6:resources (default-resources) @ vdm ---
[INFO] Using 'UTF-8' encoding to copy filtered resources.
[INFO] Copying 2 resources
[INFO] 
[INFO] --- maven-compiler-plugin:3.5.1:compile (default-compile) @ vdm ---
[INFO] Changes detected - recompiling the module!
[INFO] Compiling 22 source files to /var/lib/jenkins/workspace/scendo-pipeline_development-6SEXP6NOH4DPMHNIAG2YUHD7VUTTPKSFIJJHDCPNLS2367EFMSNQ/core/vdm/target/classes
[INFO] 
[INFO] --- maven-resources-plugin:2.6:testResources (default-testResources) @ vdm ---
[INFO] Using 'UTF-8' encoding to copy filtered resources.
[INFO] Copying 8 resources
[INFO] 
[INFO] --- maven-compiler-plugin:3.5.1:testCompile (default-testCompile) @ vdm ---
[INFO] Changes detected - recompiling the module!
[INFO] Compiling 1 source file to /var/lib/jenkins/workspace/scendo-pipeline_development-6SEXP6NOH4DPMHNIAG2YUHD7VUTTPKSFIJJHDCPNLS2367EFMSNQ/core/vdm/target/test-classes
[INFO] 
[INFO] --- maven-surefire-plugin:2.13:test (default-test) @ vdm ---
[INFO] Surefire report directory: /var/lib/jenkins/workspace/scendo-pipeline_development-6SEXP6NOH4DPMHNIAG2YUHD7VUTTPKSFIJJHDCPNLS2367EFMSNQ/core/vdm/target/surefire-reports
[INFO] Downloading: http://overture.au.dk/artifactory/remote-repos/org/apache/maven/surefire/surefire-junit4/2.13/surefire-junit4-2.13.pom
[INFO] Downloaded: http://overture.au.dk/artifactory/remote-repos/org/apache/maven/surefire/surefire-junit4/2.13/surefire-junit4-2.13.pom (3 KB at 128.0 KB/sec)
[INFO] Downloading: http://overture.au.dk/artifactory/remote-repos/org/apache/maven/surefire/surefire-providers/2.13/surefire-providers-2.13.pom
[INFO] Downloaded: http://overture.au.dk/artifactory/remote-repos/org/apache/maven/surefire/surefire-providers/2.13/surefire-providers-2.13.pom (3 KB at 145.3 KB/sec)
[INFO] Downloading: http://overture.au.dk/artifactory/remote-repos/org/apache/maven/surefire/surefire-junit4/2.13/surefire-junit4-2.13.jar
[INFO] Downloaded: http://overture.au.dk/artifactory/remote-repos/org/apache/maven/surefire/surefire-junit4/2.13/surefire-junit4-2.13.jar (78 KB at 4291.6 KB/sec)

-------------------------------------------------------
 T E S T S
-------------------------------------------------------
Picked up JAVA_TOOL_OPTIONS: -Dmaven.ext.class.path="/var/lib/jenkins/workspace/scendo-pipeline_development-6SEXP6NOH4DPMHNIAG2YUHD7VUTTPKSFIJJHDCPNLS2367EFMSNQ@tmp/withMavenfec0ddfd/pipeline-maven-spy.jar" -Dorg.jenkinsci.plugins.pipeline.maven.reportsFolder="/var/lib/jenkins/workspace/scendo-pipeline_development-6SEXP6NOH4DPMHNIAG2YUHD7VUTTPKSFIJJHDCPNLS2367EFMSNQ@tmp/withMavenfec0ddfd" 
Running vdm.CoSimTest
Parsed 6 classes in 0.115 secs. No syntax errors
Type checked 8 classes in 0.16 secs. No type errors
----------------------------------------------------------------------------------
Runtime Validator Initialized with conjectures:
----------------------------------------------------------------------------------
Running from: 0.000000 to 0.000400
	Output valve = 0.0
Running from: 0.000400 to 0.000800
	Output valve = 1.0
Running from: 0.000800 to 0.050000
	Output valve = 1.0
Running from: 0.050000 to 0.050400
	Output valve = 1.0
Running from: 0.050400 to 0.050800
	Output valve = 1.0
Running from: 0.050800 to 0.100000
	Output valve = 1.0
Running from: 0.100000 to 0.100400
	Output valve = 1.0
Running from: 0.100400 to 0.100800
	Output valve = 1.0
Running from: 0.100800 to 0.150000
	Output valve = 1.0
Running from: 0.150000 to 0.150400
	Output valve = 1.0
Running from: 0.150400 to 0.150800
	Output valve = 0.0
Running from: 0.150800 to 0.200000
	Output valve = 0.0
Running from: 0.200000 to 0.200400
	Output valve = 0.0
Running from: 0.200400 to 0.200800
	Output valve = 0.0
Running from: 0.200800 to 0.250000
	Output valve = 0.0
Running from: 0.250000 to 0.250400
	Output valve = 0.0
Running from: 0.250400 to 0.250800
	Output valve = 0.0
Running from: 0.250800 to 0.300000
	Output valve = 0.0
Running from: 0.300000 to 0.300400
	Output valve = 0.0
Running from: 0.300400 to 0.300800
	Output valve = 0.0
Running from: 0.300800 to 0.350000
	Output valve = 0.0
Running from: 0.350000 to 0.350400
	Output valve = 0.0
Running from: 0.350400 to 0.350800
	Output valve = 0.0
Running from: 0.350800 to 0.400000
	Output valve = 0.0
Running from: 0.400000 to 0.400400
	Output valve = 0.0
Running from: 0.400400 to 0.400800
	Output valve = 0.0
Running from: 0.400800 to 0.450000
	Output valve = 0.0
Running from: 0.450000 to 0.450400
	Output valve = 0.0
Running from: 0.450400 to 0.450800
	Output valve = 0.0
Running from: 0.450800 to 0.500000
	Output valve = 0.0
Running from: 0.500000 to 0.500400
	Output valve = 0.0
Running from: 0.500400 to 0.500800
	Output valve = 0.0
Running from: 0.500800 to 0.550000
	Output valve = 0.0
Running from: 0.550000 to 0.550400
	Output valve = 0.0
Running from: 0.550400 to 0.550800
	Output valve = 0.0
Running from: 0.550800 to 0.600000
	Output valve = 0.0
Running from: 0.600000 to 0.600400
	Output valve = 0.0
Running from: 0.600400 to 0.600800
	Output valve = 0.0
Running from: 0.600800 to 0.650000
	Output valve = 0.0
Running from: 0.650000 to 0.650400
	Output valve = 0.0
Running from: 0.650400 to 0.650800
	Output valve = 0.0
Running from: 0.650800 to 0.700000
	Output valve = 0.0
Running from: 0.700000 to 0.700400
	Output valve = 0.0
Running from: 0.700400 to 0.700800
	Output valve = 0.0
Running from: 0.700800 to 0.750000
	Output valve = 0.0
Running from: 0.750000 to 0.750400
	Output valve = 0.0
Running from: 0.750400 to 0.750800
	Output valve = 0.0
Running from: 0.750800 to 0.800000
	Output valve = 0.0
Running from: 0.800000 to 0.800400
	Output valve = 0.0
Running from: 0.800400 to 0.800800
	Output valve = 0.0
Running from: 0.800800 to 0.850000
	Output valve = 0.0
Running from: 0.850000 to 0.850400
	Output valve = 0.0
Running from: 0.850400 to 0.850800
	Output valve = 0.0
Running from: 0.850800 to 0.900000
	Output valve = 0.0
Running from: 0.900000 to 0.900400
	Output valve = 0.0
Running from: 0.900400 to 0.900800
	Output valve = 0.0
Running from: 0.900800 to 0.950000
	Output valve = 0.0
Running from: 0.950000 to 0.950400
	Output valve = 0.0
Running from: 0.950400 to 0.950800
	Output valve = 0.0
Running from: 0.950800 to 1.000000
	Output valve = 0.0
Running from: 1.000000 to 1.000400
	Output valve = 0.0
Running from: 1.000400 to 1.000800
	Output valve = 0.0
Running from: 1.000800 to 1.050000
	Output valve = 0.0
Running from: 1.050000 to 1.050400
	Output valve = 0.0
Running from: 1.050400 to 1.050800
	Output valve = 0.0
Running from: 1.050800 to 1.100000
	Output valve = 0.0
Running from: 1.100000 to 1.100400
	Output valve = 0.0
Running from: 1.100400 to 1.100800
	Output valve = 0.0
Running from: 1.100800 to 1.150000
	Output valve = 0.0
Running from: 1.150000 to 1.150400
	Output valve = 0.0
Running from: 1.150400 to 1.150800
	Output valve = 0.0
Running from: 1.150800 to 1.200000
	Output valve = 0.0
Running from: 1.200000 to 1.200400
	Output valve = 0.0
Running from: 1.200400 to 1.200800
	Output valve = 0.0
Running from: 1.200800 to 1.250000
	Output valve = 0.0
Running from: 1.250000 to 1.250400
	Output valve = 0.0
Running from: 1.250400 to 1.250800
	Output valve = 0.0
Running from: 1.250800 to 1.300000
	Output valve = 0.0
Running from: 1.300000 to 1.300400
	Output valve = 0.0
Running from: 1.300400 to 1.300800
	Output valve = 0.0
Running from: 1.300800 to 1.350000
	Output valve = 0.0
Running from: 1.350000 to 1.350400
	Output valve = 0.0
Running from: 1.350400 to 1.350800
	Output valve = 0.0
Running from: 1.350800 to 1.400000
	Output valve = 0.0
Running from: 1.400000 to 1.400400
	Output valve = 0.0
Running from: 1.400400 to 1.400800
	Output valve = 0.0
Running from: 1.400800 to 1.450000
	Output valve = 0.0
Running from: 1.450000 to 1.450400
	Output valve = 0.0
Running from: 1.450400 to 1.450800
	Output valve = 0.0
Running from: 1.450800 to 1.500000
	Output valve = 0.0
Running from: 1.500000 to 1.500400
	Output valve = 0.0
Running from: 1.500400 to 1.500800
	Output valve = 0.0
Running from: 1.500800 to 1.550000
	Output valve = 0.0
Running from: 1.550000 to 1.550400
	Output valve = 0.0
Running from: 1.550400 to 1.550800
	Output valve = 0.0
Running from: 1.550800 to 1.600000
	Output valve = 0.0
Running from: 1.600000 to 1.600400
	Output valve = 0.0
Running from: 1.600400 to 1.600800
	Output valve = 0.0
Running from: 1.600800 to 1.650000
	Output valve = 0.0
Running from: 1.650000 to 1.650400
	Output valve = 0.0
Running from: 1.650400 to 1.650800
	Output valve = 0.0
Running from: 1.650800 to 1.700000
	Output valve = 0.0
Running from: 1.700000 to 1.700400
	Output valve = 0.0
Running from: 1.700400 to 1.700800
	Output valve = 0.0
Running from: 1.700800 to 1.750000
	Output valve = 0.0
Running from: 1.750000 to 1.750400
	Output valve = 0.0
Running from: 1.750400 to 1.750800
	Output valve = 0.0
Running from: 1.750800 to 1.800000
	Output valve = 0.0
Running from: 1.800000 to 1.800400
	Output valve = 0.0
Running from: 1.800400 to 1.800800
	Output valve = 0.0
Running from: 1.800800 to 1.850000
	Output valve = 0.0
Running from: 1.850000 to 1.850400
	Output valve = 0.0
Running from: 1.850400 to 1.850800
	Output valve = 0.0
Running from: 1.850800 to 1.900000
	Output valve = 0.0
Running from: 1.900000 to 1.900400
	Output valve = 0.0
Running from: 1.900400 to 1.900800
	Output valve = 0.0
Running from: 1.900800 to 1.950000
	Output valve = 0.0
Running from: 1.950000 to 1.950400
	Output valve = 0.0
Running from: 1.950400 to 1.950800
	Output valve = 0.0
Running from: 1.950800 to 2.000000
	Output valve = 0.0
Running from: 2.000000 to 2.000400
	Output valve = 0.0
Running from: 2.000400 to 2.000800
	Output valve = 0.0
Running from: 2.000800 to 2.050000
	Output valve = 0.0
Running from: 2.050000 to 2.050400
	Output valve = 0.0
Running from: 2.050400 to 2.050800
	Output valve = 0.0
Running from: 2.050800 to 2.100000
	Output valve = 0.0
Running from: 2.100000 to 2.100400
	Output valve = 0.0
Running from: 2.100400 to 2.100800
	Output valve = 0.0
Running from: 2.100800 to 2.150000
	Output valve = 0.0
Running from: 2.150000 to 2.150400
	Output valve = 0.0
Running from: 2.150400 to 2.150800
	Output valve = 0.0
Running from: 2.150800 to 2.200000
	Output valve = 0.0
Running from: 2.200000 to 2.200400
	Output valve = 0.0
Running from: 2.200400 to 2.200800
	Output valve = 0.0
Running from: 2.200800 to 2.250000
	Output valve = 0.0
Running from: 2.250000 to 2.250400
	Output valve = 0.0
Running from: 2.250400 to 2.250800
	Output valve = 0.0
Running from: 2.250800 to 2.300000
	Output valve = 0.0
Running from: 2.300000 to 2.300400
	Output valve = 0.0
Running from: 2.300400 to 2.300800
	Output valve = 0.0
Running from: 2.300800 to 2.350000
	Output valve = 0.0
Running from: 2.350000 to 2.350400
	Output valve = 0.0
Running from: 2.350400 to 2.350800
	Output valve = 0.0
Running from: 2.350800 to 2.400000
	Output valve = 0.0
Running from: 2.400000 to 2.400400
	Output valve = 0.0
Running from: 2.400400 to 2.400800
	Output valve = 0.0
Running from: 2.400800 to 2.450000
	Output valve = 0.0
Running from: 2.450000 to 2.450400
	Output valve = 0.0
Running from: 2.450400 to 2.450800
	Output valve = 0.0
Running from: 2.450800 to 2.500000
	Output valve = 0.0
Running from: 2.500000 to 2.500400
	Output valve = 0.0
Running from: 2.500400 to 2.500800
	Output valve = 0.0
Running from: 2.500800 to 2.550000
	Output valve = 0.0
Running from: 2.550000 to 2.550400
	Output valve = 0.0
Running from: 2.550400 to 2.550800
	Output valve = 0.0
Running from: 2.550800 to 2.600000
	Output valve = 0.0
Running from: 2.600000 to 2.600400
	Output valve = 0.0
Running from: 2.600400 to 2.600800
	Output valve = 0.0
Running from: 2.600800 to 2.650000
	Output valve = 0.0
Running from: 2.650000 to 2.650400
	Output valve = 0.0
Running from: 2.650400 to 2.650800
	Output valve = 0.0
Running from: 2.650800 to 2.700000
	Output valve = 0.0
Running from: 2.700000 to 2.700400
	Output valve = 0.0
Running from: 2.700400 to 2.700800
	Output valve = 0.0
Running from: 2.700800 to 2.750000
	Output valve = 0.0
Running from: 2.750000 to 2.750400
	Output valve = 0.0
Running from: 2.750400 to 2.750800
	Output valve = 0.0
Running from: 2.750800 to 2.800000
	Output valve = 0.0
Running from: 2.800000 to 2.800400
	Output valve = 0.0
Running from: 2.800400 to 2.800800
	Output valve = 0.0
Running from: 2.800800 to 2.850000
	Output valve = 0.0
Running from: 2.850000 to 2.850400
	Output valve = 0.0
Running from: 2.850400 to 2.850800
	Output valve = 0.0
Running from: 2.850800 to 2.900000
	Output valve = 0.0
Running from: 2.900000 to 2.900400
	Output valve = 0.0
Running from: 2.900400 to 2.900800
	Output valve = 0.0
Running from: 2.900800 to 2.950000
	Output valve = 0.0
Running from: 2.950000 to 2.950400
	Output valve = 0.0
Running from: 2.950400 to 2.950800
	Output valve = 0.0
Running from: 2.950800 to 3.000000
	Output valve = 0.0
Running from: 3.000000 to 3.000400
	Output valve = 0.0
Running from: 3.000400 to 3.000800
	Output valve = 0.0
Running from: 3.000800 to 3.050000
	Output valve = 0.0
Running from: 3.050000 to 3.050400
	Output valve = 0.0
Running from: 3.050400 to 3.050800
	Output valve = 0.0
Running from: 3.050800 to 3.100000
	Output valve = 0.0
Running from: 3.100000 to 3.100400
	Output valve = 0.0
Running from: 3.100400 to 3.100800
	Output valve = 0.0
Running from: 3.100800 to 3.150000
	Output valve = 0.0
Running from: 3.150000 to 3.150400
	Output valve = 0.0
Running from: 3.150400 to 3.150800
	Output valve = 0.0
Running from: 3.150800 to 3.200000
	Output valve = 0.0
Running from: 3.200000 to 3.200400
	Output valve = 0.0
Running from: 3.200400 to 3.200800
	Output valve = 0.0
Running from: 3.200800 to 3.250000
	Output valve = 0.0
Running from: 3.250000 to 3.250400
	Output valve = 0.0
Running from: 3.250400 to 3.250800
	Output valve = 0.0
Running from: 3.250800 to 3.300000
	Output valve = 0.0
Running from: 3.300000 to 3.300400
	Output valve = 0.0
Running from: 3.300400 to 3.300800
	Output valve = 0.0
Running from: 3.300800 to 3.350000
	Output valve = 0.0
Running from: 3.350000 to 3.350400
	Output valve = 0.0
Running from: 3.350400 to 3.350800
	Output valve = 0.0
Running from: 3.350800 to 3.400000
	Output valve = 0.0
Running from: 3.400000 to 3.400400
	Output valve = 0.0
Running from: 3.400400 to 3.400800
	Output valve = 0.0
Running from: 3.400800 to 3.450000
	Output valve = 0.0
Running from: 3.450000 to 3.450400
	Output valve = 0.0
Running from: 3.450400 to 3.450800
	Output valve = 0.0
Running from: 3.450800 to 3.500000
	Output valve = 0.0
Running from: 3.500000 to 3.500400
	Output valve = 0.0
Running from: 3.500400 to 3.500800
	Output valve = 0.0
Running from: 3.500800 to 3.550000
	Output valve = 0.0
Running from: 3.550000 to 3.550400
	Output valve = 0.0
Running from: 3.550400 to 3.550800
	Output valve = 0.0
Running from: 3.550800 to 3.600000
	Output valve = 0.0
Running from: 3.600000 to 3.600400
	Output valve = 0.0
Running from: 3.600400 to 3.600800
	Output valve = 0.0
Running from: 3.600800 to 3.650000
	Output valve = 0.0
Running from: 3.650000 to 3.650400
	Output valve = 0.0
Running from: 3.650400 to 3.650800
	Output valve = 0.0
Running from: 3.650800 to 3.700000
	Output valve = 0.0
Running from: 3.700000 to 3.700400
	Output valve = 0.0
Running from: 3.700400 to 3.700800
	Output valve = 0.0
Running from: 3.700800 to 3.750000
	Output valve = 0.0
Running from: 3.750000 to 3.750400
	Output valve = 0.0
Running from: 3.750400 to 3.750800
	Output valve = 0.0
Running from: 3.750800 to 3.800000
	Output valve = 0.0
Running from: 3.800000 to 3.800400
	Output valve = 0.0
Running from: 3.800400 to 3.800800
	Output valve = 0.0
Running from: 3.800800 to 3.850000
	Output valve = 0.0
Running from: 3.850000 to 3.850400
	Output valve = 0.0
Running from: 3.850400 to 3.850800
	Output valve = 0.0
Running from: 3.850800 to 3.900000
	Output valve = 0.0
Running from: 3.900000 to 3.900400
	Output valve = 0.0
Running from: 3.900400 to 3.900800
	Output valve = 0.0
Running from: 3.900800 to 3.950000
	Output valve = 0.0
Running from: 3.950000 to 3.950400
	Output valve = 0.0
Running from: 3.950400 to 3.950800
	Output valve = 0.0
Running from: 3.950800 to 4.000000
	Output valve = 0.0
Running from: 4.000000 to 4.000400
	Output valve = 0.0
Running from: 4.000400 to 4.000800
	Output valve = 0.0
Running from: 4.000800 to 4.050000
	Output valve = 0.0
Running from: 4.050000 to 4.050400
	Output valve = 0.0
Running from: 4.050400 to 4.050800
	Output valve = 0.0
Running from: 4.050800 to 4.100000
	Output valve = 0.0
Running from: 4.100000 to 4.100400
	Output valve = 0.0
Running from: 4.100400 to 4.100800
	Output valve = 0.0
Running from: 4.100800 to 4.150000
	Output valve = 0.0
Running from: 4.150000 to 4.150400
	Output valve = 0.0
Running from: 4.150400 to 4.150800
	Output valve = 0.0
Running from: 4.150800 to 4.200000
	Output valve = 0.0
Running from: 4.200000 to 4.200400
	Output valve = 0.0
Running from: 4.200400 to 4.200800
	Output valve = 0.0
Running from: 4.200800 to 4.250000
	Output valve = 0.0
Running from: 4.250000 to 4.250400
	Output valve = 0.0
Running from: 4.250400 to 4.250800
	Output valve = 0.0
Running from: 4.250800 to 4.300000
	Output valve = 0.0
Running from: 4.300000 to 4.300400
	Output valve = 0.0
Running from: 4.300400 to 4.300800
	Output valve = 0.0
Running from: 4.300800 to 4.350000
	Output valve = 0.0
Running from: 4.350000 to 4.350400
	Output valve = 0.0
Running from: 4.350400 to 4.350800
	Output valve = 0.0
Running from: 4.350800 to 4.400000
	Output valve = 0.0
Running from: 4.400000 to 4.400400
	Output valve = 0.0
Running from: 4.400400 to 4.400800
	Output valve = 0.0
Running from: 4.400800 to 4.450000
	Output valve = 0.0
Running from: 4.450000 to 4.450400
	Output valve = 0.0
Running from: 4.450400 to 4.450800
	Output valve = 0.0
Running from: 4.450800 to 4.500000
	Output valve = 0.0
Running from: 4.500000 to 4.500400
	Output valve = 0.0
Running from: 4.500400 to 4.500800
	Output valve = 0.0
Running from: 4.500800 to 4.550000
	Output valve = 0.0
Running from: 4.550000 to 4.550400
	Output valve = 0.0
Running from: 4.550400 to 4.550800
	Output valve = 0.0
Running from: 4.550800 to 4.600000
	Output valve = 0.0
Running from: 4.600000 to 4.600400
	Output valve = 0.0
Running from: 4.600400 to 4.600800
	Output valve = 0.0
Running from: 4.600800 to 4.650000
	Output valve = 0.0
Running from: 4.650000 to 4.650400
	Output valve = 0.0
Running from: 4.650400 to 4.650800
	Output valve = 0.0
Running from: 4.650800 to 4.700000
	Output valve = 0.0
Running from: 4.700000 to 4.700400
	Output valve = 0.0
Running from: 4.700400 to 4.700800
	Output valve = 0.0
Running from: 4.700800 to 4.750000
	Output valve = 0.0
Running from: 4.750000 to 4.750400
	Output valve = 0.0
Running from: 4.750400 to 4.750800
	Output valve = 0.0
Running from: 4.750800 to 4.800000
	Output valve = 0.0
Running from: 4.800000 to 4.800400
	Output valve = 0.0
Running from: 4.800400 to 4.800800
	Output valve = 0.0
Running from: 4.800800 to 4.850000
	Output valve = 0.0
Running from: 4.850000 to 4.850400
	Output valve = 0.0
Running from: 4.850400 to 4.850800
	Output valve = 0.0
Running from: 4.850800 to 4.900000
	Output valve = 0.0
Running from: 4.900000 to 4.900400
	Output valve = 0.0
Running from: 4.900400 to 4.900800
	Output valve = 0.0
Running from: 4.900800 to 4.950000
	Output valve = 0.0
Running from: 4.950000 to 4.950400
	Output valve = 0.0
Running from: 4.950400 to 4.950800
	Output valve = 0.0
Running from: 4.950800 to 5.000000
	Output valve = 0.0
Tests run: 1, Failures: 0, Errors: 0, Skipped: 0, Time elapsed: 1.495 sec

Results :

Tests run: 1, Failures: 0, Errors: 0, Skipped: 0

[INFO] 
[INFO] --- maven-jar-plugin:2.4:jar (default-jar) @ vdm ---
[INFO] Building jar: /var/lib/jenkins/workspace/scendo-pipeline_development-6SEXP6NOH4DPMHNIAG2YUHD7VUTTPKSFIJJHDCPNLS2367EFMSNQ/core/vdm/target/vdm-2.2.5-SNAPSHOT.jar
[INFO] 
[INFO] --- maven-source-plugin:2.1.1:jar-no-fork (attach-sources) @ vdm ---
[INFO] Building jar: /var/lib/jenkins/workspace/scendo-pipeline_development-6SEXP6NOH4DPMHNIAG2YUHD7VUTTPKSFIJJHDCPNLS2367EFMSNQ/core/vdm/target/vdm-2.2.5-SNAPSHOT-sources.jar
[INFO] 
[INFO] --- maven-install-plugin:2.5.2:install (default-install) @ vdm ---
[INFO] Installing /var/lib/jenkins/workspace/scendo-pipeline_development-6SEXP6NOH4DPMHNIAG2YUHD7VUTTPKSFIJJHDCPNLS2367EFMSNQ/core/vdm/target/vdm-2.2.5-SNAPSHOT.jar to /var/lib/jenkins/workspace/scendo-pipeline_development-6SEXP6NOH4DPMHNIAG2YUHD7VUTTPKSFIJJHDCPNLS2367EFMSNQ/.repository/org/destecs/core/vdm/2.2.5-SNAPSHOT/vdm-2.2.5-SNAPSHOT.jar
[INFO] Installing /var/lib/jenkins/workspace/scendo-pipeline_development-6SEXP6NOH4DPMHNIAG2YUHD7VUTTPKSFIJJHDCPNLS2367EFMSNQ/core/vdm/pom.xml to /var/lib/jenkins/workspace/scendo-pipeline_development-6SEXP6NOH4DPMHNIAG2YUHD7VUTTPKSFIJJHDCPNLS2367EFMSNQ/.repository/org/destecs/core/vdm/2.2.5-SNAPSHOT/vdm-2.2.5-SNAPSHOT.pom
[INFO] Installing /var/lib/jenkins/workspace/scendo-pipeline_development-6SEXP6NOH4DPMHNIAG2YUHD7VUTTPKSFIJJHDCPNLS2367EFMSNQ/core/vdm/target/vdm-2.2.5-SNAPSHOT-sources.jar to /var/lib/jenkins/workspace/scendo-pipeline_development-6SEXP6NOH4DPMHNIAG2YUHD7VUTTPKSFIJJHDCPNLS2367EFMSNQ/.repository/org/destecs/core/vdm/2.2.5-SNAPSHOT/vdm-2.2.5-SNAPSHOT-sources.jar
[INFO]                                                                         
[INFO] ------------------------------------------------------------------------
[INFO] Building DESTECS IDE Top-level 2.2.5-SNAPSHOT
[INFO] ------------------------------------------------------------------------
[INFO] 
[INFO] --- maven-javadoc-plugin:2.9:jar (attach-javadocs) @ ide ---
[INFO] Downloading: http://overture.au.dk/artifactory/remote-repos/org/apache/maven/shared/maven-invoker/2.0.9/maven-invoker-2.0.9.pom
[INFO] Downloaded: http://overture.au.dk/artifactory/remote-repos/org/apache/maven/shared/maven-invoker/2.0.9/maven-invoker-2.0.9.pom (6 KB at 282.1 KB/sec)
[INFO] Downloading: http://overture.au.dk/artifactory/remote-repos/org/apache/maven/shared/maven-common-artifact-filters/1.3/maven-common-artifact-filters-1.3.pom
[INFO] Downloaded: http://overture.au.dk/artifactory/remote-repos/org/apache/maven/shared/maven-common-artifact-filters/1.3/maven-common-artifact-filters-1.3.pom (4 KB at 226.0 KB/sec)
[INFO] Downloading: http://overture.au.dk/artifactory/remote-repos/org/apache/maven/shared/maven-shared-components/12/maven-shared-components-12.pom
[INFO] Downloaded: http://overture.au.dk/artifactory/remote-repos/org/apache/maven/shared/maven-shared-components/12/maven-shared-components-12.pom (10 KB at 569.9 KB/sec)
[INFO] Downloading: http://overture.au.dk/artifactory/remote-repos/org/apache/maven/maven-plugin-api/2.0.8/maven-plugin-api-2.0.8.pom
[INFO] Downloaded: http://overture.au.dk/artifactory/remote-repos/org/apache/maven/maven-plugin-api/2.0.8/maven-plugin-api-2.0.8.pom (2 KB at 69.5 KB/sec)
[INFO] Downloading: http://overture.au.dk/artifactory/remote-repos/org/apache/maven/doxia/doxia-site-renderer/1.0/doxia-site-renderer-1.0.pom
[INFO] Downloaded: http://overture.au.dk/artifactory/remote-repos/org/apache/maven/doxia/doxia-site-renderer/1.0/doxia-site-renderer-1.0.pom (5 KB at 216.2 KB/sec)
[INFO] Downloading: http://overture.au.dk/artifactory/remote-repos/org/apache/maven/doxia/doxia-sitetools/1.0/doxia-sitetools-1.0.pom
[INFO] Downloaded: http://overture.au.dk/artifactory/remote-repos/org/apache/maven/doxia/doxia-sitetools/1.0/doxia-sitetools-1.0.pom (10 KB at 445.8 KB/sec)
[INFO] Downloading: http://overture.au.dk/artifactory/remote-repos/org/apache/maven/doxia/doxia-core/1.0/doxia-core-1.0.pom
[INFO] Downloaded: http://overture.au.dk/artifactory/remote-repos/org/apache/maven/doxia/doxia-core/1.0/doxia-core-1.0.pom (3 KB at 101.7 KB/sec)
[INFO] Downloading: http://overture.au.dk/artifactory/remote-repos/org/codehaus/plexus/plexus-utils/1.5.7/plexus-utils-1.5.7.pom
[INFO] Downloaded: http://overture.au.dk/artifactory/remote-repos/org/codehaus/plexus/plexus-utils/1.5.7/plexus-utils-1.5.7.pom (8 KB at 375.0 KB/sec)
[INFO] Downloading: http://overture.au.dk/artifactory/remote-repos/org/apache/maven/doxia/doxia-decoration-model/1.0/doxia-decoration-model-1.0.pom
[INFO] Downloaded: http://overture.au.dk/artifactory/remote-repos/org/apache/maven/doxia/doxia-decoration-model/1.0/doxia-decoration-model-1.0.pom (4 KB at 192.5 KB/sec)
[INFO] Downloading: http://overture.au.dk/artifactory/remote-repos/org/apache/maven/doxia/doxia-module-apt/1.0/doxia-module-apt-1.0.pom
[INFO] Downloaded: http://overture.au.dk/artifactory/remote-repos/org/apache/maven/doxia/doxia-module-apt/1.0/doxia-module-apt-1.0.pom (3 KB at 88.0 KB/sec)
[INFO] Downloading: http://overture.au.dk/artifactory/remote-repos/org/apache/maven/doxia/doxia-modules/1.0/doxia-modules-1.0.pom
[INFO] Downloaded: http://overture.au.dk/artifactory/remote-repos/org/apache/maven/doxia/doxia-modules/1.0/doxia-modules-1.0.pom (3 KB at 116.9 KB/sec)
[INFO] Downloading: http://overture.au.dk/artifactory/remote-repos/org/apache/maven/doxia/doxia-module-fml/1.0/doxia-module-fml-1.0.pom
[INFO] Downloaded: http://overture.au.dk/artifactory/remote-repos/org/apache/maven/doxia/doxia-module-fml/1.0/doxia-module-fml-1.0.pom (3 KB at 164.3 KB/sec)
[INFO] Downloading: http://overture.au.dk/artifactory/remote-repos/org/apache/maven/doxia/doxia-module-xdoc/1.0/doxia-module-xdoc-1.0.pom
[INFO] Downloaded: http://overture.au.dk/artifactory/remote-repos/org/apache/maven/doxia/doxia-module-xdoc/1.0/doxia-module-xdoc-1.0.pom (3 KB at 128.8 KB/sec)
[INFO] Downloading: http://overture.au.dk/artifactory/remote-repos/org/apache/maven/doxia/doxia-module-xhtml/1.0/doxia-module-xhtml-1.0.pom
[INFO] Downloaded: http://overture.au.dk/artifactory/remote-repos/org/apache/maven/doxia/doxia-module-xhtml/1.0/doxia-module-xhtml-1.0.pom (2 KB at 91.9 KB/sec)
[INFO] Downloading: http://overture.au.dk/artifactory/remote-repos/org/apache/maven/wagon/wagon-provider-api/1.0-beta-6/wagon-provider-api-1.0-beta-6.pom
[INFO] Downloaded: http://overture.au.dk/artifactory/remote-repos/org/apache/maven/wagon/wagon-provider-api/1.0-beta-6/wagon-provider-api-1.0-beta-6.pom (2 KB at 107.4 KB/sec)
[INFO] Downloading: http://overture.au.dk/artifactory/remote-repos/org/apache/maven/wagon/wagon/1.0-beta-6/wagon-1.0-beta-6.pom
[INFO] Downloaded: http://overture.au.dk/artifactory/remote-repos/org/apache/maven/wagon/wagon/1.0-beta-6/wagon-1.0-beta-6.pom (13 KB at 711.5 KB/sec)
[INFO] Downloading: http://overture.au.dk/artifactory/remote-repos/log4j/log4j/1.2.14/log4j-1.2.14.pom
[INFO] Downloaded: http://overture.au.dk/artifactory/remote-repos/log4j/log4j/1.2.14/log4j-1.2.14.pom (3 KB at 144.9 KB/sec)
[INFO] Downloading: http://overture.au.dk/artifactory/remote-repos/com/thoughtworks/qdox/qdox/1.12/qdox-1.12.pom
[INFO] Downloaded: http://overture.au.dk/artifactory/remote-repos/com/thoughtworks/qdox/qdox/1.12/qdox-1.12.pom (19 KB at 906.0 KB/sec)
[INFO] Downloading: http://overture.au.dk/artifactory/remote-repos/org/codehaus/plexus/plexus-archiver/2.1.2/plexus-archiver-2.1.2.pom
[INFO] Downloaded: http://overture.au.dk/artifactory/remote-repos/org/codehaus/plexus/plexus-archiver/2.1.2/plexus-archiver-2.1.2.pom (4 KB at 204.8 KB/sec)
[INFO] Downloading: http://overture.au.dk/artifactory/remote-repos/org/codehaus/plexus/plexus-utils/3.0.2/plexus-utils-3.0.2.pom
[INFO] Downloaded: http://overture.au.dk/artifactory/remote-repos/org/codehaus/plexus/plexus-utils/3.0.2/plexus-utils-3.0.2.pom (3 KB at 144.3 KB/sec)
[INFO] Downloading: http://overture.au.dk/artifactory/remote-repos/org/codehaus/plexus/plexus-io/2.0.4/plexus-io-2.0.4.pom
[INFO] Downloaded: http://overture.au.dk/artifactory/remote-repos/org/codehaus/plexus/plexus-io/2.0.4/plexus-io-2.0.4.pom (2 KB at 99.6 KB/sec)
[INFO] Downloading: http://overture.au.dk/artifactory/remote-repos/org/codehaus/plexus/plexus-utils/3.0.5/plexus-utils-3.0.5.pom
[INFO] Downloaded: http://overture.au.dk/artifactory/remote-repos/org/codehaus/plexus/plexus-utils/3.0.5/plexus-utils-3.0.5.pom (3 KB at 144.3 KB/sec)
[INFO] Downloading: http://overture.au.dk/artifactory/remote-repos/org/apache/maven/maven-core/2.2.1/maven-core-2.2.1.jar
[INFO] Downloading: http://overture.au.dk/artifactory/remote-repos/org/apache/maven/maven-plugin-parameter-documenter/2.2.1/maven-plugin-parameter-documenter-2.2.1.jar
[INFO] Downloading: http://overture.au.dk/artifactory/remote-repos/org/slf4j/slf4j-jdk14/1.5.6/slf4j-jdk14-1.5.6.jar
[INFO] Downloading: http://overture.au.dk/artifactory/remote-repos/org/slf4j/slf4j-api/1.5.6/slf4j-api-1.5.6.jar
[INFO] Downloading: http://overture.au.dk/artifactory/remote-repos/org/slf4j/jcl-over-slf4j/1.5.6/jcl-over-slf4j-1.5.6.jar
[INFO] Downloaded: http://overture.au.dk/artifactory/remote-repos/org/apache/maven/maven-plugin-parameter-documenter/2.2.1/maven-plugin-parameter-documenter-2.2.1.jar (22 KB at 985.1 KB/sec)
[INFO] Downloading: http://overture.au.dk/artifactory/remote-repos/org/apache/maven/maven-error-diagnostics/2.2.1/maven-error-diagnostics-2.2.1.jar
[INFO] Downloaded: http://overture.au.dk/artifactory/remote-repos/org/slf4j/slf4j-jdk14/1.5.6/slf4j-jdk14-1.5.6.jar (9 KB at 344.3 KB/sec)
[INFO] Downloading: http://overture.au.dk/artifactory/remote-repos/commons-cli/commons-cli/1.2/commons-cli-1.2.jar
[INFO] Downloaded: http://overture.au.dk/artifactory/remote-repos/org/slf4j/slf4j-api/1.5.6/slf4j-api-1.5.6.jar (22 KB at 807.9 KB/sec)
[INFO] Downloading: http://overture.au.dk/artifactory/remote-repos/org/apache/maven/maven-monitor/2.2.1/maven-monitor-2.2.1.jar
[INFO] Downloaded: http://overture.au.dk/artifactory/remote-repos/org/apache/maven/maven-core/2.2.1/maven-core-2.2.1.jar (174 KB at 5990.3 KB/sec)
[INFO] Downloading: http://overture.au.dk/artifactory/remote-repos/org/apache/maven/shared/maven-invoker/2.0.9/maven-invoker-2.0.9.jar
[INFO] Downloaded: http://overture.au.dk/artifactory/remote-repos/org/slf4j/jcl-over-slf4j/1.5.6/jcl-over-slf4j-1.5.6.jar (17 KB at 563.1 KB/sec)
[INFO] Downloading: http://overture.au.dk/artifactory/remote-repos/org/apache/maven/shared/maven-common-artifact-filters/1.3/maven-common-artifact-filters-1.3.jar
[INFO] Downloaded: http://overture.au.dk/artifactory/remote-repos/org/apache/maven/maven-error-diagnostics/2.2.1/maven-error-diagnostics-2.2.1.jar (13 KB at 353.2 KB/sec)
[INFO] Downloading: http://overture.au.dk/artifactory/remote-repos/org/apache/maven/doxia/doxia-sink-api/1.0/doxia-sink-api-1.0.jar
[INFO] Downloaded: http://overture.au.dk/artifactory/remote-repos/org/apache/maven/maven-monitor/2.2.1/maven-monitor-2.2.1.jar (11 KB at 261.8 KB/sec)
[INFO] Downloading: http://overture.au.dk/artifactory/remote-repos/org/apache/maven/doxia/doxia-site-renderer/1.0/doxia-site-renderer-1.0.jar
[INFO] Downloaded: http://overture.au.dk/artifactory/remote-repos/org/apache/maven/shared/maven-invoker/2.0.9/maven-invoker-2.0.9.jar (28 KB at 690.5 KB/sec)
[INFO] Downloading: http://overture.au.dk/artifactory/remote-repos/org/apache/maven/doxia/doxia-core/1.0/doxia-core-1.0.jar
[INFO] Downloaded: http://overture.au.dk/artifactory/remote-repos/commons-cli/commons-cli/1.2/commons-cli-1.2.jar (41 KB at 933.9 KB/sec)
[INFO] Downloading: http://overture.au.dk/artifactory/remote-repos/org/apache/maven/doxia/doxia-decoration-model/1.0/doxia-decoration-model-1.0.jar
[INFO] Downloaded: http://overture.au.dk/artifactory/remote-repos/org/apache/maven/shared/maven-common-artifact-filters/1.3/maven-common-artifact-filters-1.3.jar (31 KB at 594.7 KB/sec)
[INFO] Downloading: http://overture.au.dk/artifactory/remote-repos/commons-collections/commons-collections/3.2/commons-collections-3.2.jar
[INFO] Downloaded: http://overture.au.dk/artifactory/remote-repos/org/apache/maven/doxia/doxia-sink-api/1.0/doxia-sink-api-1.0.jar (10 KB at 189.2 KB/sec)
[INFO] Downloading: http://overture.au.dk/artifactory/remote-repos/org/apache/maven/doxia/doxia-module-apt/1.0/doxia-module-apt-1.0.jar
[INFO] Downloaded: http://overture.au.dk/artifactory/remote-repos/org/apache/maven/doxia/doxia-site-renderer/1.0/doxia-site-renderer-1.0.jar (46 KB at 757.1 KB/sec)
[INFO] Downloading: http://overture.au.dk/artifactory/remote-repos/org/apache/maven/doxia/doxia-module-fml/1.0/doxia-module-fml-1.0.jar
[INFO] Downloaded: http://overture.au.dk/artifactory/remote-repos/org/apache/maven/doxia/doxia-decoration-model/1.0/doxia-decoration-model-1.0.jar (48 KB at 759.3 KB/sec)
[INFO] Downloading: http://overture.au.dk/artifactory/remote-repos/org/apache/maven/doxia/doxia-module-xdoc/1.0/doxia-module-xdoc-1.0.jar
[INFO] Downloaded: http://overture.au.dk/artifactory/remote-repos/org/apache/maven/doxia/doxia-core/1.0/doxia-core-1.0.jar (54 KB at 851.8 KB/sec)
[INFO] Downloaded: http://overture.au.dk/artifactory/remote-repos/org/apache/maven/doxia/doxia-module-apt/1.0/doxia-module-apt-1.0.jar (46 KB at 686.2 KB/sec)
[INFO] Downloading: http://overture.au.dk/artifactory/remote-repos/org/apache/maven/doxia/doxia-module-xhtml/1.0/doxia-module-xhtml-1.0.jar
[INFO] Downloading: http://overture.au.dk/artifactory/remote-repos/org/apache/maven/wagon/wagon-provider-api/1.0-beta-6/wagon-provider-api-1.0-beta-6.jar
[INFO] Downloaded: http://overture.au.dk/artifactory/remote-repos/org/apache/maven/doxia/doxia-module-fml/1.0/doxia-module-fml-1.0.jar (19 KB at 215.6 KB/sec)
[INFO] Downloading: http://overture.au.dk/artifactory/remote-repos/commons-httpclient/commons-httpclient/3.1/commons-httpclient-3.1.jar
[INFO] Downloaded: http://overture.au.dk/artifactory/remote-repos/org/apache/maven/doxia/doxia-module-xhtml/1.0/doxia-module-xhtml-1.0.jar (22 KB at 253.5 KB/sec)
[INFO] Downloading: http://overture.au.dk/artifactory/remote-repos/commons-codec/commons-codec/1.2/commons-codec-1.2.jar
[INFO] Downloaded: http://overture.au.dk/artifactory/remote-repos/org/apache/maven/doxia/doxia-module-xdoc/1.0/doxia-module-xdoc-1.0.jar (28 KB at 319.4 KB/sec)
[INFO] Downloading: http://overture.au.dk/artifactory/remote-repos/commons-logging/commons-logging/1.1.1/commons-logging-1.1.1.jar
[INFO] Downloaded: http://overture.au.dk/artifactory/remote-repos/org/apache/maven/wagon/wagon-provider-api/1.0-beta-6/wagon-provider-api-1.0-beta-6.jar (52 KB at 597.0 KB/sec)
[INFO] Downloading: http://overture.au.dk/artifactory/remote-repos/log4j/log4j/1.2.14/log4j-1.2.14.jar
[INFO] Downloaded: http://overture.au.dk/artifactory/remote-repos/commons-collections/commons-collections/3.2/commons-collections-3.2.jar (558 KB at 5998.6 KB/sec)
[INFO] Downloading: http://overture.au.dk/artifactory/remote-repos/com/thoughtworks/qdox/qdox/1.12/qdox-1.12.jar
[INFO] Downloaded: http://overture.au.dk/artifactory/remote-repos/commons-codec/commons-codec/1.2/commons-codec-1.2.jar (30 KB at 309.3 KB/sec)
[INFO] Downloading: http://overture.au.dk/artifactory/remote-repos/org/codehaus/plexus/plexus-archiver/2.1.2/plexus-archiver-2.1.2.jar
[INFO] Downloaded: http://overture.au.dk/artifactory/remote-repos/commons-logging/commons-logging/1.1.1/commons-logging-1.1.1.jar (60 KB at 604.7 KB/sec)
[INFO] Downloading: http://overture.au.dk/artifactory/remote-repos/org/codehaus/plexus/plexus-io/2.0.4/plexus-io-2.0.4.jar
[INFO] Downloaded: http://overture.au.dk/artifactory/remote-repos/org/codehaus/plexus/plexus-io/2.0.4/plexus-io-2.0.4.jar (57 KB at 508.2 KB/sec)
[INFO] Downloading: http://overture.au.dk/artifactory/remote-repos/org/codehaus/plexus/plexus-utils/3.0.5/plexus-utils-3.0.5.jar
[INFO] Downloaded: http://overture.au.dk/artifactory/remote-repos/commons-httpclient/commons-httpclient/3.1/commons-httpclient-3.1.jar (298 KB at 2659.4 KB/sec)
[INFO] Downloaded: http://overture.au.dk/artifactory/remote-repos/org/codehaus/plexus/plexus-archiver/2.1.2/plexus-archiver-2.1.2.jar (181 KB at 1597.6 KB/sec)
[INFO] Downloaded: http://overture.au.dk/artifactory/remote-repos/log4j/log4j/1.2.14/log4j-1.2.14.jar (359 KB at 3120.3 KB/sec)
[INFO] Downloaded: http://overture.au.dk/artifactory/remote-repos/com/thoughtworks/qdox/qdox/1.12/qdox-1.12.jar (176 KB at 1513.0 KB/sec)
[INFO] Downloaded: http://overture.au.dk/artifactory/remote-repos/org/codehaus/plexus/plexus-utils/3.0.5/plexus-utils-3.0.5.jar (226 KB at 1744.5 KB/sec)
[INFO] Skipping javadoc generation
[INFO] 
[INFO] --- maven-install-plugin:2.5.2:install (default-install) @ ide ---
[INFO] Installing /var/lib/jenkins/workspace/scendo-pipeline_development-6SEXP6NOH4DPMHNIAG2YUHD7VUTTPKSFIJJHDCPNLS2367EFMSNQ/ide/pom.xml to /var/lib/jenkins/workspace/scendo-pipeline_development-6SEXP6NOH4DPMHNIAG2YUHD7VUTTPKSFIJJHDCPNLS2367EFMSNQ/.repository/org/destecs/ide/2.2.5-SNAPSHOT/ide-2.2.5-SNAPSHOT.pom
[INFO]                                                                         
[INFO] ------------------------------------------------------------------------
[INFO] Building org.destecs.ide.core 2.2.5-SNAPSHOT
[INFO] ------------------------------------------------------------------------
[INFO] 
[INFO] --- tycho-packaging-plugin:0.25.0:build-qualifier (default-build-qualifier) @ org.destecs.ide.core ---
[INFO] The project's OSGi version is 2.2.5.201811220749
[INFO] 
[INFO] --- tycho-packaging-plugin:0.25.0:validate-id (default-validate-id) @ org.destecs.ide.core ---
[INFO] 
[INFO] --- tycho-packaging-plugin:0.25.0:validate-version (default-validate-version) @ org.destecs.ide.core ---
[INFO] 
[INFO] --- maven-dependency-plugin:2.6:copy (copy-dependencies) @ org.destecs.ide.core ---
[INFO] Downloading: http://overture.au.dk/artifactory/remote-repos/org/apache/maven/reporting/maven-reporting-impl/2.0.5/maven-reporting-impl-2.0.5.pom
[INFO] Downloaded: http://overture.au.dk/artifactory/remote-repos/org/apache/maven/reporting/maven-reporting-impl/2.0.5/maven-reporting-impl-2.0.5.pom (5 KB at 217.1 KB/sec)
[INFO] Downloading: http://overture.au.dk/artifactory/remote-repos/org/apache/maven/shared/maven-doxia-tools/1.0.2/maven-doxia-tools-1.0.2.pom
[INFO] Downloaded: http://overture.au.dk/artifactory/remote-repos/org/apache/maven/shared/maven-doxia-tools/1.0.2/maven-doxia-tools-1.0.2.pom (6 KB at 318.2 KB/sec)
[INFO] Downloading: http://overture.au.dk/artifactory/remote-repos/org/apache/maven/shared/maven-shared-components/11/maven-shared-components-11.pom
[INFO] Downloaded: http://overture.au.dk/artifactory/remote-repos/org/apache/maven/shared/maven-shared-components/11/maven-shared-components-11.pom (9 KB at 428.7 KB/sec)
[INFO] Downloading: http://overture.au.dk/artifactory/remote-repos/org/codehaus/plexus/plexus-archiver/2.2/plexus-archiver-2.2.pom
[INFO] Downloaded: http://overture.au.dk/artifactory/remote-repos/org/codehaus/plexus/plexus-archiver/2.2/plexus-archiver-2.2.pom (4 KB at 136.4 KB/sec)
[INFO] Downloading: http://overture.au.dk/artifactory/remote-repos/org/codehaus/plexus/plexus-components/1.1.20/plexus-components-1.1.20.pom
[INFO] Downloaded: http://overture.au.dk/artifactory/remote-repos/org/codehaus/plexus/plexus-components/1.1.20/plexus-components-1.1.20.pom (3 KB at 143.7 KB/sec)
[INFO] Downloading: http://overture.au.dk/artifactory/remote-repos/org/codehaus/plexus/plexus-utils/3.0.9/plexus-utils-3.0.9.pom
[INFO] Downloaded: http://overture.au.dk/artifactory/remote-repos/org/codehaus/plexus/plexus-utils/3.0.9/plexus-utils-3.0.9.pom (4 KB at 170.5 KB/sec)
[INFO] Downloading: http://overture.au.dk/artifactory/remote-repos/org/apache/maven/shared/file-management/1.2.1/file-management-1.2.1.pom
[INFO] Downloaded: http://overture.au.dk/artifactory/remote-repos/org/apache/maven/shared/file-management/1.2.1/file-management-1.2.1.pom (4 KB at 108.3 KB/sec)
[INFO] Downloading: http://overture.au.dk/artifactory/remote-repos/org/apache/maven/shared/maven-shared-io/1.1/maven-shared-io-1.1.pom
[INFO] Downloaded: http://overture.au.dk/artifactory/remote-repos/org/apache/maven/shared/maven-shared-io/1.1/maven-shared-io-1.1.pom (4 KB at 220.3 KB/sec)
[INFO] Downloading: http://overture.au.dk/artifactory/remote-repos/org/codehaus/plexus/plexus-io/2.0.6/plexus-io-2.0.6.pom
[INFO] Downloaded: http://overture.au.dk/artifactory/remote-repos/org/codehaus/plexus/plexus-io/2.0.6/plexus-io-2.0.6.pom (3 KB at 113.6 KB/sec)
[INFO] Downloading: http://overture.au.dk/artifactory/remote-repos/org/apache/maven/shared/maven-dependency-analyzer/1.3/maven-dependency-analyzer-1.3.pom
[INFO] Downloaded: http://overture.au.dk/artifactory/remote-repos/org/apache/maven/shared/maven-dependency-analyzer/1.3/maven-dependency-analyzer-1.3.pom (6 KB at 279.5 KB/sec)
[INFO] Downloading: http://overture.au.dk/artifactory/remote-repos/asm/asm/3.3.1/asm-3.3.1.pom
[INFO] Downloaded: http://overture.au.dk/artifactory/remote-repos/asm/asm/3.3.1/asm-3.3.1.pom (266 B at 16.2 KB/sec)
[INFO] Downloading: http://overture.au.dk/artifactory/remote-repos/asm/asm-parent/3.3.1/asm-parent-3.3.1.pom
[INFO] Downloaded: http://overture.au.dk/artifactory/remote-repos/asm/asm-parent/3.3.1/asm-parent-3.3.1.pom (5 KB at 211.5 KB/sec)
[INFO] Downloading: http://overture.au.dk/artifactory/remote-repos/org/apache/maven/maven-project/2.0.5/maven-project-2.0.5.pom
[INFO] Downloaded: http://overture.au.dk/artifactory/remote-repos/org/apache/maven/maven-project/2.0.5/maven-project-2.0.5.pom (2 KB at 89.9 KB/sec)
[INFO] Downloading: http://overture.au.dk/artifactory/remote-repos/org/apache/maven/maven/2.0.5/maven-2.0.5.pom
[INFO] Downloaded: http://overture.au.dk/artifactory/remote-repos/org/apache/maven/maven/2.0.5/maven-2.0.5.pom (6 KB at 293.2 KB/sec)
[INFO] Downloading: http://overture.au.dk/artifactory/remote-repos/org/apache/maven/maven-settings/2.0.5/maven-settings-2.0.5.pom
[INFO] Downloaded: http://overture.au.dk/artifactory/remote-repos/org/apache/maven/maven-settings/2.0.5/maven-settings-2.0.5.pom (2 KB at 77.9 KB/sec)
[INFO] Downloading: http://overture.au.dk/artifactory/remote-repos/org/apache/maven/maven-model/2.0.5/maven-model-2.0.5.pom
[INFO] Downloaded: http://overture.au.dk/artifactory/remote-repos/org/apache/maven/maven-model/2.0.5/maven-model-2.0.5.pom (3 KB at 126.6 KB/sec)
[INFO] Downloading: http://overture.au.dk/artifactory/remote-repos/org/apache/maven/maven-profile/2.0.5/maven-profile-2.0.5.pom
[INFO] Downloaded: http://overture.au.dk/artifactory/remote-repos/org/apache/maven/maven-profile/2.0.5/maven-profile-2.0.5.pom (2 KB at 73.5 KB/sec)
[INFO] Downloading: http://overture.au.dk/artifactory/remote-repos/org/apache/maven/maven-artifact-manager/2.0.5/maven-artifact-manager-2.0.5.pom
[INFO] Downloaded: http://overture.au.dk/artifactory/remote-repos/org/apache/maven/maven-artifact-manager/2.0.5/maven-artifact-manager-2.0.5.pom (2 KB at 99.5 KB/sec)
[INFO] Downloading: http://overture.au.dk/artifactory/remote-repos/org/apache/maven/maven-repository-metadata/2.0.5/maven-repository-metadata-2.0.5.pom
[INFO] Downloaded: http://overture.au.dk/artifactory/remote-repos/org/apache/maven/maven-repository-metadata/2.0.5/maven-repository-metadata-2.0.5.pom (2 KB at 76.4 KB/sec)
[INFO] Downloading: http://overture.au.dk/artifactory/remote-repos/org/apache/maven/maven-artifact/2.0.5/maven-artifact-2.0.5.pom
[INFO] Downloaded: http://overture.au.dk/artifactory/remote-repos/org/apache/maven/maven-artifact/2.0.5/maven-artifact-2.0.5.pom (727 B at 41.8 KB/sec)
[INFO] Downloading: http://overture.au.dk/artifactory/remote-repos/org/apache/maven/shared/maven-dependency-tree/2.0/maven-dependency-tree-2.0.pom
[INFO] Downloaded: http://overture.au.dk/artifactory/remote-repos/org/apache/maven/shared/maven-dependency-tree/2.0/maven-dependency-tree-2.0.pom (5 KB at 240.1 KB/sec)
[INFO] Downloading: http://overture.au.dk/artifactory/remote-repos/org/apache/maven/maven-project/2.2.0/maven-project-2.2.0.pom
[INFO] Downloaded: http://overture.au.dk/artifactory/remote-repos/org/apache/maven/maven-project/2.2.0/maven-project-2.2.0.pom (3 KB at 142.5 KB/sec)
[INFO] Downloading: http://overture.au.dk/artifactory/remote-repos/org/apache/maven/maven/2.2.0/maven-2.2.0.pom
[INFO] Downloaded: http://overture.au.dk/artifactory/remote-repos/org/apache/maven/maven/2.2.0/maven-2.2.0.pom (22 KB at 1096.5 KB/sec)
[INFO] Downloading: http://overture.au.dk/artifactory/remote-repos/org/apache/maven/maven-settings/2.2.0/maven-settings-2.2.0.pom
[INFO] Downloaded: http://overture.au.dk/artifactory/remote-repos/org/apache/maven/maven-settings/2.2.0/maven-settings-2.2.0.pom (3 KB at 112.0 KB/sec)
[INFO] Downloading: http://overture.au.dk/artifactory/remote-repos/org/apache/maven/maven-model/2.2.0/maven-model-2.2.0.pom
[INFO] Downloaded: http://overture.au.dk/artifactory/remote-repos/org/apache/maven/maven-model/2.2.0/maven-model-2.2.0.pom (4 KB at 197.8 KB/sec)
[INFO] Downloading: http://overture.au.dk/artifactory/remote-repos/org/apache/maven/maven-profile/2.2.0/maven-profile-2.2.0.pom
[INFO] Downloaded: http://overture.au.dk/artifactory/remote-repos/org/apache/maven/maven-profile/2.2.0/maven-profile-2.2.0.pom (3 KB at 124.7 KB/sec)
[INFO] Downloading: http://overture.au.dk/artifactory/remote-repos/org/apache/maven/maven-artifact-manager/2.2.0/maven-artifact-manager-2.2.0.pom
[INFO] Downloaded: http://overture.au.dk/artifactory/remote-repos/org/apache/maven/maven-artifact-manager/2.2.0/maven-artifact-manager-2.2.0.pom (4 KB at 144.3 KB/sec)
[INFO] Downloading: http://overture.au.dk/artifactory/remote-repos/org/apache/maven/maven-repository-metadata/2.2.0/maven-repository-metadata-2.2.0.pom
[INFO] Downloaded: http://overture.au.dk/artifactory/remote-repos/org/apache/maven/maven-repository-metadata/2.2.0/maven-repository-metadata-2.2.0.pom (2 KB at 91.4 KB/sec)
[INFO] Downloading: http://overture.au.dk/artifactory/remote-repos/org/apache/maven/maven-artifact/2.2.0/maven-artifact-2.2.0.pom
[INFO] Downloaded: http://overture.au.dk/artifactory/remote-repos/org/apache/maven/maven-artifact/2.2.0/maven-artifact-2.2.0.pom (2 KB at 77.2 KB/sec)
[INFO] Downloading: http://overture.au.dk/artifactory/remote-repos/org/apache/maven/maven-plugin-registry/2.2.0/maven-plugin-registry-2.2.0.pom
[INFO] Downloaded: http://overture.au.dk/artifactory/remote-repos/org/apache/maven/maven-plugin-registry/2.2.0/maven-plugin-registry-2.2.0.pom (2 KB at 104.7 KB/sec)
[INFO] Downloading: http://overture.au.dk/artifactory/remote-repos/org/apache/maven/shared/maven-common-artifact-filters/1.4/maven-common-artifact-filters-1.4.pom
[INFO] Downloaded: http://overture.au.dk/artifactory/remote-repos/org/apache/maven/shared/maven-common-artifact-filters/1.4/maven-common-artifact-filters-1.4.pom (4 KB at 216.0 KB/sec)
[INFO] Downloading: http://overture.au.dk/artifactory/remote-repos/org/codehaus/plexus/plexus-container-default/1.5.5/plexus-container-default-1.5.5.pom
[INFO] Downloaded: http://overture.au.dk/artifactory/remote-repos/org/codehaus/plexus/plexus-container-default/1.5.5/plexus-container-default-1.5.5.pom (3 KB at 128.1 KB/sec)
[INFO] Downloading: http://overture.au.dk/artifactory/remote-repos/org/codehaus/plexus/plexus-classworlds/2.2.2/plexus-classworlds-2.2.2.pom
[INFO] Downloaded: http://overture.au.dk/artifactory/remote-repos/org/codehaus/plexus/plexus-classworlds/2.2.2/plexus-classworlds-2.2.2.pom (4 KB at 218.8 KB/sec)
[INFO] Downloading: http://overture.au.dk/artifactory/remote-repos/org/apache/xbean/xbean-reflect/3.4/xbean-reflect-3.4.pom
[INFO] Downloaded: http://overture.au.dk/artifactory/remote-repos/org/apache/xbean/xbean-reflect/3.4/xbean-reflect-3.4.pom (3 KB at 171.4 KB/sec)
[INFO] Downloading: http://overture.au.dk/artifactory/remote-repos/org/apache/xbean/xbean/3.4/xbean-3.4.pom
[INFO] Downloaded: http://overture.au.dk/artifactory/remote-repos/org/apache/xbean/xbean/3.4/xbean-3.4.pom (18 KB at 743.1 KB/sec)
[INFO] Downloading: http://overture.au.dk/artifactory/remote-repos/commons-logging/commons-logging-api/1.1/commons-logging-api-1.1.pom
[INFO] Downloaded: http://overture.au.dk/artifactory/remote-repos/commons-logging/commons-logging-api/1.1/commons-logging-api-1.1.pom (6 KB at 274.8 KB/sec)
[INFO] Downloading: http://overture.au.dk/artifactory/remote-repos/com/google/collections/google-collections/1.0/google-collections-1.0.pom
[INFO] Downloaded: http://overture.au.dk/artifactory/remote-repos/com/google/collections/google-collections/1.0/google-collections-1.0.pom (3 KB at 115.2 KB/sec)
[INFO] Downloading: http://overture.au.dk/artifactory/remote-repos/com/google/google/1/google-1.pom
[INFO] Downloaded: http://overture.au.dk/artifactory/remote-repos/com/google/google/1/google-1.pom (2 KB at 94.8 KB/sec)
[INFO] Downloading: http://overture.au.dk/artifactory/remote-repos/org/codehaus/plexus/plexus-utils/2.1/plexus-utils-2.1.pom
[INFO] Downloaded: http://overture.au.dk/artifactory/remote-repos/org/codehaus/plexus/plexus-utils/2.1/plexus-utils-2.1.pom (4 KB at 151.5 KB/sec)
[INFO] Downloading: http://overture.au.dk/artifactory/remote-repos/org/apache/maven/shared/maven-invoker/2.0.11/maven-invoker-2.0.11.pom
[INFO] Downloaded: http://overture.au.dk/artifactory/remote-repos/org/apache/maven/shared/maven-invoker/2.0.11/maven-invoker-2.0.11.pom (5 KB at 309.7 KB/sec)
[INFO] Downloading: http://overture.au.dk/artifactory/remote-repos/commons-lang/commons-lang/2.6/commons-lang-2.6.pom
[INFO] Downloaded: http://overture.au.dk/artifactory/remote-repos/commons-lang/commons-lang/2.6/commons-lang-2.6.pom (18 KB at 1004.9 KB/sec)
[INFO] Downloading: http://overture.au.dk/artifactory/remote-repos/org/apache/commons/commons-parent/17/commons-parent-17.pom
[INFO] Downloaded: http://overture.au.dk/artifactory/remote-repos/org/apache/commons/commons-parent/17/commons-parent-17.pom (31 KB at 1268.9 KB/sec)
[INFO] Downloading: http://overture.au.dk/artifactory/remote-repos/org/apache/maven/reporting/maven-reporting-impl/2.0.5/maven-reporting-impl-2.0.5.jar
[INFO] Downloading: http://overture.au.dk/artifactory/remote-repos/org/apache/maven/shared/maven-doxia-tools/1.0.2/maven-doxia-tools-1.0.2.jar
[INFO] Downloading: http://overture.au.dk/artifactory/remote-repos/org/codehaus/plexus/plexus-archiver/2.2/plexus-archiver-2.2.jar
[INFO] Downloading: http://overture.au.dk/artifactory/remote-repos/org/codehaus/plexus/plexus-utils/3.0.9/plexus-utils-3.0.9.jar
[INFO] Downloading: http://overture.au.dk/artifactory/remote-repos/org/apache/maven/shared/file-management/1.2.1/file-management-1.2.1.jar
[INFO] Downloaded: http://overture.au.dk/artifactory/remote-repos/org/apache/maven/reporting/maven-reporting-impl/2.0.5/maven-reporting-impl-2.0.5.jar (21 KB at 915.0 KB/sec)
[INFO] Downloading: http://overture.au.dk/artifactory/remote-repos/org/apache/maven/shared/maven-shared-io/1.1/maven-shared-io-1.1.jar
[INFO] Downloaded: http://overture.au.dk/artifactory/remote-repos/org/apache/maven/shared/maven-doxia-tools/1.0.2/maven-doxia-tools-1.0.2.jar (41 KB at 1604.8 KB/sec)
[INFO] Downloading: http://overture.au.dk/artifactory/remote-repos/org/apache/maven/wagon/wagon-provider-api/1.0-alpha-6/wagon-provider-api-1.0-alpha-6.jar
[INFO] Downloaded: http://overture.au.dk/artifactory/remote-repos/org/codehaus/plexus/plexus-archiver/2.2/plexus-archiver-2.2.jar (181 KB at 5827.1 KB/sec)
[INFO] Downloading: http://overture.au.dk/artifactory/remote-repos/org/codehaus/plexus/plexus-io/2.0.6/plexus-io-2.0.6.jar
[INFO] Downloaded: http://overture.au.dk/artifactory/remote-repos/org/apache/maven/shared/file-management/1.2.1/file-management-1.2.1.jar (37 KB at 1467.8 KB/sec)
[INFO] Downloading: http://overture.au.dk/artifactory/remote-repos/org/apache/maven/shared/maven-dependency-analyzer/1.3/maven-dependency-analyzer-1.3.jar
[INFO] Downloaded: http://overture.au.dk/artifactory/remote-repos/org/apache/maven/shared/maven-shared-io/1.1/maven-shared-io-1.1.jar (39 KB at 1285.2 KB/sec)
[INFO] Downloading: http://overture.au.dk/artifactory/remote-repos/asm/asm/3.3.1/asm-3.3.1.jar
[INFO] Downloaded: http://overture.au.dk/artifactory/remote-repos/org/apache/maven/wagon/wagon-provider-api/1.0-alpha-6/wagon-provider-api-1.0-alpha-6.jar (42 KB at 1346.0 KB/sec)
[INFO] Downloading: http://overture.au.dk/artifactory/remote-repos/org/apache/maven/shared/maven-dependency-tree/2.0/maven-dependency-tree-2.0.jar
[INFO] Downloaded: http://overture.au.dk/artifactory/remote-repos/org/codehaus/plexus/plexus-utils/3.0.9/plexus-utils-3.0.9.jar (227 KB at 6121.7 KB/sec)
[INFO] Downloading: http://overture.au.dk/artifactory/remote-repos/org/apache/maven/shared/maven-common-artifact-filters/1.4/maven-common-artifact-filters-1.4.jar
[INFO] Downloaded: http://overture.au.dk/artifactory/remote-repos/org/codehaus/plexus/plexus-io/2.0.6/plexus-io-2.0.6.jar (57 KB at 1444.0 KB/sec)
[INFO] Downloading: http://overture.au.dk/artifactory/remote-repos/org/apache/maven/shared/maven-invoker/2.0.11/maven-invoker-2.0.11.jar
[INFO] Downloaded: http://overture.au.dk/artifactory/remote-repos/org/apache/maven/shared/maven-dependency-analyzer/1.3/maven-dependency-analyzer-1.3.jar (27 KB at 686.5 KB/sec)
[INFO] Downloading: http://overture.au.dk/artifactory/remote-repos/commons-lang/commons-lang/2.6/commons-lang-2.6.jar
[INFO] Downloaded: http://overture.au.dk/artifactory/remote-repos/asm/asm/3.3.1/asm-3.3.1.jar (43 KB at 1013.3 KB/sec)
[INFO] Downloaded: http://overture.au.dk/artifactory/remote-repos/org/apache/maven/shared/maven-dependency-tree/2.0/maven-dependency-tree-2.0.jar (55 KB at 1140.0 KB/sec)
[INFO] Downloaded: http://overture.au.dk/artifactory/remote-repos/org/apache/maven/shared/maven-common-artifact-filters/1.4/maven-common-artifact-filters-1.4.jar (31 KB at 617.1 KB/sec)
[INFO] Downloaded: http://overture.au.dk/artifactory/remote-repos/org/apache/maven/shared/maven-invoker/2.0.11/maven-invoker-2.0.11.jar (29 KB at 532.7 KB/sec)
[INFO] Downloaded: http://overture.au.dk/artifactory/remote-repos/commons-lang/commons-lang/2.6/commons-lang-2.6.jar (278 KB at 4785.5 KB/sec)
[INFO] Configured Artifact: org.destecs.core:parsers:2.0.8:jar
[INFO] Configured Artifact: antlr:antlr:2.7.7:jar
[INFO] Configured Artifact: org.antlr:stringtemplate:3.2:jar
[INFO] Configured Artifact: org.antlr:antlr-runtime:3.2:jar
[INFO] Configured Artifact: org.antlr:antlr:3.2:jar
[INFO] Copying parsers-2.0.8.jar to /var/lib/jenkins/workspace/scendo-pipeline_development-6SEXP6NOH4DPMHNIAG2YUHD7VUTTPKSFIJJHDCPNLS2367EFMSNQ/ide/core/jars/parsers.jar
[INFO] Copying antlr-2.7.7.jar to /var/lib/jenkins/workspace/scendo-pipeline_development-6SEXP6NOH4DPMHNIAG2YUHD7VUTTPKSFIJJHDCPNLS2367EFMSNQ/ide/core/jars/antlr.jar
[INFO] Copying stringtemplate-3.2.jar to /var/lib/jenkins/workspace/scendo-pipeline_development-6SEXP6NOH4DPMHNIAG2YUHD7VUTTPKSFIJJHDCPNLS2367EFMSNQ/ide/core/jars/stringtemplate.jar
[INFO] Copying antlr-runtime-3.2.jar to /var/lib/jenkins/workspace/scendo-pipeline_development-6SEXP6NOH4DPMHNIAG2YUHD7VUTTPKSFIJJHDCPNLS2367EFMSNQ/ide/core/jars/antlr-runtime.jar
[INFO] Copying antlr-3.2.jar to /var/lib/jenkins/workspace/scendo-pipeline_development-6SEXP6NOH4DPMHNIAG2YUHD7VUTTPKSFIJJHDCPNLS2367EFMSNQ/ide/core/jars/antlr.jar
[INFO] 
[INFO] --- maven-resources-plugin:2.6:resources (default-resources) @ org.destecs.ide.core ---
[INFO] Using 'UTF-8' encoding to copy filtered resources.
[INFO] skip non existing resourceDirectory /var/lib/jenkins/workspace/scendo-pipeline_development-6SEXP6NOH4DPMHNIAG2YUHD7VUTTPKSFIJJHDCPNLS2367EFMSNQ/ide/core/src/main/resources
[INFO] 
[INFO] --- tycho-compiler-plugin:0.25.0:compile (default-compile) @ org.destecs.ide.core ---
[INFO] Downloading: http://overture.au.dk/artifactory/remote-repos/org/apache/maven/maven-compat/3.0/maven-compat-3.0.pom
[INFO] Downloaded: http://overture.au.dk/artifactory/remote-repos/org/apache/maven/maven-compat/3.0/maven-compat-3.0.pom (4 KB at 196.3 KB/sec)
[INFO] Downloading: http://overture.au.dk/artifactory/remote-repos/org/codehaus/plexus/plexus-compiler-manager/2.2/plexus-compiler-manager-2.2.pom
[INFO] Downloaded: http://overture.au.dk/artifactory/remote-repos/org/codehaus/plexus/plexus-compiler-manager/2.2/plexus-compiler-manager-2.2.pom (690 B at 35.5 KB/sec)
[INFO] Downloading: http://overture.au.dk/artifactory/remote-repos/org/codehaus/plexus/plexus-compiler/2.2/plexus-compiler-2.2.pom
[INFO] Downloaded: http://overture.au.dk/artifactory/remote-repos/org/codehaus/plexus/plexus-compiler/2.2/plexus-compiler-2.2.pom (4 KB at 220.6 KB/sec)
[INFO] Downloading: http://overture.au.dk/artifactory/remote-repos/org/codehaus/plexus/plexus-components/1.3.1/plexus-components-1.3.1.pom
[INFO] Downloaded: http://overture.au.dk/artifactory/remote-repos/org/codehaus/plexus/plexus-components/1.3.1/plexus-components-1.3.1.pom (3 KB at 173.2 KB/sec)
[INFO] Downloading: http://overture.au.dk/artifactory/remote-repos/org/codehaus/plexus/plexus-compiler-api/2.2/plexus-compiler-api-2.2.pom
[INFO] Downloaded: http://overture.au.dk/artifactory/remote-repos/org/codehaus/plexus/plexus-compiler-api/2.2/plexus-compiler-api-2.2.pom (865 B at 52.8 KB/sec)
[INFO] Downloading: http://overture.au.dk/artifactory/remote-repos/org/eclipse/tycho/tycho-compiler-jdt/0.25.0/tycho-compiler-jdt-0.25.0.pom
[INFO] Downloaded: http://overture.au.dk/artifactory/remote-repos/org/eclipse/tycho/tycho-compiler-jdt/0.25.0/tycho-compiler-jdt-0.25.0.pom (2 KB at 89.8 KB/sec)
[INFO] Downloading: http://overture.au.dk/artifactory/remote-repos/org/eclipse/tycho/org.eclipse.jdt.core/3.11.1.v20150902-1521/org.eclipse.jdt.core-3.11.1.v20150902-1521.pom
[INFO] Downloaded: http://overture.au.dk/artifactory/remote-repos/org/eclipse/tycho/org.eclipse.jdt.core/3.11.1.v20150902-1521/org.eclipse.jdt.core-3.11.1.v20150902-1521.pom (2 KB at 56.4 KB/sec)
[INFO] Downloading: http://overture.au.dk/artifactory/remote-repos/org/eclipse/tycho/org.eclipse.jdt.compiler.apt/1.2.0.v20150514-0146/org.eclipse.jdt.compiler.apt-1.2.0.v20150514-0146.pom
[INFO] Downloaded: http://overture.au.dk/artifactory/remote-repos/org/eclipse/tycho/org.eclipse.jdt.compiler.apt/1.2.0.v20150514-0146/org.eclipse.jdt.compiler.apt-1.2.0.v20150514-0146.pom (2 KB at 37.0 KB/sec)
[INFO] Downloading: http://overture.au.dk/artifactory/remote-repos/org/apache/maven/maven-compat/3.0/maven-compat-3.0.jar
[INFO] Downloading: http://overture.au.dk/artifactory/remote-repos/org/codehaus/plexus/plexus-compiler-manager/2.2/plexus-compiler-manager-2.2.jar
[INFO] Downloading: http://overture.au.dk/artifactory/remote-repos/org/codehaus/plexus/plexus-compiler-api/2.2/plexus-compiler-api-2.2.jar
[INFO] Downloading: http://overture.au.dk/artifactory/remote-repos/org/eclipse/tycho/tycho-compiler-jdt/0.25.0/tycho-compiler-jdt-0.25.0.jar
[INFO] Downloading: http://overture.au.dk/artifactory/remote-repos/org/eclipse/tycho/org.eclipse.jdt.core/3.11.1.v20150902-1521/org.eclipse.jdt.core-3.11.1.v20150902-1521.jar
[INFO] Downloaded: http://overture.au.dk/artifactory/remote-repos/org/codehaus/plexus/plexus-compiler-manager/2.2/plexus-compiler-manager-2.2.jar (5 KB at 171.3 KB/sec)
[INFO] Downloading: http://overture.au.dk/artifactory/remote-repos/org/eclipse/tycho/org.eclipse.jdt.compiler.apt/1.2.0.v20150514-0146/org.eclipse.jdt.compiler.apt-1.2.0.v20150514-0146.jar
[INFO] Downloaded: http://overture.au.dk/artifactory/remote-repos/org/eclipse/tycho/tycho-compiler-jdt/0.25.0/tycho-compiler-jdt-0.25.0.jar (16 KB at 721.6 KB/sec)
[INFO] Downloaded: http://overture.au.dk/artifactory/remote-repos/org/codehaus/plexus/plexus-compiler-api/2.2/plexus-compiler-api-2.2.jar (25 KB at 787.2 KB/sec)
[INFO] Downloaded: http://overture.au.dk/artifactory/remote-repos/org/apache/maven/maven-compat/3.0/maven-compat-3.0.jar (279 KB at 7728.1 KB/sec)
[INFO] Downloaded: http://overture.au.dk/artifactory/remote-repos/org/eclipse/tycho/org.eclipse.jdt.compiler.apt/1.2.0.v20150514-0146/org.eclipse.jdt.compiler.apt-1.2.0.v20150514-0146.jar (164 KB at 3897.6 KB/sec)
[INFO] Downloaded: http://overture.au.dk/artifactory/remote-repos/org/eclipse/tycho/org.eclipse.jdt.core/3.11.1.v20150902-1521/org.eclipse.jdt.core-3.11.1.v20150902-1521.jar (5584 KB at 32845.9 KB/sec)
[INFO] Compiling 19 source files to /var/lib/jenkins/workspace/scendo-pipeline_development-6SEXP6NOH4DPMHNIAG2YUHD7VUTTPKSFIJJHDCPNLS2367EFMSNQ/ide/core/target/classes
[INFO] 
[INFO] --- maven-resources-plugin:2.6:testResources (default-testResources) @ org.destecs.ide.core ---
[INFO] Not copying test resources
[INFO] 
[INFO] --- target-platform-configuration:0.25.0:target-platform (default-target-platform) @ org.destecs.ide.core ---
[INFO] 
[INFO] --- tycho-packaging-plugin:0.25.0:package-plugin (default-package-plugin) @ org.destecs.ide.core ---
[INFO] Building jar: /var/lib/jenkins/workspace/scendo-pipeline_development-6SEXP6NOH4DPMHNIAG2YUHD7VUTTPKSFIJJHDCPNLS2367EFMSNQ/ide/core/target/org.destecs.ide.core-2.2.5-SNAPSHOT.jar
[INFO] 
[INFO] --- tycho-p2-plugin:0.25.0:p2-metadata-default (default-p2-metadata-default) @ org.destecs.ide.core ---
[INFO] 
[INFO] --- maven-javadoc-plugin:2.9:jar (attach-javadocs) @ org.destecs.ide.core ---
[INFO] Skipping javadoc generation
[INFO] 
[INFO] --- maven-install-plugin:2.3.1:install (default-install) @ org.destecs.ide.core ---
[INFO] Installing /var/lib/jenkins/workspace/scendo-pipeline_development-6SEXP6NOH4DPMHNIAG2YUHD7VUTTPKSFIJJHDCPNLS2367EFMSNQ/ide/core/target/org.destecs.ide.core-2.2.5-SNAPSHOT.jar to /var/lib/jenkins/workspace/scendo-pipeline_development-6SEXP6NOH4DPMHNIAG2YUHD7VUTTPKSFIJJHDCPNLS2367EFMSNQ/.repository/org/destecs/ide/org.destecs.ide.core/2.2.5-SNAPSHOT/org.destecs.ide.core-2.2.5-SNAPSHOT.jar
[INFO] Installing /var/lib/jenkins/workspace/scendo-pipeline_development-6SEXP6NOH4DPMHNIAG2YUHD7VUTTPKSFIJJHDCPNLS2367EFMSNQ/ide/core/pom.xml to /var/lib/jenkins/workspace/scendo-pipeline_development-6SEXP6NOH4DPMHNIAG2YUHD7VUTTPKSFIJJHDCPNLS2367EFMSNQ/.repository/org/destecs/ide/org.destecs.ide.core/2.2.5-SNAPSHOT/org.destecs.ide.core-2.2.5-SNAPSHOT.pom
[INFO] Installing /var/lib/jenkins/workspace/scendo-pipeline_development-6SEXP6NOH4DPMHNIAG2YUHD7VUTTPKSFIJJHDCPNLS2367EFMSNQ/ide/core/target/p2content.xml to /var/lib/jenkins/workspace/scendo-pipeline_development-6SEXP6NOH4DPMHNIAG2YUHD7VUTTPKSFIJJHDCPNLS2367EFMSNQ/.repository/org/destecs/ide/org.destecs.ide.core/2.2.5-SNAPSHOT/org.destecs.ide.core-2.2.5-SNAPSHOT-p2metadata.xml
[INFO] Installing /var/lib/jenkins/workspace/scendo-pipeline_development-6SEXP6NOH4DPMHNIAG2YUHD7VUTTPKSFIJJHDCPNLS2367EFMSNQ/ide/core/target/p2artifacts.xml to /var/lib/jenkins/workspace/scendo-pipeline_development-6SEXP6NOH4DPMHNIAG2YUHD7VUTTPKSFIJJHDCPNLS2367EFMSNQ/.repository/org/destecs/ide/org.destecs.ide.core/2.2.5-SNAPSHOT/org.destecs.ide.core-2.2.5-SNAPSHOT-p2artifacts.xml
[INFO] 
[INFO] --- tycho-p2-plugin:0.25.0:update-local-index (default-update-local-index) @ org.destecs.ide.core ---
[INFO]                                                                         
[INFO] ------------------------------------------------------------------------
[INFO] Building DESTECS Simulation Engine 2.2.5-SNAPSHOT
[INFO] ------------------------------------------------------------------------
[INFO] 
[INFO] --- tycho-packaging-plugin:0.25.0:build-qualifier (default-build-qualifier) @ org.destecs.ide.simeng ---
[INFO] The project's OSGi version is 2.2.5.201811220749
[INFO] 
[INFO] --- tycho-packaging-plugin:0.25.0:validate-id (default-validate-id) @ org.destecs.ide.simeng ---
[INFO] 
[INFO] --- tycho-packaging-plugin:0.25.0:validate-version (default-validate-version) @ org.destecs.ide.simeng ---
[INFO] 
[INFO] --- maven-dependency-plugin:2.6:copy (copy-dependencies) @ org.destecs.ide.simeng ---
[INFO] Configured Artifact: org.destecs.core:simulationengine:2.2.5-SNAPSHOT:jar
[INFO] Configured Artifact: org.destecs.core:protocol:2.2.5-SNAPSHOT:jar
[INFO] Configured Artifact: xml-apis:xml-apis:1.0.b2:jar
[INFO] Configured Artifact: org.apache.xmlrpc:xmlrpc-common:3.1.3:jar
[INFO] Configured Artifact: org.destecs.core.xmlrpcextensions:xmlrpcbaseextension:2.2.5-SNAPSHOT:jar
[INFO] Configured Artifact: org.apache.xmlrpc:xmlrpc-client:3.1.3:jar
[INFO] Configured Artifact: log4j:log4j:1.2.12:jar
[INFO] Configured Artifact: org.apache.commons:commons-io:1.3.2:jar
[INFO] Downloading: http://overture.au.dk/artifactory/remote-repos/org/apache/commons/commons-io/1.3.2/commons-io-1.3.2.jar
[INFO] Downloaded: http://overture.au.dk/artifactory/remote-repos/org/apache/commons/commons-io/1.3.2/commons-io-1.3.2.jar (86 KB at 4511.5 KB/sec)
[INFO] Configured Artifact: org.destecs.core.xmlrpcextensions:xmlrpcclientextension:2.2.5-SNAPSHOT:jar
[INFO] Configured Artifact: org.apache.ws.commons.util:ws-commons-util:1.0.2:jar
[INFO] Configured Artifact: org.destecs.core:vdm:2.2.5-SNAPSHOT:jar
[INFO] Configured Artifact: org.destecs.core.xmlrpcextensions:xmlrpcserverextension:2.2.5-SNAPSHOT:jar
[INFO] Configured Artifact: commons-logging:commons-logging:1.1:jar
[INFO] Configured Artifact: org.apache.xmlrpc:xmlrpc-server:3.1.3:jar
[INFO] Configured Artifact: javax.servlet:servlet-api:2.3:jar
[INFO] Configured Artifact: xerces:xercesImpl:2.9.1:jar
[INFO] Copying simulationengine-2.2.5-SNAPSHOT.jar to /var/lib/jenkins/workspace/scendo-pipeline_development-6SEXP6NOH4DPMHNIAG2YUHD7VUTTPKSFIJJHDCPNLS2367EFMSNQ/ide/simeng/jars/simulationengine.jar
[INFO] Copying protocol-2.2.5-SNAPSHOT.jar to /var/lib/jenkins/workspace/scendo-pipeline_development-6SEXP6NOH4DPMHNIAG2YUHD7VUTTPKSFIJJHDCPNLS2367EFMSNQ/ide/simeng/jars/protocol.jar
[INFO] Copying xml-apis-1.0.b2.jar to /var/lib/jenkins/workspace/scendo-pipeline_development-6SEXP6NOH4DPMHNIAG2YUHD7VUTTPKSFIJJHDCPNLS2367EFMSNQ/ide/simeng/jars/xml-apis.jar
[INFO] Copying xmlrpc-common-3.1.3.jar to /var/lib/jenkins/workspace/scendo-pipeline_development-6SEXP6NOH4DPMHNIAG2YUHD7VUTTPKSFIJJHDCPNLS2367EFMSNQ/ide/simeng/jars/xmlrpc-common.jar
[INFO] Copying xmlrpcbaseextension-2.2.5-SNAPSHOT.jar to /var/lib/jenkins/workspace/scendo-pipeline_development-6SEXP6NOH4DPMHNIAG2YUHD7VUTTPKSFIJJHDCPNLS2367EFMSNQ/ide/simeng/jars/xmlrpcbaseextension.jar
[INFO] Copying xmlrpc-client-3.1.3.jar to /var/lib/jenkins/workspace/scendo-pipeline_development-6SEXP6NOH4DPMHNIAG2YUHD7VUTTPKSFIJJHDCPNLS2367EFMSNQ/ide/simeng/jars/xmlrpc-client.jar
[INFO] Copying log4j-1.2.12.jar to /var/lib/jenkins/workspace/scendo-pipeline_development-6SEXP6NOH4DPMHNIAG2YUHD7VUTTPKSFIJJHDCPNLS2367EFMSNQ/ide/simeng/jars/log4j.jar
[INFO] Copying commons-io-1.3.2.jar to /var/lib/jenkins/workspace/scendo-pipeline_development-6SEXP6NOH4DPMHNIAG2YUHD7VUTTPKSFIJJHDCPNLS2367EFMSNQ/ide/simeng/jars/commons-io.jar
[INFO] Copying xmlrpcclientextension-2.2.5-SNAPSHOT.jar to /var/lib/jenkins/workspace/scendo-pipeline_development-6SEXP6NOH4DPMHNIAG2YUHD7VUTTPKSFIJJHDCPNLS2367EFMSNQ/ide/simeng/jars/xmlrpcclientextension.jar
[INFO] Copying ws-commons-util-1.0.2.jar to /var/lib/jenkins/workspace/scendo-pipeline_development-6SEXP6NOH4DPMHNIAG2YUHD7VUTTPKSFIJJHDCPNLS2367EFMSNQ/ide/simeng/jars/ws-commons-util.jar
[INFO] Copying vdm-2.2.5-SNAPSHOT.jar to /var/lib/jenkins/workspace/scendo-pipeline_development-6SEXP6NOH4DPMHNIAG2YUHD7VUTTPKSFIJJHDCPNLS2367EFMSNQ/ide/simeng/jars/vdm.jar
[INFO] Copying xmlrpcserverextension-2.2.5-SNAPSHOT.jar to /var/lib/jenkins/workspace/scendo-pipeline_development-6SEXP6NOH4DPMHNIAG2YUHD7VUTTPKSFIJJHDCPNLS2367EFMSNQ/ide/simeng/jars/xmlrpcserverextension.jar
[INFO] Copying commons-logging-1.1.jar to /var/lib/jenkins/workspace/scendo-pipeline_development-6SEXP6NOH4DPMHNIAG2YUHD7VUTTPKSFIJJHDCPNLS2367EFMSNQ/ide/simeng/jars/commons-logging.jar
[INFO] Copying xmlrpc-server-3.1.3.jar to /var/lib/jenkins/workspace/scendo-pipeline_development-6SEXP6NOH4DPMHNIAG2YUHD7VUTTPKSFIJJHDCPNLS2367EFMSNQ/ide/simeng/jars/xmlrpc-server.jar
[INFO] Copying servlet-api-2.3.jar to /var/lib/jenkins/workspace/scendo-pipeline_development-6SEXP6NOH4DPMHNIAG2YUHD7VUTTPKSFIJJHDCPNLS2367EFMSNQ/ide/simeng/jars/servlet-api.jar
[INFO] Copying xercesImpl-2.9.1.jar to /var/lib/jenkins/workspace/scendo-pipeline_development-6SEXP6NOH4DPMHNIAG2YUHD7VUTTPKSFIJJHDCPNLS2367EFMSNQ/ide/simeng/jars/xercesImpl.jar
[INFO] 
[INFO] --- maven-antrun-plugin:1.8:run (default) @ org.destecs.ide.simeng ---
[INFO] Downloading: http://overture.au.dk/artifactory/remote-repos/org/codehaus/plexus/plexus-utils/3.0.20/plexus-utils-3.0.20.pom
[INFO] Downloaded: http://overture.au.dk/artifactory/remote-repos/org/codehaus/plexus/plexus-utils/3.0.20/plexus-utils-3.0.20.pom (4 KB at 232.5 KB/sec)
[INFO] Downloading: http://overture.au.dk/artifactory/remote-repos/org/apache/ant/ant/1.9.4/ant-1.9.4.pom
[INFO] Downloaded: http://overture.au.dk/artifactory/remote-repos/org/apache/ant/ant/1.9.4/ant-1.9.4.pom (10 KB at 552.9 KB/sec)
[INFO] Downloading: http://overture.au.dk/artifactory/remote-repos/org/apache/ant/ant-parent/1.9.4/ant-parent-1.9.4.pom
[INFO] Downloaded: http://overture.au.dk/artifactory/remote-repos/org/apache/ant/ant-parent/1.9.4/ant-parent-1.9.4.pom (6 KB at 364.8 KB/sec)
[INFO] Downloading: http://overture.au.dk/artifactory/remote-repos/org/apache/ant/ant-launcher/1.9.4/ant-launcher-1.9.4.pom
[INFO] Downloaded: http://overture.au.dk/artifactory/remote-repos/org/apache/ant/ant-launcher/1.9.4/ant-launcher-1.9.4.pom (3 KB at 162.9 KB/sec)
[INFO] Downloading: http://overture.au.dk/artifactory/remote-repos/org/codehaus/plexus/plexus-utils/3.0.20/plexus-utils-3.0.20.jar
[INFO] Downloading: http://overture.au.dk/artifactory/remote-repos/org/apache/ant/ant/1.9.4/ant-1.9.4.jar
[INFO] Downloading: http://overture.au.dk/artifactory/remote-repos/org/apache/ant/ant-launcher/1.9.4/ant-launcher-1.9.4.jar
[INFO] Downloaded: http://overture.au.dk/artifactory/remote-repos/org/codehaus/plexus/plexus-utils/3.0.20/plexus-utils-3.0.20.jar (238 KB at 10323.0 KB/sec)
[INFO] Downloaded: http://overture.au.dk/artifactory/remote-repos/org/apache/ant/ant-launcher/1.9.4/ant-launcher-1.9.4.jar (18 KB at 690.4 KB/sec)
[INFO] Downloaded: http://overture.au.dk/artifactory/remote-repos/org/apache/ant/ant/1.9.4/ant-1.9.4.jar (1972 KB at 28999.2 KB/sec)
[INFO] Executing tasks

main:
      [zip] Building zip: /var/lib/jenkins/workspace/scendo-pipeline_development-6SEXP6NOH4DPMHNIAG2YUHD7VUTTPKSFIJJHDCPNLS2367EFMSNQ/ide/simeng/examples/destecs-examples.zip
      [zip] Building zip: /var/lib/jenkins/workspace/scendo-pipeline_development-6SEXP6NOH4DPMHNIAG2YUHD7VUTTPKSFIJJHDCPNLS2367EFMSNQ/ide/simeng/examples/book-examples.zip
[INFO] Executed tasks
[INFO] 
[INFO] --- maven-resources-plugin:2.6:resources (default-resources) @ org.destecs.ide.simeng ---
[INFO] Using 'UTF-8' encoding to copy filtered resources.
[INFO] skip non existing resourceDirectory /var/lib/jenkins/workspace/scendo-pipeline_development-6SEXP6NOH4DPMHNIAG2YUHD7VUTTPKSFIJJHDCPNLS2367EFMSNQ/ide/simeng/src/main/resources
[INFO] 
[INFO] --- tycho-compiler-plugin:0.25.0:compile (default-compile) @ org.destecs.ide.simeng ---
[INFO] Compiling 24 source files to /var/lib/jenkins/workspace/scendo-pipeline_development-6SEXP6NOH4DPMHNIAG2YUHD7VUTTPKSFIJJHDCPNLS2367EFMSNQ/ide/simeng/target/classes
[INFO] 
[INFO] --- maven-resources-plugin:2.6:testResources (default-testResources) @ org.destecs.ide.simeng ---
[INFO] Not copying test resources
[INFO] 
[INFO] --- target-platform-configuration:0.25.0:target-platform (default-target-platform) @ org.destecs.ide.simeng ---
[INFO] 
[INFO] --- tycho-packaging-plugin:0.25.0:package-plugin (default-package-plugin) @ org.destecs.ide.simeng ---
[INFO] Building jar: /var/lib/jenkins/workspace/scendo-pipeline_development-6SEXP6NOH4DPMHNIAG2YUHD7VUTTPKSFIJJHDCPNLS2367EFMSNQ/ide/simeng/target/org.destecs.ide.simeng-2.2.5-SNAPSHOT.jar
[INFO] 
[INFO] --- tycho-p2-plugin:0.25.0:p2-metadata-default (default-p2-metadata-default) @ org.destecs.ide.simeng ---
[INFO] 
[INFO] --- maven-javadoc-plugin:2.9:jar (attach-javadocs) @ org.destecs.ide.simeng ---
[INFO] Skipping javadoc generation
[INFO] 
[INFO] --- maven-install-plugin:2.3.1:install (default-install) @ org.destecs.ide.simeng ---
[INFO] Installing /var/lib/jenkins/workspace/scendo-pipeline_development-6SEXP6NOH4DPMHNIAG2YUHD7VUTTPKSFIJJHDCPNLS2367EFMSNQ/ide/simeng/target/org.destecs.ide.simeng-2.2.5-SNAPSHOT.jar to /var/lib/jenkins/workspace/scendo-pipeline_development-6SEXP6NOH4DPMHNIAG2YUHD7VUTTPKSFIJJHDCPNLS2367EFMSNQ/.repository/org/destecs/ide/org.destecs.ide.simeng/2.2.5-SNAPSHOT/org.destecs.ide.simeng-2.2.5-SNAPSHOT.jar
[INFO] Installing /var/lib/jenkins/workspace/scendo-pipeline_development-6SEXP6NOH4DPMHNIAG2YUHD7VUTTPKSFIJJHDCPNLS2367EFMSNQ/ide/simeng/pom.xml to /var/lib/jenkins/workspace/scendo-pipeline_development-6SEXP6NOH4DPMHNIAG2YUHD7VUTTPKSFIJJHDCPNLS2367EFMSNQ/.repository/org/destecs/ide/org.destecs.ide.simeng/2.2.5-SNAPSHOT/org.destecs.ide.simeng-2.2.5-SNAPSHOT.pom
[INFO] Installing /var/lib/jenkins/workspace/scendo-pipeline_development-6SEXP6NOH4DPMHNIAG2YUHD7VUTTPKSFIJJHDCPNLS2367EFMSNQ/ide/simeng/target/p2content.xml to /var/lib/jenkins/workspace/scendo-pipeline_development-6SEXP6NOH4DPMHNIAG2YUHD7VUTTPKSFIJJHDCPNLS2367EFMSNQ/.repository/org/destecs/ide/org.destecs.ide.simeng/2.2.5-SNAPSHOT/org.destecs.ide.simeng-2.2.5-SNAPSHOT-p2metadata.xml
[INFO] Installing /var/lib/jenkins/workspace/scendo-pipeline_development-6SEXP6NOH4DPMHNIAG2YUHD7VUTTPKSFIJJHDCPNLS2367EFMSNQ/ide/simeng/target/p2artifacts.xml to /var/lib/jenkins/workspace/scendo-pipeline_development-6SEXP6NOH4DPMHNIAG2YUHD7VUTTPKSFIJJHDCPNLS2367EFMSNQ/.repository/org/destecs/ide/org.destecs.ide.simeng/2.2.5-SNAPSHOT/org.destecs.ide.simeng-2.2.5-SNAPSHOT-p2artifacts.xml
[INFO] 
[INFO] --- tycho-p2-plugin:0.25.0:update-local-index (default-update-local-index) @ org.destecs.ide.simeng ---
[INFO]                                                                         
[INFO] ------------------------------------------------------------------------
[INFO] Building org.destecs.ide.ui 2.2.5-SNAPSHOT
[INFO] ------------------------------------------------------------------------
[INFO] 
[INFO] --- tycho-packaging-plugin:0.25.0:build-qualifier (default-build-qualifier) @ org.destecs.ide.ui ---
[INFO] The project's OSGi version is 2.2.5.201811220749
[INFO] 
[INFO] --- tycho-packaging-plugin:0.25.0:validate-id (default-validate-id) @ org.destecs.ide.ui ---
[INFO] 
[INFO] --- tycho-packaging-plugin:0.25.0:validate-version (default-validate-version) @ org.destecs.ide.ui ---
[INFO] 
[INFO] --- maven-resources-plugin:2.6:resources (default-resources) @ org.destecs.ide.ui ---
[INFO] Using 'UTF-8' encoding to copy filtered resources.
[INFO] skip non existing resourceDirectory /var/lib/jenkins/workspace/scendo-pipeline_development-6SEXP6NOH4DPMHNIAG2YUHD7VUTTPKSFIJJHDCPNLS2367EFMSNQ/ide/ui/src/main/resources
[INFO] 
[INFO] --- tycho-compiler-plugin:0.25.0:compile (default-compile) @ org.destecs.ide.ui ---
[INFO] Compiling 37 source files to /var/lib/jenkins/workspace/scendo-pipeline_development-6SEXP6NOH4DPMHNIAG2YUHD7VUTTPKSFIJJHDCPNLS2367EFMSNQ/ide/ui/target/classes
[INFO] 
[INFO] --- maven-resources-plugin:2.6:testResources (default-testResources) @ org.destecs.ide.ui ---
[INFO] Not copying test resources
[INFO] 
[INFO] --- target-platform-configuration:0.25.0:target-platform (default-target-platform) @ org.destecs.ide.ui ---
[INFO] 
[INFO] --- tycho-packaging-plugin:0.25.0:package-plugin (default-package-plugin) @ org.destecs.ide.ui ---
[INFO] Building jar: /var/lib/jenkins/workspace/scendo-pipeline_development-6SEXP6NOH4DPMHNIAG2YUHD7VUTTPKSFIJJHDCPNLS2367EFMSNQ/ide/ui/target/org.destecs.ide.ui-2.2.5-SNAPSHOT.jar
[INFO] 
[INFO] --- tycho-p2-plugin:0.25.0:p2-metadata-default (default-p2-metadata-default) @ org.destecs.ide.ui ---
[INFO] 
[INFO] --- maven-javadoc-plugin:2.9:jar (attach-javadocs) @ org.destecs.ide.ui ---
[INFO] Skipping javadoc generation
[INFO] 
[INFO] --- maven-install-plugin:2.3.1:install (default-install) @ org.destecs.ide.ui ---
[INFO] Installing /var/lib/jenkins/workspace/scendo-pipeline_development-6SEXP6NOH4DPMHNIAG2YUHD7VUTTPKSFIJJHDCPNLS2367EFMSNQ/ide/ui/target/org.destecs.ide.ui-2.2.5-SNAPSHOT.jar to /var/lib/jenkins/workspace/scendo-pipeline_development-6SEXP6NOH4DPMHNIAG2YUHD7VUTTPKSFIJJHDCPNLS2367EFMSNQ/.repository/org/destecs/ide/org.destecs.ide.ui/2.2.5-SNAPSHOT/org.destecs.ide.ui-2.2.5-SNAPSHOT.jar
[INFO] Installing /var/lib/jenkins/workspace/scendo-pipeline_development-6SEXP6NOH4DPMHNIAG2YUHD7VUTTPKSFIJJHDCPNLS2367EFMSNQ/ide/ui/pom.xml to /var/lib/jenkins/workspace/scendo-pipeline_development-6SEXP6NOH4DPMHNIAG2YUHD7VUTTPKSFIJJHDCPNLS2367EFMSNQ/.repository/org/destecs/ide/org.destecs.ide.ui/2.2.5-SNAPSHOT/org.destecs.ide.ui-2.2.5-SNAPSHOT.pom
[INFO] Installing /var/lib/jenkins/workspace/scendo-pipeline_development-6SEXP6NOH4DPMHNIAG2YUHD7VUTTPKSFIJJHDCPNLS2367EFMSNQ/ide/ui/target/p2content.xml to /var/lib/jenkins/workspace/scendo-pipeline_development-6SEXP6NOH4DPMHNIAG2YUHD7VUTTPKSFIJJHDCPNLS2367EFMSNQ/.repository/org/destecs/ide/org.destecs.ide.ui/2.2.5-SNAPSHOT/org.destecs.ide.ui-2.2.5-SNAPSHOT-p2metadata.xml
[INFO] Installing /var/lib/jenkins/workspace/scendo-pipeline_development-6SEXP6NOH4DPMHNIAG2YUHD7VUTTPKSFIJJHDCPNLS2367EFMSNQ/ide/ui/target/p2artifacts.xml to /var/lib/jenkins/workspace/scendo-pipeline_development-6SEXP6NOH4DPMHNIAG2YUHD7VUTTPKSFIJJHDCPNLS2367EFMSNQ/.repository/org/destecs/ide/org.destecs.ide.ui/2.2.5-SNAPSHOT/org.destecs.ide.ui-2.2.5-SNAPSHOT-p2artifacts.xml
[INFO] 
[INFO] --- tycho-p2-plugin:0.25.0:update-local-index (default-update-local-index) @ org.destecs.ide.ui ---
[INFO]                                                                         
[INFO] ------------------------------------------------------------------------
[INFO] Building org.destecs.ide.debug 2.2.5-SNAPSHOT
[INFO] ------------------------------------------------------------------------
[INFO] 
[INFO] --- tycho-packaging-plugin:0.25.0:build-qualifier (default-build-qualifier) @ org.destecs.ide.debug ---
[INFO] The project's OSGi version is 2.2.5.201811220749
[INFO] 
[INFO] --- tycho-packaging-plugin:0.25.0:validate-id (default-validate-id) @ org.destecs.ide.debug ---
[INFO] 
[INFO] --- tycho-packaging-plugin:0.25.0:validate-version (default-validate-version) @ org.destecs.ide.debug ---
[INFO] 
[INFO] --- maven-resources-plugin:2.6:resources (default-resources) @ org.destecs.ide.debug ---
[INFO] Using 'UTF-8' encoding to copy filtered resources.
[INFO] skip non existing resourceDirectory /var/lib/jenkins/workspace/scendo-pipeline_development-6SEXP6NOH4DPMHNIAG2YUHD7VUTTPKSFIJJHDCPNLS2367EFMSNQ/ide/debug/src/main/resources
[INFO] 
[INFO] --- tycho-compiler-plugin:0.25.0:compile (default-compile) @ org.destecs.ide.debug ---
[INFO] Compiling 64 source files to /var/lib/jenkins/workspace/scendo-pipeline_development-6SEXP6NOH4DPMHNIAG2YUHD7VUTTPKSFIJJHDCPNLS2367EFMSNQ/ide/debug/target/classes
[INFO] 
[INFO] --- maven-resources-plugin:2.6:testResources (default-testResources) @ org.destecs.ide.debug ---
[INFO] Not copying test resources
[INFO] 
[INFO] --- target-platform-configuration:0.25.0:target-platform (default-target-platform) @ org.destecs.ide.debug ---
[INFO] 
[INFO] --- tycho-packaging-plugin:0.25.0:package-plugin (default-package-plugin) @ org.destecs.ide.debug ---
[INFO] Building jar: /var/lib/jenkins/workspace/scendo-pipeline_development-6SEXP6NOH4DPMHNIAG2YUHD7VUTTPKSFIJJHDCPNLS2367EFMSNQ/ide/debug/target/org.destecs.ide.debug-2.2.5-SNAPSHOT.jar
[INFO] 
[INFO] --- tycho-p2-plugin:0.25.0:p2-metadata-default (default-p2-metadata-default) @ org.destecs.ide.debug ---
[INFO] 
[INFO] --- maven-javadoc-plugin:2.9:jar (attach-javadocs) @ org.destecs.ide.debug ---
[INFO] Skipping javadoc generation
[INFO] 
[INFO] --- maven-install-plugin:2.3.1:install (default-install) @ org.destecs.ide.debug ---
[INFO] Installing /var/lib/jenkins/workspace/scendo-pipeline_development-6SEXP6NOH4DPMHNIAG2YUHD7VUTTPKSFIJJHDCPNLS2367EFMSNQ/ide/debug/target/org.destecs.ide.debug-2.2.5-SNAPSHOT.jar to /var/lib/jenkins/workspace/scendo-pipeline_development-6SEXP6NOH4DPMHNIAG2YUHD7VUTTPKSFIJJHDCPNLS2367EFMSNQ/.repository/org/destecs/ide/org.destecs.ide.debug/2.2.5-SNAPSHOT/org.destecs.ide.debug-2.2.5-SNAPSHOT.jar
[INFO] Installing /var/lib/jenkins/workspace/scendo-pipeline_development-6SEXP6NOH4DPMHNIAG2YUHD7VUTTPKSFIJJHDCPNLS2367EFMSNQ/ide/debug/pom.xml to /var/lib/jenkins/workspace/scendo-pipeline_development-6SEXP6NOH4DPMHNIAG2YUHD7VUTTPKSFIJJHDCPNLS2367EFMSNQ/.repository/org/destecs/ide/org.destecs.ide.debug/2.2.5-SNAPSHOT/org.destecs.ide.debug-2.2.5-SNAPSHOT.pom
[INFO] Installing /var/lib/jenkins/workspace/scendo-pipeline_development-6SEXP6NOH4DPMHNIAG2YUHD7VUTTPKSFIJJHDCPNLS2367EFMSNQ/ide/debug/target/p2content.xml to /var/lib/jenkins/workspace/scendo-pipeline_development-6SEXP6NOH4DPMHNIAG2YUHD7VUTTPKSFIJJHDCPNLS2367EFMSNQ/.repository/org/destecs/ide/org.destecs.ide.debug/2.2.5-SNAPSHOT/org.destecs.ide.debug-2.2.5-SNAPSHOT-p2metadata.xml
[INFO] Installing /var/lib/jenkins/workspace/scendo-pipeline_development-6SEXP6NOH4DPMHNIAG2YUHD7VUTTPKSFIJJHDCPNLS2367EFMSNQ/ide/debug/target/p2artifacts.xml to /var/lib/jenkins/workspace/scendo-pipeline_development-6SEXP6NOH4DPMHNIAG2YUHD7VUTTPKSFIJJHDCPNLS2367EFMSNQ/.repository/org/destecs/ide/org.destecs.ide.debug/2.2.5-SNAPSHOT/org.destecs.ide.debug-2.2.5-SNAPSHOT-p2artifacts.xml
[INFO] 
[INFO] --- tycho-p2-plugin:0.25.0:update-local-index (default-update-local-index) @ org.destecs.ide.debug ---
[INFO]                                                                         
[INFO] ------------------------------------------------------------------------
[INFO] Building org.destecs.ide.vdmmetadatabuilder 2.2.5-SNAPSHOT
[INFO] ------------------------------------------------------------------------
[INFO] 
[INFO] --- tycho-packaging-plugin:0.25.0:build-qualifier (default-build-qualifier) @ org.destecs.ide.vdmmetadatabuilder ---
[INFO] The project's OSGi version is 2.2.5.201811220749
[INFO] 
[INFO] --- tycho-packaging-plugin:0.25.0:validate-id (default-validate-id) @ org.destecs.ide.vdmmetadatabuilder ---
[INFO] 
[INFO] --- tycho-packaging-plugin:0.25.0:validate-version (default-validate-version) @ org.destecs.ide.vdmmetadatabuilder ---
[INFO] 
[INFO] --- maven-resources-plugin:2.6:resources (default-resources) @ org.destecs.ide.vdmmetadatabuilder ---
[INFO] Using 'UTF-8' encoding to copy filtered resources.
[INFO] skip non existing resourceDirectory /var/lib/jenkins/workspace/scendo-pipeline_development-6SEXP6NOH4DPMHNIAG2YUHD7VUTTPKSFIJJHDCPNLS2367EFMSNQ/ide/vdmmetadatabuilder/src/main/resources
[INFO] 
[INFO] --- tycho-compiler-plugin:0.25.0:compile (default-compile) @ org.destecs.ide.vdmmetadatabuilder ---
[INFO] Compiling 3 source files to /var/lib/jenkins/workspace/scendo-pipeline_development-6SEXP6NOH4DPMHNIAG2YUHD7VUTTPKSFIJJHDCPNLS2367EFMSNQ/ide/vdmmetadatabuilder/target/classes
[INFO] 
[INFO] --- maven-resources-plugin:2.6:testResources (default-testResources) @ org.destecs.ide.vdmmetadatabuilder ---
[INFO] Not copying test resources
[INFO] 
[INFO] --- target-platform-configuration:0.25.0:target-platform (default-target-platform) @ org.destecs.ide.vdmmetadatabuilder ---
[INFO] 
[INFO] --- tycho-packaging-plugin:0.25.0:package-plugin (default-package-plugin) @ org.destecs.ide.vdmmetadatabuilder ---
[INFO] Building jar: /var/lib/jenkins/workspace/scendo-pipeline_development-6SEXP6NOH4DPMHNIAG2YUHD7VUTTPKSFIJJHDCPNLS2367EFMSNQ/ide/vdmmetadatabuilder/target/org.destecs.ide.vdmmetadatabuilder-2.2.5-SNAPSHOT.jar
[INFO] 
[INFO] --- tycho-p2-plugin:0.25.0:p2-metadata-default (default-p2-metadata-default) @ org.destecs.ide.vdmmetadatabuilder ---
[INFO] 
[INFO] --- maven-javadoc-plugin:2.9:jar (attach-javadocs) @ org.destecs.ide.vdmmetadatabuilder ---
[INFO] Skipping javadoc generation
[INFO] 
[INFO] --- maven-install-plugin:2.3.1:install (default-install) @ org.destecs.ide.vdmmetadatabuilder ---
[INFO] Installing /var/lib/jenkins/workspace/scendo-pipeline_development-6SEXP6NOH4DPMHNIAG2YUHD7VUTTPKSFIJJHDCPNLS2367EFMSNQ/ide/vdmmetadatabuilder/target/org.destecs.ide.vdmmetadatabuilder-2.2.5-SNAPSHOT.jar to /var/lib/jenkins/workspace/scendo-pipeline_development-6SEXP6NOH4DPMHNIAG2YUHD7VUTTPKSFIJJHDCPNLS2367EFMSNQ/.repository/org/destecs/ide/org.destecs.ide.vdmmetadatabuilder/2.2.5-SNAPSHOT/org.destecs.ide.vdmmetadatabuilder-2.2.5-SNAPSHOT.jar
[INFO] Installing /var/lib/jenkins/workspace/scendo-pipeline_development-6SEXP6NOH4DPMHNIAG2YUHD7VUTTPKSFIJJHDCPNLS2367EFMSNQ/ide/vdmmetadatabuilder/pom.xml to /var/lib/jenkins/workspace/scendo-pipeline_development-6SEXP6NOH4DPMHNIAG2YUHD7VUTTPKSFIJJHDCPNLS2367EFMSNQ/.repository/org/destecs/ide/org.destecs.ide.vdmmetadatabuilder/2.2.5-SNAPSHOT/org.destecs.ide.vdmmetadatabuilder-2.2.5-SNAPSHOT.pom
[INFO] Installing /var/lib/jenkins/workspace/scendo-pipeline_development-6SEXP6NOH4DPMHNIAG2YUHD7VUTTPKSFIJJHDCPNLS2367EFMSNQ/ide/vdmmetadatabuilder/target/p2content.xml to /var/lib/jenkins/workspace/scendo-pipeline_development-6SEXP6NOH4DPMHNIAG2YUHD7VUTTPKSFIJJHDCPNLS2367EFMSNQ/.repository/org/destecs/ide/org.destecs.ide.vdmmetadatabuilder/2.2.5-SNAPSHOT/org.destecs.ide.vdmmetadatabuilder-2.2.5-SNAPSHOT-p2metadata.xml
[INFO] Installing /var/lib/jenkins/workspace/scendo-pipeline_development-6SEXP6NOH4DPMHNIAG2YUHD7VUTTPKSFIJJHDCPNLS2367EFMSNQ/ide/vdmmetadatabuilder/target/p2artifacts.xml to /var/lib/jenkins/workspace/scendo-pipeline_development-6SEXP6NOH4DPMHNIAG2YUHD7VUTTPKSFIJJHDCPNLS2367EFMSNQ/.repository/org/destecs/ide/org.destecs.ide.vdmmetadatabuilder/2.2.5-SNAPSHOT/org.destecs.ide.vdmmetadatabuilder-2.2.5-SNAPSHOT-p2artifacts.xml
[INFO] 
[INFO] --- tycho-p2-plugin:0.25.0:update-local-index (default-update-local-index) @ org.destecs.ide.vdmmetadatabuilder ---
[INFO]                                                                         
[INFO] ------------------------------------------------------------------------
[INFO] Building org.destecs.ide.libraries 2.2.5-SNAPSHOT
[INFO] ------------------------------------------------------------------------
[INFO] 
[INFO] --- tycho-packaging-plugin:0.25.0:build-qualifier (default-build-qualifier) @ org.destecs.ide.libraries ---
[INFO] The project's OSGi version is 2.2.5.201811220749
[INFO] 
[INFO] --- tycho-packaging-plugin:0.25.0:validate-id (default-validate-id) @ org.destecs.ide.libraries ---
[INFO] 
[INFO] --- tycho-packaging-plugin:0.25.0:validate-version (default-validate-version) @ org.destecs.ide.libraries ---
[INFO] 
[INFO] --- maven-resources-plugin:2.6:resources (default-resources) @ org.destecs.ide.libraries ---
[INFO] Using 'UTF-8' encoding to copy filtered resources.
[INFO] skip non existing resourceDirectory /var/lib/jenkins/workspace/scendo-pipeline_development-6SEXP6NOH4DPMHNIAG2YUHD7VUTTPKSFIJJHDCPNLS2367EFMSNQ/ide/libraries/src/main/resources
[INFO] 
[INFO] --- tycho-compiler-plugin:0.25.0:compile (default-compile) @ org.destecs.ide.libraries ---
[INFO] Compiling 10 source files to /var/lib/jenkins/workspace/scendo-pipeline_development-6SEXP6NOH4DPMHNIAG2YUHD7VUTTPKSFIJJHDCPNLS2367EFMSNQ/ide/libraries/target/classes
[INFO] 
[INFO] --- maven-resources-plugin:2.6:testResources (default-testResources) @ org.destecs.ide.libraries ---
[INFO] Not copying test resources
[INFO] 
[INFO] --- target-platform-configuration:0.25.0:target-platform (default-target-platform) @ org.destecs.ide.libraries ---
[INFO] 
[INFO] --- tycho-packaging-plugin:0.25.0:package-plugin (default-package-plugin) @ org.destecs.ide.libraries ---
[INFO] Building jar: /var/lib/jenkins/workspace/scendo-pipeline_development-6SEXP6NOH4DPMHNIAG2YUHD7VUTTPKSFIJJHDCPNLS2367EFMSNQ/ide/libraries/target/org.destecs.ide.libraries-2.2.5-SNAPSHOT.jar
[INFO] 
[INFO] --- tycho-p2-plugin:0.25.0:p2-metadata-default (default-p2-metadata-default) @ org.destecs.ide.libraries ---
[INFO] 
[INFO] --- maven-javadoc-plugin:2.9:jar (attach-javadocs) @ org.destecs.ide.libraries ---
[INFO] Skipping javadoc generation
[INFO] 
[INFO] --- maven-install-plugin:2.3.1:install (default-install) @ org.destecs.ide.libraries ---
[INFO] Installing /var/lib/jenkins/workspace/scendo-pipeline_development-6SEXP6NOH4DPMHNIAG2YUHD7VUTTPKSFIJJHDCPNLS2367EFMSNQ/ide/libraries/target/org.destecs.ide.libraries-2.2.5-SNAPSHOT.jar to /var/lib/jenkins/workspace/scendo-pipeline_development-6SEXP6NOH4DPMHNIAG2YUHD7VUTTPKSFIJJHDCPNLS2367EFMSNQ/.repository/org/destecs/ide/org.destecs.ide.libraries/2.2.5-SNAPSHOT/org.destecs.ide.libraries-2.2.5-SNAPSHOT.jar
[INFO] Installing /var/lib/jenkins/workspace/scendo-pipeline_development-6SEXP6NOH4DPMHNIAG2YUHD7VUTTPKSFIJJHDCPNLS2367EFMSNQ/ide/libraries/pom.xml to /var/lib/jenkins/workspace/scendo-pipeline_development-6SEXP6NOH4DPMHNIAG2YUHD7VUTTPKSFIJJHDCPNLS2367EFMSNQ/.repository/org/destecs/ide/org.destecs.ide.libraries/2.2.5-SNAPSHOT/org.destecs.ide.libraries-2.2.5-SNAPSHOT.pom
[INFO] Installing /var/lib/jenkins/workspace/scendo-pipeline_development-6SEXP6NOH4DPMHNIAG2YUHD7VUTTPKSFIJJHDCPNLS2367EFMSNQ/ide/libraries/target/p2content.xml to /var/lib/jenkins/workspace/scendo-pipeline_development-6SEXP6NOH4DPMHNIAG2YUHD7VUTTPKSFIJJHDCPNLS2367EFMSNQ/.repository/org/destecs/ide/org.destecs.ide.libraries/2.2.5-SNAPSHOT/org.destecs.ide.libraries-2.2.5-SNAPSHOT-p2metadata.xml
[INFO] Installing /var/lib/jenkins/workspace/scendo-pipeline_development-6SEXP6NOH4DPMHNIAG2YUHD7VUTTPKSFIJJHDCPNLS2367EFMSNQ/ide/libraries/target/p2artifacts.xml to /var/lib/jenkins/workspace/scendo-pipeline_development-6SEXP6NOH4DPMHNIAG2YUHD7VUTTPKSFIJJHDCPNLS2367EFMSNQ/.repository/org/destecs/ide/org.destecs.ide.libraries/2.2.5-SNAPSHOT/org.destecs.ide.libraries-2.2.5-SNAPSHOT-p2artifacts.xml
[INFO] 
[INFO] --- tycho-p2-plugin:0.25.0:update-local-index (default-update-local-index) @ org.destecs.ide.libraries ---
[INFO]                                                                         
[INFO] ------------------------------------------------------------------------
[INFO] Building org.destecs.ide.platform 2.2.5-SNAPSHOT
[INFO] ------------------------------------------------------------------------
[INFO] 
[INFO] --- tycho-packaging-plugin:0.25.0:build-qualifier (default-build-qualifier) @ org.destecs.ide.platform ---
[INFO] The project's OSGi version is 2.2.5.201811220749
[INFO] 
[INFO] --- tycho-packaging-plugin:0.25.0:validate-id (default-validate-id) @ org.destecs.ide.platform ---
[INFO] 
[INFO] --- tycho-packaging-plugin:0.25.0:validate-version (default-validate-version) @ org.destecs.ide.platform ---
[INFO] 
[INFO] --- git-commit-id-plugin:2.1.4:revision (default) @ org.destecs.ide.platform ---
[INFO] Downloading: http://overture.au.dk/artifactory/remote-repos/joda-time/joda-time/2.0/joda-time-2.0.pom
[INFO] Downloaded: http://overture.au.dk/artifactory/remote-repos/joda-time/joda-time/2.0/joda-time-2.0.pom (15 KB at 747.5 KB/sec)
[INFO] Downloading: http://overture.au.dk/artifactory/remote-repos/com/google/guava/guava/13.0/guava-13.0.pom
[INFO] Downloaded: http://overture.au.dk/artifactory/remote-repos/com/google/guava/guava/13.0/guava-13.0.pom (6 KB at 274.7 KB/sec)
[INFO] Downloading: http://overture.au.dk/artifactory/remote-repos/com/google/guava/guava-parent/13.0/guava-parent-13.0.pom
[INFO] Downloaded: http://overture.au.dk/artifactory/remote-repos/com/google/guava/guava-parent/13.0/guava-parent-13.0.pom (3 KB at 131.2 KB/sec)
[INFO] Downloading: http://overture.au.dk/artifactory/remote-repos/com/intellij/annotations/9.0.4/annotations-9.0.4.pom
[INFO] Downloaded: http://overture.au.dk/artifactory/remote-repos/com/intellij/annotations/9.0.4/annotations-9.0.4.pom (2 KB at 77.0 KB/sec)
[INFO] Downloading: http://overture.au.dk/artifactory/remote-repos/org/eclipse/jgit/org.eclipse.jgit/2.0.0.201206130900-r/org.eclipse.jgit-2.0.0.201206130900-r.pom
[INFO] Downloaded: http://overture.au.dk/artifactory/remote-repos/org/eclipse/jgit/org.eclipse.jgit/2.0.0.201206130900-r/org.eclipse.jgit-2.0.0.201206130900-r.pom (6 KB at 306.3 KB/sec)
[INFO] Downloading: http://overture.au.dk/artifactory/remote-repos/org/eclipse/jgit/org.eclipse.jgit-parent/2.0.0.201206130900-r/org.eclipse.jgit-parent-2.0.0.201206130900-r.pom
[INFO] Downloaded: http://overture.au.dk/artifactory/remote-repos/org/eclipse/jgit/org.eclipse.jgit-parent/2.0.0.201206130900-r/org.eclipse.jgit-parent-2.0.0.201206130900-r.pom (17 KB at 770.4 KB/sec)
[INFO] Downloading: http://overture.au.dk/artifactory/remote-repos/org/codehaus/plexus/plexus-utils/1.5.15/plexus-utils-1.5.15.jar
[INFO] Downloading: http://overture.au.dk/artifactory/remote-repos/joda-time/joda-time/2.0/joda-time-2.0.jar
[INFO] Downloading: http://overture.au.dk/artifactory/remote-repos/com/google/guava/guava/13.0/guava-13.0.jar
[INFO] Downloading: http://overture.au.dk/artifactory/remote-repos/com/intellij/annotations/9.0.4/annotations-9.0.4.jar
[INFO] Downloading: http://overture.au.dk/artifactory/remote-repos/org/eclipse/jgit/org.eclipse.jgit/2.0.0.201206130900-r/org.eclipse.jgit-2.0.0.201206130900-r.jar
[INFO] Downloaded: http://overture.au.dk/artifactory/remote-repos/org/codehaus/plexus/plexus-utils/1.5.15/plexus-utils-1.5.15.jar (223 KB at 6187.9 KB/sec)
[INFO] Downloaded: http://overture.au.dk/artifactory/remote-repos/com/intellij/annotations/9.0.4/annotations-9.0.4.jar (10 KB at 294.7 KB/sec)
[INFO] Downloaded: http://overture.au.dk/artifactory/remote-repos/joda-time/joda-time/2.0/joda-time-2.0.jar (556 KB at 12353.1 KB/sec)
[INFO] Downloaded: http://overture.au.dk/artifactory/remote-repos/org/eclipse/jgit/org.eclipse.jgit/2.0.0.201206130900-r/org.eclipse.jgit-2.0.0.201206130900-r.jar (1542 KB at 21707.2 KB/sec)
[INFO] Downloaded: http://overture.au.dk/artifactory/remote-repos/com/google/guava/guava/13.0/guava-13.0.jar (1847 KB at 17588.4 KB/sec)
[INFO] 
[INFO] --- maven-resources-plugin:2.6:resources (default-resources) @ org.destecs.ide.platform ---
[INFO] Using 'UTF-8' encoding to copy filtered resources.
[INFO] Copying 1 resource to /var/lib/jenkins/workspace/scendo-pipeline_development-6SEXP6NOH4DPMHNIAG2YUHD7VUTTPKSFIJJHDCPNLS2367EFMSNQ/ide/platform
[INFO] 
[INFO] --- tycho-compiler-plugin:0.25.0:compile (default-compile) @ org.destecs.ide.platform ---
[INFO] Compiling 2 source files to /var/lib/jenkins/workspace/scendo-pipeline_development-6SEXP6NOH4DPMHNIAG2YUHD7VUTTPKSFIJJHDCPNLS2367EFMSNQ/ide/platform/target/classes
[INFO] 
[INFO] --- maven-resources-plugin:2.6:testResources (default-testResources) @ org.destecs.ide.platform ---
[INFO] Not copying test resources
[INFO] 
[INFO] --- target-platform-configuration:0.25.0:target-platform (default-target-platform) @ org.destecs.ide.platform ---
[INFO] 
[INFO] --- tycho-packaging-plugin:0.25.0:package-plugin (default-package-plugin) @ org.destecs.ide.platform ---
[INFO] Building jar: /var/lib/jenkins/workspace/scendo-pipeline_development-6SEXP6NOH4DPMHNIAG2YUHD7VUTTPKSFIJJHDCPNLS2367EFMSNQ/ide/platform/target/org.destecs.ide.platform-2.2.5-SNAPSHOT.jar
[INFO] 
[INFO] --- tycho-p2-plugin:0.25.0:p2-metadata-default (default-p2-metadata-default) @ org.destecs.ide.platform ---
[INFO] 
[INFO] --- maven-javadoc-plugin:2.9:jar (attach-javadocs) @ org.destecs.ide.platform ---
[INFO] Skipping javadoc generation
[INFO] 
[INFO] --- maven-install-plugin:2.3.1:install (default-install) @ org.destecs.ide.platform ---
[INFO] Installing /var/lib/jenkins/workspace/scendo-pipeline_development-6SEXP6NOH4DPMHNIAG2YUHD7VUTTPKSFIJJHDCPNLS2367EFMSNQ/ide/platform/target/org.destecs.ide.platform-2.2.5-SNAPSHOT.jar to /var/lib/jenkins/workspace/scendo-pipeline_development-6SEXP6NOH4DPMHNIAG2YUHD7VUTTPKSFIJJHDCPNLS2367EFMSNQ/.repository/org/destecs/ide/org.destecs.ide.platform/2.2.5-SNAPSHOT/org.destecs.ide.platform-2.2.5-SNAPSHOT.jar
[INFO] Installing /var/lib/jenkins/workspace/scendo-pipeline_development-6SEXP6NOH4DPMHNIAG2YUHD7VUTTPKSFIJJHDCPNLS2367EFMSNQ/ide/platform/pom.xml to /var/lib/jenkins/workspace/scendo-pipeline_development-6SEXP6NOH4DPMHNIAG2YUHD7VUTTPKSFIJJHDCPNLS2367EFMSNQ/.repository/org/destecs/ide/org.destecs.ide.platform/2.2.5-SNAPSHOT/org.destecs.ide.platform-2.2.5-SNAPSHOT.pom
[INFO] Installing /var/lib/jenkins/workspace/scendo-pipeline_development-6SEXP6NOH4DPMHNIAG2YUHD7VUTTPKSFIJJHDCPNLS2367EFMSNQ/ide/platform/target/p2content.xml to /var/lib/jenkins/workspace/scendo-pipeline_development-6SEXP6NOH4DPMHNIAG2YUHD7VUTTPKSFIJJHDCPNLS2367EFMSNQ/.repository/org/destecs/ide/org.destecs.ide.platform/2.2.5-SNAPSHOT/org.destecs.ide.platform-2.2.5-SNAPSHOT-p2metadata.xml
[INFO] Installing /var/lib/jenkins/workspace/scendo-pipeline_development-6SEXP6NOH4DPMHNIAG2YUHD7VUTTPKSFIJJHDCPNLS2367EFMSNQ/ide/platform/target/p2artifacts.xml to /var/lib/jenkins/workspace/scendo-pipeline_development-6SEXP6NOH4DPMHNIAG2YUHD7VUTTPKSFIJJHDCPNLS2367EFMSNQ/.repository/org/destecs/ide/org.destecs.ide.platform/2.2.5-SNAPSHOT/org.destecs.ide.platform-2.2.5-SNAPSHOT-p2artifacts.xml
[INFO] 
[INFO] --- tycho-p2-plugin:0.25.0:update-local-index (default-update-local-index) @ org.destecs.ide.platform ---
[INFO]                                                                         
[INFO] ------------------------------------------------------------------------
[INFO] Building DESTECS IDE Eclipse features 2.2.5-SNAPSHOT
[INFO] ------------------------------------------------------------------------
[INFO] 
[INFO] --- maven-javadoc-plugin:2.9:jar (attach-javadocs) @ features ---
[INFO] Skipping javadoc generation
[INFO] 
[INFO] --- maven-install-plugin:2.5.2:install (default-install) @ features ---
[INFO] Installing /var/lib/jenkins/workspace/scendo-pipeline_development-6SEXP6NOH4DPMHNIAG2YUHD7VUTTPKSFIJJHDCPNLS2367EFMSNQ/ide/features/pom.xml to /var/lib/jenkins/workspace/scendo-pipeline_development-6SEXP6NOH4DPMHNIAG2YUHD7VUTTPKSFIJJHDCPNLS2367EFMSNQ/.repository/org/destecs/ide/features/2.2.5-SNAPSHOT/features-2.2.5-SNAPSHOT.pom
[INFO]                                                                         
[INFO] ------------------------------------------------------------------------
[INFO] Building DESTECS IDE Eclipse rcp feature 2.2.5-SNAPSHOT
[INFO] ------------------------------------------------------------------------
[INFO] 
[INFO] --- tycho-packaging-plugin:0.25.0:build-qualifier-aggregator (default-build-qualifier-aggregator) @ org.destecs.ide.features.rcp ---
[INFO] The project's OSGi version is 2.2.5.201811220749
[INFO] 
[INFO] --- tycho-packaging-plugin:0.25.0:validate-id (default-validate-id) @ org.destecs.ide.features.rcp ---
[INFO] 
[INFO] --- tycho-packaging-plugin:0.25.0:validate-version (default-validate-version) @ org.destecs.ide.features.rcp ---
[INFO] 
[INFO] --- target-platform-configuration:0.25.0:target-platform (default-target-platform) @ org.destecs.ide.features.rcp ---
[INFO] 
[INFO] --- tycho-packaging-plugin:0.25.0:package-feature (default-package-feature) @ org.destecs.ide.features.rcp ---
[INFO] Building jar: /var/lib/jenkins/workspace/scendo-pipeline_development-6SEXP6NOH4DPMHNIAG2YUHD7VUTTPKSFIJJHDCPNLS2367EFMSNQ/ide/features/rcp/target/org.destecs.ide.features.rcp-2.2.5-SNAPSHOT.jar
[INFO] 
[INFO] --- tycho-p2-plugin:0.25.0:p2-metadata-default (default-p2-metadata-default) @ org.destecs.ide.features.rcp ---
[INFO] 
[INFO] --- tycho-p2-plugin:0.25.0:feature-p2-metadata (default-feature-p2-metadata) @ org.destecs.ide.features.rcp ---
[INFO] 
[INFO] --- maven-javadoc-plugin:2.9:jar (attach-javadocs) @ org.destecs.ide.features.rcp ---
[INFO] Skipping javadoc generation
[INFO] 
[INFO] --- maven-install-plugin:2.3.1:install (default-install) @ org.destecs.ide.features.rcp ---
[INFO] Installing /var/lib/jenkins/workspace/scendo-pipeline_development-6SEXP6NOH4DPMHNIAG2YUHD7VUTTPKSFIJJHDCPNLS2367EFMSNQ/ide/features/rcp/target/org.destecs.ide.features.rcp-2.2.5-SNAPSHOT.jar to /var/lib/jenkins/workspace/scendo-pipeline_development-6SEXP6NOH4DPMHNIAG2YUHD7VUTTPKSFIJJHDCPNLS2367EFMSNQ/.repository/org/destecs/ide/features/org.destecs.ide.features.rcp/2.2.5-SNAPSHOT/org.destecs.ide.features.rcp-2.2.5-SNAPSHOT.jar
[INFO] Installing /var/lib/jenkins/workspace/scendo-pipeline_development-6SEXP6NOH4DPMHNIAG2YUHD7VUTTPKSFIJJHDCPNLS2367EFMSNQ/ide/features/rcp/pom.xml to /var/lib/jenkins/workspace/scendo-pipeline_development-6SEXP6NOH4DPMHNIAG2YUHD7VUTTPKSFIJJHDCPNLS2367EFMSNQ/.repository/org/destecs/ide/features/org.destecs.ide.features.rcp/2.2.5-SNAPSHOT/org.destecs.ide.features.rcp-2.2.5-SNAPSHOT.pom
[INFO] Installing /var/lib/jenkins/workspace/scendo-pipeline_development-6SEXP6NOH4DPMHNIAG2YUHD7VUTTPKSFIJJHDCPNLS2367EFMSNQ/ide/features/rcp/target/p2content.xml to /var/lib/jenkins/workspace/scendo-pipeline_development-6SEXP6NOH4DPMHNIAG2YUHD7VUTTPKSFIJJHDCPNLS2367EFMSNQ/.repository/org/destecs/ide/features/org.destecs.ide.features.rcp/2.2.5-SNAPSHOT/org.destecs.ide.features.rcp-2.2.5-SNAPSHOT-p2metadata.xml
[INFO] Installing /var/lib/jenkins/workspace/scendo-pipeline_development-6SEXP6NOH4DPMHNIAG2YUHD7VUTTPKSFIJJHDCPNLS2367EFMSNQ/ide/features/rcp/target/p2artifacts.xml to /var/lib/jenkins/workspace/scendo-pipeline_development-6SEXP6NOH4DPMHNIAG2YUHD7VUTTPKSFIJJHDCPNLS2367EFMSNQ/.repository/org/destecs/ide/features/org.destecs.ide.features.rcp/2.2.5-SNAPSHOT/org.destecs.ide.features.rcp-2.2.5-SNAPSHOT-p2artifacts.xml
[INFO] 
[INFO] --- tycho-p2-plugin:0.25.0:update-local-index (default-update-local-index) @ org.destecs.ide.features.rcp ---
[INFO]                                                                         
[INFO] ------------------------------------------------------------------------
[INFO] Building DESTECS IDE Standalone Product 2.2.5-SNAPSHOT
[INFO] ------------------------------------------------------------------------
[INFO] 
[INFO] --- tycho-packaging-plugin:0.25.0:build-qualifier-aggregator (default-build-qualifier-aggregator) @ org.destecs.ide.product ---
[INFO] The project's OSGi version is 2.2.5.201811220749
[INFO] 
[INFO] --- maven-clean-plugin:2.5:clean (default-clean-1) @ org.destecs.ide.product ---
[INFO] 
[INFO] --- maven-resources-plugin:2.6:resources (default-resources) @ org.destecs.ide.product ---
[INFO] Using 'UTF-8' encoding to copy filtered resources.
[INFO] Copying 4 resources to /var/lib/jenkins/workspace/scendo-pipeline_development-6SEXP6NOH4DPMHNIAG2YUHD7VUTTPKSFIJJHDCPNLS2367EFMSNQ/ide/product/target/installer
[INFO] Copying 1 resource to /var/lib/jenkins/workspace/scendo-pipeline_development-6SEXP6NOH4DPMHNIAG2YUHD7VUTTPKSFIJJHDCPNLS2367EFMSNQ/ide/product/target/installer/x86_64
[INFO] 
[INFO] --- target-platform-configuration:0.25.0:target-platform (default-target-platform) @ org.destecs.ide.product ---
[INFO] 
[INFO] --- tycho-p2-publisher-plugin:0.25.0:publish-products (default-publish-products) @ org.destecs.ide.product ---
Error - 3 icon(s) not replaced in /tmp/p2.brandingIron4121715311622349075/launcher.exe using /var/lib/jenkins/workspace/scendo-pipeline_development-6SEXP6NOH4DPMHNIAG2YUHD7VUTTPKSFIJJHDCPNLS2367EFMSNQ/ide/product/icons/win/crescendo.ico
Error - 3 icon(s) not replaced in /tmp/p2.brandingIron7799019064323248360/launcher.exe using /var/lib/jenkins/workspace/scendo-pipeline_development-6SEXP6NOH4DPMHNIAG2YUHD7VUTTPKSFIJJHDCPNLS2367EFMSNQ/ide/product/icons/win/crescendo.ico
[INFO] 
[INFO] --- tycho-p2-publisher-plugin:0.25.0:publish-categories (default-publish-categories) @ org.destecs.ide.product ---
[INFO] 
[INFO] --- tycho-p2-publisher-plugin:0.25.0:attach-artifacts (default-attach-artifacts) @ org.destecs.ide.product ---
[INFO] 
[INFO] --- tycho-p2-repository-plugin:0.25.0:assemble-repository (default-assemble-repository) @ org.destecs.ide.product ---
[INFO] Copying resources from /var/lib/jenkins/workspace/scendo-pipeline_development-6SEXP6NOH4DPMHNIAG2YUHD7VUTTPKSFIJJHDCPNLS2367EFMSNQ/ide/product/target/classes to /var/lib/jenkins/workspace/scendo-pipeline_development-6SEXP6NOH4DPMHNIAG2YUHD7VUTTPKSFIJJHDCPNLS2367EFMSNQ/ide/product/target/repository
[WARNING] Mirror tool: Problems resolving provisioning plan.: [Unable to satisfy dependency from org.destecs.ide.platform.product 2.2.5.201811220749 to org.eclipse.e4.rcp.feature.group [1.6.3.v20180329-0507].; Unable to satisfy dependency from org.destecs.ide.platform.product 2.2.5.201811220749 to org.eclipse.equinox.p2.core.feature.feature.group [1.4.1.v20170928-1405].; Unable to satisfy dependency from org.destecs.ide.platform.product 2.2.5.201811220749 to org.eclipse.platform.feature.group [4.7.3.v20180330-0640].; Unable to satisfy dependency from org.destecs.ide.platform.product 2.2.5.201811220749 to org.eclipse.equinox.p2.rcp.feature.feature.group [1.3.2.v20171108-1343].; Unable to satisfy dependency from org.destecs.ide.platform.product 2.2.5.201811220749 to org.eclipse.equinox.p2.user.ui.feature.group [2.3.2.v20171108-1343].; Unable to satisfy dependency from org.destecs.ide.platform.product 2.2.5.201811220749 to org.eclipse.rcp.feature.group [4.7.3.v20180330-0640].; Unable to satisfy dependency from org.destecs.ide.platform.product 2.2.5.201811220749 to org.eclipse.equinox.p2.extras.feature.feature.group [1.3.1.v20170928-1405].; Unable to satisfy dependency from org.destecs.ide.platform.product 2.2.5.201811220749 to org.eclipse.help.feature.group [2.2.104.v20180330-0640].]
[WARNING] More information on the preceding warning(s) can be found here:
[WARNING] - http://wiki.eclipse.org/Tycho_Messages_Explained#Mirror_tool
[WARNING] Mirror tool: Problems resolving provisioning plan.: [Unable to satisfy dependency from org.destecs.ide.platform.product 2.2.5.201811220749 to org.eclipse.e4.rcp.feature.group [1.6.3.v20180329-0507].; Unable to satisfy dependency from org.destecs.ide.platform.product 2.2.5.201811220749 to org.eclipse.equinox.p2.core.feature.feature.group [1.4.1.v20170928-1405].; Unable to satisfy dependency from org.destecs.ide.platform.product 2.2.5.201811220749 to org.eclipse.platform.feature.group [4.7.3.v20180330-0640].; Unable to satisfy dependency from org.destecs.ide.platform.product 2.2.5.201811220749 to org.eclipse.equinox.p2.rcp.feature.feature.group [1.3.2.v20171108-1343].; Unable to satisfy dependency from org.destecs.ide.platform.product 2.2.5.201811220749 to org.eclipse.equinox.p2.user.ui.feature.group [2.3.2.v20171108-1343].; Unable to satisfy dependency from org.destecs.ide.platform.product 2.2.5.201811220749 to org.eclipse.rcp.feature.group [4.7.3.v20180330-0640].; Unable to satisfy dependency from org.destecs.ide.platform.product 2.2.5.201811220749 to org.eclipse.equinox.p2.extras.feature.feature.group [1.3.1.v20170928-1405].; Unable to satisfy dependency from org.destecs.ide.platform.product 2.2.5.201811220749 to org.eclipse.help.feature.group [2.2.104.v20180330-0640].]
[WARNING] More information on the preceding warning(s) can be found here:
[WARNING] - http://wiki.eclipse.org/Tycho_Messages_Explained#Mirror_tool
[WARNING] Mirror tool: Problems resolving provisioning plan.: [Unable to satisfy dependency from org.destecs.ide.platform.product 2.2.5.201811220749 to org.eclipse.e4.rcp.feature.group [1.6.3.v20180329-0507].; Unable to satisfy dependency from org.destecs.ide.platform.product 2.2.5.201811220749 to org.eclipse.equinox.p2.core.feature.feature.group [1.4.1.v20170928-1405].; Unable to satisfy dependency from org.destecs.ide.platform.product 2.2.5.201811220749 to org.eclipse.platform.feature.group [4.7.3.v20180330-0640].; Unable to satisfy dependency from org.destecs.ide.platform.product 2.2.5.201811220749 to org.eclipse.equinox.p2.rcp.feature.feature.group [1.3.2.v20171108-1343].; Unable to satisfy dependency from org.destecs.ide.platform.product 2.2.5.201811220749 to org.eclipse.equinox.p2.user.ui.feature.group [2.3.2.v20171108-1343].; Unable to satisfy dependency from org.destecs.ide.platform.product 2.2.5.201811220749 to org.eclipse.rcp.feature.group [4.7.3.v20180330-0640].; Unable to satisfy dependency from org.destecs.ide.platform.product 2.2.5.201811220749 to org.eclipse.equinox.p2.extras.feature.feature.group [1.3.1.v20170928-1405].; Unable to satisfy dependency from org.destecs.ide.platform.product 2.2.5.201811220749 to org.eclipse.help.feature.group [2.2.104.v20180330-0640].]
[WARNING] More information on the preceding warning(s) can be found here:
[WARNING] - http://wiki.eclipse.org/Tycho_Messages_Explained#Mirror_tool
[WARNING] Mirror tool: Problems resolving provisioning plan.: [Unable to satisfy dependency from org.destecs.ide.platform.product 2.2.5.201811220749 to org.eclipse.e4.rcp.feature.group [1.6.3.v20180329-0507].; Unable to satisfy dependency from org.destecs.ide.platform.product 2.2.5.201811220749 to org.eclipse.equinox.p2.core.feature.feature.group [1.4.1.v20170928-1405].; Unable to satisfy dependency from org.destecs.ide.platform.product 2.2.5.201811220749 to org.eclipse.platform.feature.group [4.7.3.v20180330-0640].; Unable to satisfy dependency from org.destecs.ide.platform.product 2.2.5.201811220749 to org.eclipse.equinox.p2.rcp.feature.feature.group [1.3.2.v20171108-1343].; Unable to satisfy dependency from org.destecs.ide.platform.product 2.2.5.201811220749 to org.eclipse.equinox.p2.user.ui.feature.group [2.3.2.v20171108-1343].; Unable to satisfy dependency from org.destecs.ide.platform.product 2.2.5.201811220749 to org.eclipse.rcp.feature.group [4.7.3.v20180330-0640].; Unable to satisfy dependency from org.destecs.ide.platform.product 2.2.5.201811220749 to org.eclipse.equinox.p2.extras.feature.feature.group [1.3.1.v20170928-1405].; Unable to satisfy dependency from org.destecs.ide.platform.product 2.2.5.201811220749 to org.eclipse.help.feature.group [2.2.104.v20180330-0640].]
[WARNING] More information on the preceding warning(s) can be found here:
[WARNING] - http://wiki.eclipse.org/Tycho_Messages_Explained#Mirror_tool
[WARNING] Mirror tool: Problems resolving provisioning plan.: [Unable to satisfy dependency from org.destecs.ide.platform.product 2.2.5.201811220749 to org.eclipse.e4.rcp.feature.group [1.6.3.v20180329-0507].; Unable to satisfy dependency from org.destecs.ide.platform.product 2.2.5.201811220749 to org.eclipse.equinox.p2.core.feature.feature.group [1.4.1.v20170928-1405].; Unable to satisfy dependency from org.destecs.ide.platform.product 2.2.5.201811220749 to org.eclipse.platform.feature.group [4.7.3.v20180330-0640].; Unable to satisfy dependency from org.destecs.ide.platform.product 2.2.5.201811220749 to org.eclipse.equinox.p2.rcp.feature.feature.group [1.3.2.v20171108-1343].; Unable to satisfy dependency from org.destecs.ide.platform.product 2.2.5.201811220749 to org.eclipse.equinox.p2.user.ui.feature.group [2.3.2.v20171108-1343].; Unable to satisfy dependency from org.destecs.ide.platform.product 2.2.5.201811220749 to org.eclipse.rcp.feature.group [4.7.3.v20180330-0640].; Unable to satisfy dependency from org.destecs.ide.platform.product 2.2.5.201811220749 to org.eclipse.equinox.p2.extras.feature.feature.group [1.3.1.v20170928-1405].; Unable to satisfy dependency from org.destecs.ide.platform.product 2.2.5.201811220749 to org.eclipse.help.feature.group [2.2.104.v20180330-0640].]
[WARNING] More information on the preceding warning(s) can be found here:
[WARNING] - http://wiki.eclipse.org/Tycho_Messages_Explained#Mirror_tool
[INFO] 
[INFO] --- tycho-p2-repository-plugin:0.25.0:archive-repository (default-archive-repository) @ org.destecs.ide.product ---
[INFO] Building zip: /var/lib/jenkins/workspace/scendo-pipeline_development-6SEXP6NOH4DPMHNIAG2YUHD7VUTTPKSFIJJHDCPNLS2367EFMSNQ/ide/product/target/org.destecs.ide.product-2.2.5-SNAPSHOT.zip
[INFO] 
[INFO] --- maven-javadoc-plugin:2.9:jar (attach-javadocs) @ org.destecs.ide.product ---
[INFO] Skipping javadoc generation
[INFO] 
[INFO] --- tycho-p2-director-plugin:0.25.0:materialize-products (materialize-products) @ org.destecs.ide.product ---
[INFO] Installing product org.destecs.ide.platform.product for environment win32/win32/x86 to /var/lib/jenkins/workspace/scendo-pipeline_development-6SEXP6NOH4DPMHNIAG2YUHD7VUTTPKSFIJJHDCPNLS2367EFMSNQ/ide/product/target/products/org.destecs.ide.platform.product/win32/win32/x86
Installing org.destecs.ide.platform.product 2.2.5.201811220749.
Installation failed.
Cannot complete the install because one or more required items could not be found.
 Software being installed: Crescendo Tools 2.2.5.201811220749 (org.destecs.ide.platform.product 2.2.5.201811220749)
 Missing requirement: Crescendo Tools 2.2.5.201811220749 (org.destecs.ide.platform.product 2.2.5.201811220749) requires 'org.eclipse.e4.rcp.feature.group [1.6.3.v20180329-0507]' but it could not be found
Application failed, log file location: /var/lib/jenkins/workspace/scendo-pipeline_development-6SEXP6NOH4DPMHNIAG2YUHD7VUTTPKSFIJJHDCPNLS2367EFMSNQ/workspace/.metadata/.log
[INFO] ------------------------------------------------------------------------
[INFO] Reactor Summary:
[INFO] 
[INFO] DESTECS ............................................ SUCCESS [  0.939 s]
[INFO] Core Tools ......................................... SUCCESS [  0.029 s]
[INFO] xmlrpc-extensions .................................. SUCCESS [  0.003 s]
[INFO] xmlrpc-baseextension ............................... SUCCESS [  3.767 s]
[INFO] DESTECS Maven plugins and standalone tools ......... SUCCESS [  0.005 s]
[INFO] Java Co-Simulation protocol generator .............. SUCCESS [  7.168 s]
[INFO] The Co-Simulation protocol ......................... SUCCESS [  0.764 s]
[INFO] xmlrpc-clientextension ............................. SUCCESS [  0.214 s]
[INFO] Simulation Engine .................................. SUCCESS [  1.298 s]
[INFO] xmlrpc-serverextension ............................. SUCCESS [  0.142 s]
[INFO] Co-Simulator for VDM ............................... SUCCESS [  3.180 s]
[INFO] DESTECS IDE Top-level .............................. SUCCESS [  0.913 s]
[INFO] org.destecs.ide.core ............................... SUCCESS [  3.619 s]
[INFO] DESTECS Simulation Engine .......................... SUCCESS [  5.023 s]
[INFO] org.destecs.ide.ui ................................. SUCCESS [  0.608 s]
[INFO] org.destecs.ide.debug .............................. SUCCESS [  0.807 s]
[INFO] org.destecs.ide.vdmmetadatabuilder ................. SUCCESS [  0.203 s]
[INFO] org.destecs.ide.libraries .......................... SUCCESS [  0.327 s]
[INFO] org.destecs.ide.platform ........................... SUCCESS [  3.693 s]
[INFO] DESTECS IDE Eclipse features ....................... SUCCESS [  0.007 s]
[INFO] DESTECS IDE Eclipse rcp feature .................... SUCCESS [  0.303 s]
[INFO] DESTECS IDE Standalone Product ..................... FAILURE [  9.695 s]
[INFO] ------------------------------------------------------------------------
[INFO] BUILD FAILURE
[INFO] ------------------------------------------------------------------------
[INFO] Total time: 08:05 min
[INFO] Finished at: 2018-11-22T08:50:01+01:00
[INFO] Final Memory: 207M/875M
[INFO] ------------------------------------------------------------------------
[jenkins-maven-event-spy] INFO generated /var/lib/jenkins/workspace/scendo-pipeline_development-6SEXP6NOH4DPMHNIAG2YUHD7VUTTPKSFIJJHDCPNLS2367EFMSNQ@tmp/withMavenfec0ddfd/maven-spy-20181122-084155-80596786022159903326.log
[ERROR] Failed to execute goal org.eclipse.tycho:tycho-p2-director-plugin:0.25.0:materialize-products (materialize-products) on project org.destecs.ide.product: Installation of product org.destecs.ide.platform.product for environment win32/win32/x86 failed: Call to p2 director application failed with exit code 13. Program arguments were: [-metadataRepository, file:/var/lib/jenkins/workspace/scendo-pipeline_development-6SEXP6NOH4DPMHNIAG2YUHD7VUTTPKSFIJJHDCPNLS2367EFMSNQ/ide/product/target/,file:/var/lib/jenkins/workspace/scendo-pipeline_development-6SEXP6NOH4DPMHNIAG2YUHD7VUTTPKSFIJJHDCPNLS2367EFMSNQ/ide/product/target/targetPlatformRepository/, -artifactRepository, file:/var/lib/jenkins/workspace/scendo-pipeline_development-6SEXP6NOH4DPMHNIAG2YUHD7VUTTPKSFIJJHDCPNLS2367EFMSNQ/ide/product/target/,file:/resolution-context-artifacts@/var/lib/jenkins/workspace/scendo-pipeline_development-6SEXP6NOH4DPMHNIAG2YUHD7VUTTPKSFIJJHDCPNLS2367EFMSNQ/ide/product,file:/var/lib/jenkins/workspace/scendo-pipeline_development-6SEXP6NOH4DPMHNIAG2YUHD7VUTTPKSFIJJHDCPNLS2367EFMSNQ/ide/simeng/target/,file:/var/lib/jenkins/workspace/scendo-pipeline_development-6SEXP6NOH4DPMHNIAG2YUHD7VUTTPKSFIJJHDCPNLS2367EFMSNQ/ide/core/target/,file:/var/lib/jenkins/workspace/scendo-pipeline_development-6SEXP6NOH4DPMHNIAG2YUHD7VUTTPKSFIJJHDCPNLS2367EFMSNQ/ide/debug/target/,file:/var/lib/jenkins/workspace/scendo-pipeline_development-6SEXP6NOH4DPMHNIAG2YUHD7VUTTPKSFIJJHDCPNLS2367EFMSNQ/ide/ui/target/,file:/var/lib/jenkins/workspace/scendo-pipeline_development-6SEXP6NOH4DPMHNIAG2YUHD7VUTTPKSFIJJHDCPNLS2367EFMSNQ/ide/features/rcp/target/,file:/var/lib/jenkins/workspace/scendo-pipeline_development-6SEXP6NOH4DPMHNIAG2YUHD7VUTTPKSFIJJHDCPNLS2367EFMSNQ/ide/platform/target/,file:/var/lib/jenkins/workspace/scendo-pipeline_development-6SEXP6NOH4DPMHNIAG2YUHD7VUTTPKSFIJJHDCPNLS2367EFMSNQ/ide/libraries/target/,file:/var/lib/jenkins/workspace/scendo-pipeline_development-6SEXP6NOH4DPMHNIAG2YUHD7VUTTPKSFIJJHDCPNLS2367EFMSNQ/ide/vdmmetadatabuilder/target/,file:/var/lib/jenkins/workspace/scendo-pipeline_development-6SEXP6NOH4DPMHNIAG2YUHD7VUTTPKSFIJJHDCPNLS2367EFMSNQ/ide/product/target/,file:/var/lib/jenkins/workspace/scendo-pipeline_development-6SEXP6NOH4DPMHNIAG2YUHD7VUTTPKSFIJJHDCPNLS2367EFMSNQ/.repository/, -installIU, org.destecs.ide.platform.product, -destination, /var/lib/jenkins/workspace/scendo-pipeline_development-6SEXP6NOH4DPMHNIAG2YUHD7VUTTPKSFIJJHDCPNLS2367EFMSNQ/ide/product/target/products/org.destecs.ide.platform.product/win32/win32/x86, -profile, DefaultProfile, -profileProperties, org.eclipse.update.install.features=true, -roaming, -p2.os, win32, -p2.ws, win32, -p2.arch, x86]. -> [Help 1]
[ERROR] 
[ERROR] To see the full stack trace of the errors, re-run Maven with the -e switch.
[ERROR] Re-run Maven using the -X switch to enable full debug logging.
[ERROR] 
[ERROR] For more information about the errors and possible solutions, please read the following articles:
[ERROR] [Help 1] http://cwiki.apache.org/confluence/display/MAVEN/MojoFailureException
[ERROR] 
[ERROR] After correcting the problems, you can resume the build with the command
[ERROR]   mvn <goals> -rf :org.destecs.ide.product