FailedConsole Output

Skipping 37 KB.. Full Log
=[INFO] --- maven-install-plugin:2.5.2:install (default-install) @ xmlrpcbaseextension ---
[INFO] Installing /var/lib/jenkins/workspace/scendo-pipeline_development-6SEXP6NOH4DPMHNIAG2YUHD7VUTTPKSFIJJHDCPNLS2367EFMSNQ/core/xmlrpcextensions/xmlrpcbaseextension/target/xmlrpcbaseextension-2.2.5-SNAPSHOT.jar to /var/lib/jenkins/workspace/scendo-pipeline_development-6SEXP6NOH4DPMHNIAG2YUHD7VUTTPKSFIJJHDCPNLS2367EFMSNQ/.repository/org/destecs/core/xmlrpcextensions/xmlrpcbaseextension/2.2.5-SNAPSHOT/xmlrpcbaseextension-2.2.5-SNAPSHOT.jar
[INFO] Installing /var/lib/jenkins/workspace/scendo-pipeline_development-6SEXP6NOH4DPMHNIAG2YUHD7VUTTPKSFIJJHDCPNLS2367EFMSNQ/core/xmlrpcextensions/xmlrpcbaseextension/pom.xml to /var/lib/jenkins/workspace/scendo-pipeline_development-6SEXP6NOH4DPMHNIAG2YUHD7VUTTPKSFIJJHDCPNLS2367EFMSNQ/.repository/org/destecs/core/xmlrpcextensions/xmlrpcbaseextension/2.2.5-SNAPSHOT/xmlrpcbaseextension-2.2.5-SNAPSHOT.pom
[INFO]                                                                         
[INFO] ------------------------------------------------------------------------
[INFO] Building DESTECS Maven plugins and standalone tools 2.2.5-SNAPSHOT
[INFO] ------------------------------------------------------------------------
[INFO] 
[INFO] --- maven-install-plugin:2.5.2:install (default-install) @ tool ---
[INFO] Installing /var/lib/jenkins/workspace/scendo-pipeline_development-6SEXP6NOH4DPMHNIAG2YUHD7VUTTPKSFIJJHDCPNLS2367EFMSNQ/tools/pom.xml to /var/lib/jenkins/workspace/scendo-pipeline_development-6SEXP6NOH4DPMHNIAG2YUHD7VUTTPKSFIJJHDCPNLS2367EFMSNQ/.repository/org/destecs/tools/tool/2.2.5-SNAPSHOT/tool-2.2.5-SNAPSHOT.pom
[INFO]                                                                         
[INFO] ------------------------------------------------------------------------
[INFO] Building Java Co-Simulation protocol generator 2.2.5-SNAPSHOT
[INFO] ------------------------------------------------------------------------
[INFO] 
[INFO] --- maven-resources-plugin:2.6:resources (default-resources) @ jprotocolgenerator ---
[INFO] Using 'UTF-8' encoding to copy filtered resources.
[INFO] skip non existing resourceDirectory /var/lib/jenkins/workspace/scendo-pipeline_development-6SEXP6NOH4DPMHNIAG2YUHD7VUTTPKSFIJJHDCPNLS2367EFMSNQ/tools/jprotocolgenerator/src/main/resources
[INFO] 
[INFO] --- maven-compiler-plugin:3.5.1:compile (default-compile) @ jprotocolgenerator ---
[INFO] Changes detected - recompiling the module!
[INFO] Compiling 21 source files to /var/lib/jenkins/workspace/scendo-pipeline_development-6SEXP6NOH4DPMHNIAG2YUHD7VUTTPKSFIJJHDCPNLS2367EFMSNQ/tools/jprotocolgenerator/target/classes
[INFO] 
[INFO] --- maven-plugin-plugin:3.3:descriptor (default-descriptor) @ jprotocolgenerator ---
[INFO] Using 'UTF-8' encoding to read mojo metadata.
[INFO] Applying mojo extractor for language: java
[WARNING] org.destecs.tools.plugins.GenerateJava#project:
[WARNING]   The syntax
[WARNING]     @parameter expression="${property}"
[WARNING]   is deprecated, please use
[WARNING]     @parameter property="property"
[WARNING]   instead.
[INFO] Mojo extractor for language: java found 1 mojo descriptors.
[INFO] Applying mojo extractor for language: bsh
[INFO] Mojo extractor for language: bsh found 0 mojo descriptors.
[INFO] Applying mojo extractor for language: java-annotations
[INFO] Mojo extractor for language: java-annotations found 0 mojo descriptors.
[INFO] 
[INFO] --- maven-resources-plugin:2.6:testResources (default-testResources) @ jprotocolgenerator ---
[INFO] Using 'UTF-8' encoding to copy filtered resources.
[INFO] skip non existing resourceDirectory /var/lib/jenkins/workspace/scendo-pipeline_development-6SEXP6NOH4DPMHNIAG2YUHD7VUTTPKSFIJJHDCPNLS2367EFMSNQ/tools/jprotocolgenerator/src/test/resources
[INFO] 
[INFO] --- maven-compiler-plugin:3.5.1:testCompile (default-testCompile) @ jprotocolgenerator ---
[INFO] No sources to compile
[INFO] 
[INFO] --- maven-surefire-plugin:2.13:test (default-test) @ jprotocolgenerator ---
[INFO] No tests to run.
[INFO] 
[INFO] --- maven-jar-plugin:2.4:jar (default-jar) @ jprotocolgenerator ---
[INFO] Building jar: /var/lib/jenkins/workspace/scendo-pipeline_development-6SEXP6NOH4DPMHNIAG2YUHD7VUTTPKSFIJJHDCPNLS2367EFMSNQ/tools/jprotocolgenerator/target/jprotocolgenerator-2.2.5-SNAPSHOT.jar
[INFO] 
[INFO] --- maven-plugin-plugin:3.3:addPluginArtifactMetadata (default-addPluginArtifactMetadata) @ jprotocolgenerator ---
[INFO] 
[INFO] --- maven-install-plugin:2.5.2:install (default-install) @ jprotocolgenerator ---
[INFO] Installing /var/lib/jenkins/workspace/scendo-pipeline_development-6SEXP6NOH4DPMHNIAG2YUHD7VUTTPKSFIJJHDCPNLS2367EFMSNQ/tools/jprotocolgenerator/target/jprotocolgenerator-2.2.5-SNAPSHOT.jar to /var/lib/jenkins/workspace/scendo-pipeline_development-6SEXP6NOH4DPMHNIAG2YUHD7VUTTPKSFIJJHDCPNLS2367EFMSNQ/.repository/org/destecs/tools/jprotocolgenerator/2.2.5-SNAPSHOT/jprotocolgenerator-2.2.5-SNAPSHOT.jar
[INFO] Installing /var/lib/jenkins/workspace/scendo-pipeline_development-6SEXP6NOH4DPMHNIAG2YUHD7VUTTPKSFIJJHDCPNLS2367EFMSNQ/tools/jprotocolgenerator/pom.xml to /var/lib/jenkins/workspace/scendo-pipeline_development-6SEXP6NOH4DPMHNIAG2YUHD7VUTTPKSFIJJHDCPNLS2367EFMSNQ/.repository/org/destecs/tools/jprotocolgenerator/2.2.5-SNAPSHOT/jprotocolgenerator-2.2.5-SNAPSHOT.pom
[INFO]                                                                         
[INFO] ------------------------------------------------------------------------
[INFO] Building The Co-Simulation protocol 2.2.5-SNAPSHOT
[INFO] ------------------------------------------------------------------------
[INFO] 
[INFO] --- build-helper-maven-plugin:1.7:add-source (add-source) @ protocol ---
[INFO] Source directory: /var/lib/jenkins/workspace/scendo-pipeline_development-6SEXP6NOH4DPMHNIAG2YUHD7VUTTPKSFIJJHDCPNLS2367EFMSNQ/core/protocol/target/generated-sources/jprotocolgenerator added.
[INFO] 
[INFO] --- maven-resources-plugin:2.6:resources (default-resources) @ protocol ---
[INFO] Using 'UTF-8' encoding to copy filtered resources.
[INFO] Copying 5 resources
[INFO] 
[INFO] --- jprotocolgenerator:2.2.5-SNAPSHOT:java (java) @ protocol ---
[INFO] Generating Java Interface
Interface Generation:
	InterfaceName: ICoSimProtocol
	PackageName: org.destecs.protocol
	Input Xml: /var/lib/jenkins/workspace/scendo-pipeline_development-6SEXP6NOH4DPMHNIAG2YUHD7VUTTPKSFIJJHDCPNLS2367EFMSNQ/core/protocol/src/main/resources/DestecsInterface.xml
	Output folder: /var/lib/jenkins/workspace/scendo-pipeline_development-6SEXP6NOH4DPMHNIAG2YUHD7VUTTPKSFIJJHDCPNLS2367EFMSNQ/core/protocol/target/generated-sources/jprotocolgenerator
Name normalized: XML-RPC_Library           -> XMLRPCLibrary
Name normalized: destecs.getVersion        -> destecsgetVersion
Name normalized: destecs.initialize        -> destecsinitialize
Name normalized: destecs.terminate         -> destecsterminate
Name normalized: destecs.load              -> destecsload
Name normalized: destecs.saveRequired      -> destecssaveRequired
Name normalized: destecs.queryInterface    -> destecsqueryInterface
Name normalized: destecs.queryVariables    -> destecsqueryVariables
Name normalized: destecs.queryParameters   -> destecsqueryParameters
Name normalized: destecs.queryImplementations -> destecsqueryImplementations
Name normalized: destecs.setParameters     -> destecssetParameters
Name normalized: destecs.setDesignParameters -> destecssetDesignParameters
Name normalized: destecs.setImplementations -> destecssetImplementations
Name normalized: destecs.getParameters     -> destecsgetParameters
Name normalized: destecs.getDesignParameters -> destecsgetDesignParameters
Name normalized: destecs.getVariables      -> destecsgetVariables
Name normalized: destecs.step              -> destecsstep
Name normalized: destecs.getStatus         -> destecsgetStatus
Name normalized: destecs.start             -> destecsstart
Name normalized: destecs.stop              -> destecsstop
Name normalized: destecs.suspend           -> destecssuspend
Name normalized: destecs.resume            -> destecsresume
Name normalized: destecs.setSettings       -> destecssetSettings
Name normalized: destecs.querySettings     -> destecsquerySettings
Name normalized: destecs.setLogVariables   -> destecssetLogVariables
[INFO] 
[INFO] --- maven-compiler-plugin:3.5.1:compile (default-compile) @ protocol ---
[INFO] Changes detected - recompiling the module!
[INFO] Compiling 24 source files to /var/lib/jenkins/workspace/scendo-pipeline_development-6SEXP6NOH4DPMHNIAG2YUHD7VUTTPKSFIJJHDCPNLS2367EFMSNQ/core/protocol/target/classes
[INFO] 
[INFO] --- maven-resources-plugin:2.6:testResources (default-testResources) @ protocol ---
[INFO] Using 'UTF-8' encoding to copy filtered resources.
[INFO] skip non existing resourceDirectory /var/lib/jenkins/workspace/scendo-pipeline_development-6SEXP6NOH4DPMHNIAG2YUHD7VUTTPKSFIJJHDCPNLS2367EFMSNQ/core/protocol/src/test/resources
[INFO] 
[INFO] --- maven-compiler-plugin:3.5.1:testCompile (default-testCompile) @ protocol ---
[INFO] No sources to compile
[INFO] 
[INFO] --- maven-surefire-plugin:2.13:test (default-test) @ protocol ---
[INFO] No tests to run.
[INFO] 
[INFO] --- maven-jar-plugin:2.4:jar (default-jar) @ protocol ---
[INFO] Building jar: /var/lib/jenkins/workspace/scendo-pipeline_development-6SEXP6NOH4DPMHNIAG2YUHD7VUTTPKSFIJJHDCPNLS2367EFMSNQ/core/protocol/target/protocol-2.2.5-SNAPSHOT.jar
[INFO] 
[INFO] --- maven-install-plugin:2.5.2:install (default-install) @ protocol ---
[INFO] Installing /var/lib/jenkins/workspace/scendo-pipeline_development-6SEXP6NOH4DPMHNIAG2YUHD7VUTTPKSFIJJHDCPNLS2367EFMSNQ/core/protocol/target/protocol-2.2.5-SNAPSHOT.jar to /var/lib/jenkins/workspace/scendo-pipeline_development-6SEXP6NOH4DPMHNIAG2YUHD7VUTTPKSFIJJHDCPNLS2367EFMSNQ/.repository/org/destecs/core/protocol/2.2.5-SNAPSHOT/protocol-2.2.5-SNAPSHOT.jar
[INFO] Installing /var/lib/jenkins/workspace/scendo-pipeline_development-6SEXP6NOH4DPMHNIAG2YUHD7VUTTPKSFIJJHDCPNLS2367EFMSNQ/core/protocol/pom.xml to /var/lib/jenkins/workspace/scendo-pipeline_development-6SEXP6NOH4DPMHNIAG2YUHD7VUTTPKSFIJJHDCPNLS2367EFMSNQ/.repository/org/destecs/core/protocol/2.2.5-SNAPSHOT/protocol-2.2.5-SNAPSHOT.pom
[INFO]                                                                         
[INFO] ------------------------------------------------------------------------
[INFO] Building xmlrpc-clientextension 2.2.5-SNAPSHOT
[INFO] ------------------------------------------------------------------------
[INFO] 
[INFO] --- maven-resources-plugin:2.6:resources (default-resources) @ xmlrpcclientextension ---
[INFO] Using 'UTF-8' encoding to copy filtered resources.
[INFO] skip non existing resourceDirectory /var/lib/jenkins/workspace/scendo-pipeline_development-6SEXP6NOH4DPMHNIAG2YUHD7VUTTPKSFIJJHDCPNLS2367EFMSNQ/core/xmlrpcextensions/xmlrpcclientextension/src/main/resources
[INFO] 
[INFO] --- maven-compiler-plugin:3.5.1:compile (default-compile) @ xmlrpcclientextension ---
[INFO] Changes detected - recompiling the module!
[INFO] Compiling 1 source file to /var/lib/jenkins/workspace/scendo-pipeline_development-6SEXP6NOH4DPMHNIAG2YUHD7VUTTPKSFIJJHDCPNLS2367EFMSNQ/core/xmlrpcextensions/xmlrpcclientextension/target/classes
[INFO] 
[INFO] --- maven-resources-plugin:2.6:testResources (default-testResources) @ xmlrpcclientextension ---
[INFO] Using 'UTF-8' encoding to copy filtered resources.
[INFO] skip non existing resourceDirectory /var/lib/jenkins/workspace/scendo-pipeline_development-6SEXP6NOH4DPMHNIAG2YUHD7VUTTPKSFIJJHDCPNLS2367EFMSNQ/core/xmlrpcextensions/xmlrpcclientextension/src/test/resources
[INFO] 
[INFO] --- maven-compiler-plugin:3.5.1:testCompile (default-testCompile) @ xmlrpcclientextension ---
[INFO] No sources to compile
[INFO] 
[INFO] --- maven-surefire-plugin:2.13:test (default-test) @ xmlrpcclientextension ---
[INFO] No tests to run.
[INFO] 
[INFO] --- maven-jar-plugin:2.4:jar (default-jar) @ xmlrpcclientextension ---
[INFO] Building jar: /var/lib/jenkins/workspace/scendo-pipeline_development-6SEXP6NOH4DPMHNIAG2YUHD7VUTTPKSFIJJHDCPNLS2367EFMSNQ/core/xmlrpcextensions/xmlrpcclientextension/target/xmlrpcclientextension-2.2.5-SNAPSHOT.jar
[INFO] 
[INFO] --- maven-install-plugin:2.5.2:install (default-install) @ xmlrpcclientextension ---
[INFO] Installing /var/lib/jenkins/workspace/scendo-pipeline_development-6SEXP6NOH4DPMHNIAG2YUHD7VUTTPKSFIJJHDCPNLS2367EFMSNQ/core/xmlrpcextensions/xmlrpcclientextension/target/xmlrpcclientextension-2.2.5-SNAPSHOT.jar to /var/lib/jenkins/workspace/scendo-pipeline_development-6SEXP6NOH4DPMHNIAG2YUHD7VUTTPKSFIJJHDCPNLS2367EFMSNQ/.repository/org/destecs/core/xmlrpcextensions/xmlrpcclientextension/2.2.5-SNAPSHOT/xmlrpcclientextension-2.2.5-SNAPSHOT.jar
[INFO] Installing /var/lib/jenkins/workspace/scendo-pipeline_development-6SEXP6NOH4DPMHNIAG2YUHD7VUTTPKSFIJJHDCPNLS2367EFMSNQ/core/xmlrpcextensions/xmlrpcclientextension/pom.xml to /var/lib/jenkins/workspace/scendo-pipeline_development-6SEXP6NOH4DPMHNIAG2YUHD7VUTTPKSFIJJHDCPNLS2367EFMSNQ/.repository/org/destecs/core/xmlrpcextensions/xmlrpcclientextension/2.2.5-SNAPSHOT/xmlrpcclientextension-2.2.5-SNAPSHOT.pom
[INFO]                                                                         
[INFO] ------------------------------------------------------------------------
[INFO] Building Simulation Engine 2.2.5-SNAPSHOT
[INFO] ------------------------------------------------------------------------
[INFO] 
[INFO] --- maven-resources-plugin:2.6:resources (default-resources) @ simulationengine ---
[INFO] Using 'UTF-8' encoding to copy filtered resources.
[INFO] Copying 1 resource
[INFO] 
[INFO] --- maven-compiler-plugin:3.5.1:compile (default-compile) @ simulationengine ---
[INFO] Changes detected - recompiling the module!
[INFO] Compiling 31 source files to /var/lib/jenkins/workspace/scendo-pipeline_development-6SEXP6NOH4DPMHNIAG2YUHD7VUTTPKSFIJJHDCPNLS2367EFMSNQ/core/simulationengine/target/classes
[INFO] /var/lib/jenkins/workspace/scendo-pipeline_development-6SEXP6NOH4DPMHNIAG2YUHD7VUTTPKSFIJJHDCPNLS2367EFMSNQ/core/simulationengine/src/main/java/org/destecs/core/simulationengine/script/ScriptEvaluator.java: /var/lib/jenkins/workspace/scendo-pipeline_development-6SEXP6NOH4DPMHNIAG2YUHD7VUTTPKSFIJJHDCPNLS2367EFMSNQ/core/simulationengine/src/main/java/org/destecs/core/simulationengine/script/ScriptEvaluator.java uses or overrides a deprecated API.
[INFO] /var/lib/jenkins/workspace/scendo-pipeline_development-6SEXP6NOH4DPMHNIAG2YUHD7VUTTPKSFIJJHDCPNLS2367EFMSNQ/core/simulationengine/src/main/java/org/destecs/core/simulationengine/script/ScriptEvaluator.java: Recompile with -Xlint:deprecation for details.
[INFO] 
[INFO] --- maven-resources-plugin:2.6:testResources (default-testResources) @ simulationengine ---
[INFO] Using 'UTF-8' encoding to copy filtered resources.
[INFO] skip non existing resourceDirectory /var/lib/jenkins/workspace/scendo-pipeline_development-6SEXP6NOH4DPMHNIAG2YUHD7VUTTPKSFIJJHDCPNLS2367EFMSNQ/core/simulationengine/src/test/resources
[INFO] 
[INFO] --- maven-compiler-plugin:3.5.1:testCompile (default-testCompile) @ simulationengine ---
[INFO] No sources to compile
[INFO] 
[INFO] --- maven-surefire-plugin:2.13:test (default-test) @ simulationengine ---
[INFO] No tests to run.
[INFO] 
[INFO] --- maven-jar-plugin:2.4:jar (default-jar) @ simulationengine ---
[INFO] Building jar: /var/lib/jenkins/workspace/scendo-pipeline_development-6SEXP6NOH4DPMHNIAG2YUHD7VUTTPKSFIJJHDCPNLS2367EFMSNQ/core/simulationengine/target/simulationengine-2.2.5-SNAPSHOT.jar
[INFO] 
[INFO] --- maven-source-plugin:2.1.1:jar-no-fork (attach-sources) @ simulationengine ---
[INFO] Building jar: /var/lib/jenkins/workspace/scendo-pipeline_development-6SEXP6NOH4DPMHNIAG2YUHD7VUTTPKSFIJJHDCPNLS2367EFMSNQ/core/simulationengine/target/simulationengine-2.2.5-SNAPSHOT-sources.jar
[INFO] 
[INFO] --- maven-install-plugin:2.5.2:install (default-install) @ simulationengine ---
[INFO] Installing /var/lib/jenkins/workspace/scendo-pipeline_development-6SEXP6NOH4DPMHNIAG2YUHD7VUTTPKSFIJJHDCPNLS2367EFMSNQ/core/simulationengine/target/simulationengine-2.2.5-SNAPSHOT.jar to /var/lib/jenkins/workspace/scendo-pipeline_development-6SEXP6NOH4DPMHNIAG2YUHD7VUTTPKSFIJJHDCPNLS2367EFMSNQ/.repository/org/destecs/core/simulationengine/2.2.5-SNAPSHOT/simulationengine-2.2.5-SNAPSHOT.jar
[INFO] Installing /var/lib/jenkins/workspace/scendo-pipeline_development-6SEXP6NOH4DPMHNIAG2YUHD7VUTTPKSFIJJHDCPNLS2367EFMSNQ/core/simulationengine/pom.xml to /var/lib/jenkins/workspace/scendo-pipeline_development-6SEXP6NOH4DPMHNIAG2YUHD7VUTTPKSFIJJHDCPNLS2367EFMSNQ/.repository/org/destecs/core/simulationengine/2.2.5-SNAPSHOT/simulationengine-2.2.5-SNAPSHOT.pom
[INFO] Installing /var/lib/jenkins/workspace/scendo-pipeline_development-6SEXP6NOH4DPMHNIAG2YUHD7VUTTPKSFIJJHDCPNLS2367EFMSNQ/core/simulationengine/target/simulationengine-2.2.5-SNAPSHOT-sources.jar to /var/lib/jenkins/workspace/scendo-pipeline_development-6SEXP6NOH4DPMHNIAG2YUHD7VUTTPKSFIJJHDCPNLS2367EFMSNQ/.repository/org/destecs/core/simulationengine/2.2.5-SNAPSHOT/simulationengine-2.2.5-SNAPSHOT-sources.jar
[INFO]                                                                         
[INFO] ------------------------------------------------------------------------
[INFO] Building xmlrpc-serverextension 2.2.5-SNAPSHOT
[INFO] ------------------------------------------------------------------------
[INFO] 
[INFO] --- maven-resources-plugin:2.6:resources (default-resources) @ xmlrpcserverextension ---
[INFO] Using 'UTF-8' encoding to copy filtered resources.
[INFO] skip non existing resourceDirectory /var/lib/jenkins/workspace/scendo-pipeline_development-6SEXP6NOH4DPMHNIAG2YUHD7VUTTPKSFIJJHDCPNLS2367EFMSNQ/core/xmlrpcextensions/xmlrpcserverextension/src/main/resources
[INFO] 
[INFO] --- maven-compiler-plugin:3.5.1:compile (default-compile) @ xmlrpcserverextension ---
[INFO] Changes detected - recompiling the module!
[INFO] Compiling 1 source file to /var/lib/jenkins/workspace/scendo-pipeline_development-6SEXP6NOH4DPMHNIAG2YUHD7VUTTPKSFIJJHDCPNLS2367EFMSNQ/core/xmlrpcextensions/xmlrpcserverextension/target/classes
[INFO] 
[INFO] --- maven-resources-plugin:2.6:testResources (default-testResources) @ xmlrpcserverextension ---
[INFO] Using 'UTF-8' encoding to copy filtered resources.
[INFO] skip non existing resourceDirectory /var/lib/jenkins/workspace/scendo-pipeline_development-6SEXP6NOH4DPMHNIAG2YUHD7VUTTPKSFIJJHDCPNLS2367EFMSNQ/core/xmlrpcextensions/xmlrpcserverextension/src/test/resources
[INFO] 
[INFO] --- maven-compiler-plugin:3.5.1:testCompile (default-testCompile) @ xmlrpcserverextension ---
[INFO] No sources to compile
[INFO] 
[INFO] --- maven-surefire-plugin:2.13:test (default-test) @ xmlrpcserverextension ---
[INFO] No tests to run.
[INFO] 
[INFO] --- maven-jar-plugin:2.4:jar (default-jar) @ xmlrpcserverextension ---
[INFO] Building jar: /var/lib/jenkins/workspace/scendo-pipeline_development-6SEXP6NOH4DPMHNIAG2YUHD7VUTTPKSFIJJHDCPNLS2367EFMSNQ/core/xmlrpcextensions/xmlrpcserverextension/target/xmlrpcserverextension-2.2.5-SNAPSHOT.jar
[INFO] 
[INFO] --- maven-install-plugin:2.5.2:install (default-install) @ xmlrpcserverextension ---
[INFO] Installing /var/lib/jenkins/workspace/scendo-pipeline_development-6SEXP6NOH4DPMHNIAG2YUHD7VUTTPKSFIJJHDCPNLS2367EFMSNQ/core/xmlrpcextensions/xmlrpcserverextension/target/xmlrpcserverextension-2.2.5-SNAPSHOT.jar to /var/lib/jenkins/workspace/scendo-pipeline_development-6SEXP6NOH4DPMHNIAG2YUHD7VUTTPKSFIJJHDCPNLS2367EFMSNQ/.repository/org/destecs/core/xmlrpcextensions/xmlrpcserverextension/2.2.5-SNAPSHOT/xmlrpcserverextension-2.2.5-SNAPSHOT.jar
[INFO] Installing /var/lib/jenkins/workspace/scendo-pipeline_development-6SEXP6NOH4DPMHNIAG2YUHD7VUTTPKSFIJJHDCPNLS2367EFMSNQ/core/xmlrpcextensions/xmlrpcserverextension/pom.xml to /var/lib/jenkins/workspace/scendo-pipeline_development-6SEXP6NOH4DPMHNIAG2YUHD7VUTTPKSFIJJHDCPNLS2367EFMSNQ/.repository/org/destecs/core/xmlrpcextensions/xmlrpcserverextension/2.2.5-SNAPSHOT/xmlrpcserverextension-2.2.5-SNAPSHOT.pom
[INFO]                                                                         
[INFO] ------------------------------------------------------------------------
[INFO] Building Co-Simulator for VDM 2.2.5-SNAPSHOT
[INFO] ------------------------------------------------------------------------
[INFO] 
[INFO] --- maven-resources-plugin:2.6:resources (default-resources) @ vdm ---
[INFO] Using 'UTF-8' encoding to copy filtered resources.
[INFO] Copying 2 resources
[INFO] 
[INFO] --- maven-compiler-plugin:3.5.1:compile (default-compile) @ vdm ---
[INFO] Changes detected - recompiling the module!
[INFO] Compiling 22 source files to /var/lib/jenkins/workspace/scendo-pipeline_development-6SEXP6NOH4DPMHNIAG2YUHD7VUTTPKSFIJJHDCPNLS2367EFMSNQ/core/vdm/target/classes
[INFO] 
[INFO] --- maven-resources-plugin:2.6:testResources (default-testResources) @ vdm ---
[INFO] Using 'UTF-8' encoding to copy filtered resources.
[INFO] Copying 8 resources
[INFO] 
[INFO] --- maven-compiler-plugin:3.5.1:testCompile (default-testCompile) @ vdm ---
[INFO] Changes detected - recompiling the module!
[INFO] Compiling 1 source file to /var/lib/jenkins/workspace/scendo-pipeline_development-6SEXP6NOH4DPMHNIAG2YUHD7VUTTPKSFIJJHDCPNLS2367EFMSNQ/core/vdm/target/test-classes
[INFO] 
[INFO] --- maven-surefire-plugin:2.13:test (default-test) @ vdm ---
[INFO] Surefire report directory: /var/lib/jenkins/workspace/scendo-pipeline_development-6SEXP6NOH4DPMHNIAG2YUHD7VUTTPKSFIJJHDCPNLS2367EFMSNQ/core/vdm/target/surefire-reports

-------------------------------------------------------
 T E S T S
-------------------------------------------------------
Picked up JAVA_TOOL_OPTIONS: -Dmaven.ext.class.path="/var/lib/jenkins/workspace/scendo-pipeline_development-6SEXP6NOH4DPMHNIAG2YUHD7VUTTPKSFIJJHDCPNLS2367EFMSNQ@tmp/withMaven172ea620/pipeline-maven-spy.jar" -Dorg.jenkinsci.plugins.pipeline.maven.reportsFolder="/var/lib/jenkins/workspace/scendo-pipeline_development-6SEXP6NOH4DPMHNIAG2YUHD7VUTTPKSFIJJHDCPNLS2367EFMSNQ@tmp/withMaven172ea620" 
Running vdm.CoSimTest
Parsed 6 classes in 0.122 secs. No syntax errors
Type checked 8 classes in 0.118 secs. No type errors
----------------------------------------------------------------------------------
Runtime Validator Initialized with conjectures:
----------------------------------------------------------------------------------
Running from: 0.000000 to 0.000400
	Output valve = 0.0
Running from: 0.000400 to 0.000800
	Output valve = 1.0
Running from: 0.000800 to 0.050000
	Output valve = 1.0
Running from: 0.050000 to 0.050400
	Output valve = 1.0
Running from: 0.050400 to 0.050800
	Output valve = 1.0
Running from: 0.050800 to 0.100000
	Output valve = 1.0
Running from: 0.100000 to 0.100400
	Output valve = 1.0
Running from: 0.100400 to 0.100800
	Output valve = 1.0
Running from: 0.100800 to 0.150000
	Output valve = 1.0
Running from: 0.150000 to 0.150400
	Output valve = 1.0
Running from: 0.150400 to 0.150800
	Output valve = 0.0
Running from: 0.150800 to 0.200000
	Output valve = 0.0
Running from: 0.200000 to 0.200400
	Output valve = 0.0
Running from: 0.200400 to 0.200800
	Output valve = 0.0
Running from: 0.200800 to 0.250000
	Output valve = 0.0
Running from: 0.250000 to 0.250400
	Output valve = 0.0
Running from: 0.250400 to 0.250800
	Output valve = 0.0
Running from: 0.250800 to 0.300000
	Output valve = 0.0
Running from: 0.300000 to 0.300400
	Output valve = 0.0
Running from: 0.300400 to 0.300800
	Output valve = 0.0
Running from: 0.300800 to 0.350000
	Output valve = 0.0
Running from: 0.350000 to 0.350400
	Output valve = 0.0
Running from: 0.350400 to 0.350800
	Output valve = 0.0
Running from: 0.350800 to 0.400000
	Output valve = 0.0
Running from: 0.400000 to 0.400400
	Output valve = 0.0
Running from: 0.400400 to 0.400800
	Output valve = 0.0
Running from: 0.400800 to 0.450000
	Output valve = 0.0
Running from: 0.450000 to 0.450400
	Output valve = 0.0
Running from: 0.450400 to 0.450800
	Output valve = 0.0
Running from: 0.450800 to 0.500000
	Output valve = 0.0
Running from: 0.500000 to 0.500400
	Output valve = 0.0
Running from: 0.500400 to 0.500800
	Output valve = 0.0
Running from: 0.500800 to 0.550000
	Output valve = 0.0
Running from: 0.550000 to 0.550400
	Output valve = 0.0
Running from: 0.550400 to 0.550800
	Output valve = 0.0
Running from: 0.550800 to 0.600000
	Output valve = 0.0
Running from: 0.600000 to 0.600400
	Output valve = 0.0
Running from: 0.600400 to 0.600800
	Output valve = 0.0
Running from: 0.600800 to 0.650000
	Output valve = 0.0
Running from: 0.650000 to 0.650400
	Output valve = 0.0
Running from: 0.650400 to 0.650800
	Output valve = 0.0
Running from: 0.650800 to 0.700000
	Output valve = 0.0
Running from: 0.700000 to 0.700400
	Output valve = 0.0
Running from: 0.700400 to 0.700800
	Output valve = 0.0
Running from: 0.700800 to 0.750000
	Output valve = 0.0
Running from: 0.750000 to 0.750400
	Output valve = 0.0
Running from: 0.750400 to 0.750800
	Output valve = 0.0
Running from: 0.750800 to 0.800000
	Output valve = 0.0
Running from: 0.800000 to 0.800400
	Output valve = 0.0
Running from: 0.800400 to 0.800800
	Output valve = 0.0
Running from: 0.800800 to 0.850000
	Output valve = 0.0
Running from: 0.850000 to 0.850400
	Output valve = 0.0
Running from: 0.850400 to 0.850800
	Output valve = 0.0
Running from: 0.850800 to 0.900000
	Output valve = 0.0
Running from: 0.900000 to 0.900400
	Output valve = 0.0
Running from: 0.900400 to 0.900800
	Output valve = 0.0
Running from: 0.900800 to 0.950000
	Output valve = 0.0
Running from: 0.950000 to 0.950400
	Output valve = 0.0
Running from: 0.950400 to 0.950800
	Output valve = 0.0
Running from: 0.950800 to 1.000000
	Output valve = 0.0
Running from: 1.000000 to 1.000400
	Output valve = 0.0
Running from: 1.000400 to 1.000800
	Output valve = 0.0
Running from: 1.000800 to 1.050000
	Output valve = 0.0
Running from: 1.050000 to 1.050400
	Output valve = 0.0
Running from: 1.050400 to 1.050800
	Output valve = 0.0
Running from: 1.050800 to 1.100000
	Output valve = 0.0
Running from: 1.100000 to 1.100400
	Output valve = 0.0
Running from: 1.100400 to 1.100800
	Output valve = 0.0
Running from: 1.100800 to 1.150000
	Output valve = 0.0
Running from: 1.150000 to 1.150400
	Output valve = 0.0
Running from: 1.150400 to 1.150800
	Output valve = 0.0
Running from: 1.150800 to 1.200000
	Output valve = 0.0
Running from: 1.200000 to 1.200400
	Output valve = 0.0
Running from: 1.200400 to 1.200800
	Output valve = 0.0
Running from: 1.200800 to 1.250000
	Output valve = 0.0
Running from: 1.250000 to 1.250400
	Output valve = 0.0
Running from: 1.250400 to 1.250800
	Output valve = 0.0
Running from: 1.250800 to 1.300000
	Output valve = 0.0
Running from: 1.300000 to 1.300400
	Output valve = 0.0
Running from: 1.300400 to 1.300800
	Output valve = 0.0
Running from: 1.300800 to 1.350000
	Output valve = 0.0
Running from: 1.350000 to 1.350400
	Output valve = 0.0
Running from: 1.350400 to 1.350800
	Output valve = 0.0
Running from: 1.350800 to 1.400000
	Output valve = 0.0
Running from: 1.400000 to 1.400400
	Output valve = 0.0
Running from: 1.400400 to 1.400800
	Output valve = 0.0
Running from: 1.400800 to 1.450000
	Output valve = 0.0
Running from: 1.450000 to 1.450400
	Output valve = 0.0
Running from: 1.450400 to 1.450800
	Output valve = 0.0
Running from: 1.450800 to 1.500000
	Output valve = 0.0
Running from: 1.500000 to 1.500400
	Output valve = 0.0
Running from: 1.500400 to 1.500800
	Output valve = 0.0
Running from: 1.500800 to 1.550000
	Output valve = 0.0
Running from: 1.550000 to 1.550400
	Output valve = 0.0
Running from: 1.550400 to 1.550800
	Output valve = 0.0
Running from: 1.550800 to 1.600000
	Output valve = 0.0
Running from: 1.600000 to 1.600400
	Output valve = 0.0
Running from: 1.600400 to 1.600800
	Output valve = 0.0
Running from: 1.600800 to 1.650000
	Output valve = 0.0
Running from: 1.650000 to 1.650400
	Output valve = 0.0
Running from: 1.650400 to 1.650800
	Output valve = 0.0
Running from: 1.650800 to 1.700000
	Output valve = 0.0
Running from: 1.700000 to 1.700400
	Output valve = 0.0
Running from: 1.700400 to 1.700800
	Output valve = 0.0
Running from: 1.700800 to 1.750000
	Output valve = 0.0
Running from: 1.750000 to 1.750400
	Output valve = 0.0
Running from: 1.750400 to 1.750800
	Output valve = 0.0
Running from: 1.750800 to 1.800000
	Output valve = 0.0
Running from: 1.800000 to 1.800400
	Output valve = 0.0
Running from: 1.800400 to 1.800800
	Output valve = 0.0
Running from: 1.800800 to 1.850000
	Output valve = 0.0
Running from: 1.850000 to 1.850400
	Output valve = 0.0
Running from: 1.850400 to 1.850800
	Output valve = 0.0
Running from: 1.850800 to 1.900000
	Output valve = 0.0
Running from: 1.900000 to 1.900400
	Output valve = 0.0
Running from: 1.900400 to 1.900800
	Output valve = 0.0
Running from: 1.900800 to 1.950000
	Output valve = 0.0
Running from: 1.950000 to 1.950400
	Output valve = 0.0
Running from: 1.950400 to 1.950800
	Output valve = 0.0
Running from: 1.950800 to 2.000000
	Output valve = 0.0
Running from: 2.000000 to 2.000400
	Output valve = 0.0
Running from: 2.000400 to 2.000800
	Output valve = 0.0
Running from: 2.000800 to 2.050000
	Output valve = 0.0
Running from: 2.050000 to 2.050400
	Output valve = 0.0
Running from: 2.050400 to 2.050800
	Output valve = 0.0
Running from: 2.050800 to 2.100000
	Output valve = 0.0
Running from: 2.100000 to 2.100400
	Output valve = 0.0
Running from: 2.100400 to 2.100800
	Output valve = 0.0
Running from: 2.100800 to 2.150000
	Output valve = 0.0
Running from: 2.150000 to 2.150400
	Output valve = 0.0
Running from: 2.150400 to 2.150800
	Output valve = 0.0
Running from: 2.150800 to 2.200000
	Output valve = 0.0
Running from: 2.200000 to 2.200400
	Output valve = 0.0
Running from: 2.200400 to 2.200800
	Output valve = 0.0
Running from: 2.200800 to 2.250000
	Output valve = 0.0
Running from: 2.250000 to 2.250400
	Output valve = 0.0
Running from: 2.250400 to 2.250800
	Output valve = 0.0
Running from: 2.250800 to 2.300000
	Output valve = 0.0
Running from: 2.300000 to 2.300400
	Output valve = 0.0
Running from: 2.300400 to 2.300800
	Output valve = 0.0
Running from: 2.300800 to 2.350000
	Output valve = 0.0
Running from: 2.350000 to 2.350400
	Output valve = 0.0
Running from: 2.350400 to 2.350800
	Output valve = 0.0
Running from: 2.350800 to 2.400000
	Output valve = 0.0
Running from: 2.400000 to 2.400400
	Output valve = 0.0
Running from: 2.400400 to 2.400800
	Output valve = 0.0
Running from: 2.400800 to 2.450000
	Output valve = 0.0
Running from: 2.450000 to 2.450400
	Output valve = 0.0
Running from: 2.450400 to 2.450800
	Output valve = 0.0
Running from: 2.450800 to 2.500000
	Output valve = 0.0
Running from: 2.500000 to 2.500400
	Output valve = 0.0
Running from: 2.500400 to 2.500800
	Output valve = 0.0
Running from: 2.500800 to 2.550000
	Output valve = 0.0
Running from: 2.550000 to 2.550400
	Output valve = 0.0
Running from: 2.550400 to 2.550800
	Output valve = 0.0
Running from: 2.550800 to 2.600000
	Output valve = 0.0
Running from: 2.600000 to 2.600400
	Output valve = 0.0
Running from: 2.600400 to 2.600800
	Output valve = 0.0
Running from: 2.600800 to 2.650000
	Output valve = 0.0
Running from: 2.650000 to 2.650400
	Output valve = 0.0
Running from: 2.650400 to 2.650800
	Output valve = 0.0
Running from: 2.650800 to 2.700000
	Output valve = 0.0
Running from: 2.700000 to 2.700400
	Output valve = 0.0
Running from: 2.700400 to 2.700800
	Output valve = 0.0
Running from: 2.700800 to 2.750000
	Output valve = 0.0
Running from: 2.750000 to 2.750400
	Output valve = 0.0
Running from: 2.750400 to 2.750800
	Output valve = 0.0
Running from: 2.750800 to 2.800000
	Output valve = 0.0
Running from: 2.800000 to 2.800400
	Output valve = 0.0
Running from: 2.800400 to 2.800800
	Output valve = 0.0
Running from: 2.800800 to 2.850000
	Output valve = 0.0
Running from: 2.850000 to 2.850400
	Output valve = 0.0
Running from: 2.850400 to 2.850800
	Output valve = 0.0
Running from: 2.850800 to 2.900000
	Output valve = 0.0
Running from: 2.900000 to 2.900400
	Output valve = 0.0
Running from: 2.900400 to 2.900800
	Output valve = 0.0
Running from: 2.900800 to 2.950000
	Output valve = 0.0
Running from: 2.950000 to 2.950400
	Output valve = 0.0
Running from: 2.950400 to 2.950800
	Output valve = 0.0
Running from: 2.950800 to 3.000000
	Output valve = 0.0
Running from: 3.000000 to 3.000400
	Output valve = 0.0
Running from: 3.000400 to 3.000800
	Output valve = 0.0
Running from: 3.000800 to 3.050000
	Output valve = 0.0
Running from: 3.050000 to 3.050400
	Output valve = 0.0
Running from: 3.050400 to 3.050800
	Output valve = 0.0
Running from: 3.050800 to 3.100000
	Output valve = 0.0
Running from: 3.100000 to 3.100400
	Output valve = 0.0
Running from: 3.100400 to 3.100800
	Output valve = 0.0
Running from: 3.100800 to 3.150000
	Output valve = 0.0
Running from: 3.150000 to 3.150400
	Output valve = 0.0
Running from: 3.150400 to 3.150800
	Output valve = 0.0
Running from: 3.150800 to 3.200000
	Output valve = 0.0
Running from: 3.200000 to 3.200400
	Output valve = 0.0
Running from: 3.200400 to 3.200800
	Output valve = 0.0
Running from: 3.200800 to 3.250000
	Output valve = 0.0
Running from: 3.250000 to 3.250400
	Output valve = 0.0
Running from: 3.250400 to 3.250800
	Output valve = 0.0
Running from: 3.250800 to 3.300000
	Output valve = 0.0
Running from: 3.300000 to 3.300400
	Output valve = 0.0
Running from: 3.300400 to 3.300800
	Output valve = 0.0
Running from: 3.300800 to 3.350000
	Output valve = 0.0
Running from: 3.350000 to 3.350400
	Output valve = 0.0
Running from: 3.350400 to 3.350800
	Output valve = 0.0
Running from: 3.350800 to 3.400000
	Output valve = 0.0
Running from: 3.400000 to 3.400400
	Output valve = 0.0
Running from: 3.400400 to 3.400800
	Output valve = 0.0
Running from: 3.400800 to 3.450000
	Output valve = 0.0
Running from: 3.450000 to 3.450400
	Output valve = 0.0
Running from: 3.450400 to 3.450800
	Output valve = 0.0
Running from: 3.450800 to 3.500000
	Output valve = 0.0
Running from: 3.500000 to 3.500400
	Output valve = 0.0
Running from: 3.500400 to 3.500800
	Output valve = 0.0
Running from: 3.500800 to 3.550000
	Output valve = 0.0
Running from: 3.550000 to 3.550400
	Output valve = 0.0
Running from: 3.550400 to 3.550800
	Output valve = 0.0
Running from: 3.550800 to 3.600000
	Output valve = 0.0
Running from: 3.600000 to 3.600400
	Output valve = 0.0
Running from: 3.600400 to 3.600800
	Output valve = 0.0
Running from: 3.600800 to 3.650000
	Output valve = 0.0
Running from: 3.650000 to 3.650400
	Output valve = 0.0
Running from: 3.650400 to 3.650800
	Output valve = 0.0
Running from: 3.650800 to 3.700000
	Output valve = 0.0
Running from: 3.700000 to 3.700400
	Output valve = 0.0
Running from: 3.700400 to 3.700800
	Output valve = 0.0
Running from: 3.700800 to 3.750000
	Output valve = 0.0
Running from: 3.750000 to 3.750400
	Output valve = 0.0
Running from: 3.750400 to 3.750800
	Output valve = 0.0
Running from: 3.750800 to 3.800000
	Output valve = 0.0
Running from: 3.800000 to 3.800400
	Output valve = 0.0
Running from: 3.800400 to 3.800800
	Output valve = 0.0
Running from: 3.800800 to 3.850000
	Output valve = 0.0
Running from: 3.850000 to 3.850400
	Output valve = 0.0
Running from: 3.850400 to 3.850800
	Output valve = 0.0
Running from: 3.850800 to 3.900000
	Output valve = 0.0
Running from: 3.900000 to 3.900400
	Output valve = 0.0
Running from: 3.900400 to 3.900800
	Output valve = 0.0
Running from: 3.900800 to 3.950000
	Output valve = 0.0
Running from: 3.950000 to 3.950400
	Output valve = 0.0
Running from: 3.950400 to 3.950800
	Output valve = 0.0
Running from: 3.950800 to 4.000000
	Output valve = 0.0
Running from: 4.000000 to 4.000400
	Output valve = 0.0
Running from: 4.000400 to 4.000800
	Output valve = 0.0
Running from: 4.000800 to 4.050000
	Output valve = 0.0
Running from: 4.050000 to 4.050400
	Output valve = 0.0
Running from: 4.050400 to 4.050800
	Output valve = 0.0
Running from: 4.050800 to 4.100000
	Output valve = 0.0
Running from: 4.100000 to 4.100400
	Output valve = 0.0
Running from: 4.100400 to 4.100800
	Output valve = 0.0
Running from: 4.100800 to 4.150000
	Output valve = 0.0
Running from: 4.150000 to 4.150400
	Output valve = 0.0
Running from: 4.150400 to 4.150800
	Output valve = 0.0
Running from: 4.150800 to 4.200000
	Output valve = 0.0
Running from: 4.200000 to 4.200400
	Output valve = 0.0
Running from: 4.200400 to 4.200800
	Output valve = 0.0
Running from: 4.200800 to 4.250000
	Output valve = 0.0
Running from: 4.250000 to 4.250400
	Output valve = 0.0
Running from: 4.250400 to 4.250800
	Output valve = 0.0
Running from: 4.250800 to 4.300000
	Output valve = 0.0
Running from: 4.300000 to 4.300400
	Output valve = 0.0
Running from: 4.300400 to 4.300800
	Output valve = 0.0
Running from: 4.300800 to 4.350000
	Output valve = 0.0
Running from: 4.350000 to 4.350400
	Output valve = 0.0
Running from: 4.350400 to 4.350800
	Output valve = 0.0
Running from: 4.350800 to 4.400000
	Output valve = 0.0
Running from: 4.400000 to 4.400400
	Output valve = 0.0
Running from: 4.400400 to 4.400800
	Output valve = 0.0
Running from: 4.400800 to 4.450000
	Output valve = 0.0
Running from: 4.450000 to 4.450400
	Output valve = 0.0
Running from: 4.450400 to 4.450800
	Output valve = 0.0
Running from: 4.450800 to 4.500000
	Output valve = 0.0
Running from: 4.500000 to 4.500400
	Output valve = 0.0
Running from: 4.500400 to 4.500800
	Output valve = 0.0
Running from: 4.500800 to 4.550000
	Output valve = 0.0
Running from: 4.550000 to 4.550400
	Output valve = 0.0
Running from: 4.550400 to 4.550800
	Output valve = 0.0
Running from: 4.550800 to 4.600000
	Output valve = 0.0
Running from: 4.600000 to 4.600400
	Output valve = 0.0
Running from: 4.600400 to 4.600800
	Output valve = 0.0
Running from: 4.600800 to 4.650000
	Output valve = 0.0
Running from: 4.650000 to 4.650400
	Output valve = 0.0
Running from: 4.650400 to 4.650800
	Output valve = 0.0
Running from: 4.650800 to 4.700000
	Output valve = 0.0
Running from: 4.700000 to 4.700400
	Output valve = 0.0
Running from: 4.700400 to 4.700800
	Output valve = 0.0
Running from: 4.700800 to 4.750000
	Output valve = 0.0
Running from: 4.750000 to 4.750400
	Output valve = 0.0
Running from: 4.750400 to 4.750800
	Output valve = 0.0
Running from: 4.750800 to 4.800000
	Output valve = 0.0
Running from: 4.800000 to 4.800400
	Output valve = 0.0
Running from: 4.800400 to 4.800800
	Output valve = 0.0
Running from: 4.800800 to 4.850000
	Output valve = 0.0
Running from: 4.850000 to 4.850400
	Output valve = 0.0
Running from: 4.850400 to 4.850800
	Output valve = 0.0
Running from: 4.850800 to 4.900000
	Output valve = 0.0
Running from: 4.900000 to 4.900400
	Output valve = 0.0
Running from: 4.900400 to 4.900800
	Output valve = 0.0
Running from: 4.900800 to 4.950000
	Output valve = 0.0
Running from: 4.950000 to 4.950400
	Output valve = 0.0
Running from: 4.950400 to 4.950800
	Output valve = 0.0
Running from: 4.950800 to 5.000000
	Output valve = 0.0
Tests run: 1, Failures: 0, Errors: 0, Skipped: 0, Time elapsed: 1.567 sec

Results :

Tests run: 1, Failures: 0, Errors: 0, Skipped: 0

[INFO] 
[INFO] --- maven-jar-plugin:2.4:jar (default-jar) @ vdm ---
[INFO] Building jar: /var/lib/jenkins/workspace/scendo-pipeline_development-6SEXP6NOH4DPMHNIAG2YUHD7VUTTPKSFIJJHDCPNLS2367EFMSNQ/core/vdm/target/vdm-2.2.5-SNAPSHOT.jar
[INFO] 
[INFO] --- maven-source-plugin:2.1.1:jar-no-fork (attach-sources) @ vdm ---
[INFO] Building jar: /var/lib/jenkins/workspace/scendo-pipeline_development-6SEXP6NOH4DPMHNIAG2YUHD7VUTTPKSFIJJHDCPNLS2367EFMSNQ/core/vdm/target/vdm-2.2.5-SNAPSHOT-sources.jar
[INFO] 
[INFO] --- maven-install-plugin:2.5.2:install (default-install) @ vdm ---
[INFO] Installing /var/lib/jenkins/workspace/scendo-pipeline_development-6SEXP6NOH4DPMHNIAG2YUHD7VUTTPKSFIJJHDCPNLS2367EFMSNQ/core/vdm/target/vdm-2.2.5-SNAPSHOT.jar to /var/lib/jenkins/workspace/scendo-pipeline_development-6SEXP6NOH4DPMHNIAG2YUHD7VUTTPKSFIJJHDCPNLS2367EFMSNQ/.repository/org/destecs/core/vdm/2.2.5-SNAPSHOT/vdm-2.2.5-SNAPSHOT.jar
[INFO] Installing /var/lib/jenkins/workspace/scendo-pipeline_development-6SEXP6NOH4DPMHNIAG2YUHD7VUTTPKSFIJJHDCPNLS2367EFMSNQ/core/vdm/pom.xml to /var/lib/jenkins/workspace/scendo-pipeline_development-6SEXP6NOH4DPMHNIAG2YUHD7VUTTPKSFIJJHDCPNLS2367EFMSNQ/.repository/org/destecs/core/vdm/2.2.5-SNAPSHOT/vdm-2.2.5-SNAPSHOT.pom
[INFO] Installing /var/lib/jenkins/workspace/scendo-pipeline_development-6SEXP6NOH4DPMHNIAG2YUHD7VUTTPKSFIJJHDCPNLS2367EFMSNQ/core/vdm/target/vdm-2.2.5-SNAPSHOT-sources.jar to /var/lib/jenkins/workspace/scendo-pipeline_development-6SEXP6NOH4DPMHNIAG2YUHD7VUTTPKSFIJJHDCPNLS2367EFMSNQ/.repository/org/destecs/core/vdm/2.2.5-SNAPSHOT/vdm-2.2.5-SNAPSHOT-sources.jar
[INFO]                                                                         
[INFO] ------------------------------------------------------------------------
[INFO] Building DESTECS IDE Top-level 2.2.5-SNAPSHOT
[INFO] ------------------------------------------------------------------------
[INFO] 
[INFO] --- maven-javadoc-plugin:2.9:jar (attach-javadocs) @ ide ---
[INFO] Skipping javadoc generation
[INFO] 
[INFO] --- maven-install-plugin:2.5.2:install (default-install) @ ide ---
[INFO] Installing /var/lib/jenkins/workspace/scendo-pipeline_development-6SEXP6NOH4DPMHNIAG2YUHD7VUTTPKSFIJJHDCPNLS2367EFMSNQ/ide/pom.xml to /var/lib/jenkins/workspace/scendo-pipeline_development-6SEXP6NOH4DPMHNIAG2YUHD7VUTTPKSFIJJHDCPNLS2367EFMSNQ/.repository/org/destecs/ide/2.2.5-SNAPSHOT/ide-2.2.5-SNAPSHOT.pom
[INFO]                                                                         
[INFO] ------------------------------------------------------------------------
[INFO] Building org.destecs.ide.core 2.2.5-SNAPSHOT
[INFO] ------------------------------------------------------------------------
[INFO] 
[INFO] --- tycho-packaging-plugin:0.25.0:build-qualifier (default-build-qualifier) @ org.destecs.ide.core ---
[INFO] The project's OSGi version is 2.2.5.201811220809
[INFO] 
[INFO] --- tycho-packaging-plugin:0.25.0:validate-id (default-validate-id) @ org.destecs.ide.core ---
[INFO] 
[INFO] --- tycho-packaging-plugin:0.25.0:validate-version (default-validate-version) @ org.destecs.ide.core ---
[INFO] 
[INFO] --- maven-dependency-plugin:2.6:copy (copy-dependencies) @ org.destecs.ide.core ---
[INFO] Configured Artifact: org.destecs.core:parsers:2.0.8:jar
[INFO] Configured Artifact: antlr:antlr:2.7.7:jar
[INFO] Configured Artifact: org.antlr:stringtemplate:3.2:jar
[INFO] Configured Artifact: org.antlr:antlr-runtime:3.2:jar
[INFO] Configured Artifact: org.antlr:antlr:3.2:jar
[INFO] Copying parsers-2.0.8.jar to /var/lib/jenkins/workspace/scendo-pipeline_development-6SEXP6NOH4DPMHNIAG2YUHD7VUTTPKSFIJJHDCPNLS2367EFMSNQ/ide/core/jars/parsers.jar
[INFO] Copying antlr-2.7.7.jar to /var/lib/jenkins/workspace/scendo-pipeline_development-6SEXP6NOH4DPMHNIAG2YUHD7VUTTPKSFIJJHDCPNLS2367EFMSNQ/ide/core/jars/antlr.jar
[INFO] Copying stringtemplate-3.2.jar to /var/lib/jenkins/workspace/scendo-pipeline_development-6SEXP6NOH4DPMHNIAG2YUHD7VUTTPKSFIJJHDCPNLS2367EFMSNQ/ide/core/jars/stringtemplate.jar
[INFO] Copying antlr-runtime-3.2.jar to /var/lib/jenkins/workspace/scendo-pipeline_development-6SEXP6NOH4DPMHNIAG2YUHD7VUTTPKSFIJJHDCPNLS2367EFMSNQ/ide/core/jars/antlr-runtime.jar
[INFO] Copying antlr-3.2.jar to /var/lib/jenkins/workspace/scendo-pipeline_development-6SEXP6NOH4DPMHNIAG2YUHD7VUTTPKSFIJJHDCPNLS2367EFMSNQ/ide/core/jars/antlr.jar
[INFO] 
[INFO] --- maven-resources-plugin:2.6:resources (default-resources) @ org.destecs.ide.core ---
[INFO] Using 'UTF-8' encoding to copy filtered resources.
[INFO] skip non existing resourceDirectory /var/lib/jenkins/workspace/scendo-pipeline_development-6SEXP6NOH4DPMHNIAG2YUHD7VUTTPKSFIJJHDCPNLS2367EFMSNQ/ide/core/src/main/resources
[INFO] 
[INFO] --- tycho-compiler-plugin:0.25.0:compile (default-compile) @ org.destecs.ide.core ---
[INFO] Nothing to compile - all classes are up to date
[INFO] 
[INFO] --- maven-resources-plugin:2.6:testResources (default-testResources) @ org.destecs.ide.core ---
[INFO] Not copying test resources
[INFO] 
[INFO] --- target-platform-configuration:0.25.0:target-platform (default-target-platform) @ org.destecs.ide.core ---
[INFO] 
[INFO] --- tycho-packaging-plugin:0.25.0:package-plugin (default-package-plugin) @ org.destecs.ide.core ---
[INFO] Building jar: /var/lib/jenkins/workspace/scendo-pipeline_development-6SEXP6NOH4DPMHNIAG2YUHD7VUTTPKSFIJJHDCPNLS2367EFMSNQ/ide/core/target/org.destecs.ide.core-2.2.5-SNAPSHOT.jar
[INFO] 
[INFO] --- tycho-p2-plugin:0.25.0:p2-metadata-default (default-p2-metadata-default) @ org.destecs.ide.core ---
[INFO] 
[INFO] --- maven-javadoc-plugin:2.9:jar (attach-javadocs) @ org.destecs.ide.core ---
[INFO] Skipping javadoc generation
[INFO] 
[INFO] --- maven-install-plugin:2.3.1:install (default-install) @ org.destecs.ide.core ---
[INFO] Installing /var/lib/jenkins/workspace/scendo-pipeline_development-6SEXP6NOH4DPMHNIAG2YUHD7VUTTPKSFIJJHDCPNLS2367EFMSNQ/ide/core/target/org.destecs.ide.core-2.2.5-SNAPSHOT.jar to /var/lib/jenkins/workspace/scendo-pipeline_development-6SEXP6NOH4DPMHNIAG2YUHD7VUTTPKSFIJJHDCPNLS2367EFMSNQ/.repository/org/destecs/ide/org.destecs.ide.core/2.2.5-SNAPSHOT/org.destecs.ide.core-2.2.5-SNAPSHOT.jar
[INFO] Installing /var/lib/jenkins/workspace/scendo-pipeline_development-6SEXP6NOH4DPMHNIAG2YUHD7VUTTPKSFIJJHDCPNLS2367EFMSNQ/ide/core/pom.xml to /var/lib/jenkins/workspace/scendo-pipeline_development-6SEXP6NOH4DPMHNIAG2YUHD7VUTTPKSFIJJHDCPNLS2367EFMSNQ/.repository/org/destecs/ide/org.destecs.ide.core/2.2.5-SNAPSHOT/org.destecs.ide.core-2.2.5-SNAPSHOT.pom
[INFO] Installing /var/lib/jenkins/workspace/scendo-pipeline_development-6SEXP6NOH4DPMHNIAG2YUHD7VUTTPKSFIJJHDCPNLS2367EFMSNQ/ide/core/target/p2content.xml to /var/lib/jenkins/workspace/scendo-pipeline_development-6SEXP6NOH4DPMHNIAG2YUHD7VUTTPKSFIJJHDCPNLS2367EFMSNQ/.repository/org/destecs/ide/org.destecs.ide.core/2.2.5-SNAPSHOT/org.destecs.ide.core-2.2.5-SNAPSHOT-p2metadata.xml
[INFO] Installing /var/lib/jenkins/workspace/scendo-pipeline_development-6SEXP6NOH4DPMHNIAG2YUHD7VUTTPKSFIJJHDCPNLS2367EFMSNQ/ide/core/target/p2artifacts.xml to /var/lib/jenkins/workspace/scendo-pipeline_development-6SEXP6NOH4DPMHNIAG2YUHD7VUTTPKSFIJJHDCPNLS2367EFMSNQ/.repository/org/destecs/ide/org.destecs.ide.core/2.2.5-SNAPSHOT/org.destecs.ide.core-2.2.5-SNAPSHOT-p2artifacts.xml
[INFO] 
[INFO] --- tycho-p2-plugin:0.25.0:update-local-index (default-update-local-index) @ org.destecs.ide.core ---
[INFO]                                                                         
[INFO] ------------------------------------------------------------------------
[INFO] Building DESTECS Simulation Engine 2.2.5-SNAPSHOT
[INFO] ------------------------------------------------------------------------
[INFO] 
[INFO] --- tycho-packaging-plugin:0.25.0:build-qualifier (default-build-qualifier) @ org.destecs.ide.simeng ---
[INFO] The project's OSGi version is 2.2.5.201811220809
[INFO] 
[INFO] --- tycho-packaging-plugin:0.25.0:validate-id (default-validate-id) @ org.destecs.ide.simeng ---
[INFO] 
[INFO] --- tycho-packaging-plugin:0.25.0:validate-version (default-validate-version) @ org.destecs.ide.simeng ---
[INFO] 
[INFO] --- maven-dependency-plugin:2.6:copy (copy-dependencies) @ org.destecs.ide.simeng ---
[INFO] Configured Artifact: org.destecs.core:simulationengine:2.2.5-SNAPSHOT:jar
[INFO] Configured Artifact: org.destecs.core:protocol:2.2.5-SNAPSHOT:jar
[INFO] Configured Artifact: xml-apis:xml-apis:1.0.b2:jar
[INFO] Configured Artifact: org.apache.xmlrpc:xmlrpc-common:3.1.3:jar
[INFO] Configured Artifact: org.destecs.core.xmlrpcextensions:xmlrpcbaseextension:2.2.5-SNAPSHOT:jar
[INFO] Configured Artifact: org.apache.xmlrpc:xmlrpc-client:3.1.3:jar
[INFO] Configured Artifact: log4j:log4j:1.2.12:jar
[INFO] Configured Artifact: org.apache.commons:commons-io:1.3.2:jar
[INFO] Configured Artifact: org.destecs.core.xmlrpcextensions:xmlrpcclientextension:2.2.5-SNAPSHOT:jar
[INFO] Configured Artifact: org.apache.ws.commons.util:ws-commons-util:1.0.2:jar
[INFO] Configured Artifact: org.destecs.core:vdm:2.2.5-SNAPSHOT:jar
[INFO] Configured Artifact: org.destecs.core.xmlrpcextensions:xmlrpcserverextension:2.2.5-SNAPSHOT:jar
[INFO] Configured Artifact: commons-logging:commons-logging:1.1:jar
[INFO] Configured Artifact: org.apache.xmlrpc:xmlrpc-server:3.1.3:jar
[INFO] Configured Artifact: javax.servlet:servlet-api:2.3:jar
[INFO] Configured Artifact: xerces:xercesImpl:2.9.1:jar
[INFO] Copying simulationengine-2.2.5-SNAPSHOT.jar to /var/lib/jenkins/workspace/scendo-pipeline_development-6SEXP6NOH4DPMHNIAG2YUHD7VUTTPKSFIJJHDCPNLS2367EFMSNQ/ide/simeng/jars/simulationengine.jar
[INFO] Copying protocol-2.2.5-SNAPSHOT.jar to /var/lib/jenkins/workspace/scendo-pipeline_development-6SEXP6NOH4DPMHNIAG2YUHD7VUTTPKSFIJJHDCPNLS2367EFMSNQ/ide/simeng/jars/protocol.jar
[INFO] Copying xml-apis-1.0.b2.jar to /var/lib/jenkins/workspace/scendo-pipeline_development-6SEXP6NOH4DPMHNIAG2YUHD7VUTTPKSFIJJHDCPNLS2367EFMSNQ/ide/simeng/jars/xml-apis.jar
[INFO] Copying xmlrpc-common-3.1.3.jar to /var/lib/jenkins/workspace/scendo-pipeline_development-6SEXP6NOH4DPMHNIAG2YUHD7VUTTPKSFIJJHDCPNLS2367EFMSNQ/ide/simeng/jars/xmlrpc-common.jar
[INFO] Copying xmlrpcbaseextension-2.2.5-SNAPSHOT.jar to /var/lib/jenkins/workspace/scendo-pipeline_development-6SEXP6NOH4DPMHNIAG2YUHD7VUTTPKSFIJJHDCPNLS2367EFMSNQ/ide/simeng/jars/xmlrpcbaseextension.jar
[INFO] Copying xmlrpc-client-3.1.3.jar to /var/lib/jenkins/workspace/scendo-pipeline_development-6SEXP6NOH4DPMHNIAG2YUHD7VUTTPKSFIJJHDCPNLS2367EFMSNQ/ide/simeng/jars/xmlrpc-client.jar
[INFO] Copying log4j-1.2.12.jar to /var/lib/jenkins/workspace/scendo-pipeline_development-6SEXP6NOH4DPMHNIAG2YUHD7VUTTPKSFIJJHDCPNLS2367EFMSNQ/ide/simeng/jars/log4j.jar
[INFO] Copying commons-io-1.3.2.jar to /var/lib/jenkins/workspace/scendo-pipeline_development-6SEXP6NOH4DPMHNIAG2YUHD7VUTTPKSFIJJHDCPNLS2367EFMSNQ/ide/simeng/jars/commons-io.jar
[INFO] Copying xmlrpcclientextension-2.2.5-SNAPSHOT.jar to /var/lib/jenkins/workspace/scendo-pipeline_development-6SEXP6NOH4DPMHNIAG2YUHD7VUTTPKSFIJJHDCPNLS2367EFMSNQ/ide/simeng/jars/xmlrpcclientextension.jar
[INFO] Copying ws-commons-util-1.0.2.jar to /var/lib/jenkins/workspace/scendo-pipeline_development-6SEXP6NOH4DPMHNIAG2YUHD7VUTTPKSFIJJHDCPNLS2367EFMSNQ/ide/simeng/jars/ws-commons-util.jar
[INFO] Copying vdm-2.2.5-SNAPSHOT.jar to /var/lib/jenkins/workspace/scendo-pipeline_development-6SEXP6NOH4DPMHNIAG2YUHD7VUTTPKSFIJJHDCPNLS2367EFMSNQ/ide/simeng/jars/vdm.jar
[INFO] Copying xmlrpcserverextension-2.2.5-SNAPSHOT.jar to /var/lib/jenkins/workspace/scendo-pipeline_development-6SEXP6NOH4DPMHNIAG2YUHD7VUTTPKSFIJJHDCPNLS2367EFMSNQ/ide/simeng/jars/xmlrpcserverextension.jar
[INFO] Copying commons-logging-1.1.jar to /var/lib/jenkins/workspace/scendo-pipeline_development-6SEXP6NOH4DPMHNIAG2YUHD7VUTTPKSFIJJHDCPNLS2367EFMSNQ/ide/simeng/jars/commons-logging.jar
[INFO] Copying xmlrpc-server-3.1.3.jar to /var/lib/jenkins/workspace/scendo-pipeline_development-6SEXP6NOH4DPMHNIAG2YUHD7VUTTPKSFIJJHDCPNLS2367EFMSNQ/ide/simeng/jars/xmlrpc-server.jar
[INFO] Copying servlet-api-2.3.jar to /var/lib/jenkins/workspace/scendo-pipeline_development-6SEXP6NOH4DPMHNIAG2YUHD7VUTTPKSFIJJHDCPNLS2367EFMSNQ/ide/simeng/jars/servlet-api.jar
[INFO] Copying xercesImpl-2.9.1.jar to /var/lib/jenkins/workspace/scendo-pipeline_development-6SEXP6NOH4DPMHNIAG2YUHD7VUTTPKSFIJJHDCPNLS2367EFMSNQ/ide/simeng/jars/xercesImpl.jar
[INFO] 
[INFO] --- maven-antrun-plugin:1.8:run (default) @ org.destecs.ide.simeng ---
[INFO] Executing tasks

main:
[INFO] Executed tasks
[INFO] 
[INFO] --- maven-resources-plugin:2.6:resources (default-resources) @ org.destecs.ide.simeng ---
[INFO] Using 'UTF-8' encoding to copy filtered resources.
[INFO] skip non existing resourceDirectory /var/lib/jenkins/workspace/scendo-pipeline_development-6SEXP6NOH4DPMHNIAG2YUHD7VUTTPKSFIJJHDCPNLS2367EFMSNQ/ide/simeng/src/main/resources
[INFO] 
[INFO] --- tycho-compiler-plugin:0.25.0:compile (default-compile) @ org.destecs.ide.simeng ---
[INFO] Nothing to compile - all classes are up to date
[INFO] 
[INFO] --- maven-resources-plugin:2.6:testResources (default-testResources) @ org.destecs.ide.simeng ---
[INFO] Not copying test resources
[INFO] 
[INFO] --- target-platform-configuration:0.25.0:target-platform (default-target-platform) @ org.destecs.ide.simeng ---
[INFO] 
[INFO] --- tycho-packaging-plugin:0.25.0:package-plugin (default-package-plugin) @ org.destecs.ide.simeng ---
[INFO] Building jar: /var/lib/jenkins/workspace/scendo-pipeline_development-6SEXP6NOH4DPMHNIAG2YUHD7VUTTPKSFIJJHDCPNLS2367EFMSNQ/ide/simeng/target/org.destecs.ide.simeng-2.2.5-SNAPSHOT.jar
[INFO] 
[INFO] --- tycho-p2-plugin:0.25.0:p2-metadata-default (default-p2-metadata-default) @ org.destecs.ide.simeng ---
[INFO] 
[INFO] --- maven-javadoc-plugin:2.9:jar (attach-javadocs) @ org.destecs.ide.simeng ---
[INFO] Skipping javadoc generation
[INFO] 
[INFO] --- maven-install-plugin:2.3.1:install (default-install) @ org.destecs.ide.simeng ---
[INFO] Installing /var/lib/jenkins/workspace/scendo-pipeline_development-6SEXP6NOH4DPMHNIAG2YUHD7VUTTPKSFIJJHDCPNLS2367EFMSNQ/ide/simeng/target/org.destecs.ide.simeng-2.2.5-SNAPSHOT.jar to /var/lib/jenkins/workspace/scendo-pipeline_development-6SEXP6NOH4DPMHNIAG2YUHD7VUTTPKSFIJJHDCPNLS2367EFMSNQ/.repository/org/destecs/ide/org.destecs.ide.simeng/2.2.5-SNAPSHOT/org.destecs.ide.simeng-2.2.5-SNAPSHOT.jar
[INFO] Installing /var/lib/jenkins/workspace/scendo-pipeline_development-6SEXP6NOH4DPMHNIAG2YUHD7VUTTPKSFIJJHDCPNLS2367EFMSNQ/ide/simeng/pom.xml to /var/lib/jenkins/workspace/scendo-pipeline_development-6SEXP6NOH4DPMHNIAG2YUHD7VUTTPKSFIJJHDCPNLS2367EFMSNQ/.repository/org/destecs/ide/org.destecs.ide.simeng/2.2.5-SNAPSHOT/org.destecs.ide.simeng-2.2.5-SNAPSHOT.pom
[INFO] Installing /var/lib/jenkins/workspace/scendo-pipeline_development-6SEXP6NOH4DPMHNIAG2YUHD7VUTTPKSFIJJHDCPNLS2367EFMSNQ/ide/simeng/target/p2content.xml to /var/lib/jenkins/workspace/scendo-pipeline_development-6SEXP6NOH4DPMHNIAG2YUHD7VUTTPKSFIJJHDCPNLS2367EFMSNQ/.repository/org/destecs/ide/org.destecs.ide.simeng/2.2.5-SNAPSHOT/org.destecs.ide.simeng-2.2.5-SNAPSHOT-p2metadata.xml
[INFO] Installing /var/lib/jenkins/workspace/scendo-pipeline_development-6SEXP6NOH4DPMHNIAG2YUHD7VUTTPKSFIJJHDCPNLS2367EFMSNQ/ide/simeng/target/p2artifacts.xml to /var/lib/jenkins/workspace/scendo-pipeline_development-6SEXP6NOH4DPMHNIAG2YUHD7VUTTPKSFIJJHDCPNLS2367EFMSNQ/.repository/org/destecs/ide/org.destecs.ide.simeng/2.2.5-SNAPSHOT/org.destecs.ide.simeng-2.2.5-SNAPSHOT-p2artifacts.xml
[INFO] 
[INFO] --- tycho-p2-plugin:0.25.0:update-local-index (default-update-local-index) @ org.destecs.ide.simeng ---
[INFO]                                                                         
[INFO] ------------------------------------------------------------------------
[INFO] Building org.destecs.ide.ui 2.2.5-SNAPSHOT
[INFO] ------------------------------------------------------------------------
[INFO] 
[INFO] --- tycho-packaging-plugin:0.25.0:build-qualifier (default-build-qualifier) @ org.destecs.ide.ui ---
[INFO] The project's OSGi version is 2.2.5.201811220809
[INFO] 
[INFO] --- tycho-packaging-plugin:0.25.0:validate-id (default-validate-id) @ org.destecs.ide.ui ---
[INFO] 
[INFO] --- tycho-packaging-plugin:0.25.0:validate-version (default-validate-version) @ org.destecs.ide.ui ---
[INFO] 
[INFO] --- maven-resources-plugin:2.6:resources (default-resources) @ org.destecs.ide.ui ---
[INFO] Using 'UTF-8' encoding to copy filtered resources.
[INFO] skip non existing resourceDirectory /var/lib/jenkins/workspace/scendo-pipeline_development-6SEXP6NOH4DPMHNIAG2YUHD7VUTTPKSFIJJHDCPNLS2367EFMSNQ/ide/ui/src/main/resources
[INFO] 
[INFO] --- tycho-compiler-plugin:0.25.0:compile (default-compile) @ org.destecs.ide.ui ---
[INFO] Nothing to compile - all classes are up to date
[INFO] 
[INFO] --- maven-resources-plugin:2.6:testResources (default-testResources) @ org.destecs.ide.ui ---
[INFO] Not copying test resources
[INFO] 
[INFO] --- target-platform-configuration:0.25.0:target-platform (default-target-platform) @ org.destecs.ide.ui ---
[INFO] 
[INFO] --- tycho-packaging-plugin:0.25.0:package-plugin (default-package-plugin) @ org.destecs.ide.ui ---
[INFO] Building jar: /var/lib/jenkins/workspace/scendo-pipeline_development-6SEXP6NOH4DPMHNIAG2YUHD7VUTTPKSFIJJHDCPNLS2367EFMSNQ/ide/ui/target/org.destecs.ide.ui-2.2.5-SNAPSHOT.jar
[INFO] 
[INFO] --- tycho-p2-plugin:0.25.0:p2-metadata-default (default-p2-metadata-default) @ org.destecs.ide.ui ---
[INFO] 
[INFO] --- maven-javadoc-plugin:2.9:jar (attach-javadocs) @ org.destecs.ide.ui ---
[INFO] Skipping javadoc generation
[INFO] 
[INFO] --- maven-install-plugin:2.3.1:install (default-install) @ org.destecs.ide.ui ---
[INFO] Installing /var/lib/jenkins/workspace/scendo-pipeline_development-6SEXP6NOH4DPMHNIAG2YUHD7VUTTPKSFIJJHDCPNLS2367EFMSNQ/ide/ui/target/org.destecs.ide.ui-2.2.5-SNAPSHOT.jar to /var/lib/jenkins/workspace/scendo-pipeline_development-6SEXP6NOH4DPMHNIAG2YUHD7VUTTPKSFIJJHDCPNLS2367EFMSNQ/.repository/org/destecs/ide/org.destecs.ide.ui/2.2.5-SNAPSHOT/org.destecs.ide.ui-2.2.5-SNAPSHOT.jar
[INFO] Installing /var/lib/jenkins/workspace/scendo-pipeline_development-6SEXP6NOH4DPMHNIAG2YUHD7VUTTPKSFIJJHDCPNLS2367EFMSNQ/ide/ui/pom.xml to /var/lib/jenkins/workspace/scendo-pipeline_development-6SEXP6NOH4DPMHNIAG2YUHD7VUTTPKSFIJJHDCPNLS2367EFMSNQ/.repository/org/destecs/ide/org.destecs.ide.ui/2.2.5-SNAPSHOT/org.destecs.ide.ui-2.2.5-SNAPSHOT.pom
[INFO] Installing /var/lib/jenkins/workspace/scendo-pipeline_development-6SEXP6NOH4DPMHNIAG2YUHD7VUTTPKSFIJJHDCPNLS2367EFMSNQ/ide/ui/target/p2content.xml to /var/lib/jenkins/workspace/scendo-pipeline_development-6SEXP6NOH4DPMHNIAG2YUHD7VUTTPKSFIJJHDCPNLS2367EFMSNQ/.repository/org/destecs/ide/org.destecs.ide.ui/2.2.5-SNAPSHOT/org.destecs.ide.ui-2.2.5-SNAPSHOT-p2metadata.xml
[INFO] Installing /var/lib/jenkins/workspace/scendo-pipeline_development-6SEXP6NOH4DPMHNIAG2YUHD7VUTTPKSFIJJHDCPNLS2367EFMSNQ/ide/ui/target/p2artifacts.xml to /var/lib/jenkins/workspace/scendo-pipeline_development-6SEXP6NOH4DPMHNIAG2YUHD7VUTTPKSFIJJHDCPNLS2367EFMSNQ/.repository/org/destecs/ide/org.destecs.ide.ui/2.2.5-SNAPSHOT/org.destecs.ide.ui-2.2.5-SNAPSHOT-p2artifacts.xml
[INFO] 
[INFO] --- tycho-p2-plugin:0.25.0:update-local-index (default-update-local-index) @ org.destecs.ide.ui ---
[INFO]                                                                         
[INFO] ------------------------------------------------------------------------
[INFO] Building org.destecs.ide.debug 2.2.5-SNAPSHOT
[INFO] ------------------------------------------------------------------------
[INFO] 
[INFO] --- tycho-packaging-plugin:0.25.0:build-qualifier (default-build-qualifier) @ org.destecs.ide.debug ---
[INFO] The project's OSGi version is 2.2.5.201811220809
[INFO] 
[INFO] --- tycho-packaging-plugin:0.25.0:validate-id (default-validate-id) @ org.destecs.ide.debug ---
[INFO] 
[INFO] --- tycho-packaging-plugin:0.25.0:validate-version (default-validate-version) @ org.destecs.ide.debug ---
[INFO] 
[INFO] --- maven-resources-plugin:2.6:resources (default-resources) @ org.destecs.ide.debug ---
[INFO] Using 'UTF-8' encoding to copy filtered resources.
[INFO] skip non existing resourceDirectory /var/lib/jenkins/workspace/scendo-pipeline_development-6SEXP6NOH4DPMHNIAG2YUHD7VUTTPKSFIJJHDCPNLS2367EFMSNQ/ide/debug/src/main/resources
[INFO] 
[INFO] --- tycho-compiler-plugin:0.25.0:compile (default-compile) @ org.destecs.ide.debug ---
[INFO] Nothing to compile - all classes are up to date
[INFO] 
[INFO] --- maven-resources-plugin:2.6:testResources (default-testResources) @ org.destecs.ide.debug ---
[INFO] Not copying test resources
[INFO] 
[INFO] --- target-platform-configuration:0.25.0:target-platform (default-target-platform) @ org.destecs.ide.debug ---
[INFO] 
[INFO] --- tycho-packaging-plugin:0.25.0:package-plugin (default-package-plugin) @ org.destecs.ide.debug ---
[INFO] Building jar: /var/lib/jenkins/workspace/scendo-pipeline_development-6SEXP6NOH4DPMHNIAG2YUHD7VUTTPKSFIJJHDCPNLS2367EFMSNQ/ide/debug/target/org.destecs.ide.debug-2.2.5-SNAPSHOT.jar
[INFO] 
[INFO] --- tycho-p2-plugin:0.25.0:p2-metadata-default (default-p2-metadata-default) @ org.destecs.ide.debug ---
[INFO] 
[INFO] --- maven-javadoc-plugin:2.9:jar (attach-javadocs) @ org.destecs.ide.debug ---
[INFO] Skipping javadoc generation
[INFO] 
[INFO] --- maven-install-plugin:2.3.1:install (default-install) @ org.destecs.ide.debug ---
[INFO] Installing /var/lib/jenkins/workspace/scendo-pipeline_development-6SEXP6NOH4DPMHNIAG2YUHD7VUTTPKSFIJJHDCPNLS2367EFMSNQ/ide/debug/target/org.destecs.ide.debug-2.2.5-SNAPSHOT.jar to /var/lib/jenkins/workspace/scendo-pipeline_development-6SEXP6NOH4DPMHNIAG2YUHD7VUTTPKSFIJJHDCPNLS2367EFMSNQ/.repository/org/destecs/ide/org.destecs.ide.debug/2.2.5-SNAPSHOT/org.destecs.ide.debug-2.2.5-SNAPSHOT.jar
[INFO] Installing /var/lib/jenkins/workspace/scendo-pipeline_development-6SEXP6NOH4DPMHNIAG2YUHD7VUTTPKSFIJJHDCPNLS2367EFMSNQ/ide/debug/pom.xml to /var/lib/jenkins/workspace/scendo-pipeline_development-6SEXP6NOH4DPMHNIAG2YUHD7VUTTPKSFIJJHDCPNLS2367EFMSNQ/.repository/org/destecs/ide/org.destecs.ide.debug/2.2.5-SNAPSHOT/org.destecs.ide.debug-2.2.5-SNAPSHOT.pom
[INFO] Installing /var/lib/jenkins/workspace/scendo-pipeline_development-6SEXP6NOH4DPMHNIAG2YUHD7VUTTPKSFIJJHDCPNLS2367EFMSNQ/ide/debug/target/p2content.xml to /var/lib/jenkins/workspace/scendo-pipeline_development-6SEXP6NOH4DPMHNIAG2YUHD7VUTTPKSFIJJHDCPNLS2367EFMSNQ/.repository/org/destecs/ide/org.destecs.ide.debug/2.2.5-SNAPSHOT/org.destecs.ide.debug-2.2.5-SNAPSHOT-p2metadata.xml
[INFO] Installing /var/lib/jenkins/workspace/scendo-pipeline_development-6SEXP6NOH4DPMHNIAG2YUHD7VUTTPKSFIJJHDCPNLS2367EFMSNQ/ide/debug/target/p2artifacts.xml to /var/lib/jenkins/workspace/scendo-pipeline_development-6SEXP6NOH4DPMHNIAG2YUHD7VUTTPKSFIJJHDCPNLS2367EFMSNQ/.repository/org/destecs/ide/org.destecs.ide.debug/2.2.5-SNAPSHOT/org.destecs.ide.debug-2.2.5-SNAPSHOT-p2artifacts.xml
[INFO] 
[INFO] --- tycho-p2-plugin:0.25.0:update-local-index (default-update-local-index) @ org.destecs.ide.debug ---
[INFO]                                                                         
[INFO] ------------------------------------------------------------------------
[INFO] Building org.destecs.ide.vdmmetadatabuilder 2.2.5-SNAPSHOT
[INFO] ------------------------------------------------------------------------
[INFO] 
[INFO] --- tycho-packaging-plugin:0.25.0:build-qualifier (default-build-qualifier) @ org.destecs.ide.vdmmetadatabuilder ---
[INFO] The project's OSGi version is 2.2.5.201811220809
[INFO] 
[INFO] --- tycho-packaging-plugin:0.25.0:validate-id (default-validate-id) @ org.destecs.ide.vdmmetadatabuilder ---
[INFO] 
[INFO] --- tycho-packaging-plugin:0.25.0:validate-version (default-validate-version) @ org.destecs.ide.vdmmetadatabuilder ---
[INFO] 
[INFO] --- maven-resources-plugin:2.6:resources (default-resources) @ org.destecs.ide.vdmmetadatabuilder ---
[INFO] Using 'UTF-8' encoding to copy filtered resources.
[INFO] skip non existing resourceDirectory /var/lib/jenkins/workspace/scendo-pipeline_development-6SEXP6NOH4DPMHNIAG2YUHD7VUTTPKSFIJJHDCPNLS2367EFMSNQ/ide/vdmmetadatabuilder/src/main/resources
[INFO] 
[INFO] --- tycho-compiler-plugin:0.25.0:compile (default-compile) @ org.destecs.ide.vdmmetadatabuilder ---
[INFO] Nothing to compile - all classes are up to date
[INFO] 
[INFO] --- maven-resources-plugin:2.6:testResources (default-testResources) @ org.destecs.ide.vdmmetadatabuilder ---
[INFO] Not copying test resources
[INFO] 
[INFO] --- target-platform-configuration:0.25.0:target-platform (default-target-platform) @ org.destecs.ide.vdmmetadatabuilder ---
[INFO] 
[INFO] --- tycho-packaging-plugin:0.25.0:package-plugin (default-package-plugin) @ org.destecs.ide.vdmmetadatabuilder ---
[INFO] Building jar: /var/lib/jenkins/workspace/scendo-pipeline_development-6SEXP6NOH4DPMHNIAG2YUHD7VUTTPKSFIJJHDCPNLS2367EFMSNQ/ide/vdmmetadatabuilder/target/org.destecs.ide.vdmmetadatabuilder-2.2.5-SNAPSHOT.jar
[INFO] 
[INFO] --- tycho-p2-plugin:0.25.0:p2-metadata-default (default-p2-metadata-default) @ org.destecs.ide.vdmmetadatabuilder ---
[INFO] 
[INFO] --- maven-javadoc-plugin:2.9:jar (attach-javadocs) @ org.destecs.ide.vdmmetadatabuilder ---
[INFO] Skipping javadoc generation
[INFO] 
[INFO] --- maven-install-plugin:2.3.1:install (default-install) @ org.destecs.ide.vdmmetadatabuilder ---
[INFO] Installing /var/lib/jenkins/workspace/scendo-pipeline_development-6SEXP6NOH4DPMHNIAG2YUHD7VUTTPKSFIJJHDCPNLS2367EFMSNQ/ide/vdmmetadatabuilder/target/org.destecs.ide.vdmmetadatabuilder-2.2.5-SNAPSHOT.jar to /var/lib/jenkins/workspace/scendo-pipeline_development-6SEXP6NOH4DPMHNIAG2YUHD7VUTTPKSFIJJHDCPNLS2367EFMSNQ/.repository/org/destecs/ide/org.destecs.ide.vdmmetadatabuilder/2.2.5-SNAPSHOT/org.destecs.ide.vdmmetadatabuilder-2.2.5-SNAPSHOT.jar
[INFO] Installing /var/lib/jenkins/workspace/scendo-pipeline_development-6SEXP6NOH4DPMHNIAG2YUHD7VUTTPKSFIJJHDCPNLS2367EFMSNQ/ide/vdmmetadatabuilder/pom.xml to /var/lib/jenkins/workspace/scendo-pipeline_development-6SEXP6NOH4DPMHNIAG2YUHD7VUTTPKSFIJJHDCPNLS2367EFMSNQ/.repository/org/destecs/ide/org.destecs.ide.vdmmetadatabuilder/2.2.5-SNAPSHOT/org.destecs.ide.vdmmetadatabuilder-2.2.5-SNAPSHOT.pom
[INFO] Installing /var/lib/jenkins/workspace/scendo-pipeline_development-6SEXP6NOH4DPMHNIAG2YUHD7VUTTPKSFIJJHDCPNLS2367EFMSNQ/ide/vdmmetadatabuilder/target/p2content.xml to /var/lib/jenkins/workspace/scendo-pipeline_development-6SEXP6NOH4DPMHNIAG2YUHD7VUTTPKSFIJJHDCPNLS2367EFMSNQ/.repository/org/destecs/ide/org.destecs.ide.vdmmetadatabuilder/2.2.5-SNAPSHOT/org.destecs.ide.vdmmetadatabuilder-2.2.5-SNAPSHOT-p2metadata.xml
[INFO] Installing /var/lib/jenkins/workspace/scendo-pipeline_development-6SEXP6NOH4DPMHNIAG2YUHD7VUTTPKSFIJJHDCPNLS2367EFMSNQ/ide/vdmmetadatabuilder/target/p2artifacts.xml to /var/lib/jenkins/workspace/scendo-pipeline_development-6SEXP6NOH4DPMHNIAG2YUHD7VUTTPKSFIJJHDCPNLS2367EFMSNQ/.repository/org/destecs/ide/org.destecs.ide.vdmmetadatabuilder/2.2.5-SNAPSHOT/org.destecs.ide.vdmmetadatabuilder-2.2.5-SNAPSHOT-p2artifacts.xml
[INFO] 
[INFO] --- tycho-p2-plugin:0.25.0:update-local-index (default-update-local-index) @ org.destecs.ide.vdmmetadatabuilder ---
[INFO]                                                                         
[INFO] ------------------------------------------------------------------------
[INFO] Building org.destecs.ide.libraries 2.2.5-SNAPSHOT
[INFO] ------------------------------------------------------------------------
[INFO] 
[INFO] --- tycho-packaging-plugin:0.25.0:build-qualifier (default-build-qualifier) @ org.destecs.ide.libraries ---
[INFO] The project's OSGi version is 2.2.5.201811220809
[INFO] 
[INFO] --- tycho-packaging-plugin:0.25.0:validate-id (default-validate-id) @ org.destecs.ide.libraries ---
[INFO] 
[INFO] --- tycho-packaging-plugin:0.25.0:validate-version (default-validate-version) @ org.destecs.ide.libraries ---
[INFO] 
[INFO] --- maven-resources-plugin:2.6:resources (default-resources) @ org.destecs.ide.libraries ---
[INFO] Using 'UTF-8' encoding to copy filtered resources.
[INFO] skip non existing resourceDirectory /var/lib/jenkins/workspace/scendo-pipeline_development-6SEXP6NOH4DPMHNIAG2YUHD7VUTTPKSFIJJHDCPNLS2367EFMSNQ/ide/libraries/src/main/resources
[INFO] 
[INFO] --- tycho-compiler-plugin:0.25.0:compile (default-compile) @ org.destecs.ide.libraries ---
[INFO] Nothing to compile - all classes are up to date
[INFO] 
[INFO] --- maven-resources-plugin:2.6:testResources (default-testResources) @ org.destecs.ide.libraries ---
[INFO] Not copying test resources
[INFO] 
[INFO] --- target-platform-configuration:0.25.0:target-platform (default-target-platform) @ org.destecs.ide.libraries ---
[INFO] 
[INFO] --- tycho-packaging-plugin:0.25.0:package-plugin (default-package-plugin) @ org.destecs.ide.libraries ---
[INFO] Building jar: /var/lib/jenkins/workspace/scendo-pipeline_development-6SEXP6NOH4DPMHNIAG2YUHD7VUTTPKSFIJJHDCPNLS2367EFMSNQ/ide/libraries/target/org.destecs.ide.libraries-2.2.5-SNAPSHOT.jar
[INFO] 
[INFO] --- tycho-p2-plugin:0.25.0:p2-metadata-default (default-p2-metadata-default) @ org.destecs.ide.libraries ---
[INFO] 
[INFO] --- maven-javadoc-plugin:2.9:jar (attach-javadocs) @ org.destecs.ide.libraries ---
[INFO] Skipping javadoc generation
[INFO] 
[INFO] --- maven-install-plugin:2.3.1:install (default-install) @ org.destecs.ide.libraries ---
[INFO] Installing /var/lib/jenkins/workspace/scendo-pipeline_development-6SEXP6NOH4DPMHNIAG2YUHD7VUTTPKSFIJJHDCPNLS2367EFMSNQ/ide/libraries/target/org.destecs.ide.libraries-2.2.5-SNAPSHOT.jar to /var/lib/jenkins/workspace/scendo-pipeline_development-6SEXP6NOH4DPMHNIAG2YUHD7VUTTPKSFIJJHDCPNLS2367EFMSNQ/.repository/org/destecs/ide/org.destecs.ide.libraries/2.2.5-SNAPSHOT/org.destecs.ide.libraries-2.2.5-SNAPSHOT.jar
[INFO] Installing /var/lib/jenkins/workspace/scendo-pipeline_development-6SEXP6NOH4DPMHNIAG2YUHD7VUTTPKSFIJJHDCPNLS2367EFMSNQ/ide/libraries/pom.xml to /var/lib/jenkins/workspace/scendo-pipeline_development-6SEXP6NOH4DPMHNIAG2YUHD7VUTTPKSFIJJHDCPNLS2367EFMSNQ/.repository/org/destecs/ide/org.destecs.ide.libraries/2.2.5-SNAPSHOT/org.destecs.ide.libraries-2.2.5-SNAPSHOT.pom
[INFO] Installing /var/lib/jenkins/workspace/scendo-pipeline_development-6SEXP6NOH4DPMHNIAG2YUHD7VUTTPKSFIJJHDCPNLS2367EFMSNQ/ide/libraries/target/p2content.xml to /var/lib/jenkins/workspace/scendo-pipeline_development-6SEXP6NOH4DPMHNIAG2YUHD7VUTTPKSFIJJHDCPNLS2367EFMSNQ/.repository/org/destecs/ide/org.destecs.ide.libraries/2.2.5-SNAPSHOT/org.destecs.ide.libraries-2.2.5-SNAPSHOT-p2metadata.xml
[INFO] Installing /var/lib/jenkins/workspace/scendo-pipeline_development-6SEXP6NOH4DPMHNIAG2YUHD7VUTTPKSFIJJHDCPNLS2367EFMSNQ/ide/libraries/target/p2artifacts.xml to /var/lib/jenkins/workspace/scendo-pipeline_development-6SEXP6NOH4DPMHNIAG2YUHD7VUTTPKSFIJJHDCPNLS2367EFMSNQ/.repository/org/destecs/ide/org.destecs.ide.libraries/2.2.5-SNAPSHOT/org.destecs.ide.libraries-2.2.5-SNAPSHOT-p2artifacts.xml
[INFO] 
[INFO] --- tycho-p2-plugin:0.25.0:update-local-index (default-update-local-index) @ org.destecs.ide.libraries ---
[INFO]                                                                         
[INFO] ------------------------------------------------------------------------
[INFO] Building org.destecs.ide.platform 2.2.5-SNAPSHOT
[INFO] ------------------------------------------------------------------------
[INFO] 
[INFO] --- tycho-packaging-plugin:0.25.0:build-qualifier (default-build-qualifier) @ org.destecs.ide.platform ---
[INFO] The project's OSGi version is 2.2.5.201811220809
[INFO] 
[INFO] --- tycho-packaging-plugin:0.25.0:validate-id (default-validate-id) @ org.destecs.ide.platform ---
[INFO] 
[INFO] --- tycho-packaging-plugin:0.25.0:validate-version (default-validate-version) @ org.destecs.ide.platform ---
[INFO] 
[INFO] --- git-commit-id-plugin:2.1.4:revision (default) @ org.destecs.ide.platform ---
[INFO] 
[INFO] --- maven-resources-plugin:2.6:resources (default-resources) @ org.destecs.ide.platform ---
[INFO] Using 'UTF-8' encoding to copy filtered resources.
[INFO] Copying 1 resource to /var/lib/jenkins/workspace/scendo-pipeline_development-6SEXP6NOH4DPMHNIAG2YUHD7VUTTPKSFIJJHDCPNLS2367EFMSNQ/ide/platform
[INFO] 
[INFO] --- tycho-compiler-plugin:0.25.0:compile (default-compile) @ org.destecs.ide.platform ---
[INFO] Nothing to compile - all classes are up to date
[INFO] 
[INFO] --- maven-resources-plugin:2.6:testResources (default-testResources) @ org.destecs.ide.platform ---
[INFO] Not copying test resources
[INFO] 
[INFO] --- target-platform-configuration:0.25.0:target-platform (default-target-platform) @ org.destecs.ide.platform ---
[INFO] 
[INFO] --- tycho-packaging-plugin:0.25.0:package-plugin (default-package-plugin) @ org.destecs.ide.platform ---
[INFO] Building jar: /var/lib/jenkins/workspace/scendo-pipeline_development-6SEXP6NOH4DPMHNIAG2YUHD7VUTTPKSFIJJHDCPNLS2367EFMSNQ/ide/platform/target/org.destecs.ide.platform-2.2.5-SNAPSHOT.jar
[INFO] 
[INFO] --- tycho-p2-plugin:0.25.0:p2-metadata-default (default-p2-metadata-default) @ org.destecs.ide.platform ---
[INFO] 
[INFO] --- maven-javadoc-plugin:2.9:jar (attach-javadocs) @ org.destecs.ide.platform ---
[INFO] Skipping javadoc generation
[INFO] 
[INFO] --- maven-install-plugin:2.3.1:install (default-install) @ org.destecs.ide.platform ---
[INFO] Installing /var/lib/jenkins/workspace/scendo-pipeline_development-6SEXP6NOH4DPMHNIAG2YUHD7VUTTPKSFIJJHDCPNLS2367EFMSNQ/ide/platform/target/org.destecs.ide.platform-2.2.5-SNAPSHOT.jar to /var/lib/jenkins/workspace/scendo-pipeline_development-6SEXP6NOH4DPMHNIAG2YUHD7VUTTPKSFIJJHDCPNLS2367EFMSNQ/.repository/org/destecs/ide/org.destecs.ide.platform/2.2.5-SNAPSHOT/org.destecs.ide.platform-2.2.5-SNAPSHOT.jar
[INFO] Installing /var/lib/jenkins/workspace/scendo-pipeline_development-6SEXP6NOH4DPMHNIAG2YUHD7VUTTPKSFIJJHDCPNLS2367EFMSNQ/ide/platform/pom.xml to /var/lib/jenkins/workspace/scendo-pipeline_development-6SEXP6NOH4DPMHNIAG2YUHD7VUTTPKSFIJJHDCPNLS2367EFMSNQ/.repository/org/destecs/ide/org.destecs.ide.platform/2.2.5-SNAPSHOT/org.destecs.ide.platform-2.2.5-SNAPSHOT.pom
[INFO] Installing /var/lib/jenkins/workspace/scendo-pipeline_development-6SEXP6NOH4DPMHNIAG2YUHD7VUTTPKSFIJJHDCPNLS2367EFMSNQ/ide/platform/target/p2content.xml to /var/lib/jenkins/workspace/scendo-pipeline_development-6SEXP6NOH4DPMHNIAG2YUHD7VUTTPKSFIJJHDCPNLS2367EFMSNQ/.repository/org/destecs/ide/org.destecs.ide.platform/2.2.5-SNAPSHOT/org.destecs.ide.platform-2.2.5-SNAPSHOT-p2metadata.xml
[INFO] Installing /var/lib/jenkins/workspace/scendo-pipeline_development-6SEXP6NOH4DPMHNIAG2YUHD7VUTTPKSFIJJHDCPNLS2367EFMSNQ/ide/platform/target/p2artifacts.xml to /var/lib/jenkins/workspace/scendo-pipeline_development-6SEXP6NOH4DPMHNIAG2YUHD7VUTTPKSFIJJHDCPNLS2367EFMSNQ/.repository/org/destecs/ide/org.destecs.ide.platform/2.2.5-SNAPSHOT/org.destecs.ide.platform-2.2.5-SNAPSHOT-p2artifacts.xml
[INFO] 
[INFO] --- tycho-p2-plugin:0.25.0:update-local-index (default-update-local-index) @ org.destecs.ide.platform ---
[INFO]                                                                         
[INFO] ------------------------------------------------------------------------
[INFO] Building DESTECS IDE Eclipse features 2.2.5-SNAPSHOT
[INFO] ------------------------------------------------------------------------
[INFO] 
[INFO] --- maven-javadoc-plugin:2.9:jar (attach-javadocs) @ features ---
[INFO] Skipping javadoc generation
[INFO] 
[INFO] --- maven-install-plugin:2.5.2:install (default-install) @ features ---
[INFO] Installing /var/lib/jenkins/workspace/scendo-pipeline_development-6SEXP6NOH4DPMHNIAG2YUHD7VUTTPKSFIJJHDCPNLS2367EFMSNQ/ide/features/pom.xml to /var/lib/jenkins/workspace/scendo-pipeline_development-6SEXP6NOH4DPMHNIAG2YUHD7VUTTPKSFIJJHDCPNLS2367EFMSNQ/.repository/org/destecs/ide/features/2.2.5-SNAPSHOT/features-2.2.5-SNAPSHOT.pom
[INFO]                                                                         
[INFO] ------------------------------------------------------------------------
[INFO] Building DESTECS IDE Eclipse rcp feature 2.2.5-SNAPSHOT
[INFO] ------------------------------------------------------------------------
[INFO] 
[INFO] --- tycho-packaging-plugin:0.25.0:build-qualifier-aggregator (default-build-qualifier-aggregator) @ org.destecs.ide.features.rcp ---
[INFO] The project's OSGi version is 2.2.5.201811220809
[INFO] 
[INFO] --- tycho-packaging-plugin:0.25.0:validate-id (default-validate-id) @ org.destecs.ide.features.rcp ---
[INFO] 
[INFO] --- tycho-packaging-plugin:0.25.0:validate-version (default-validate-version) @ org.destecs.ide.features.rcp ---
[INFO] 
[INFO] --- target-platform-configuration:0.25.0:target-platform (default-target-platform) @ org.destecs.ide.features.rcp ---
[INFO] 
[INFO] --- tycho-packaging-plugin:0.25.0:package-feature (default-package-feature) @ org.destecs.ide.features.rcp ---
[INFO] Building jar: /var/lib/jenkins/workspace/scendo-pipeline_development-6SEXP6NOH4DPMHNIAG2YUHD7VUTTPKSFIJJHDCPNLS2367EFMSNQ/ide/features/rcp/target/org.destecs.ide.features.rcp-2.2.5-SNAPSHOT.jar
[INFO] 
[INFO] --- tycho-p2-plugin:0.25.0:p2-metadata-default (default-p2-metadata-default) @ org.destecs.ide.features.rcp ---
[INFO] 
[INFO] --- tycho-p2-plugin:0.25.0:feature-p2-metadata (default-feature-p2-metadata) @ org.destecs.ide.features.rcp ---
[INFO] 
[INFO] --- maven-javadoc-plugin:2.9:jar (attach-javadocs) @ org.destecs.ide.features.rcp ---
[INFO] Skipping javadoc generation
[INFO] 
[INFO] --- maven-install-plugin:2.3.1:install (default-install) @ org.destecs.ide.features.rcp ---
[INFO] Installing /var/lib/jenkins/workspace/scendo-pipeline_development-6SEXP6NOH4DPMHNIAG2YUHD7VUTTPKSFIJJHDCPNLS2367EFMSNQ/ide/features/rcp/target/org.destecs.ide.features.rcp-2.2.5-SNAPSHOT.jar to /var/lib/jenkins/workspace/scendo-pipeline_development-6SEXP6NOH4DPMHNIAG2YUHD7VUTTPKSFIJJHDCPNLS2367EFMSNQ/.repository/org/destecs/ide/features/org.destecs.ide.features.rcp/2.2.5-SNAPSHOT/org.destecs.ide.features.rcp-2.2.5-SNAPSHOT.jar
[INFO] Installing /var/lib/jenkins/workspace/scendo-pipeline_development-6SEXP6NOH4DPMHNIAG2YUHD7VUTTPKSFIJJHDCPNLS2367EFMSNQ/ide/features/rcp/pom.xml to /var/lib/jenkins/workspace/scendo-pipeline_development-6SEXP6NOH4DPMHNIAG2YUHD7VUTTPKSFIJJHDCPNLS2367EFMSNQ/.repository/org/destecs/ide/features/org.destecs.ide.features.rcp/2.2.5-SNAPSHOT/org.destecs.ide.features.rcp-2.2.5-SNAPSHOT.pom
[INFO] Installing /var/lib/jenkins/workspace/scendo-pipeline_development-6SEXP6NOH4DPMHNIAG2YUHD7VUTTPKSFIJJHDCPNLS2367EFMSNQ/ide/features/rcp/target/p2content.xml to /var/lib/jenkins/workspace/scendo-pipeline_development-6SEXP6NOH4DPMHNIAG2YUHD7VUTTPKSFIJJHDCPNLS2367EFMSNQ/.repository/org/destecs/ide/features/org.destecs.ide.features.rcp/2.2.5-SNAPSHOT/org.destecs.ide.features.rcp-2.2.5-SNAPSHOT-p2metadata.xml
[INFO] Installing /var/lib/jenkins/workspace/scendo-pipeline_development-6SEXP6NOH4DPMHNIAG2YUHD7VUTTPKSFIJJHDCPNLS2367EFMSNQ/ide/features/rcp/target/p2artifacts.xml to /var/lib/jenkins/workspace/scendo-pipeline_development-6SEXP6NOH4DPMHNIAG2YUHD7VUTTPKSFIJJHDCPNLS2367EFMSNQ/.repository/org/destecs/ide/features/org.destecs.ide.features.rcp/2.2.5-SNAPSHOT/org.destecs.ide.features.rcp-2.2.5-SNAPSHOT-p2artifacts.xml
[INFO] 
[INFO] --- tycho-p2-plugin:0.25.0:update-local-index (default-update-local-index) @ org.destecs.ide.features.rcp ---
[INFO]                                                                         
[INFO] ------------------------------------------------------------------------
[INFO] Building DESTECS IDE Standalone Product 2.2.5-SNAPSHOT
[INFO] ------------------------------------------------------------------------
[INFO] 
[INFO] --- tycho-packaging-plugin:0.25.0:build-qualifier-aggregator (default-build-qualifier-aggregator) @ org.destecs.ide.product ---
[INFO] The project's OSGi version is 2.2.5.201811220809
[INFO] 
[INFO] --- maven-clean-plugin:2.5:clean (default-clean-1) @ org.destecs.ide.product ---
[INFO] Deleting /var/lib/jenkins/workspace/scendo-pipeline_development-6SEXP6NOH4DPMHNIAG2YUHD7VUTTPKSFIJJHDCPNLS2367EFMSNQ/ide/product/target
[INFO] 
[INFO] --- maven-resources-plugin:2.6:resources (default-resources) @ org.destecs.ide.product ---
[INFO] Using 'UTF-8' encoding to copy filtered resources.
[INFO] Copying 4 resources to /var/lib/jenkins/workspace/scendo-pipeline_development-6SEXP6NOH4DPMHNIAG2YUHD7VUTTPKSFIJJHDCPNLS2367EFMSNQ/ide/product/target/installer
[INFO] Copying 1 resource to /var/lib/jenkins/workspace/scendo-pipeline_development-6SEXP6NOH4DPMHNIAG2YUHD7VUTTPKSFIJJHDCPNLS2367EFMSNQ/ide/product/target/installer/x86_64
[INFO] 
[INFO] --- target-platform-configuration:0.25.0:target-platform (default-target-platform) @ org.destecs.ide.product ---
[INFO] 
[INFO] --- tycho-p2-publisher-plugin:0.25.0:publish-products (default-publish-products) @ org.destecs.ide.product ---
Error - 3 icon(s) not replaced in /tmp/p2.brandingIron8271136052064609524/launcher.exe using /var/lib/jenkins/workspace/scendo-pipeline_development-6SEXP6NOH4DPMHNIAG2YUHD7VUTTPKSFIJJHDCPNLS2367EFMSNQ/ide/product/icons/win/crescendo.ico
Error - 3 icon(s) not replaced in /tmp/p2.brandingIron6135190371658038821/launcher.exe using /var/lib/jenkins/workspace/scendo-pipeline_development-6SEXP6NOH4DPMHNIAG2YUHD7VUTTPKSFIJJHDCPNLS2367EFMSNQ/ide/product/icons/win/crescendo.ico
[INFO] 
[INFO] --- tycho-p2-publisher-plugin:0.25.0:publish-categories (default-publish-categories) @ org.destecs.ide.product ---
[INFO] 
[INFO] --- tycho-p2-publisher-plugin:0.25.0:attach-artifacts (default-attach-artifacts) @ org.destecs.ide.product ---
[INFO] 
[INFO] --- tycho-p2-repository-plugin:0.25.0:assemble-repository (default-assemble-repository) @ org.destecs.ide.product ---
[INFO] Copying resources from /var/lib/jenkins/workspace/scendo-pipeline_development-6SEXP6NOH4DPMHNIAG2YUHD7VUTTPKSFIJJHDCPNLS2367EFMSNQ/ide/product/target/classes to /var/lib/jenkins/workspace/scendo-pipeline_development-6SEXP6NOH4DPMHNIAG2YUHD7VUTTPKSFIJJHDCPNLS2367EFMSNQ/ide/product/target/repository
[WARNING] Mirror tool: Problems resolving provisioning plan.: [Unable to satisfy dependency from org.destecs.ide.platform.product 2.2.5.201811220809 to org.eclipse.e4.rcp.feature.group [1.6.3.v20180329-0507].; Unable to satisfy dependency from org.destecs.ide.platform.product 2.2.5.201811220809 to org.eclipse.equinox.p2.core.feature.feature.group [1.4.1.v20170928-1405].; Unable to satisfy dependency from org.destecs.ide.platform.product 2.2.5.201811220809 to org.eclipse.platform.feature.group [4.7.3.v20180330-0640].; Unable to satisfy dependency from org.destecs.ide.platform.product 2.2.5.201811220809 to org.eclipse.equinox.p2.rcp.feature.feature.group [1.3.2.v20171108-1343].; Unable to satisfy dependency from org.destecs.ide.platform.product 2.2.5.201811220809 to org.eclipse.equinox.p2.user.ui.feature.group [2.3.2.v20171108-1343].; Unable to satisfy dependency from org.destecs.ide.platform.product 2.2.5.201811220809 to org.eclipse.rcp.feature.group [4.7.3.v20180330-0640].; Unable to satisfy dependency from org.destecs.ide.platform.product 2.2.5.201811220809 to org.eclipse.equinox.p2.extras.feature.feature.group [1.3.1.v20170928-1405].; Unable to satisfy dependency from org.destecs.ide.platform.product 2.2.5.201811220809 to org.eclipse.help.feature.group [2.2.104.v20180330-0640].]
[WARNING] More information on the preceding warning(s) can be found here:
[WARNING] - http://wiki.eclipse.org/Tycho_Messages_Explained#Mirror_tool
[WARNING] Mirror tool: Problems resolving provisioning plan.: [Unable to satisfy dependency from org.destecs.ide.platform.product 2.2.5.201811220809 to org.eclipse.e4.rcp.feature.group [1.6.3.v20180329-0507].; Unable to satisfy dependency from org.destecs.ide.platform.product 2.2.5.201811220809 to org.eclipse.equinox.p2.core.feature.feature.group [1.4.1.v20170928-1405].; Unable to satisfy dependency from org.destecs.ide.platform.product 2.2.5.201811220809 to org.eclipse.platform.feature.group [4.7.3.v20180330-0640].; Unable to satisfy dependency from org.destecs.ide.platform.product 2.2.5.201811220809 to org.eclipse.equinox.p2.rcp.feature.feature.group [1.3.2.v20171108-1343].; Unable to satisfy dependency from org.destecs.ide.platform.product 2.2.5.201811220809 to org.eclipse.equinox.p2.user.ui.feature.group [2.3.2.v20171108-1343].; Unable to satisfy dependency from org.destecs.ide.platform.product 2.2.5.201811220809 to org.eclipse.rcp.feature.group [4.7.3.v20180330-0640].; Unable to satisfy dependency from org.destecs.ide.platform.product 2.2.5.201811220809 to org.eclipse.equinox.p2.extras.feature.feature.group [1.3.1.v20170928-1405].; Unable to satisfy dependency from org.destecs.ide.platform.product 2.2.5.201811220809 to org.eclipse.help.feature.group [2.2.104.v20180330-0640].]
[WARNING] More information on the preceding warning(s) can be found here:
[WARNING] - http://wiki.eclipse.org/Tycho_Messages_Explained#Mirror_tool
[WARNING] Mirror tool: Problems resolving provisioning plan.: [Unable to satisfy dependency from org.destecs.ide.platform.product 2.2.5.201811220809 to org.eclipse.e4.rcp.feature.group [1.6.3.v20180329-0507].; Unable to satisfy dependency from org.destecs.ide.platform.product 2.2.5.201811220809 to org.eclipse.equinox.p2.core.feature.feature.group [1.4.1.v20170928-1405].; Unable to satisfy dependency from org.destecs.ide.platform.product 2.2.5.201811220809 to org.eclipse.platform.feature.group [4.7.3.v20180330-0640].; Unable to satisfy dependency from org.destecs.ide.platform.product 2.2.5.201811220809 to org.eclipse.equinox.p2.rcp.feature.feature.group [1.3.2.v20171108-1343].; Unable to satisfy dependency from org.destecs.ide.platform.product 2.2.5.201811220809 to org.eclipse.equinox.p2.user.ui.feature.group [2.3.2.v20171108-1343].; Unable to satisfy dependency from org.destecs.ide.platform.product 2.2.5.201811220809 to org.eclipse.rcp.feature.group [4.7.3.v20180330-0640].; Unable to satisfy dependency from org.destecs.ide.platform.product 2.2.5.201811220809 to org.eclipse.equinox.p2.extras.feature.feature.group [1.3.1.v20170928-1405].; Unable to satisfy dependency from org.destecs.ide.platform.product 2.2.5.201811220809 to org.eclipse.help.feature.group [2.2.104.v20180330-0640].]
[WARNING] More information on the preceding warning(s) can be found here:
[WARNING] - http://wiki.eclipse.org/Tycho_Messages_Explained#Mirror_tool
[WARNING] Mirror tool: Problems resolving provisioning plan.: [Unable to satisfy dependency from org.destecs.ide.platform.product 2.2.5.201811220809 to org.eclipse.e4.rcp.feature.group [1.6.3.v20180329-0507].; Unable to satisfy dependency from org.destecs.ide.platform.product 2.2.5.201811220809 to org.eclipse.equinox.p2.core.feature.feature.group [1.4.1.v20170928-1405].; Unable to satisfy dependency from org.destecs.ide.platform.product 2.2.5.201811220809 to org.eclipse.platform.feature.group [4.7.3.v20180330-0640].; Unable to satisfy dependency from org.destecs.ide.platform.product 2.2.5.201811220809 to org.eclipse.equinox.p2.rcp.feature.feature.group [1.3.2.v20171108-1343].; Unable to satisfy dependency from org.destecs.ide.platform.product 2.2.5.201811220809 to org.eclipse.equinox.p2.user.ui.feature.group [2.3.2.v20171108-1343].; Unable to satisfy dependency from org.destecs.ide.platform.product 2.2.5.201811220809 to org.eclipse.rcp.feature.group [4.7.3.v20180330-0640].; Unable to satisfy dependency from org.destecs.ide.platform.product 2.2.5.201811220809 to org.eclipse.equinox.p2.extras.feature.feature.group [1.3.1.v20170928-1405].; Unable to satisfy dependency from org.destecs.ide.platform.product 2.2.5.201811220809 to org.eclipse.help.feature.group [2.2.104.v20180330-0640].]
[WARNING] More information on the preceding warning(s) can be found here:
[WARNING] - http://wiki.eclipse.org/Tycho_Messages_Explained#Mirror_tool
[WARNING] Mirror tool: Problems resolving provisioning plan.: [Unable to satisfy dependency from org.destecs.ide.platform.product 2.2.5.201811220809 to org.eclipse.e4.rcp.feature.group [1.6.3.v20180329-0507].; Unable to satisfy dependency from org.destecs.ide.platform.product 2.2.5.201811220809 to org.eclipse.equinox.p2.core.feature.feature.group [1.4.1.v20170928-1405].; Unable to satisfy dependency from org.destecs.ide.platform.product 2.2.5.201811220809 to org.eclipse.platform.feature.group [4.7.3.v20180330-0640].; Unable to satisfy dependency from org.destecs.ide.platform.product 2.2.5.201811220809 to org.eclipse.equinox.p2.rcp.feature.feature.group [1.3.2.v20171108-1343].; Unable to satisfy dependency from org.destecs.ide.platform.product 2.2.5.201811220809 to org.eclipse.equinox.p2.user.ui.feature.group [2.3.2.v20171108-1343].; Unable to satisfy dependency from org.destecs.ide.platform.product 2.2.5.201811220809 to org.eclipse.rcp.feature.group [4.7.3.v20180330-0640].; Unable to satisfy dependency from org.destecs.ide.platform.product 2.2.5.201811220809 to org.eclipse.equinox.p2.extras.feature.feature.group [1.3.1.v20170928-1405].; Unable to satisfy dependency from org.destecs.ide.platform.product 2.2.5.201811220809 to org.eclipse.help.feature.group [2.2.104.v20180330-0640].]
[WARNING] More information on the preceding warning(s) can be found here:
[WARNING] - http://wiki.eclipse.org/Tycho_Messages_Explained#Mirror_tool
[INFO] 
[INFO] --- tycho-p2-repository-plugin:0.25.0:archive-repository (default-archive-repository) @ org.destecs.ide.product ---
[INFO] Building zip: /var/lib/jenkins/workspace/scendo-pipeline_development-6SEXP6NOH4DPMHNIAG2YUHD7VUTTPKSFIJJHDCPNLS2367EFMSNQ/ide/product/target/org.destecs.ide.product-2.2.5-SNAPSHOT.zip
[INFO] 
[INFO] --- maven-javadoc-plugin:2.9:jar (attach-javadocs) @ org.destecs.ide.product ---
[INFO] Skipping javadoc generation
[INFO] 
[INFO] --- tycho-p2-director-plugin:0.25.0:materialize-products (materialize-products) @ org.destecs.ide.product ---
[INFO] Installing product org.destecs.ide.platform.product for environment win32/win32/x86 to /var/lib/jenkins/workspace/scendo-pipeline_development-6SEXP6NOH4DPMHNIAG2YUHD7VUTTPKSFIJJHDCPNLS2367EFMSNQ/ide/product/target/products/org.destecs.ide.platform.product/win32/win32/x86
Installing org.destecs.ide.platform.product 2.2.5.201811220809.
Installation failed.
Cannot complete the install because one or more required items could not be found.
 Software being installed: Crescendo Tools 2.2.5.201811220809 (org.destecs.ide.platform.product 2.2.5.201811220809)
 Missing requirement: Crescendo Tools 2.2.5.201811220809 (org.destecs.ide.platform.product 2.2.5.201811220809) requires 'org.eclipse.e4.rcp.feature.group [1.6.3.v20180329-0507]' but it could not be found
Application failed, log file location: /var/lib/jenkins/workspace/scendo-pipeline_development-6SEXP6NOH4DPMHNIAG2YUHD7VUTTPKSFIJJHDCPNLS2367EFMSNQ/workspace/.metadata/.log
[INFO] ------------------------------------------------------------------------
[INFO] Reactor Summary:
[INFO] 
[INFO] DESTECS ............................................ SUCCESS [  0.110 s]
[INFO] Core Tools ......................................... SUCCESS [  0.025 s]
[INFO] xmlrpc-extensions .................................. SUCCESS [  0.004 s]
[INFO] xmlrpc-baseextension ............................... SUCCESS [  0.696 s]
[INFO] DESTECS Maven plugins and standalone tools ......... SUCCESS [  0.007 s]
[INFO] Java Co-Simulation protocol generator .............. SUCCESS [  1.759 s]
[INFO] The Co-Simulation protocol ......................... SUCCESS [  0.495 s]
[INFO] xmlrpc-clientextension ............................. SUCCESS [  0.088 s]
[INFO] Simulation Engine .................................. SUCCESS [  0.549 s]
[INFO] xmlrpc-serverextension ............................. SUCCESS [  0.044 s]
[INFO] Co-Simulator for VDM ............................... SUCCESS [  2.285 s]
[INFO] DESTECS IDE Top-level .............................. SUCCESS [  0.233 s]
[INFO] org.destecs.ide.core ............................... SUCCESS [  0.837 s]
[INFO] DESTECS Simulation Engine .......................... SUCCESS [  2.131 s]
[INFO] org.destecs.ide.ui ................................. SUCCESS [  0.205 s]
[INFO] org.destecs.ide.debug .............................. SUCCESS [  0.168 s]
[INFO] org.destecs.ide.vdmmetadatabuilder ................. SUCCESS [  0.092 s]
[INFO] org.destecs.ide.libraries .......................... SUCCESS [  0.097 s]
[INFO] org.destecs.ide.platform ........................... SUCCESS [  2.885 s]
[INFO] DESTECS IDE Eclipse features ....................... SUCCESS [  0.005 s]
[INFO] DESTECS IDE Eclipse rcp feature .................... SUCCESS [  0.219 s]
[INFO] DESTECS IDE Standalone Product ..................... FAILURE [  9.299 s]
[INFO] ------------------------------------------------------------------------
[INFO] BUILD FAILURE
[INFO] ------------------------------------------------------------------------
[INFO] Total time: 01:00 min
[INFO] Finished at: 2018-11-22T09:09:43+01:00
[INFO] Final Memory: 150M/855M
[INFO] ------------------------------------------------------------------------
[jenkins-maven-event-spy] INFO generated /var/lib/jenkins/workspace/scendo-pipeline_development-6SEXP6NOH4DPMHNIAG2YUHD7VUTTPKSFIJJHDCPNLS2367EFMSNQ@tmp/withMaven172ea620/maven-spy-20181122-090842-7678749510578972421889.log
[ERROR] Failed to execute goal org.eclipse.tycho:tycho-p2-director-plugin:0.25.0:materialize-products (materialize-products) on project org.destecs.ide.product: Installation of product org.destecs.ide.platform.product for environment win32/win32/x86 failed: Call to p2 director application failed with exit code 13. Program arguments were: [-metadataRepository, file:/var/lib/jenkins/workspace/scendo-pipeline_development-6SEXP6NOH4DPMHNIAG2YUHD7VUTTPKSFIJJHDCPNLS2367EFMSNQ/ide/product/target/,file:/var/lib/jenkins/workspace/scendo-pipeline_development-6SEXP6NOH4DPMHNIAG2YUHD7VUTTPKSFIJJHDCPNLS2367EFMSNQ/ide/product/target/targetPlatformRepository/, -artifactRepository, file:/var/lib/jenkins/workspace/scendo-pipeline_development-6SEXP6NOH4DPMHNIAG2YUHD7VUTTPKSFIJJHDCPNLS2367EFMSNQ/ide/product/target/,file:/resolution-context-artifacts@/var/lib/jenkins/workspace/scendo-pipeline_development-6SEXP6NOH4DPMHNIAG2YUHD7VUTTPKSFIJJHDCPNLS2367EFMSNQ/ide/product,file:/var/lib/jenkins/workspace/scendo-pipeline_development-6SEXP6NOH4DPMHNIAG2YUHD7VUTTPKSFIJJHDCPNLS2367EFMSNQ/ide/simeng/target/,file:/var/lib/jenkins/workspace/scendo-pipeline_development-6SEXP6NOH4DPMHNIAG2YUHD7VUTTPKSFIJJHDCPNLS2367EFMSNQ/ide/core/target/,file:/var/lib/jenkins/workspace/scendo-pipeline_development-6SEXP6NOH4DPMHNIAG2YUHD7VUTTPKSFIJJHDCPNLS2367EFMSNQ/ide/debug/target/,file:/var/lib/jenkins/workspace/scendo-pipeline_development-6SEXP6NOH4DPMHNIAG2YUHD7VUTTPKSFIJJHDCPNLS2367EFMSNQ/ide/ui/target/,file:/var/lib/jenkins/workspace/scendo-pipeline_development-6SEXP6NOH4DPMHNIAG2YUHD7VUTTPKSFIJJHDCPNLS2367EFMSNQ/ide/features/rcp/target/,file:/var/lib/jenkins/workspace/scendo-pipeline_development-6SEXP6NOH4DPMHNIAG2YUHD7VUTTPKSFIJJHDCPNLS2367EFMSNQ/ide/platform/target/,file:/var/lib/jenkins/workspace/scendo-pipeline_development-6SEXP6NOH4DPMHNIAG2YUHD7VUTTPKSFIJJHDCPNLS2367EFMSNQ/ide/libraries/target/,file:/var/lib/jenkins/workspace/scendo-pipeline_development-6SEXP6NOH4DPMHNIAG2YUHD7VUTTPKSFIJJHDCPNLS2367EFMSNQ/ide/vdmmetadatabuilder/target/,file:/var/lib/jenkins/workspace/scendo-pipeline_development-6SEXP6NOH4DPMHNIAG2YUHD7VUTTPKSFIJJHDCPNLS2367EFMSNQ/ide/product/target/,file:/var/lib/jenkins/workspace/scendo-pipeline_development-6SEXP6NOH4DPMHNIAG2YUHD7VUTTPKSFIJJHDCPNLS2367EFMSNQ/.repository/, -installIU, org.destecs.ide.platform.product, -destination, /var/lib/jenkins/workspace/scendo-pipeline_development-6SEXP6NOH4DPMHNIAG2YUHD7VUTTPKSFIJJHDCPNLS2367EFMSNQ/ide/product/target/products/org.destecs.ide.platform.product/win32/win32/x86, -profile, DefaultProfile, -profileProperties, org.eclipse.update.install.features=true, -roaming, -p2.os, win32, -p2.ws, win32, -p2.arch, x86]. -> [Help 1]
[ERROR] 
[ERROR] To see the full stack trace of the errors, re-run Maven with the -e switch.
[ERROR] Re-run Maven using the -X switch to enable full debug logging.
[ERROR] 
[ERROR] For more information about the errors and possible solutions, please read the following articles:
[ERROR] [Help 1] http://cwiki.apache.org/confluence/display/MAVEN/MojoFailureException
[ERROR] 
[ERROR] After correcting the problems, you can resume the build with the command
[ERROR]   mvn <goals> -rf :org.destecs.ide.product
[Pipeline] }
[withMaven] artifactsPublisher - Archive artifact pom.xml under org/destecs/root/2.2.5-SNAPSHOT/root-2.2.5-SNAPSHOT.pom
[withMaven] artifactsPublisher - Archive artifact core/pom.xml under org/destecs/core/2.2.5-SNAPSHOT/core-2.2.5-SNAPSHOT.pom
[withMaven] artifactsPublisher - Archive artifact core/xmlrpcextensions/pom.xml under org/destecs/core/xmlrpc-extensions/2.2.5-SNAPSHOT/xmlrpc-extensions-2.2.5-SNAPSHOT.pom
[withMaven] artifactsPublisher - Archive artifact core/xmlrpcextensions/xmlrpcbaseextension/pom.xml under org/destecs/core/xmlrpcextensions/xmlrpcbaseextension/2.2.5-SNAPSHOT/xmlrpcbaseextension-2.2.5-SNAPSHOT.pom
[withMaven] artifactsPublisher - Archive artifact core/xmlrpcextensions/xmlrpcbaseextension/target/xmlrpcbaseextension-2.2.5-SNAPSHOT.jar under org/destecs/core/xmlrpcextensions/xmlrpcbaseextension/2.2.5-SNAPSHOT/xmlrpcbaseextension-2.2.5-SNAPSHOT.jar
[withMaven] artifactsPublisher - Archive artifact tools/pom.xml under org/destecs/tools/tool/2.2.5-SNAPSHOT/tool-2.2.5-SNAPSHOT.pom
[withMaven] artifactsPublisher - Archive artifact tools/jprotocolgenerator/pom.xml under org/destecs/tools/jprotocolgenerator/2.2.5-SNAPSHOT/jprotocolgenerator-2.2.5-SNAPSHOT.pom
[withMaven] artifactsPublisher - Archive artifact tools/jprotocolgenerator/target/jprotocolgenerator-2.2.5-SNAPSHOT.jar under org/destecs/tools/jprotocolgenerator/2.2.5-SNAPSHOT/jprotocolgenerator-2.2.5-SNAPSHOT.jar
[withMaven] artifactsPublisher - Archive artifact core/protocol/pom.xml under org/destecs/core/protocol/2.2.5-SNAPSHOT/protocol-2.2.5-SNAPSHOT.pom
[withMaven] artifactsPublisher - Archive artifact core/protocol/target/protocol-2.2.5-SNAPSHOT.jar under org/destecs/core/protocol/2.2.5-SNAPSHOT/protocol-2.2.5-SNAPSHOT.jar
[withMaven] artifactsPublisher - Archive artifact core/xmlrpcextensions/xmlrpcclientextension/pom.xml under org/destecs/core/xmlrpcextensions/xmlrpcclientextension/2.2.5-SNAPSHOT/xmlrpcclientextension-2.2.5-SNAPSHOT.pom
[withMaven] artifactsPublisher - Archive artifact core/xmlrpcextensions/xmlrpcclientextension/target/xmlrpcclientextension-2.2.5-SNAPSHOT.jar under org/destecs/core/xmlrpcextensions/xmlrpcclientextension/2.2.5-SNAPSHOT/xmlrpcclientextension-2.2.5-SNAPSHOT.jar
[withMaven] artifactsPublisher - Archive artifact core/simulationengine/pom.xml under org/destecs/core/simulationengine/2.2.5-SNAPSHOT/simulationengine-2.2.5-SNAPSHOT.pom
[withMaven] artifactsPublisher - Archive artifact core/simulationengine/target/simulationengine-2.2.5-SNAPSHOT.jar under org/destecs/core/simulationengine/2.2.5-SNAPSHOT/simulationengine-2.2.5-SNAPSHOT.jar
[withMaven] artifactsPublisher - Archive artifact core/xmlrpcextensions/xmlrpcserverextension/pom.xml under org/destecs/core/xmlrpcextensions/xmlrpcserverextension/2.2.5-SNAPSHOT/xmlrpcserverextension-2.2.5-SNAPSHOT.pom
[withMaven] artifactsPublisher - Archive artifact core/xmlrpcextensions/xmlrpcserverextension/target/xmlrpcserverextension-2.2.5-SNAPSHOT.jar under org/destecs/core/xmlrpcextensions/xmlrpcserverextension/2.2.5-SNAPSHOT/xmlrpcserverextension-2.2.5-SNAPSHOT.jar
[withMaven] artifactsPublisher - Archive artifact core/vdm/pom.xml under org/destecs/core/vdm/2.2.5-SNAPSHOT/vdm-2.2.5-SNAPSHOT.pom
[withMaven] artifactsPublisher - Archive artifact core/vdm/target/vdm-2.2.5-SNAPSHOT.jar under org/destecs/core/vdm/2.2.5-SNAPSHOT/vdm-2.2.5-SNAPSHOT.jar
[withMaven] artifactsPublisher - Archive artifact ide/pom.xml under org/destecs/ide/2.2.5-SNAPSHOT/ide-2.2.5-SNAPSHOT.pom
[withMaven] artifactsPublisher - Archive artifact ide/core/pom.xml under org/destecs/ide/org.destecs.ide.core/2.2.5-SNAPSHOT/org.destecs.ide.core-2.2.5-SNAPSHOT.pom
[withMaven] artifactsPublisher - Archive artifact ide/core/target/org.destecs.ide.core-2.2.5-SNAPSHOT.jar under org/destecs/ide/org.destecs.ide.core/2.2.5-SNAPSHOT/org.destecs.ide.core-2.2.5-SNAPSHOT.jar
[withMaven] artifactsPublisher - Archive artifact ide/simeng/pom.xml under org/destecs/ide/org.destecs.ide.simeng/2.2.5-SNAPSHOT/org.destecs.ide.simeng-2.2.5-SNAPSHOT.pom
[withMaven] artifactsPublisher - Archive artifact ide/simeng/target/org.destecs.ide.simeng-2.2.5-SNAPSHOT.jar under org/destecs/ide/org.destecs.ide.simeng/2.2.5-SNAPSHOT/org.destecs.ide.simeng-2.2.5-SNAPSHOT.jar
[withMaven] artifactsPublisher - Archive artifact ide/ui/pom.xml under org/destecs/ide/org.destecs.ide.ui/2.2.5-SNAPSHOT/org.destecs.ide.ui-2.2.5-SNAPSHOT.pom
[withMaven] artifactsPublisher - Archive artifact ide/ui/target/org.destecs.ide.ui-2.2.5-SNAPSHOT.jar under org/destecs/ide/org.destecs.ide.ui/2.2.5-SNAPSHOT/org.destecs.ide.ui-2.2.5-SNAPSHOT.jar
[withMaven] artifactsPublisher - Archive artifact ide/debug/pom.xml under org/destecs/ide/org.destecs.ide.debug/2.2.5-SNAPSHOT/org.destecs.ide.debug-2.2.5-SNAPSHOT.pom
[withMaven] artifactsPublisher - Archive artifact ide/debug/target/org.destecs.ide.debug-2.2.5-SNAPSHOT.jar under org/destecs/ide/org.destecs.ide.debug/2.2.5-SNAPSHOT/org.destecs.ide.debug-2.2.5-SNAPSHOT.jar
[withMaven] artifactsPublisher - Archive artifact ide/vdmmetadatabuilder/pom.xml under org/destecs/ide/org.destecs.ide.vdmmetadatabuilder/2.2.5-SNAPSHOT/org.destecs.ide.vdmmetadatabuilder-2.2.5-SNAPSHOT.pom
[withMaven] artifactsPublisher - Archive artifact ide/vdmmetadatabuilder/target/org.destecs.ide.vdmmetadatabuilder-2.2.5-SNAPSHOT.jar under org/destecs/ide/org.destecs.ide.vdmmetadatabuilder/2.2.5-SNAPSHOT/org.destecs.ide.vdmmetadatabuilder-2.2.5-SNAPSHOT.jar
[withMaven] artifactsPublisher - Archive artifact ide/libraries/pom.xml under org/destecs/ide/org.destecs.ide.libraries/2.2.5-SNAPSHOT/org.destecs.ide.libraries-2.2.5-SNAPSHOT.pom
[withMaven] artifactsPublisher - Archive artifact ide/libraries/target/org.destecs.ide.libraries-2.2.5-SNAPSHOT.jar under org/destecs/ide/org.destecs.ide.libraries/2.2.5-SNAPSHOT/org.destecs.ide.libraries-2.2.5-SNAPSHOT.jar
[withMaven] artifactsPublisher - Archive artifact ide/platform/pom.xml under org/destecs/ide/org.destecs.ide.platform/2.2.5-SNAPSHOT/org.destecs.ide.platform-2.2.5-SNAPSHOT.pom
[withMaven] artifactsPublisher - Archive artifact ide/platform/target/org.destecs.ide.platform-2.2.5-SNAPSHOT.jar under org/destecs/ide/org.destecs.ide.platform/2.2.5-SNAPSHOT/org.destecs.ide.platform-2.2.5-SNAPSHOT.jar
[withMaven] artifactsPublisher - Archive artifact ide/features/pom.xml under org/destecs/ide/features/2.2.5-SNAPSHOT/features-2.2.5-SNAPSHOT.pom
[withMaven] artifactsPublisher - Archive artifact ide/features/rcp/pom.xml under org/destecs/ide/features/org.destecs.ide.features.rcp/2.2.5-SNAPSHOT/org.destecs.ide.features.rcp-2.2.5-SNAPSHOT.pom
[withMaven] artifactsPublisher - Archive artifact ide/features/rcp/target/org.destecs.ide.features.rcp-2.2.5-SNAPSHOT.jar under org/destecs/ide/features/org.destecs.ide.features.rcp/2.2.5-SNAPSHOT/org.destecs.ide.features.rcp-2.2.5-SNAPSHOT.jar
[withMaven] artifactsPublisher - Archive artifact core/simulationengine/target/simulationengine-2.2.5-SNAPSHOT-sources.jar under org/destecs/core/simulationengine/2.2.5-SNAPSHOT/simulationengine-2.2.5-SNAPSHOT-sources.jar
[withMaven] artifactsPublisher - Archive artifact core/vdm/target/vdm-2.2.5-SNAPSHOT-sources.jar under org/destecs/core/vdm/2.2.5-SNAPSHOT/vdm-2.2.5-SNAPSHOT-sources.jar
[withMaven] artifactsPublisher - Archive artifact ide/core/target/p2content.xml under org/destecs/ide/org.destecs.ide.core/2.2.5-SNAPSHOT/org.destecs.ide.core-2.2.5-SNAPSHOT-p2metadata.xml
[withMaven] artifactsPublisher - Archive artifact ide/core/target/p2artifacts.xml under org/destecs/ide/org.destecs.ide.core/2.2.5-SNAPSHOT/org.destecs.ide.core-2.2.5-SNAPSHOT-p2artifacts.xml
[withMaven] artifactsPublisher - Archive artifact ide/simeng/target/p2content.xml under org/destecs/ide/org.destecs.ide.simeng/2.2.5-SNAPSHOT/org.destecs.ide.simeng-2.2.5-SNAPSHOT-p2metadata.xml
[withMaven] artifactsPublisher - Archive artifact ide/simeng/target/p2artifacts.xml under org/destecs/ide/org.destecs.ide.simeng/2.2.5-SNAPSHOT/org.destecs.ide.simeng-2.2.5-SNAPSHOT-p2artifacts.xml
[withMaven] artifactsPublisher - Archive artifact ide/ui/target/p2content.xml under org/destecs/ide/org.destecs.ide.ui/2.2.5-SNAPSHOT/org.destecs.ide.ui-2.2.5-SNAPSHOT-p2metadata.xml
[withMaven] artifactsPublisher - Archive artifact ide/ui/target/p2artifacts.xml under org/destecs/ide/org.destecs.ide.ui/2.2.5-SNAPSHOT/org.destecs.ide.ui-2.2.5-SNAPSHOT-p2artifacts.xml
[withMaven] artifactsPublisher - Archive artifact ide/debug/target/p2content.xml under org/destecs/ide/org.destecs.ide.debug/2.2.5-SNAPSHOT/org.destecs.ide.debug-2.2.5-SNAPSHOT-p2metadata.xml
[withMaven] artifactsPublisher - Archive artifact ide/debug/target/p2artifacts.xml under org/destecs/ide/org.destecs.ide.debug/2.2.5-SNAPSHOT/org.destecs.ide.debug-2.2.5-SNAPSHOT-p2artifacts.xml
[withMaven] artifactsPublisher - Archive artifact ide/vdmmetadatabuilder/target/p2content.xml under org/destecs/ide/org.destecs.ide.vdmmetadatabuilder/2.2.5-SNAPSHOT/org.destecs.ide.vdmmetadatabuilder-2.2.5-SNAPSHOT-p2metadata.xml
[withMaven] artifactsPublisher - Archive artifact ide/vdmmetadatabuilder/target/p2artifacts.xml under org/destecs/ide/org.destecs.ide.vdmmetadatabuilder/2.2.5-SNAPSHOT/org.destecs.ide.vdmmetadatabuilder-2.2.5-SNAPSHOT-p2artifacts.xml
[withMaven] artifactsPublisher - Archive artifact ide/libraries/target/p2content.xml under org/destecs/ide/org.destecs.ide.libraries/2.2.5-SNAPSHOT/org.destecs.ide.libraries-2.2.5-SNAPSHOT-p2metadata.xml
[withMaven] artifactsPublisher - Archive artifact ide/libraries/target/p2artifacts.xml under org/destecs/ide/org.destecs.ide.libraries/2.2.5-SNAPSHOT/org.destecs.ide.libraries-2.2.5-SNAPSHOT-p2artifacts.xml
[withMaven] artifactsPublisher - Archive artifact ide/platform/target/p2content.xml under org/destecs/ide/org.destecs.ide.platform/2.2.5-SNAPSHOT/org.destecs.ide.platform-2.2.5-SNAPSHOT-p2metadata.xml
[withMaven] artifactsPublisher - Archive artifact ide/platform/target/p2artifacts.xml under org/destecs/ide/org.destecs.ide.platform/2.2.5-SNAPSHOT/org.destecs.ide.platform-2.2.5-SNAPSHOT-p2artifacts.xml
[withMaven] artifactsPublisher - Archive artifact ide/features/rcp/target/p2content.xml under org/destecs/ide/features/org.destecs.ide.features.rcp/2.2.5-SNAPSHOT/org.destecs.ide.features.rcp-2.2.5-SNAPSHOT-p2metadata.xml
[withMaven] artifactsPublisher - Archive artifact ide/features/rcp/target/p2artifacts.xml under org/destecs/ide/features/org.destecs.ide.features.rcp/2.2.5-SNAPSHOT/org.destecs.ide.features.rcp-2.2.5-SNAPSHOT-p2artifacts.xml
[withMaven] junitPublisher - Archive test results for Maven artifact org.destecs.core.xmlrpcextensions:xmlrpcbaseextension:2.2.5-SNAPSHOT generated by maven-surefire-plugin:test (default-test): core/xmlrpcextensions/xmlrpcbaseextension/target/surefire-reports/*.xml
[withMaven] junitPublisher - Jenkins JUnit Attachments Plugin not found, can't publish test attachments.Recording test results
None of the test reports contained any result
[withMaven] junitPublisher - Archive test results for Maven artifact org.destecs.tools:jprotocolgenerator:2.2.5-SNAPSHOT generated by maven-surefire-plugin:test (default-test): tools/jprotocolgenerator/target/surefire-reports/*.xml
[withMaven] junitPublisher - Jenkins JUnit Attachments Plugin not found, can't publish test attachments.Recording test results
None of the test reports contained any result
[withMaven] junitPublisher - Archive test results for Maven artifact org.destecs.core:protocol:2.2.5-SNAPSHOT generated by maven-surefire-plugin:test (default-test): core/protocol/target/surefire-reports/*.xml
[withMaven] junitPublisher - Jenkins JUnit Attachments Plugin not found, can't publish test attachments.Recording test results
None of the test reports contained any result
[withMaven] junitPublisher - Archive test results for Maven artifact org.destecs.core.xmlrpcextensions:xmlrpcclientextension:2.2.5-SNAPSHOT generated by maven-surefire-plugin:test (default-test): core/xmlrpcextensions/xmlrpcclientextension/target/surefire-reports/*.xml
[withMaven] junitPublisher - Jenkins JUnit Attachments Plugin not found, can't publish test attachments.Recording test results
None of the test reports contained any result
[withMaven] junitPublisher - Archive test results for Maven artifact org.destecs.core:simulationengine:2.2.5-SNAPSHOT generated by maven-surefire-plugin:test (default-test): core/simulationengine/target/surefire-reports/*.xml
[withMaven] junitPublisher - Jenkins JUnit Attachments Plugin not found, can't publish test attachments.Recording test results
None of the test reports contained any result
[withMaven] junitPublisher - Archive test results for Maven artifact org.destecs.core.xmlrpcextensions:xmlrpcserverextension:2.2.5-SNAPSHOT generated by maven-surefire-plugin:test (default-test): core/xmlrpcextensions/xmlrpcserverextension/target/surefire-reports/*.xml
[withMaven] junitPublisher - Jenkins JUnit Attachments Plugin not found, can't publish test attachments.Recording test results
None of the test reports contained any result
[withMaven] junitPublisher - Archive test results for Maven artifact org.destecs.core:vdm:2.2.5-SNAPSHOT generated by maven-surefire-plugin:test (default-test): core/vdm/target/surefire-reports/*.xml
[withMaven] junitPublisher - Jenkins JUnit Attachments Plugin not found, can't publish test attachments.Recording test results
[withMaven] openTasksPublisher - Scan Tasks for Maven artifact org.destecs.core.xmlrpcextensions:xmlrpcbaseextension:2.2.5-SNAPSHOT in source directory core/xmlrpcextensions/xmlrpcbaseextension/src/main/java
[withMaven] openTasksPublisher - Scan Tasks for Maven artifact org.destecs.tools:jprotocolgenerator:2.2.5-SNAPSHOT in source directory tools/jprotocolgenerator/src/main/java
[withMaven] openTasksPublisher - Scan Tasks for Maven artifact org.destecs.core:protocol:2.2.5-SNAPSHOT in source directory core/protocol/src/main/java
[withMaven] openTasksPublisher - Scan Tasks for Maven artifact org.destecs.core.xmlrpcextensions:xmlrpcclientextension:2.2.5-SNAPSHOT in source directory core/xmlrpcextensions/xmlrpcclientextension/src/main/java
[withMaven] openTasksPublisher - Scan Tasks for Maven artifact org.destecs.core:simulationengine:2.2.5-SNAPSHOT in source directory core/simulationengine/src/main/java
[withMaven] openTasksPublisher - Scan Tasks for Maven artifact org.destecs.core.xmlrpcextensions:xmlrpcserverextension:2.2.5-SNAPSHOT in source directory core/xmlrpcextensions/xmlrpcserverextension/src/main/java
[withMaven] openTasksPublisher - Scan Tasks for Maven artifact org.destecs.core:vdm:2.2.5-SNAPSHOT in source directory core/vdm/src/main/java
[withMaven] openTasksPublisher - Scan Tasks for Maven artifact org.destecs.ide:org.destecs.ide.core:2.2.5-SNAPSHOT in source directory ide/core/src/main/java
[withMaven] openTasksPublisher - Scan Tasks for Maven artifact org.destecs.ide:org.destecs.ide.simeng:2.2.5-SNAPSHOT in source directory ide/simeng/src/main/java
[withMaven] openTasksPublisher - Scan Tasks for Maven artifact org.destecs.ide:org.destecs.ide.ui:2.2.5-SNAPSHOT in source directory ide/ui/src/main/java
[withMaven] openTasksPublisher - Scan Tasks for Maven artifact org.destecs.ide:org.destecs.ide.debug:2.2.5-SNAPSHOT in source directory ide/debug/src/main/java
[withMaven] openTasksPublisher - Scan Tasks for Maven artifact org.destecs.ide:org.destecs.ide.vdmmetadatabuilder:2.2.5-SNAPSHOT in source directory ide/vdmmetadatabuilder/src/main/java
[withMaven] openTasksPublisher - Scan Tasks for Maven artifact org.destecs.ide:org.destecs.ide.libraries:2.2.5-SNAPSHOT in source directory ide/libraries/src/main/java
[withMaven] openTasksPublisher - Scan Tasks for Maven artifact org.destecs.ide:org.destecs.ide.platform:2.2.5-SNAPSHOT in source directory ide/platform/src/main/java
[TASKS] Scanning folder '/var/lib/jenkins/workspace/scendo-pipeline_development-6SEXP6NOH4DPMHNIAG2YUHD7VUTTPKSFIJJHDCPNLS2367EFMSNQ' for files matching the pattern 'core/xmlrpcextensions/xmlrpcbaseextension/src/main/java/**/*,tools/jprotocolgenerator/src/main/java/**/*,core/protocol/src/main/java/**/*,core/xmlrpcextensions/xmlrpcclientextension/src/main/java/**/*,core/simulationengine/src/main/java/**/*,core/xmlrpcextensions/xmlrpcserverextension/src/main/java/**/*,core/vdm/src/main/java/**/*,ide/core/src/main/java/**/*,ide/simeng/src/main/java/**/*,ide/ui/src/main/java/**/*,ide/debug/src/main/java/**/*,ide/vdmmetadatabuilder/src/main/java/**/*,ide/libraries/src/main/java/**/*,ide/platform/src/main/java/**/*' - excludes: null
[TASKS] Found 242 files to scan for tasks
[TASKS] Found 1 open tasks.
Skipping warnings blame since pipelines do not have an SCM link.%n
[TASKS] Computing warning deltas based on reference build #59
[Pipeline] // withMaven
[Pipeline] }
[Pipeline] // stage
[Pipeline] stage
[Pipeline] { (Reporting)
[Pipeline] emailextrecipients
Not sending mail to user casper.thule@eng.au.dk with no permission to view crescendo-pipeline » development #61[Pipeline] emailext
An attempt to send an e-mail to empty list of recipients, ignored.
[Pipeline] }
[Pipeline] // stage
[Pipeline] }
[Pipeline] // node
[Pipeline] End of Pipeline

GitHub has been notified of this commit’s build result

ERROR: script returned exit code 1
Finished: FAILURE