FailedConsole Output

Skipping 74 KB.. Full Log
750800
	Output valve = 0.0
Running from: 0.750800 to 0.800000
	Output valve = 0.0
Running from: 0.800000 to 0.800400
	Output valve = 0.0
Running from: 0.800400 to 0.800800
	Output valve = 0.0
Running from: 0.800800 to 0.850000
	Output valve = 0.0
Running from: 0.850000 to 0.850400
	Output valve = 0.0
Running from: 0.850400 to 0.850800
	Output valve = 0.0
Running from: 0.850800 to 0.900000
	Output valve = 0.0
Running from: 0.900000 to 0.900400
	Output valve = 0.0
Running from: 0.900400 to 0.900800
	Output valve = 0.0
Running from: 0.900800 to 0.950000
	Output valve = 0.0
Running from: 0.950000 to 0.950400
	Output valve = 0.0
Running from: 0.950400 to 0.950800
	Output valve = 0.0
Running from: 0.950800 to 1.000000
	Output valve = 0.0
Running from: 1.000000 to 1.000400
	Output valve = 0.0
Running from: 1.000400 to 1.000800
	Output valve = 0.0
Running from: 1.000800 to 1.050000
	Output valve = 0.0
Running from: 1.050000 to 1.050400
	Output valve = 0.0
Running from: 1.050400 to 1.050800
	Output valve = 0.0
Running from: 1.050800 to 1.100000
	Output valve = 0.0
Running from: 1.100000 to 1.100400
	Output valve = 0.0
Running from: 1.100400 to 1.100800
	Output valve = 0.0
Running from: 1.100800 to 1.150000
	Output valve = 0.0
Running from: 1.150000 to 1.150400
	Output valve = 0.0
Running from: 1.150400 to 1.150800
	Output valve = 0.0
Running from: 1.150800 to 1.200000
	Output valve = 0.0
Running from: 1.200000 to 1.200400
	Output valve = 0.0
Running from: 1.200400 to 1.200800
	Output valve = 0.0
Running from: 1.200800 to 1.250000
	Output valve = 0.0
Running from: 1.250000 to 1.250400
	Output valve = 0.0
Running from: 1.250400 to 1.250800
	Output valve = 0.0
Running from: 1.250800 to 1.300000
	Output valve = 0.0
Running from: 1.300000 to 1.300400
	Output valve = 0.0
Running from: 1.300400 to 1.300800
	Output valve = 0.0
Running from: 1.300800 to 1.350000
	Output valve = 0.0
Running from: 1.350000 to 1.350400
	Output valve = 0.0
Running from: 1.350400 to 1.350800
	Output valve = 0.0
Running from: 1.350800 to 1.400000
	Output valve = 0.0
Running from: 1.400000 to 1.400400
	Output valve = 0.0
Running from: 1.400400 to 1.400800
	Output valve = 0.0
Running from: 1.400800 to 1.450000
	Output valve = 0.0
Running from: 1.450000 to 1.450400
	Output valve = 0.0
Running from: 1.450400 to 1.450800
	Output valve = 0.0
Running from: 1.450800 to 1.500000
	Output valve = 0.0
Running from: 1.500000 to 1.500400
	Output valve = 0.0
Running from: 1.500400 to 1.500800
	Output valve = 0.0
Running from: 1.500800 to 1.550000
	Output valve = 0.0
Running from: 1.550000 to 1.550400
	Output valve = 0.0
Running from: 1.550400 to 1.550800
	Output valve = 0.0
Running from: 1.550800 to 1.600000
	Output valve = 0.0
Running from: 1.600000 to 1.600400
	Output valve = 0.0
Running from: 1.600400 to 1.600800
	Output valve = 0.0
Running from: 1.600800 to 1.650000
	Output valve = 0.0
Running from: 1.650000 to 1.650400
	Output valve = 0.0
Running from: 1.650400 to 1.650800
	Output valve = 0.0
Running from: 1.650800 to 1.700000
	Output valve = 0.0
Running from: 1.700000 to 1.700400
	Output valve = 0.0
Running from: 1.700400 to 1.700800
	Output valve = 0.0
Running from: 1.700800 to 1.750000
	Output valve = 0.0
Running from: 1.750000 to 1.750400
	Output valve = 0.0
Running from: 1.750400 to 1.750800
	Output valve = 0.0
Running from: 1.750800 to 1.800000
	Output valve = 0.0
Running from: 1.800000 to 1.800400
	Output valve = 0.0
Running from: 1.800400 to 1.800800
	Output valve = 0.0
Running from: 1.800800 to 1.850000
	Output valve = 0.0
Running from: 1.850000 to 1.850400
	Output valve = 0.0
Running from: 1.850400 to 1.850800
	Output valve = 0.0
Running from: 1.850800 to 1.900000
	Output valve = 0.0
Running from: 1.900000 to 1.900400
	Output valve = 0.0
Running from: 1.900400 to 1.900800
	Output valve = 0.0
Running from: 1.900800 to 1.950000
	Output valve = 0.0
Running from: 1.950000 to 1.950400
	Output valve = 0.0
Running from: 1.950400 to 1.950800
	Output valve = 0.0
Running from: 1.950800 to 2.000000
	Output valve = 0.0
Running from: 2.000000 to 2.000400
	Output valve = 0.0
Running from: 2.000400 to 2.000800
	Output valve = 0.0
Running from: 2.000800 to 2.050000
	Output valve = 0.0
Running from: 2.050000 to 2.050400
	Output valve = 0.0
Running from: 2.050400 to 2.050800
	Output valve = 0.0
Running from: 2.050800 to 2.100000
	Output valve = 0.0
Running from: 2.100000 to 2.100400
	Output valve = 0.0
Running from: 2.100400 to 2.100800
	Output valve = 0.0
Running from: 2.100800 to 2.150000
	Output valve = 0.0
Running from: 2.150000 to 2.150400
	Output valve = 0.0
Running from: 2.150400 to 2.150800
	Output valve = 0.0
Running from: 2.150800 to 2.200000
	Output valve = 0.0
Running from: 2.200000 to 2.200400
	Output valve = 0.0
Running from: 2.200400 to 2.200800
	Output valve = 0.0
Running from: 2.200800 to 2.250000
	Output valve = 0.0
Running from: 2.250000 to 2.250400
	Output valve = 0.0
Running from: 2.250400 to 2.250800
	Output valve = 0.0
Running from: 2.250800 to 2.300000
	Output valve = 0.0
Running from: 2.300000 to 2.300400
	Output valve = 0.0
Running from: 2.300400 to 2.300800
	Output valve = 0.0
Running from: 2.300800 to 2.350000
	Output valve = 0.0
Running from: 2.350000 to 2.350400
	Output valve = 0.0
Running from: 2.350400 to 2.350800
	Output valve = 0.0
Running from: 2.350800 to 2.400000
	Output valve = 0.0
Running from: 2.400000 to 2.400400
	Output valve = 0.0
Running from: 2.400400 to 2.400800
	Output valve = 0.0
Running from: 2.400800 to 2.450000
	Output valve = 0.0
Running from: 2.450000 to 2.450400
	Output valve = 0.0
Running from: 2.450400 to 2.450800
	Output valve = 0.0
Running from: 2.450800 to 2.500000
	Output valve = 0.0
Running from: 2.500000 to 2.500400
	Output valve = 0.0
Running from: 2.500400 to 2.500800
	Output valve = 0.0
Running from: 2.500800 to 2.550000
	Output valve = 0.0
Running from: 2.550000 to 2.550400
	Output valve = 0.0
Running from: 2.550400 to 2.550800
	Output valve = 0.0
Running from: 2.550800 to 2.600000
	Output valve = 0.0
Running from: 2.600000 to 2.600400
	Output valve = 0.0
Running from: 2.600400 to 2.600800
	Output valve = 0.0
Running from: 2.600800 to 2.650000
	Output valve = 0.0
Running from: 2.650000 to 2.650400
	Output valve = 0.0
Running from: 2.650400 to 2.650800
	Output valve = 0.0
Running from: 2.650800 to 2.700000
	Output valve = 0.0
Running from: 2.700000 to 2.700400
	Output valve = 0.0
Running from: 2.700400 to 2.700800
	Output valve = 0.0
Running from: 2.700800 to 2.750000
	Output valve = 0.0
Running from: 2.750000 to 2.750400
	Output valve = 0.0
Running from: 2.750400 to 2.750800
	Output valve = 0.0
Running from: 2.750800 to 2.800000
	Output valve = 0.0
Running from: 2.800000 to 2.800400
	Output valve = 0.0
Running from: 2.800400 to 2.800800
	Output valve = 0.0
Running from: 2.800800 to 2.850000
	Output valve = 0.0
Running from: 2.850000 to 2.850400
	Output valve = 0.0
Running from: 2.850400 to 2.850800
	Output valve = 0.0
Running from: 2.850800 to 2.900000
	Output valve = 0.0
Running from: 2.900000 to 2.900400
	Output valve = 0.0
Running from: 2.900400 to 2.900800
	Output valve = 0.0
Running from: 2.900800 to 2.950000
	Output valve = 0.0
Running from: 2.950000 to 2.950400
	Output valve = 0.0
Running from: 2.950400 to 2.950800
	Output valve = 0.0
Running from: 2.950800 to 3.000000
	Output valve = 0.0
Running from: 3.000000 to 3.000400
	Output valve = 0.0
Running from: 3.000400 to 3.000800
	Output valve = 0.0
Running from: 3.000800 to 3.050000
	Output valve = 0.0
Running from: 3.050000 to 3.050400
	Output valve = 0.0
Running from: 3.050400 to 3.050800
	Output valve = 0.0
Running from: 3.050800 to 3.100000
	Output valve = 0.0
Running from: 3.100000 to 3.100400
	Output valve = 0.0
Running from: 3.100400 to 3.100800
	Output valve = 0.0
Running from: 3.100800 to 3.150000
	Output valve = 0.0
Running from: 3.150000 to 3.150400
	Output valve = 0.0
Running from: 3.150400 to 3.150800
	Output valve = 0.0
Running from: 3.150800 to 3.200000
	Output valve = 0.0
Running from: 3.200000 to 3.200400
	Output valve = 0.0
Running from: 3.200400 to 3.200800
	Output valve = 0.0
Running from: 3.200800 to 3.250000
	Output valve = 0.0
Running from: 3.250000 to 3.250400
	Output valve = 0.0
Running from: 3.250400 to 3.250800
	Output valve = 0.0
Running from: 3.250800 to 3.300000
	Output valve = 0.0
Running from: 3.300000 to 3.300400
	Output valve = 0.0
Running from: 3.300400 to 3.300800
	Output valve = 0.0
Running from: 3.300800 to 3.350000
	Output valve = 0.0
Running from: 3.350000 to 3.350400
	Output valve = 0.0
Running from: 3.350400 to 3.350800
	Output valve = 0.0
Running from: 3.350800 to 3.400000
	Output valve = 0.0
Running from: 3.400000 to 3.400400
	Output valve = 0.0
Running from: 3.400400 to 3.400800
	Output valve = 0.0
Running from: 3.400800 to 3.450000
	Output valve = 0.0
Running from: 3.450000 to 3.450400
	Output valve = 0.0
Running from: 3.450400 to 3.450800
	Output valve = 0.0
Running from: 3.450800 to 3.500000
	Output valve = 0.0
Running from: 3.500000 to 3.500400
	Output valve = 0.0
Running from: 3.500400 to 3.500800
	Output valve = 0.0
Running from: 3.500800 to 3.550000
	Output valve = 0.0
Running from: 3.550000 to 3.550400
	Output valve = 0.0
Running from: 3.550400 to 3.550800
	Output valve = 0.0
Running from: 3.550800 to 3.600000
	Output valve = 0.0
Running from: 3.600000 to 3.600400
	Output valve = 0.0
Running from: 3.600400 to 3.600800
	Output valve = 0.0
Running from: 3.600800 to 3.650000
	Output valve = 0.0
Running from: 3.650000 to 3.650400
	Output valve = 0.0
Running from: 3.650400 to 3.650800
	Output valve = 0.0
Running from: 3.650800 to 3.700000
	Output valve = 0.0
Running from: 3.700000 to 3.700400
	Output valve = 0.0
Running from: 3.700400 to 3.700800
	Output valve = 0.0
Running from: 3.700800 to 3.750000
	Output valve = 0.0
Running from: 3.750000 to 3.750400
	Output valve = 0.0
Running from: 3.750400 to 3.750800
	Output valve = 0.0
Running from: 3.750800 to 3.800000
	Output valve = 0.0
Running from: 3.800000 to 3.800400
	Output valve = 0.0
Running from: 3.800400 to 3.800800
	Output valve = 0.0
Running from: 3.800800 to 3.850000
	Output valve = 0.0
Running from: 3.850000 to 3.850400
	Output valve = 0.0
Running from: 3.850400 to 3.850800
	Output valve = 0.0
Running from: 3.850800 to 3.900000
	Output valve = 0.0
Running from: 3.900000 to 3.900400
	Output valve = 0.0
Running from: 3.900400 to 3.900800
	Output valve = 0.0
Running from: 3.900800 to 3.950000
	Output valve = 0.0
Running from: 3.950000 to 3.950400
	Output valve = 0.0
Running from: 3.950400 to 3.950800
	Output valve = 0.0
Running from: 3.950800 to 4.000000
	Output valve = 0.0
Running from: 4.000000 to 4.000400
	Output valve = 0.0
Running from: 4.000400 to 4.000800
	Output valve = 0.0
Running from: 4.000800 to 4.050000
	Output valve = 0.0
Running from: 4.050000 to 4.050400
	Output valve = 0.0
Running from: 4.050400 to 4.050800
	Output valve = 0.0
Running from: 4.050800 to 4.100000
	Output valve = 0.0
Running from: 4.100000 to 4.100400
	Output valve = 0.0
Running from: 4.100400 to 4.100800
	Output valve = 0.0
Running from: 4.100800 to 4.150000
	Output valve = 0.0
Running from: 4.150000 to 4.150400
	Output valve = 0.0
Running from: 4.150400 to 4.150800
	Output valve = 0.0
Running from: 4.150800 to 4.200000
	Output valve = 0.0
Running from: 4.200000 to 4.200400
	Output valve = 0.0
Running from: 4.200400 to 4.200800
	Output valve = 0.0
Running from: 4.200800 to 4.250000
	Output valve = 0.0
Running from: 4.250000 to 4.250400
	Output valve = 0.0
Running from: 4.250400 to 4.250800
	Output valve = 0.0
Running from: 4.250800 to 4.300000
	Output valve = 0.0
Running from: 4.300000 to 4.300400
	Output valve = 0.0
Running from: 4.300400 to 4.300800
	Output valve = 0.0
Running from: 4.300800 to 4.350000
	Output valve = 0.0
Running from: 4.350000 to 4.350400
	Output valve = 0.0
Running from: 4.350400 to 4.350800
	Output valve = 0.0
Running from: 4.350800 to 4.400000
	Output valve = 0.0
Running from: 4.400000 to 4.400400
	Output valve = 0.0
Running from: 4.400400 to 4.400800
	Output valve = 0.0
Running from: 4.400800 to 4.450000
	Output valve = 0.0
Running from: 4.450000 to 4.450400
	Output valve = 0.0
Running from: 4.450400 to 4.450800
	Output valve = 0.0
Running from: 4.450800 to 4.500000
	Output valve = 0.0
Running from: 4.500000 to 4.500400
	Output valve = 0.0
Running from: 4.500400 to 4.500800
	Output valve = 0.0
Running from: 4.500800 to 4.550000
	Output valve = 0.0
Running from: 4.550000 to 4.550400
	Output valve = 0.0
Running from: 4.550400 to 4.550800
	Output valve = 0.0
Running from: 4.550800 to 4.600000
	Output valve = 0.0
Running from: 4.600000 to 4.600400
	Output valve = 0.0
Running from: 4.600400 to 4.600800
	Output valve = 0.0
Running from: 4.600800 to 4.650000
	Output valve = 0.0
Running from: 4.650000 to 4.650400
	Output valve = 0.0
Running from: 4.650400 to 4.650800
	Output valve = 0.0
Running from: 4.650800 to 4.700000
	Output valve = 0.0
Running from: 4.700000 to 4.700400
	Output valve = 0.0
Running from: 4.700400 to 4.700800
	Output valve = 0.0
Running from: 4.700800 to 4.750000
	Output valve = 0.0
Running from: 4.750000 to 4.750400
	Output valve = 0.0
Running from: 4.750400 to 4.750800
	Output valve = 0.0
Running from: 4.750800 to 4.800000
	Output valve = 0.0
Running from: 4.800000 to 4.800400
	Output valve = 0.0
Running from: 4.800400 to 4.800800
	Output valve = 0.0
Running from: 4.800800 to 4.850000
	Output valve = 0.0
Running from: 4.850000 to 4.850400
	Output valve = 0.0
Running from: 4.850400 to 4.850800
	Output valve = 0.0
Running from: 4.850800 to 4.900000
	Output valve = 0.0
Running from: 4.900000 to 4.900400
	Output valve = 0.0
Running from: 4.900400 to 4.900800
	Output valve = 0.0
Running from: 4.900800 to 4.950000
	Output valve = 0.0
Running from: 4.950000 to 4.950400
	Output valve = 0.0
Running from: 4.950400 to 4.950800
	Output valve = 0.0
Running from: 4.950800 to 5.000000
	Output valve = 0.0
Tests run: 1, Failures: 0, Errors: 0, Skipped: 0, Time elapsed: 1.577 sec

Results :

Tests run: 1, Failures: 0, Errors: 0, Skipped: 0

[INFO] 
[INFO] --- maven-jar-plugin:2.4:jar (default-jar) @ vdm ---
[INFO] Building jar: /var/lib/jenkins/workspace/crescendo-pipeline_master-CP6XM76MSAFTBEKNXNTUPPF3MNVQTIVFT4XWG7O5T5XCURBKSRNA/core/vdm/target/vdm-2.2.4.jar
[INFO] 
[INFO] --- maven-source-plugin:2.1.1:jar-no-fork (attach-sources) @ vdm ---
[INFO] Building jar: /var/lib/jenkins/workspace/crescendo-pipeline_master-CP6XM76MSAFTBEKNXNTUPPF3MNVQTIVFT4XWG7O5T5XCURBKSRNA/core/vdm/target/vdm-2.2.4-sources.jar
[INFO] 
[INFO] --- maven-install-plugin:2.5.2:install (default-install) @ vdm ---
[INFO] Installing /var/lib/jenkins/workspace/crescendo-pipeline_master-CP6XM76MSAFTBEKNXNTUPPF3MNVQTIVFT4XWG7O5T5XCURBKSRNA/core/vdm/target/vdm-2.2.4.jar to /var/lib/jenkins/workspace/crescendo-pipeline_master-CP6XM76MSAFTBEKNXNTUPPF3MNVQTIVFT4XWG7O5T5XCURBKSRNA/.repository/org/destecs/core/vdm/2.2.4/vdm-2.2.4.jar
[INFO] Installing /var/lib/jenkins/workspace/crescendo-pipeline_master-CP6XM76MSAFTBEKNXNTUPPF3MNVQTIVFT4XWG7O5T5XCURBKSRNA/core/vdm/pom.xml to /var/lib/jenkins/workspace/crescendo-pipeline_master-CP6XM76MSAFTBEKNXNTUPPF3MNVQTIVFT4XWG7O5T5XCURBKSRNA/.repository/org/destecs/core/vdm/2.2.4/vdm-2.2.4.pom
[INFO] Installing /var/lib/jenkins/workspace/crescendo-pipeline_master-CP6XM76MSAFTBEKNXNTUPPF3MNVQTIVFT4XWG7O5T5XCURBKSRNA/core/vdm/target/vdm-2.2.4-sources.jar to /var/lib/jenkins/workspace/crescendo-pipeline_master-CP6XM76MSAFTBEKNXNTUPPF3MNVQTIVFT4XWG7O5T5XCURBKSRNA/.repository/org/destecs/core/vdm/2.2.4/vdm-2.2.4-sources.jar
[INFO]                                                                         
[INFO] ------------------------------------------------------------------------
[INFO] Building DESTECS IDE Top-level 2.2.4
[INFO] ------------------------------------------------------------------------
[INFO] 
[INFO] --- maven-javadoc-plugin:2.9:jar (attach-javadocs) @ ide ---
[INFO] Downloading: http://overture.au.dk/artifactory/remote-repos/org/apache/maven/shared/maven-invoker/2.0.9/maven-invoker-2.0.9.pom
[INFO] Downloaded: http://overture.au.dk/artifactory/remote-repos/org/apache/maven/shared/maven-invoker/2.0.9/maven-invoker-2.0.9.pom (6 KB at 217.0 KB/sec)
[INFO] Downloading: http://overture.au.dk/artifactory/remote-repos/org/apache/maven/shared/maven-common-artifact-filters/1.3/maven-common-artifact-filters-1.3.pom
[INFO] Downloaded: http://overture.au.dk/artifactory/remote-repos/org/apache/maven/shared/maven-common-artifact-filters/1.3/maven-common-artifact-filters-1.3.pom (4 KB at 164.3 KB/sec)
[INFO] Downloading: http://overture.au.dk/artifactory/remote-repos/org/apache/maven/shared/maven-shared-components/12/maven-shared-components-12.pom
[INFO] Downloaded: http://overture.au.dk/artifactory/remote-repos/org/apache/maven/shared/maven-shared-components/12/maven-shared-components-12.pom (10 KB at 455.9 KB/sec)
[INFO] Downloading: http://overture.au.dk/artifactory/remote-repos/org/apache/maven/maven-plugin-api/2.0.8/maven-plugin-api-2.0.8.pom
[INFO] Downloaded: http://overture.au.dk/artifactory/remote-repos/org/apache/maven/maven-plugin-api/2.0.8/maven-plugin-api-2.0.8.pom (2 KB at 52.1 KB/sec)
[INFO] Downloading: http://overture.au.dk/artifactory/remote-repos/org/apache/maven/doxia/doxia-site-renderer/1.0/doxia-site-renderer-1.0.pom
[INFO] Downloaded: http://overture.au.dk/artifactory/remote-repos/org/apache/maven/doxia/doxia-site-renderer/1.0/doxia-site-renderer-1.0.pom (5 KB at 227.5 KB/sec)
[INFO] Downloading: http://overture.au.dk/artifactory/remote-repos/org/apache/maven/doxia/doxia-sitetools/1.0/doxia-sitetools-1.0.pom
[INFO] Downloaded: http://overture.au.dk/artifactory/remote-repos/org/apache/maven/doxia/doxia-sitetools/1.0/doxia-sitetools-1.0.pom (10 KB at 585.1 KB/sec)
[INFO] Downloading: http://overture.au.dk/artifactory/remote-repos/org/apache/maven/doxia/doxia-core/1.0/doxia-core-1.0.pom
[INFO] Downloaded: http://overture.au.dk/artifactory/remote-repos/org/apache/maven/doxia/doxia-core/1.0/doxia-core-1.0.pom (3 KB at 129.9 KB/sec)
[INFO] Downloading: http://overture.au.dk/artifactory/remote-repos/org/codehaus/plexus/plexus-utils/1.5.7/plexus-utils-1.5.7.pom
[INFO] Downloaded: http://overture.au.dk/artifactory/remote-repos/org/codehaus/plexus/plexus-utils/1.5.7/plexus-utils-1.5.7.pom (8 KB at 357.9 KB/sec)
[INFO] Downloading: http://overture.au.dk/artifactory/remote-repos/org/apache/maven/doxia/doxia-decoration-model/1.0/doxia-decoration-model-1.0.pom
[INFO] Downloaded: http://overture.au.dk/artifactory/remote-repos/org/apache/maven/doxia/doxia-decoration-model/1.0/doxia-decoration-model-1.0.pom (4 KB at 192.5 KB/sec)
[INFO] Downloading: http://overture.au.dk/artifactory/remote-repos/org/apache/maven/doxia/doxia-module-apt/1.0/doxia-module-apt-1.0.pom
[INFO] Downloaded: http://overture.au.dk/artifactory/remote-repos/org/apache/maven/doxia/doxia-module-apt/1.0/doxia-module-apt-1.0.pom (3 KB at 137.5 KB/sec)
[INFO] Downloading: http://overture.au.dk/artifactory/remote-repos/org/apache/maven/doxia/doxia-modules/1.0/doxia-modules-1.0.pom
[INFO] Downloaded: http://overture.au.dk/artifactory/remote-repos/org/apache/maven/doxia/doxia-modules/1.0/doxia-modules-1.0.pom (3 KB at 155.9 KB/sec)
[INFO] Downloading: http://overture.au.dk/artifactory/remote-repos/org/apache/maven/doxia/doxia-module-fml/1.0/doxia-module-fml-1.0.pom
[INFO] Downloaded: http://overture.au.dk/artifactory/remote-repos/org/apache/maven/doxia/doxia-module-fml/1.0/doxia-module-fml-1.0.pom (3 KB at 175.3 KB/sec)
[INFO] Downloading: http://overture.au.dk/artifactory/remote-repos/org/apache/maven/doxia/doxia-module-xdoc/1.0/doxia-module-xdoc-1.0.pom
[INFO] Downloaded: http://overture.au.dk/artifactory/remote-repos/org/apache/maven/doxia/doxia-module-xdoc/1.0/doxia-module-xdoc-1.0.pom (3 KB at 121.6 KB/sec)
[INFO] Downloading: http://overture.au.dk/artifactory/remote-repos/org/apache/maven/doxia/doxia-module-xhtml/1.0/doxia-module-xhtml-1.0.pom
[INFO] Downloaded: http://overture.au.dk/artifactory/remote-repos/org/apache/maven/doxia/doxia-module-xhtml/1.0/doxia-module-xhtml-1.0.pom (2 KB at 62.5 KB/sec)
[INFO] Downloading: http://overture.au.dk/artifactory/remote-repos/org/apache/maven/wagon/wagon-provider-api/1.0-beta-6/wagon-provider-api-1.0-beta-6.pom
[INFO] Downloaded: http://overture.au.dk/artifactory/remote-repos/org/apache/maven/wagon/wagon-provider-api/1.0-beta-6/wagon-provider-api-1.0-beta-6.pom (2 KB at 95.5 KB/sec)
[INFO] Downloading: http://overture.au.dk/artifactory/remote-repos/org/apache/maven/wagon/wagon/1.0-beta-6/wagon-1.0-beta-6.pom
[INFO] Downloaded: http://overture.au.dk/artifactory/remote-repos/org/apache/maven/wagon/wagon/1.0-beta-6/wagon-1.0-beta-6.pom (13 KB at 672.0 KB/sec)
[INFO] Downloading: http://overture.au.dk/artifactory/remote-repos/log4j/log4j/1.2.14/log4j-1.2.14.pom
[INFO] Downloaded: http://overture.au.dk/artifactory/remote-repos/log4j/log4j/1.2.14/log4j-1.2.14.pom (3 KB at 89.2 KB/sec)
[INFO] Downloading: http://overture.au.dk/artifactory/remote-repos/com/thoughtworks/qdox/qdox/1.12/qdox-1.12.pom
[INFO] Downloaded: http://overture.au.dk/artifactory/remote-repos/com/thoughtworks/qdox/qdox/1.12/qdox-1.12.pom (19 KB at 604.0 KB/sec)
[INFO] Downloading: http://overture.au.dk/artifactory/remote-repos/org/codehaus/plexus/plexus-archiver/2.1.2/plexus-archiver-2.1.2.pom
[INFO] Downloaded: http://overture.au.dk/artifactory/remote-repos/org/codehaus/plexus/plexus-archiver/2.1.2/plexus-archiver-2.1.2.pom (4 KB at 111.7 KB/sec)
[INFO] Downloading: http://overture.au.dk/artifactory/remote-repos/org/codehaus/plexus/plexus-utils/3.0.2/plexus-utils-3.0.2.pom
[INFO] Downloaded: http://overture.au.dk/artifactory/remote-repos/org/codehaus/plexus/plexus-utils/3.0.2/plexus-utils-3.0.2.pom (3 KB at 144.3 KB/sec)
[INFO] Downloading: http://overture.au.dk/artifactory/remote-repos/org/codehaus/plexus/plexus-io/2.0.4/plexus-io-2.0.4.pom
[INFO] Downloaded: http://overture.au.dk/artifactory/remote-repos/org/codehaus/plexus/plexus-io/2.0.4/plexus-io-2.0.4.pom (2 KB at 62.7 KB/sec)
[INFO] Downloading: http://overture.au.dk/artifactory/remote-repos/org/codehaus/plexus/plexus-utils/3.0.5/plexus-utils-3.0.5.pom
[INFO] Downloaded: http://overture.au.dk/artifactory/remote-repos/org/codehaus/plexus/plexus-utils/3.0.5/plexus-utils-3.0.5.pom (3 KB at 84.6 KB/sec)
[INFO] Downloading: http://overture.au.dk/artifactory/remote-repos/org/apache/maven/maven-core/2.2.1/maven-core-2.2.1.jar
[INFO] Downloading: http://overture.au.dk/artifactory/remote-repos/org/apache/maven/maven-plugin-parameter-documenter/2.2.1/maven-plugin-parameter-documenter-2.2.1.jar
[INFO] Downloading: http://overture.au.dk/artifactory/remote-repos/org/slf4j/slf4j-jdk14/1.5.6/slf4j-jdk14-1.5.6.jar
[INFO] Downloading: http://overture.au.dk/artifactory/remote-repos/org/slf4j/slf4j-api/1.5.6/slf4j-api-1.5.6.jar
[INFO] Downloading: http://overture.au.dk/artifactory/remote-repos/org/slf4j/jcl-over-slf4j/1.5.6/jcl-over-slf4j-1.5.6.jar
[INFO] Downloaded: http://overture.au.dk/artifactory/remote-repos/org/slf4j/slf4j-jdk14/1.5.6/slf4j-jdk14-1.5.6.jar (9 KB at 246.0 KB/sec)
[INFO] Downloading: http://overture.au.dk/artifactory/remote-repos/org/apache/maven/maven-error-diagnostics/2.2.1/maven-error-diagnostics-2.2.1.jar
[INFO] Downloaded: http://overture.au.dk/artifactory/remote-repos/org/slf4j/slf4j-api/1.5.6/slf4j-api-1.5.6.jar (22 KB at 545.4 KB/sec)
[INFO] Downloading: http://overture.au.dk/artifactory/remote-repos/commons-cli/commons-cli/1.2/commons-cli-1.2.jar
[INFO] Downloaded: http://overture.au.dk/artifactory/remote-repos/org/apache/maven/maven-plugin-parameter-documenter/2.2.1/maven-plugin-parameter-documenter-2.2.1.jar (22 KB at 492.5 KB/sec)
[INFO] Downloading: http://overture.au.dk/artifactory/remote-repos/org/apache/maven/maven-monitor/2.2.1/maven-monitor-2.2.1.jar
[INFO] Downloaded: http://overture.au.dk/artifactory/remote-repos/org/slf4j/jcl-over-slf4j/1.5.6/jcl-over-slf4j-1.5.6.jar (17 KB at 347.4 KB/sec)
[INFO] Downloading: http://overture.au.dk/artifactory/remote-repos/org/apache/maven/shared/maven-invoker/2.0.9/maven-invoker-2.0.9.jar
[INFO] Downloaded: http://overture.au.dk/artifactory/remote-repos/org/apache/maven/maven-core/2.2.1/maven-core-2.2.1.jar (174 KB at 2592.8 KB/sec)
[INFO] Downloading: http://overture.au.dk/artifactory/remote-repos/org/apache/maven/shared/maven-common-artifact-filters/1.3/maven-common-artifact-filters-1.3.jar
[INFO] Downloaded: http://overture.au.dk/artifactory/remote-repos/org/apache/maven/maven-error-diagnostics/2.2.1/maven-error-diagnostics-2.2.1.jar (13 KB at 208.5 KB/sec)
[INFO] Downloading: http://overture.au.dk/artifactory/remote-repos/org/apache/maven/doxia/doxia-sink-api/1.0/doxia-sink-api-1.0.jar
[INFO] Downloaded: http://overture.au.dk/artifactory/remote-repos/commons-cli/commons-cli/1.2/commons-cli-1.2.jar (41 KB at 590.6 KB/sec)
[INFO] Downloading: http://overture.au.dk/artifactory/remote-repos/org/apache/maven/doxia/doxia-site-renderer/1.0/doxia-site-renderer-1.0.jar
[INFO] Downloaded: http://overture.au.dk/artifactory/remote-repos/org/apache/maven/maven-monitor/2.2.1/maven-monitor-2.2.1.jar (11 KB at 139.9 KB/sec)
[INFO] Downloading: http://overture.au.dk/artifactory/remote-repos/org/apache/maven/doxia/doxia-core/1.0/doxia-core-1.0.jar
[INFO] Downloaded: http://overture.au.dk/artifactory/remote-repos/org/apache/maven/shared/maven-invoker/2.0.9/maven-invoker-2.0.9.jar (28 KB at 349.6 KB/sec)
[INFO] Downloading: http://overture.au.dk/artifactory/remote-repos/org/apache/maven/doxia/doxia-decoration-model/1.0/doxia-decoration-model-1.0.jar
[INFO] Downloaded: http://overture.au.dk/artifactory/remote-repos/org/apache/maven/doxia/doxia-sink-api/1.0/doxia-sink-api-1.0.jar (10 KB at 108.1 KB/sec)
[INFO] Downloading: http://overture.au.dk/artifactory/remote-repos/commons-collections/commons-collections/3.2/commons-collections-3.2.jar
[INFO] Downloaded: http://overture.au.dk/artifactory/remote-repos/org/apache/maven/shared/maven-common-artifact-filters/1.3/maven-common-artifact-filters-1.3.jar (31 KB at 309.5 KB/sec)
[INFO] Downloading: http://overture.au.dk/artifactory/remote-repos/org/apache/maven/doxia/doxia-module-apt/1.0/doxia-module-apt-1.0.jar
[INFO] Downloaded: http://overture.au.dk/artifactory/remote-repos/org/apache/maven/doxia/doxia-core/1.0/doxia-core-1.0.jar (54 KB at 501.5 KB/sec)
[INFO] Downloading: http://overture.au.dk/artifactory/remote-repos/org/apache/maven/doxia/doxia-module-fml/1.0/doxia-module-fml-1.0.jar
[INFO] Downloaded: http://overture.au.dk/artifactory/remote-repos/org/apache/maven/doxia/doxia-site-renderer/1.0/doxia-site-renderer-1.0.jar (46 KB at 420.6 KB/sec)
[INFO] Downloading: http://overture.au.dk/artifactory/remote-repos/org/apache/maven/doxia/doxia-module-xdoc/1.0/doxia-module-xdoc-1.0.jar
[INFO] Downloaded: http://overture.au.dk/artifactory/remote-repos/org/apache/maven/doxia/doxia-decoration-model/1.0/doxia-decoration-model-1.0.jar (48 KB at 412.4 KB/sec)
[INFO] Downloading: http://overture.au.dk/artifactory/remote-repos/org/apache/maven/doxia/doxia-module-xhtml/1.0/doxia-module-xhtml-1.0.jar
[INFO] Downloaded: http://overture.au.dk/artifactory/remote-repos/org/apache/maven/doxia/doxia-module-xhtml/1.0/doxia-module-xhtml-1.0.jar (22 KB at 161.3 KB/sec)
[INFO] Downloading: http://overture.au.dk/artifactory/remote-repos/org/apache/maven/wagon/wagon-provider-api/1.0-beta-6/wagon-provider-api-1.0-beta-6.jar
[INFO] Downloaded: http://overture.au.dk/artifactory/remote-repos/org/apache/maven/doxia/doxia-module-xdoc/1.0/doxia-module-xdoc-1.0.jar (28 KB at 204.1 KB/sec)
[INFO] Downloading: http://overture.au.dk/artifactory/remote-repos/commons-httpclient/commons-httpclient/3.1/commons-httpclient-3.1.jar
[INFO] Downloaded: http://overture.au.dk/artifactory/remote-repos/org/apache/maven/doxia/doxia-module-fml/1.0/doxia-module-fml-1.0.jar (19 KB at 131.2 KB/sec)
[INFO] Downloading: http://overture.au.dk/artifactory/remote-repos/commons-codec/commons-codec/1.2/commons-codec-1.2.jar
[INFO] Downloaded: http://overture.au.dk/artifactory/remote-repos/commons-codec/commons-codec/1.2/commons-codec-1.2.jar (30 KB at 181.4 KB/sec)
[INFO] Downloading: http://overture.au.dk/artifactory/remote-repos/commons-logging/commons-logging/1.1.1/commons-logging-1.1.1.jar
[INFO] Downloaded: http://overture.au.dk/artifactory/remote-repos/org/apache/maven/wagon/wagon-provider-api/1.0-beta-6/wagon-provider-api-1.0-beta-6.jar (52 KB at 316.7 KB/sec)
[INFO] Downloading: http://overture.au.dk/artifactory/remote-repos/log4j/log4j/1.2.14/log4j-1.2.14.jar
[INFO] Downloaded: http://overture.au.dk/artifactory/remote-repos/commons-collections/commons-collections/3.2/commons-collections-3.2.jar (558 KB at 3340.5 KB/sec)
[INFO] Downloading: http://overture.au.dk/artifactory/remote-repos/com/thoughtworks/qdox/qdox/1.12/qdox-1.12.jar
[INFO] Downloaded: http://overture.au.dk/artifactory/remote-repos/org/apache/maven/doxia/doxia-module-apt/1.0/doxia-module-apt-1.0.jar (46 KB at 272.0 KB/sec)
[INFO] Downloading: http://overture.au.dk/artifactory/remote-repos/org/codehaus/plexus/plexus-archiver/2.1.2/plexus-archiver-2.1.2.jar
[INFO] Downloaded: http://overture.au.dk/artifactory/remote-repos/commons-httpclient/commons-httpclient/3.1/commons-httpclient-3.1.jar (298 KB at 1504.3 KB/sec)
[INFO] Downloading: http://overture.au.dk/artifactory/remote-repos/org/codehaus/plexus/plexus-io/2.0.4/plexus-io-2.0.4.jar
[INFO] Downloaded: http://overture.au.dk/artifactory/remote-repos/commons-logging/commons-logging/1.1.1/commons-logging-1.1.1.jar (60 KB at 293.4 KB/sec)
[INFO] Downloading: http://overture.au.dk/artifactory/remote-repos/org/codehaus/plexus/plexus-utils/3.0.5/plexus-utils-3.0.5.jar
[INFO] Downloaded: http://overture.au.dk/artifactory/remote-repos/com/thoughtworks/qdox/qdox/1.12/qdox-1.12.jar (176 KB at 864.6 KB/sec)
[INFO] Downloaded: http://overture.au.dk/artifactory/remote-repos/org/codehaus/plexus/plexus-archiver/2.1.2/plexus-archiver-2.1.2.jar (181 KB at 855.6 KB/sec)
[INFO] Downloaded: http://overture.au.dk/artifactory/remote-repos/log4j/log4j/1.2.14/log4j-1.2.14.jar (359 KB at 1638.5 KB/sec)
[INFO] Downloaded: http://overture.au.dk/artifactory/remote-repos/org/codehaus/plexus/plexus-io/2.0.4/plexus-io-2.0.4.jar (57 KB at 255.2 KB/sec)
[INFO] Downloaded: http://overture.au.dk/artifactory/remote-repos/org/codehaus/plexus/plexus-utils/3.0.5/plexus-utils-3.0.5.jar (226 KB at 922.3 KB/sec)
[INFO] Skipping javadoc generation
[INFO] 
[INFO] --- maven-install-plugin:2.5.2:install (default-install) @ ide ---
[INFO] Installing /var/lib/jenkins/workspace/crescendo-pipeline_master-CP6XM76MSAFTBEKNXNTUPPF3MNVQTIVFT4XWG7O5T5XCURBKSRNA/ide/pom.xml to /var/lib/jenkins/workspace/crescendo-pipeline_master-CP6XM76MSAFTBEKNXNTUPPF3MNVQTIVFT4XWG7O5T5XCURBKSRNA/.repository/org/destecs/ide/2.2.4/ide-2.2.4.pom
[INFO]                                                                         
[INFO] ------------------------------------------------------------------------
[INFO] Building org.destecs.ide.core 2.2.4
[INFO] ------------------------------------------------------------------------
[INFO] 
[INFO] --- tycho-packaging-plugin:0.25.0:build-qualifier (default-build-qualifier) @ org.destecs.ide.core ---
[INFO] The project's OSGi version is 2.2.4
[INFO] 
[INFO] --- tycho-packaging-plugin:0.25.0:validate-id (default-validate-id) @ org.destecs.ide.core ---
[INFO] 
[INFO] --- tycho-packaging-plugin:0.25.0:validate-version (default-validate-version) @ org.destecs.ide.core ---
[INFO] 
[INFO] --- maven-dependency-plugin:2.6:copy (copy-dependencies) @ org.destecs.ide.core ---
[INFO] Downloading: http://overture.au.dk/artifactory/remote-repos/org/apache/maven/reporting/maven-reporting-impl/2.0.5/maven-reporting-impl-2.0.5.pom
[INFO] Downloaded: http://overture.au.dk/artifactory/remote-repos/org/apache/maven/reporting/maven-reporting-impl/2.0.5/maven-reporting-impl-2.0.5.pom (5 KB at 152.7 KB/sec)
[INFO] Downloading: http://overture.au.dk/artifactory/remote-repos/org/apache/maven/shared/maven-doxia-tools/1.0.2/maven-doxia-tools-1.0.2.pom
[INFO] Downloaded: http://overture.au.dk/artifactory/remote-repos/org/apache/maven/shared/maven-doxia-tools/1.0.2/maven-doxia-tools-1.0.2.pom (6 KB at 301.4 KB/sec)
[INFO] Downloading: http://overture.au.dk/artifactory/remote-repos/org/apache/maven/shared/maven-shared-components/11/maven-shared-components-11.pom
[INFO] Downloaded: http://overture.au.dk/artifactory/remote-repos/org/apache/maven/shared/maven-shared-components/11/maven-shared-components-11.pom (9 KB at 354.2 KB/sec)
[INFO] Downloading: http://overture.au.dk/artifactory/remote-repos/org/codehaus/plexus/plexus-archiver/2.2/plexus-archiver-2.2.pom
[INFO] Downloaded: http://overture.au.dk/artifactory/remote-repos/org/codehaus/plexus/plexus-archiver/2.2/plexus-archiver-2.2.pom (4 KB at 49.8 KB/sec)
[INFO] Downloading: http://overture.au.dk/artifactory/remote-repos/org/codehaus/plexus/plexus-components/1.1.20/plexus-components-1.1.20.pom
[INFO] Downloaded: http://overture.au.dk/artifactory/remote-repos/org/codehaus/plexus/plexus-components/1.1.20/plexus-components-1.1.20.pom (3 KB at 109.2 KB/sec)
[INFO] Downloading: http://overture.au.dk/artifactory/remote-repos/org/codehaus/plexus/plexus-utils/3.0.9/plexus-utils-3.0.9.pom
[INFO] Downloaded: http://overture.au.dk/artifactory/remote-repos/org/codehaus/plexus/plexus-utils/3.0.9/plexus-utils-3.0.9.pom (4 KB at 127.8 KB/sec)
[INFO] Downloading: http://overture.au.dk/artifactory/remote-repos/org/apache/maven/shared/file-management/1.2.1/file-management-1.2.1.pom
[INFO] Downloaded: http://overture.au.dk/artifactory/remote-repos/org/apache/maven/shared/file-management/1.2.1/file-management-1.2.1.pom (4 KB at 172.3 KB/sec)
[INFO] Downloading: http://overture.au.dk/artifactory/remote-repos/org/apache/maven/shared/maven-shared-io/1.1/maven-shared-io-1.1.pom
[INFO] Downloaded: http://overture.au.dk/artifactory/remote-repos/org/apache/maven/shared/maven-shared-io/1.1/maven-shared-io-1.1.pom (4 KB at 172.4 KB/sec)
[INFO] Downloading: http://overture.au.dk/artifactory/remote-repos/org/codehaus/plexus/plexus-io/2.0.6/plexus-io-2.0.6.pom
[INFO] Downloaded: http://overture.au.dk/artifactory/remote-repos/org/codehaus/plexus/plexus-io/2.0.6/plexus-io-2.0.6.pom (3 KB at 120.0 KB/sec)
[INFO] Downloading: http://overture.au.dk/artifactory/remote-repos/org/apache/maven/shared/maven-dependency-analyzer/1.3/maven-dependency-analyzer-1.3.pom
[INFO] Downloaded: http://overture.au.dk/artifactory/remote-repos/org/apache/maven/shared/maven-dependency-analyzer/1.3/maven-dependency-analyzer-1.3.pom (6 KB at 147.9 KB/sec)
[INFO] Downloading: http://overture.au.dk/artifactory/remote-repos/asm/asm/3.3.1/asm-3.3.1.pom
[INFO] Downloaded: http://overture.au.dk/artifactory/remote-repos/asm/asm/3.3.1/asm-3.3.1.pom (266 B at 8.4 KB/sec)
[INFO] Downloading: http://overture.au.dk/artifactory/remote-repos/asm/asm-parent/3.3.1/asm-parent-3.3.1.pom
[INFO] Downloaded: http://overture.au.dk/artifactory/remote-repos/asm/asm-parent/3.3.1/asm-parent-3.3.1.pom (5 KB at 183.9 KB/sec)
[INFO] Downloading: http://overture.au.dk/artifactory/remote-repos/org/apache/maven/maven-project/2.0.5/maven-project-2.0.5.pom
[INFO] Downloaded: http://overture.au.dk/artifactory/remote-repos/org/apache/maven/maven-project/2.0.5/maven-project-2.0.5.pom (2 KB at 64.2 KB/sec)
[INFO] Downloading: http://overture.au.dk/artifactory/remote-repos/org/apache/maven/maven/2.0.5/maven-2.0.5.pom
[INFO] Downloaded: http://overture.au.dk/artifactory/remote-repos/org/apache/maven/maven/2.0.5/maven-2.0.5.pom (6 KB at 278.5 KB/sec)
[INFO] Downloading: http://overture.au.dk/artifactory/remote-repos/org/apache/maven/maven-settings/2.0.5/maven-settings-2.0.5.pom
[INFO] Downloaded: http://overture.au.dk/artifactory/remote-repos/org/apache/maven/maven-settings/2.0.5/maven-settings-2.0.5.pom (2 KB at 56.4 KB/sec)
[INFO] Downloading: http://overture.au.dk/artifactory/remote-repos/org/apache/maven/maven-model/2.0.5/maven-model-2.0.5.pom
[INFO] Downloaded: http://overture.au.dk/artifactory/remote-repos/org/apache/maven/maven-model/2.0.5/maven-model-2.0.5.pom (3 KB at 139.9 KB/sec)
[INFO] Downloading: http://overture.au.dk/artifactory/remote-repos/org/apache/maven/maven-profile/2.0.5/maven-profile-2.0.5.pom
[INFO] Downloaded: http://overture.au.dk/artifactory/remote-repos/org/apache/maven/maven-profile/2.0.5/maven-profile-2.0.5.pom (2 KB at 95.1 KB/sec)
[INFO] Downloading: http://overture.au.dk/artifactory/remote-repos/org/apache/maven/maven-artifact-manager/2.0.5/maven-artifact-manager-2.0.5.pom
[INFO] Downloaded: http://overture.au.dk/artifactory/remote-repos/org/apache/maven/maven-artifact-manager/2.0.5/maven-artifact-manager-2.0.5.pom (2 KB at 77.9 KB/sec)
[INFO] Downloading: http://overture.au.dk/artifactory/remote-repos/org/apache/maven/maven-repository-metadata/2.0.5/maven-repository-metadata-2.0.5.pom
[INFO] Downloaded: http://overture.au.dk/artifactory/remote-repos/org/apache/maven/maven-repository-metadata/2.0.5/maven-repository-metadata-2.0.5.pom (2 KB at 66.0 KB/sec)
[INFO] Downloading: http://overture.au.dk/artifactory/remote-repos/org/apache/maven/maven-artifact/2.0.5/maven-artifact-2.0.5.pom
[INFO] Downloaded: http://overture.au.dk/artifactory/remote-repos/org/apache/maven/maven-artifact/2.0.5/maven-artifact-2.0.5.pom (727 B at 32.3 KB/sec)
[INFO] Downloading: http://overture.au.dk/artifactory/remote-repos/org/apache/maven/shared/maven-dependency-tree/2.0/maven-dependency-tree-2.0.pom
[INFO] Downloaded: http://overture.au.dk/artifactory/remote-repos/org/apache/maven/shared/maven-dependency-tree/2.0/maven-dependency-tree-2.0.pom (5 KB at 240.1 KB/sec)
[INFO] Downloading: http://overture.au.dk/artifactory/remote-repos/org/apache/maven/maven-project/2.2.0/maven-project-2.2.0.pom
[INFO] Downloaded: http://overture.au.dk/artifactory/remote-repos/org/apache/maven/maven-project/2.2.0/maven-project-2.2.0.pom (3 KB at 90.3 KB/sec)
[INFO] Downloading: http://overture.au.dk/artifactory/remote-repos/org/apache/maven/maven/2.2.0/maven-2.2.0.pom
[INFO] Downloaded: http://overture.au.dk/artifactory/remote-repos/org/apache/maven/maven/2.2.0/maven-2.2.0.pom (22 KB at 707.4 KB/sec)
[INFO] Downloading: http://overture.au.dk/artifactory/remote-repos/org/apache/maven/maven-settings/2.2.0/maven-settings-2.2.0.pom
[INFO] Downloaded: http://overture.au.dk/artifactory/remote-repos/org/apache/maven/maven-settings/2.2.0/maven-settings-2.2.0.pom (3 KB at 101.3 KB/sec)
[INFO] Downloading: http://overture.au.dk/artifactory/remote-repos/org/apache/maven/maven-model/2.2.0/maven-model-2.2.0.pom
[INFO] Downloaded: http://overture.au.dk/artifactory/remote-repos/org/apache/maven/maven-model/2.2.0/maven-model-2.2.0.pom (4 KB at 150.7 KB/sec)
[INFO] Downloading: http://overture.au.dk/artifactory/remote-repos/org/apache/maven/maven-profile/2.2.0/maven-profile-2.2.0.pom
[INFO] Downloaded: http://overture.au.dk/artifactory/remote-repos/org/apache/maven/maven-profile/2.2.0/maven-profile-2.2.0.pom (3 KB at 141.3 KB/sec)
[INFO] Downloading: http://overture.au.dk/artifactory/remote-repos/org/apache/maven/maven-artifact-manager/2.2.0/maven-artifact-manager-2.2.0.pom
[INFO] Downloaded: http://overture.au.dk/artifactory/remote-repos/org/apache/maven/maven-artifact-manager/2.2.0/maven-artifact-manager-2.2.0.pom (4 KB at 189.4 KB/sec)
[INFO] Downloading: http://overture.au.dk/artifactory/remote-repos/org/apache/maven/maven-repository-metadata/2.2.0/maven-repository-metadata-2.2.0.pom
[INFO] Downloaded: http://overture.au.dk/artifactory/remote-repos/org/apache/maven/maven-repository-metadata/2.2.0/maven-repository-metadata-2.2.0.pom (2 KB at 107.5 KB/sec)
[INFO] Downloading: http://overture.au.dk/artifactory/remote-repos/org/apache/maven/maven-artifact/2.2.0/maven-artifact-2.2.0.pom
[INFO] Downloaded: http://overture.au.dk/artifactory/remote-repos/org/apache/maven/maven-artifact/2.2.0/maven-artifact-2.2.0.pom (2 KB at 81.3 KB/sec)
[INFO] Downloading: http://overture.au.dk/artifactory/remote-repos/org/apache/maven/maven-plugin-registry/2.2.0/maven-plugin-registry-2.2.0.pom
[INFO] Downloaded: http://overture.au.dk/artifactory/remote-repos/org/apache/maven/maven-plugin-registry/2.2.0/maven-plugin-registry-2.2.0.pom (2 KB at 94.2 KB/sec)
[INFO] Downloading: http://overture.au.dk/artifactory/remote-repos/org/apache/maven/shared/maven-common-artifact-filters/1.4/maven-common-artifact-filters-1.4.pom
[INFO] Downloaded: http://overture.au.dk/artifactory/remote-repos/org/apache/maven/shared/maven-common-artifact-filters/1.4/maven-common-artifact-filters-1.4.pom (4 KB at 244.8 KB/sec)
[INFO] Downloading: http://overture.au.dk/artifactory/remote-repos/org/codehaus/plexus/plexus-container-default/1.5.5/plexus-container-default-1.5.5.pom
[INFO] Downloaded: http://overture.au.dk/artifactory/remote-repos/org/codehaus/plexus/plexus-container-default/1.5.5/plexus-container-default-1.5.5.pom (3 KB at 96.1 KB/sec)
[INFO] Downloading: http://overture.au.dk/artifactory/remote-repos/org/codehaus/plexus/plexus-classworlds/2.2.2/plexus-classworlds-2.2.2.pom
[INFO] Downloaded: http://overture.au.dk/artifactory/remote-repos/org/codehaus/plexus/plexus-classworlds/2.2.2/plexus-classworlds-2.2.2.pom (4 KB at 207.3 KB/sec)
[INFO] Downloading: http://overture.au.dk/artifactory/remote-repos/org/apache/xbean/xbean-reflect/3.4/xbean-reflect-3.4.pom
[INFO] Downloaded: http://overture.au.dk/artifactory/remote-repos/org/apache/xbean/xbean-reflect/3.4/xbean-reflect-3.4.pom (3 KB at 124.7 KB/sec)
[INFO] Downloading: http://overture.au.dk/artifactory/remote-repos/org/apache/xbean/xbean/3.4/xbean-3.4.pom
[INFO] Downloaded: http://overture.au.dk/artifactory/remote-repos/org/apache/xbean/xbean/3.4/xbean-3.4.pom (18 KB at 509.6 KB/sec)
[INFO] Downloading: http://overture.au.dk/artifactory/remote-repos/commons-logging/commons-logging-api/1.1/commons-logging-api-1.1.pom
[INFO] Downloaded: http://overture.au.dk/artifactory/remote-repos/commons-logging/commons-logging-api/1.1/commons-logging-api-1.1.pom (6 KB at 274.8 KB/sec)
[INFO] Downloading: http://overture.au.dk/artifactory/remote-repos/com/google/collections/google-collections/1.0/google-collections-1.0.pom
[INFO] Downloaded: http://overture.au.dk/artifactory/remote-repos/com/google/collections/google-collections/1.0/google-collections-1.0.pom (3 KB at 151.2 KB/sec)
[INFO] Downloading: http://overture.au.dk/artifactory/remote-repos/com/google/google/1/google-1.pom
[INFO] Downloaded: http://overture.au.dk/artifactory/remote-repos/com/google/google/1/google-1.pom (2 KB at 101.2 KB/sec)
[INFO] Downloading: http://overture.au.dk/artifactory/remote-repos/org/codehaus/plexus/plexus-utils/2.1/plexus-utils-2.1.pom
[INFO] Downloaded: http://overture.au.dk/artifactory/remote-repos/org/codehaus/plexus/plexus-utils/2.1/plexus-utils-2.1.pom (4 KB at 281.4 KB/sec)
[INFO] Downloading: http://overture.au.dk/artifactory/remote-repos/org/apache/maven/shared/maven-invoker/2.0.11/maven-invoker-2.0.11.pom
[INFO] Downloaded: http://overture.au.dk/artifactory/remote-repos/org/apache/maven/shared/maven-invoker/2.0.11/maven-invoker-2.0.11.pom (5 KB at 291.5 KB/sec)
[INFO] Downloading: http://overture.au.dk/artifactory/remote-repos/commons-lang/commons-lang/2.6/commons-lang-2.6.pom
[INFO] Downloaded: http://overture.au.dk/artifactory/remote-repos/commons-lang/commons-lang/2.6/commons-lang-2.6.pom (18 KB at 1067.7 KB/sec)
[INFO] Downloading: http://overture.au.dk/artifactory/remote-repos/org/apache/commons/commons-parent/17/commons-parent-17.pom
[INFO] Downloaded: http://overture.au.dk/artifactory/remote-repos/org/apache/commons/commons-parent/17/commons-parent-17.pom (31 KB at 1691.9 KB/sec)
[INFO] Downloading: http://overture.au.dk/artifactory/remote-repos/org/apache/maven/reporting/maven-reporting-impl/2.0.5/maven-reporting-impl-2.0.5.jar
[INFO] Downloading: http://overture.au.dk/artifactory/remote-repos/org/apache/maven/shared/maven-doxia-tools/1.0.2/maven-doxia-tools-1.0.2.jar
[INFO] Downloading: http://overture.au.dk/artifactory/remote-repos/org/codehaus/plexus/plexus-archiver/2.2/plexus-archiver-2.2.jar
[INFO] Downloading: http://overture.au.dk/artifactory/remote-repos/org/apache/maven/shared/file-management/1.2.1/file-management-1.2.1.jar
[INFO] Downloading: http://overture.au.dk/artifactory/remote-repos/org/codehaus/plexus/plexus-utils/3.0.9/plexus-utils-3.0.9.jar
[INFO] Downloaded: http://overture.au.dk/artifactory/remote-repos/org/apache/maven/reporting/maven-reporting-impl/2.0.5/maven-reporting-impl-2.0.5.jar (21 KB at 1118.3 KB/sec)
[INFO] Downloading: http://overture.au.dk/artifactory/remote-repos/org/apache/maven/shared/maven-shared-io/1.1/maven-shared-io-1.1.jar
[INFO] Downloaded: http://overture.au.dk/artifactory/remote-repos/org/apache/maven/shared/maven-doxia-tools/1.0.2/maven-doxia-tools-1.0.2.jar (41 KB at 1910.5 KB/sec)
[INFO] Downloading: http://overture.au.dk/artifactory/remote-repos/org/apache/maven/wagon/wagon-provider-api/1.0-alpha-6/wagon-provider-api-1.0-alpha-6.jar
[INFO] Downloaded: http://overture.au.dk/artifactory/remote-repos/org/apache/maven/shared/file-management/1.2.1/file-management-1.2.1.jar (37 KB at 1668.0 KB/sec)
[INFO] Downloading: http://overture.au.dk/artifactory/remote-repos/org/codehaus/plexus/plexus-io/2.0.6/plexus-io-2.0.6.jar
[INFO] Downloaded: http://overture.au.dk/artifactory/remote-repos/org/apache/maven/shared/maven-shared-io/1.1/maven-shared-io-1.1.jar (39 KB at 1204.8 KB/sec)
[INFO] Downloading: http://overture.au.dk/artifactory/remote-repos/org/apache/maven/shared/maven-dependency-analyzer/1.3/maven-dependency-analyzer-1.3.jar
[INFO] Downloaded: http://overture.au.dk/artifactory/remote-repos/org/codehaus/plexus/plexus-utils/3.0.9/plexus-utils-3.0.9.jar (227 KB at 6121.7 KB/sec)
[INFO] Downloading: http://overture.au.dk/artifactory/remote-repos/asm/asm/3.3.1/asm-3.3.1.jar
[INFO] Downloaded: http://overture.au.dk/artifactory/remote-repos/org/codehaus/plexus/plexus-io/2.0.6/plexus-io-2.0.6.jar (57 KB at 1609.1 KB/sec)
[INFO] Downloading: http://overture.au.dk/artifactory/remote-repos/org/apache/maven/shared/maven-dependency-tree/2.0/maven-dependency-tree-2.0.jar
[INFO] Downloaded: http://overture.au.dk/artifactory/remote-repos/org/codehaus/plexus/plexus-archiver/2.2/plexus-archiver-2.2.jar (181 KB at 3542.0 KB/sec)
[INFO] Downloading: http://overture.au.dk/artifactory/remote-repos/org/apache/maven/shared/maven-common-artifact-filters/1.4/maven-common-artifact-filters-1.4.jar
[INFO] Downloaded: http://overture.au.dk/artifactory/remote-repos/org/apache/maven/shared/maven-dependency-tree/2.0/maven-dependency-tree-2.0.jar (55 KB at 1116.7 KB/sec)
[INFO] Downloading: http://overture.au.dk/artifactory/remote-repos/org/apache/maven/shared/maven-invoker/2.0.11/maven-invoker-2.0.11.jar
[INFO] Downloaded: http://overture.au.dk/artifactory/remote-repos/org/apache/maven/wagon/wagon-provider-api/1.0-alpha-6/wagon-provider-api-1.0-alpha-6.jar (42 KB at 745.1 KB/sec)
[INFO] Downloading: http://overture.au.dk/artifactory/remote-repos/commons-lang/commons-lang/2.6/commons-lang-2.6.jar
[INFO] Downloaded: http://overture.au.dk/artifactory/remote-repos/org/apache/maven/shared/maven-dependency-analyzer/1.3/maven-dependency-analyzer-1.3.jar (27 KB at 461.6 KB/sec)
[INFO] Downloaded: http://overture.au.dk/artifactory/remote-repos/org/apache/maven/shared/maven-invoker/2.0.11/maven-invoker-2.0.11.jar (29 KB at 441.1 KB/sec)
[INFO] Downloaded: http://overture.au.dk/artifactory/remote-repos/org/apache/maven/shared/maven-common-artifact-filters/1.4/maven-common-artifact-filters-1.4.jar (31 KB at 474.7 KB/sec)
[INFO] Downloaded: http://overture.au.dk/artifactory/remote-repos/asm/asm/3.3.1/asm-3.3.1.jar (43 KB at 575.1 KB/sec)
[INFO] Downloaded: http://overture.au.dk/artifactory/remote-repos/commons-lang/commons-lang/2.6/commons-lang-2.6.jar (278 KB at 3513.4 KB/sec)
[INFO] Configured Artifact: org.destecs.core:parsers:2.0.8:jar
[INFO] Configured Artifact: antlr:antlr:2.7.7:jar
[INFO] Configured Artifact: org.antlr:stringtemplate:3.2:jar
[INFO] Configured Artifact: org.antlr:antlr-runtime:3.2:jar
[INFO] Configured Artifact: org.antlr:antlr:3.2:jar
[INFO] Copying parsers-2.0.8.jar to /var/lib/jenkins/workspace/crescendo-pipeline_master-CP6XM76MSAFTBEKNXNTUPPF3MNVQTIVFT4XWG7O5T5XCURBKSRNA/ide/core/jars/parsers.jar
[INFO] Copying antlr-2.7.7.jar to /var/lib/jenkins/workspace/crescendo-pipeline_master-CP6XM76MSAFTBEKNXNTUPPF3MNVQTIVFT4XWG7O5T5XCURBKSRNA/ide/core/jars/antlr.jar
[INFO] Copying stringtemplate-3.2.jar to /var/lib/jenkins/workspace/crescendo-pipeline_master-CP6XM76MSAFTBEKNXNTUPPF3MNVQTIVFT4XWG7O5T5XCURBKSRNA/ide/core/jars/stringtemplate.jar
[INFO] Copying antlr-runtime-3.2.jar to /var/lib/jenkins/workspace/crescendo-pipeline_master-CP6XM76MSAFTBEKNXNTUPPF3MNVQTIVFT4XWG7O5T5XCURBKSRNA/ide/core/jars/antlr-runtime.jar
[INFO] Copying antlr-3.2.jar to /var/lib/jenkins/workspace/crescendo-pipeline_master-CP6XM76MSAFTBEKNXNTUPPF3MNVQTIVFT4XWG7O5T5XCURBKSRNA/ide/core/jars/antlr.jar
[INFO] 
[INFO] --- maven-resources-plugin:2.6:resources (default-resources) @ org.destecs.ide.core ---
[INFO] Using 'UTF-8' encoding to copy filtered resources.
[INFO] skip non existing resourceDirectory /var/lib/jenkins/workspace/crescendo-pipeline_master-CP6XM76MSAFTBEKNXNTUPPF3MNVQTIVFT4XWG7O5T5XCURBKSRNA/ide/core/src/main/resources
[INFO] 
[INFO] --- tycho-compiler-plugin:0.25.0:compile (default-compile) @ org.destecs.ide.core ---
[INFO] Downloading: http://overture.au.dk/artifactory/remote-repos/org/apache/maven/maven-compat/3.0/maven-compat-3.0.pom
[INFO] Downloaded: http://overture.au.dk/artifactory/remote-repos/org/apache/maven/maven-compat/3.0/maven-compat-3.0.pom (4 KB at 231.0 KB/sec)
[INFO] Downloading: http://overture.au.dk/artifactory/remote-repos/org/codehaus/plexus/plexus-compiler-manager/2.2/plexus-compiler-manager-2.2.pom
[INFO] Downloaded: http://overture.au.dk/artifactory/remote-repos/org/codehaus/plexus/plexus-compiler-manager/2.2/plexus-compiler-manager-2.2.pom (690 B at 28.1 KB/sec)
[INFO] Downloading: http://overture.au.dk/artifactory/remote-repos/org/codehaus/plexus/plexus-compiler/2.2/plexus-compiler-2.2.pom
[INFO] Downloaded: http://overture.au.dk/artifactory/remote-repos/org/codehaus/plexus/plexus-compiler/2.2/plexus-compiler-2.2.pom (4 KB at 153.4 KB/sec)
[INFO] Downloading: http://overture.au.dk/artifactory/remote-repos/org/codehaus/plexus/plexus-components/1.3.1/plexus-components-1.3.1.pom
[INFO] Downloaded: http://overture.au.dk/artifactory/remote-repos/org/codehaus/plexus/plexus-components/1.3.1/plexus-components-1.3.1.pom (3 KB at 173.2 KB/sec)
[INFO] Downloading: http://overture.au.dk/artifactory/remote-repos/org/codehaus/plexus/plexus-compiler-api/2.2/plexus-compiler-api-2.2.pom
[INFO] Downloaded: http://overture.au.dk/artifactory/remote-repos/org/codehaus/plexus/plexus-compiler-api/2.2/plexus-compiler-api-2.2.pom (865 B at 46.9 KB/sec)
[INFO] Downloading: http://overture.au.dk/artifactory/remote-repos/org/eclipse/tycho/tycho-compiler-jdt/0.25.0/tycho-compiler-jdt-0.25.0.pom
[INFO] Downloaded: http://overture.au.dk/artifactory/remote-repos/org/eclipse/tycho/tycho-compiler-jdt/0.25.0/tycho-compiler-jdt-0.25.0.pom (2 KB at 69.1 KB/sec)
[INFO] Downloading: http://overture.au.dk/artifactory/remote-repos/org/eclipse/tycho/org.eclipse.jdt.core/3.11.1.v20150902-1521/org.eclipse.jdt.core-3.11.1.v20150902-1521.pom
[INFO] Downloaded: http://overture.au.dk/artifactory/remote-repos/org/eclipse/tycho/org.eclipse.jdt.core/3.11.1.v20150902-1521/org.eclipse.jdt.core-3.11.1.v20150902-1521.pom (2 KB at 32.7 KB/sec)
[INFO] Downloading: http://overture.au.dk/artifactory/remote-repos/org/eclipse/tycho/org.eclipse.jdt.compiler.apt/1.2.0.v20150514-0146/org.eclipse.jdt.compiler.apt-1.2.0.v20150514-0146.pom
[INFO] Downloaded: http://overture.au.dk/artifactory/remote-repos/org/eclipse/tycho/org.eclipse.jdt.compiler.apt/1.2.0.v20150514-0146/org.eclipse.jdt.compiler.apt-1.2.0.v20150514-0146.pom (2 KB at 41.5 KB/sec)
[INFO] Downloading: http://overture.au.dk/artifactory/remote-repos/org/apache/maven/maven-compat/3.0/maven-compat-3.0.jar
[INFO] Downloading: http://overture.au.dk/artifactory/remote-repos/org/codehaus/plexus/plexus-compiler-manager/2.2/plexus-compiler-manager-2.2.jar
[INFO] Downloading: http://overture.au.dk/artifactory/remote-repos/org/eclipse/tycho/tycho-compiler-jdt/0.25.0/tycho-compiler-jdt-0.25.0.jar
[INFO] Downloading: http://overture.au.dk/artifactory/remote-repos/org/codehaus/plexus/plexus-compiler-api/2.2/plexus-compiler-api-2.2.jar
[INFO] Downloading: http://overture.au.dk/artifactory/remote-repos/org/eclipse/tycho/org.eclipse.jdt.core/3.11.1.v20150902-1521/org.eclipse.jdt.core-3.11.1.v20150902-1521.jar
[INFO] Downloaded: http://overture.au.dk/artifactory/remote-repos/org/codehaus/plexus/plexus-compiler-manager/2.2/plexus-compiler-manager-2.2.jar (5 KB at 212.1 KB/sec)
[INFO] Downloading: http://overture.au.dk/artifactory/remote-repos/org/eclipse/tycho/org.eclipse.jdt.compiler.apt/1.2.0.v20150514-0146/org.eclipse.jdt.compiler.apt-1.2.0.v20150514-0146.jar
[INFO] Downloaded: http://overture.au.dk/artifactory/remote-repos/org/eclipse/tycho/tycho-compiler-jdt/0.25.0/tycho-compiler-jdt-0.25.0.jar (16 KB at 541.2 KB/sec)
[INFO] Downloaded: http://overture.au.dk/artifactory/remote-repos/org/codehaus/plexus/plexus-compiler-api/2.2/plexus-compiler-api-2.2.jar (25 KB at 717.8 KB/sec)
[INFO] Downloaded: http://overture.au.dk/artifactory/remote-repos/org/apache/maven/maven-compat/3.0/maven-compat-3.0.jar (279 KB at 5249.3 KB/sec)
[INFO] Downloaded: http://overture.au.dk/artifactory/remote-repos/org/eclipse/tycho/org.eclipse.jdt.compiler.apt/1.2.0.v20150514-0146/org.eclipse.jdt.compiler.apt-1.2.0.v20150514-0146.jar (164 KB at 3148.1 KB/sec)
[INFO] Downloaded: http://overture.au.dk/artifactory/remote-repos/org/eclipse/tycho/org.eclipse.jdt.core/3.11.1.v20150902-1521/org.eclipse.jdt.core-3.11.1.v20150902-1521.jar (5584 KB at 33841.2 KB/sec)
[INFO] Compiling 19 source files to /var/lib/jenkins/workspace/crescendo-pipeline_master-CP6XM76MSAFTBEKNXNTUPPF3MNVQTIVFT4XWG7O5T5XCURBKSRNA/ide/core/target/classes
[INFO] 
[INFO] --- maven-resources-plugin:2.6:testResources (default-testResources) @ org.destecs.ide.core ---
[INFO] Not copying test resources
[INFO] 
[INFO] --- target-platform-configuration:0.25.0:target-platform (default-target-platform) @ org.destecs.ide.core ---
[INFO] 
[INFO] --- tycho-packaging-plugin:0.25.0:package-plugin (default-package-plugin) @ org.destecs.ide.core ---
[INFO] Building jar: /var/lib/jenkins/workspace/crescendo-pipeline_master-CP6XM76MSAFTBEKNXNTUPPF3MNVQTIVFT4XWG7O5T5XCURBKSRNA/ide/core/target/org.destecs.ide.core-2.2.4.jar
[INFO] 
[INFO] --- tycho-p2-plugin:0.25.0:p2-metadata-default (default-p2-metadata-default) @ org.destecs.ide.core ---
[INFO] 
[INFO] --- maven-javadoc-plugin:2.9:jar (attach-javadocs) @ org.destecs.ide.core ---
[INFO] Skipping javadoc generation
[INFO] 
[INFO] --- maven-install-plugin:2.3.1:install (default-install) @ org.destecs.ide.core ---
[INFO] Installing /var/lib/jenkins/workspace/crescendo-pipeline_master-CP6XM76MSAFTBEKNXNTUPPF3MNVQTIVFT4XWG7O5T5XCURBKSRNA/ide/core/target/org.destecs.ide.core-2.2.4.jar to /var/lib/jenkins/workspace/crescendo-pipeline_master-CP6XM76MSAFTBEKNXNTUPPF3MNVQTIVFT4XWG7O5T5XCURBKSRNA/.repository/org/destecs/ide/org.destecs.ide.core/2.2.4/org.destecs.ide.core-2.2.4.jar
[INFO] Installing /var/lib/jenkins/workspace/crescendo-pipeline_master-CP6XM76MSAFTBEKNXNTUPPF3MNVQTIVFT4XWG7O5T5XCURBKSRNA/ide/core/pom.xml to /var/lib/jenkins/workspace/crescendo-pipeline_master-CP6XM76MSAFTBEKNXNTUPPF3MNVQTIVFT4XWG7O5T5XCURBKSRNA/.repository/org/destecs/ide/org.destecs.ide.core/2.2.4/org.destecs.ide.core-2.2.4.pom
[INFO] Installing /var/lib/jenkins/workspace/crescendo-pipeline_master-CP6XM76MSAFTBEKNXNTUPPF3MNVQTIVFT4XWG7O5T5XCURBKSRNA/ide/core/target/p2content.xml to /var/lib/jenkins/workspace/crescendo-pipeline_master-CP6XM76MSAFTBEKNXNTUPPF3MNVQTIVFT4XWG7O5T5XCURBKSRNA/.repository/org/destecs/ide/org.destecs.ide.core/2.2.4/org.destecs.ide.core-2.2.4-p2metadata.xml
[INFO] Installing /var/lib/jenkins/workspace/crescendo-pipeline_master-CP6XM76MSAFTBEKNXNTUPPF3MNVQTIVFT4XWG7O5T5XCURBKSRNA/ide/core/target/p2artifacts.xml to /var/lib/jenkins/workspace/crescendo-pipeline_master-CP6XM76MSAFTBEKNXNTUPPF3MNVQTIVFT4XWG7O5T5XCURBKSRNA/.repository/org/destecs/ide/org.destecs.ide.core/2.2.4/org.destecs.ide.core-2.2.4-p2artifacts.xml
[INFO] 
[INFO] --- tycho-p2-plugin:0.25.0:update-local-index (default-update-local-index) @ org.destecs.ide.core ---
[INFO]                                                                         
[INFO] ------------------------------------------------------------------------
[INFO] Building DESTECS Simulation Engine 2.2.4
[INFO] ------------------------------------------------------------------------
[INFO] 
[INFO] --- tycho-packaging-plugin:0.25.0:build-qualifier (default-build-qualifier) @ org.destecs.ide.simeng ---
[INFO] The project's OSGi version is 2.2.4
[INFO] 
[INFO] --- tycho-packaging-plugin:0.25.0:validate-id (default-validate-id) @ org.destecs.ide.simeng ---
[INFO] 
[INFO] --- tycho-packaging-plugin:0.25.0:validate-version (default-validate-version) @ org.destecs.ide.simeng ---
[INFO] 
[INFO] --- maven-dependency-plugin:2.6:copy (copy-dependencies) @ org.destecs.ide.simeng ---
[INFO] Configured Artifact: org.destecs.core:simulationengine:2.2.4:jar
[INFO] Configured Artifact: org.destecs.core:protocol:2.2.4:jar
[INFO] Configured Artifact: xml-apis:xml-apis:1.0.b2:jar
[INFO] Configured Artifact: org.apache.xmlrpc:xmlrpc-common:3.1.3:jar
[INFO] Configured Artifact: org.destecs.core.xmlrpcextensions:xmlrpcbaseextension:2.2.4:jar
[INFO] Configured Artifact: org.apache.xmlrpc:xmlrpc-client:3.1.3:jar
[INFO] Configured Artifact: log4j:log4j:1.2.12:jar
[INFO] Configured Artifact: org.apache.commons:commons-io:1.3.2:jar
[INFO] Downloading: http://overture.au.dk/artifactory/remote-repos/org/apache/commons/commons-io/1.3.2/commons-io-1.3.2.jar
[INFO] Downloaded: http://overture.au.dk/artifactory/remote-repos/org/apache/commons/commons-io/1.3.2/commons-io-1.3.2.jar (86 KB at 4285.9 KB/sec)
[INFO] Configured Artifact: org.destecs.core.xmlrpcextensions:xmlrpcclientextension:2.2.4:jar
[INFO] Configured Artifact: org.apache.ws.commons.util:ws-commons-util:1.0.2:jar
[INFO] Configured Artifact: org.destecs.core:vdm:2.2.4:jar
[INFO] Configured Artifact: org.destecs.core.xmlrpcextensions:xmlrpcserverextension:2.2.4:jar
[INFO] Configured Artifact: commons-logging:commons-logging:1.1:jar
[INFO] Configured Artifact: org.apache.xmlrpc:xmlrpc-server:3.1.3:jar
[INFO] Configured Artifact: javax.servlet:servlet-api:2.3:jar
[INFO] Configured Artifact: xerces:xercesImpl:2.9.1:jar
[INFO] Copying simulationengine-2.2.4.jar to /var/lib/jenkins/workspace/crescendo-pipeline_master-CP6XM76MSAFTBEKNXNTUPPF3MNVQTIVFT4XWG7O5T5XCURBKSRNA/ide/simeng/jars/simulationengine.jar
[INFO] Copying protocol-2.2.4.jar to /var/lib/jenkins/workspace/crescendo-pipeline_master-CP6XM76MSAFTBEKNXNTUPPF3MNVQTIVFT4XWG7O5T5XCURBKSRNA/ide/simeng/jars/protocol.jar
[INFO] Copying xml-apis-1.0.b2.jar to /var/lib/jenkins/workspace/crescendo-pipeline_master-CP6XM76MSAFTBEKNXNTUPPF3MNVQTIVFT4XWG7O5T5XCURBKSRNA/ide/simeng/jars/xml-apis.jar
[INFO] Copying xmlrpc-common-3.1.3.jar to /var/lib/jenkins/workspace/crescendo-pipeline_master-CP6XM76MSAFTBEKNXNTUPPF3MNVQTIVFT4XWG7O5T5XCURBKSRNA/ide/simeng/jars/xmlrpc-common.jar
[INFO] Copying xmlrpcbaseextension-2.2.4.jar to /var/lib/jenkins/workspace/crescendo-pipeline_master-CP6XM76MSAFTBEKNXNTUPPF3MNVQTIVFT4XWG7O5T5XCURBKSRNA/ide/simeng/jars/xmlrpcbaseextension.jar
[INFO] Copying xmlrpc-client-3.1.3.jar to /var/lib/jenkins/workspace/crescendo-pipeline_master-CP6XM76MSAFTBEKNXNTUPPF3MNVQTIVFT4XWG7O5T5XCURBKSRNA/ide/simeng/jars/xmlrpc-client.jar
[INFO] Copying log4j-1.2.12.jar to /var/lib/jenkins/workspace/crescendo-pipeline_master-CP6XM76MSAFTBEKNXNTUPPF3MNVQTIVFT4XWG7O5T5XCURBKSRNA/ide/simeng/jars/log4j.jar
[INFO] Copying commons-io-1.3.2.jar to /var/lib/jenkins/workspace/crescendo-pipeline_master-CP6XM76MSAFTBEKNXNTUPPF3MNVQTIVFT4XWG7O5T5XCURBKSRNA/ide/simeng/jars/commons-io.jar
[INFO] Copying xmlrpcclientextension-2.2.4.jar to /var/lib/jenkins/workspace/crescendo-pipeline_master-CP6XM76MSAFTBEKNXNTUPPF3MNVQTIVFT4XWG7O5T5XCURBKSRNA/ide/simeng/jars/xmlrpcclientextension.jar
[INFO] Copying ws-commons-util-1.0.2.jar to /var/lib/jenkins/workspace/crescendo-pipeline_master-CP6XM76MSAFTBEKNXNTUPPF3MNVQTIVFT4XWG7O5T5XCURBKSRNA/ide/simeng/jars/ws-commons-util.jar
[INFO] Copying vdm-2.2.4.jar to /var/lib/jenkins/workspace/crescendo-pipeline_master-CP6XM76MSAFTBEKNXNTUPPF3MNVQTIVFT4XWG7O5T5XCURBKSRNA/ide/simeng/jars/vdm.jar
[INFO] Copying xmlrpcserverextension-2.2.4.jar to /var/lib/jenkins/workspace/crescendo-pipeline_master-CP6XM76MSAFTBEKNXNTUPPF3MNVQTIVFT4XWG7O5T5XCURBKSRNA/ide/simeng/jars/xmlrpcserverextension.jar
[INFO] Copying commons-logging-1.1.jar to /var/lib/jenkins/workspace/crescendo-pipeline_master-CP6XM76MSAFTBEKNXNTUPPF3MNVQTIVFT4XWG7O5T5XCURBKSRNA/ide/simeng/jars/commons-logging.jar
[INFO] Copying xmlrpc-server-3.1.3.jar to /var/lib/jenkins/workspace/crescendo-pipeline_master-CP6XM76MSAFTBEKNXNTUPPF3MNVQTIVFT4XWG7O5T5XCURBKSRNA/ide/simeng/jars/xmlrpc-server.jar
[INFO] Copying servlet-api-2.3.jar to /var/lib/jenkins/workspace/crescendo-pipeline_master-CP6XM76MSAFTBEKNXNTUPPF3MNVQTIVFT4XWG7O5T5XCURBKSRNA/ide/simeng/jars/servlet-api.jar
[INFO] Copying xercesImpl-2.9.1.jar to /var/lib/jenkins/workspace/crescendo-pipeline_master-CP6XM76MSAFTBEKNXNTUPPF3MNVQTIVFT4XWG7O5T5XCURBKSRNA/ide/simeng/jars/xercesImpl.jar
[INFO] 
[INFO] --- maven-antrun-plugin:1.8:run (default) @ org.destecs.ide.simeng ---
[INFO] Downloading: http://overture.au.dk/artifactory/remote-repos/org/codehaus/plexus/plexus-utils/3.0.20/plexus-utils-3.0.20.pom
[INFO] Downloaded: http://overture.au.dk/artifactory/remote-repos/org/codehaus/plexus/plexus-utils/3.0.20/plexus-utils-3.0.20.pom (4 KB at 186.0 KB/sec)
[INFO] Downloading: http://overture.au.dk/artifactory/remote-repos/org/apache/ant/ant/1.9.4/ant-1.9.4.pom
[INFO] Downloaded: http://overture.au.dk/artifactory/remote-repos/org/apache/ant/ant/1.9.4/ant-1.9.4.pom (10 KB at 427.2 KB/sec)
[INFO] Downloading: http://overture.au.dk/artifactory/remote-repos/org/apache/ant/ant-parent/1.9.4/ant-parent-1.9.4.pom
[INFO] Downloaded: http://overture.au.dk/artifactory/remote-repos/org/apache/ant/ant-parent/1.9.4/ant-parent-1.9.4.pom (6 KB at 260.6 KB/sec)
[INFO] Downloading: http://overture.au.dk/artifactory/remote-repos/org/apache/ant/ant-launcher/1.9.4/ant-launcher-1.9.4.pom
[INFO] Downloaded: http://overture.au.dk/artifactory/remote-repos/org/apache/ant/ant-launcher/1.9.4/ant-launcher-1.9.4.pom (3 KB at 95.0 KB/sec)
[INFO] Downloading: http://overture.au.dk/artifactory/remote-repos/org/codehaus/plexus/plexus-utils/3.0.20/plexus-utils-3.0.20.jar
[INFO] Downloading: http://overture.au.dk/artifactory/remote-repos/org/apache/ant/ant/1.9.4/ant-1.9.4.jar
[INFO] Downloading: http://overture.au.dk/artifactory/remote-repos/org/apache/ant/ant-launcher/1.9.4/ant-launcher-1.9.4.jar
[INFO] Downloaded: http://overture.au.dk/artifactory/remote-repos/org/apache/ant/ant-launcher/1.9.4/ant-launcher-1.9.4.jar (18 KB at 1196.7 KB/sec)
[INFO] Downloaded: http://overture.au.dk/artifactory/remote-repos/org/codehaus/plexus/plexus-utils/3.0.20/plexus-utils-3.0.20.jar (238 KB at 3491.6 KB/sec)
[INFO] Downloaded: http://overture.au.dk/artifactory/remote-repos/org/apache/ant/ant/1.9.4/ant-1.9.4.jar (1972 KB at 24649.3 KB/sec)
[INFO] Executing tasks

main:
      [zip] Building zip: /var/lib/jenkins/workspace/crescendo-pipeline_master-CP6XM76MSAFTBEKNXNTUPPF3MNVQTIVFT4XWG7O5T5XCURBKSRNA/ide/simeng/examples/destecs-examples.zip
      [zip] Building zip: /var/lib/jenkins/workspace/crescendo-pipeline_master-CP6XM76MSAFTBEKNXNTUPPF3MNVQTIVFT4XWG7O5T5XCURBKSRNA/ide/simeng/examples/book-examples.zip
[INFO] Executed tasks
[INFO] 
[INFO] --- maven-resources-plugin:2.6:resources (default-resources) @ org.destecs.ide.simeng ---
[INFO] Using 'UTF-8' encoding to copy filtered resources.
[INFO] skip non existing resourceDirectory /var/lib/jenkins/workspace/crescendo-pipeline_master-CP6XM76MSAFTBEKNXNTUPPF3MNVQTIVFT4XWG7O5T5XCURBKSRNA/ide/simeng/src/main/resources
[INFO] 
[INFO] --- tycho-compiler-plugin:0.25.0:compile (default-compile) @ org.destecs.ide.simeng ---
[INFO] Compiling 24 source files to /var/lib/jenkins/workspace/crescendo-pipeline_master-CP6XM76MSAFTBEKNXNTUPPF3MNVQTIVFT4XWG7O5T5XCURBKSRNA/ide/simeng/target/classes
[INFO] 
[INFO] --- maven-resources-plugin:2.6:testResources (default-testResources) @ org.destecs.ide.simeng ---
[INFO] Not copying test resources
[INFO] 
[INFO] --- target-platform-configuration:0.25.0:target-platform (default-target-platform) @ org.destecs.ide.simeng ---
[INFO] 
[INFO] --- tycho-packaging-plugin:0.25.0:package-plugin (default-package-plugin) @ org.destecs.ide.simeng ---
[INFO] Building jar: /var/lib/jenkins/workspace/crescendo-pipeline_master-CP6XM76MSAFTBEKNXNTUPPF3MNVQTIVFT4XWG7O5T5XCURBKSRNA/ide/simeng/target/org.destecs.ide.simeng-2.2.4.jar
[INFO] 
[INFO] --- tycho-p2-plugin:0.25.0:p2-metadata-default (default-p2-metadata-default) @ org.destecs.ide.simeng ---
[INFO] 
[INFO] --- maven-javadoc-plugin:2.9:jar (attach-javadocs) @ org.destecs.ide.simeng ---
[INFO] Skipping javadoc generation
[INFO] 
[INFO] --- maven-install-plugin:2.3.1:install (default-install) @ org.destecs.ide.simeng ---
[INFO] Installing /var/lib/jenkins/workspace/crescendo-pipeline_master-CP6XM76MSAFTBEKNXNTUPPF3MNVQTIVFT4XWG7O5T5XCURBKSRNA/ide/simeng/target/org.destecs.ide.simeng-2.2.4.jar to /var/lib/jenkins/workspace/crescendo-pipeline_master-CP6XM76MSAFTBEKNXNTUPPF3MNVQTIVFT4XWG7O5T5XCURBKSRNA/.repository/org/destecs/ide/org.destecs.ide.simeng/2.2.4/org.destecs.ide.simeng-2.2.4.jar
[INFO] Installing /var/lib/jenkins/workspace/crescendo-pipeline_master-CP6XM76MSAFTBEKNXNTUPPF3MNVQTIVFT4XWG7O5T5XCURBKSRNA/ide/simeng/pom.xml to /var/lib/jenkins/workspace/crescendo-pipeline_master-CP6XM76MSAFTBEKNXNTUPPF3MNVQTIVFT4XWG7O5T5XCURBKSRNA/.repository/org/destecs/ide/org.destecs.ide.simeng/2.2.4/org.destecs.ide.simeng-2.2.4.pom
[INFO] Installing /var/lib/jenkins/workspace/crescendo-pipeline_master-CP6XM76MSAFTBEKNXNTUPPF3MNVQTIVFT4XWG7O5T5XCURBKSRNA/ide/simeng/target/p2content.xml to /var/lib/jenkins/workspace/crescendo-pipeline_master-CP6XM76MSAFTBEKNXNTUPPF3MNVQTIVFT4XWG7O5T5XCURBKSRNA/.repository/org/destecs/ide/org.destecs.ide.simeng/2.2.4/org.destecs.ide.simeng-2.2.4-p2metadata.xml
[INFO] Installing /var/lib/jenkins/workspace/crescendo-pipeline_master-CP6XM76MSAFTBEKNXNTUPPF3MNVQTIVFT4XWG7O5T5XCURBKSRNA/ide/simeng/target/p2artifacts.xml to /var/lib/jenkins/workspace/crescendo-pipeline_master-CP6XM76MSAFTBEKNXNTUPPF3MNVQTIVFT4XWG7O5T5XCURBKSRNA/.repository/org/destecs/ide/org.destecs.ide.simeng/2.2.4/org.destecs.ide.simeng-2.2.4-p2artifacts.xml
[INFO] 
[INFO] --- tycho-p2-plugin:0.25.0:update-local-index (default-update-local-index) @ org.destecs.ide.simeng ---
[INFO]                                                                         
[INFO] ------------------------------------------------------------------------
[INFO] Building org.destecs.ide.ui 2.2.4
[INFO] ------------------------------------------------------------------------
[INFO] 
[INFO] --- tycho-packaging-plugin:0.25.0:build-qualifier (default-build-qualifier) @ org.destecs.ide.ui ---
[INFO] The project's OSGi version is 2.2.4
[INFO] 
[INFO] --- tycho-packaging-plugin:0.25.0:validate-id (default-validate-id) @ org.destecs.ide.ui ---
[INFO] 
[INFO] --- tycho-packaging-plugin:0.25.0:validate-version (default-validate-version) @ org.destecs.ide.ui ---
[INFO] 
[INFO] --- maven-resources-plugin:2.6:resources (default-resources) @ org.destecs.ide.ui ---
[INFO] Using 'UTF-8' encoding to copy filtered resources.
[INFO] skip non existing resourceDirectory /var/lib/jenkins/workspace/crescendo-pipeline_master-CP6XM76MSAFTBEKNXNTUPPF3MNVQTIVFT4XWG7O5T5XCURBKSRNA/ide/ui/src/main/resources
[INFO] 
[INFO] --- tycho-compiler-plugin:0.25.0:compile (default-compile) @ org.destecs.ide.ui ---
[INFO] Compiling 37 source files to /var/lib/jenkins/workspace/crescendo-pipeline_master-CP6XM76MSAFTBEKNXNTUPPF3MNVQTIVFT4XWG7O5T5XCURBKSRNA/ide/ui/target/classes
[INFO] 
[INFO] --- maven-resources-plugin:2.6:testResources (default-testResources) @ org.destecs.ide.ui ---
[INFO] Not copying test resources
[INFO] 
[INFO] --- target-platform-configuration:0.25.0:target-platform (default-target-platform) @ org.destecs.ide.ui ---
[INFO] 
[INFO] --- tycho-packaging-plugin:0.25.0:package-plugin (default-package-plugin) @ org.destecs.ide.ui ---
[INFO] Building jar: /var/lib/jenkins/workspace/crescendo-pipeline_master-CP6XM76MSAFTBEKNXNTUPPF3MNVQTIVFT4XWG7O5T5XCURBKSRNA/ide/ui/target/org.destecs.ide.ui-2.2.4.jar
[INFO] 
[INFO] --- tycho-p2-plugin:0.25.0:p2-metadata-default (default-p2-metadata-default) @ org.destecs.ide.ui ---
[INFO] 
[INFO] --- maven-javadoc-plugin:2.9:jar (attach-javadocs) @ org.destecs.ide.ui ---
[INFO] Skipping javadoc generation
[INFO] 
[INFO] --- maven-install-plugin:2.3.1:install (default-install) @ org.destecs.ide.ui ---
[INFO] Installing /var/lib/jenkins/workspace/crescendo-pipeline_master-CP6XM76MSAFTBEKNXNTUPPF3MNVQTIVFT4XWG7O5T5XCURBKSRNA/ide/ui/target/org.destecs.ide.ui-2.2.4.jar to /var/lib/jenkins/workspace/crescendo-pipeline_master-CP6XM76MSAFTBEKNXNTUPPF3MNVQTIVFT4XWG7O5T5XCURBKSRNA/.repository/org/destecs/ide/org.destecs.ide.ui/2.2.4/org.destecs.ide.ui-2.2.4.jar
[INFO] Installing /var/lib/jenkins/workspace/crescendo-pipeline_master-CP6XM76MSAFTBEKNXNTUPPF3MNVQTIVFT4XWG7O5T5XCURBKSRNA/ide/ui/pom.xml to /var/lib/jenkins/workspace/crescendo-pipeline_master-CP6XM76MSAFTBEKNXNTUPPF3MNVQTIVFT4XWG7O5T5XCURBKSRNA/.repository/org/destecs/ide/org.destecs.ide.ui/2.2.4/org.destecs.ide.ui-2.2.4.pom
[INFO] Installing /var/lib/jenkins/workspace/crescendo-pipeline_master-CP6XM76MSAFTBEKNXNTUPPF3MNVQTIVFT4XWG7O5T5XCURBKSRNA/ide/ui/target/p2content.xml to /var/lib/jenkins/workspace/crescendo-pipeline_master-CP6XM76MSAFTBEKNXNTUPPF3MNVQTIVFT4XWG7O5T5XCURBKSRNA/.repository/org/destecs/ide/org.destecs.ide.ui/2.2.4/org.destecs.ide.ui-2.2.4-p2metadata.xml
[INFO] Installing /var/lib/jenkins/workspace/crescendo-pipeline_master-CP6XM76MSAFTBEKNXNTUPPF3MNVQTIVFT4XWG7O5T5XCURBKSRNA/ide/ui/target/p2artifacts.xml to /var/lib/jenkins/workspace/crescendo-pipeline_master-CP6XM76MSAFTBEKNXNTUPPF3MNVQTIVFT4XWG7O5T5XCURBKSRNA/.repository/org/destecs/ide/org.destecs.ide.ui/2.2.4/org.destecs.ide.ui-2.2.4-p2artifacts.xml
[INFO] 
[INFO] --- tycho-p2-plugin:0.25.0:update-local-index (default-update-local-index) @ org.destecs.ide.ui ---
[INFO]                                                                         
[INFO] ------------------------------------------------------------------------
[INFO] Building org.destecs.ide.debug 2.2.4
[INFO] ------------------------------------------------------------------------
[INFO] 
[INFO] --- tycho-packaging-plugin:0.25.0:build-qualifier (default-build-qualifier) @ org.destecs.ide.debug ---
[INFO] The project's OSGi version is 2.2.4
[INFO] 
[INFO] --- tycho-packaging-plugin:0.25.0:validate-id (default-validate-id) @ org.destecs.ide.debug ---
[INFO] 
[INFO] --- tycho-packaging-plugin:0.25.0:validate-version (default-validate-version) @ org.destecs.ide.debug ---
[INFO] 
[INFO] --- maven-resources-plugin:2.6:resources (default-resources) @ org.destecs.ide.debug ---
[INFO] Using 'UTF-8' encoding to copy filtered resources.
[INFO] skip non existing resourceDirectory /var/lib/jenkins/workspace/crescendo-pipeline_master-CP6XM76MSAFTBEKNXNTUPPF3MNVQTIVFT4XWG7O5T5XCURBKSRNA/ide/debug/src/main/resources
[INFO] 
[INFO] --- tycho-compiler-plugin:0.25.0:compile (default-compile) @ org.destecs.ide.debug ---
[INFO] Compiling 64 source files to /var/lib/jenkins/workspace/crescendo-pipeline_master-CP6XM76MSAFTBEKNXNTUPPF3MNVQTIVFT4XWG7O5T5XCURBKSRNA/ide/debug/target/classes
[INFO] 
[INFO] --- maven-resources-plugin:2.6:testResources (default-testResources) @ org.destecs.ide.debug ---
[INFO] Not copying test resources
[INFO] 
[INFO] --- target-platform-configuration:0.25.0:target-platform (default-target-platform) @ org.destecs.ide.debug ---
[INFO] 
[INFO] --- tycho-packaging-plugin:0.25.0:package-plugin (default-package-plugin) @ org.destecs.ide.debug ---
[INFO] Building jar: /var/lib/jenkins/workspace/crescendo-pipeline_master-CP6XM76MSAFTBEKNXNTUPPF3MNVQTIVFT4XWG7O5T5XCURBKSRNA/ide/debug/target/org.destecs.ide.debug-2.2.4.jar
[INFO] 
[INFO] --- tycho-p2-plugin:0.25.0:p2-metadata-default (default-p2-metadata-default) @ org.destecs.ide.debug ---
[INFO] 
[INFO] --- maven-javadoc-plugin:2.9:jar (attach-javadocs) @ org.destecs.ide.debug ---
[INFO] Skipping javadoc generation
[INFO] 
[INFO] --- maven-install-plugin:2.3.1:install (default-install) @ org.destecs.ide.debug ---
[INFO] Installing /var/lib/jenkins/workspace/crescendo-pipeline_master-CP6XM76MSAFTBEKNXNTUPPF3MNVQTIVFT4XWG7O5T5XCURBKSRNA/ide/debug/target/org.destecs.ide.debug-2.2.4.jar to /var/lib/jenkins/workspace/crescendo-pipeline_master-CP6XM76MSAFTBEKNXNTUPPF3MNVQTIVFT4XWG7O5T5XCURBKSRNA/.repository/org/destecs/ide/org.destecs.ide.debug/2.2.4/org.destecs.ide.debug-2.2.4.jar
[INFO] Installing /var/lib/jenkins/workspace/crescendo-pipeline_master-CP6XM76MSAFTBEKNXNTUPPF3MNVQTIVFT4XWG7O5T5XCURBKSRNA/ide/debug/pom.xml to /var/lib/jenkins/workspace/crescendo-pipeline_master-CP6XM76MSAFTBEKNXNTUPPF3MNVQTIVFT4XWG7O5T5XCURBKSRNA/.repository/org/destecs/ide/org.destecs.ide.debug/2.2.4/org.destecs.ide.debug-2.2.4.pom
[INFO] Installing /var/lib/jenkins/workspace/crescendo-pipeline_master-CP6XM76MSAFTBEKNXNTUPPF3MNVQTIVFT4XWG7O5T5XCURBKSRNA/ide/debug/target/p2content.xml to /var/lib/jenkins/workspace/crescendo-pipeline_master-CP6XM76MSAFTBEKNXNTUPPF3MNVQTIVFT4XWG7O5T5XCURBKSRNA/.repository/org/destecs/ide/org.destecs.ide.debug/2.2.4/org.destecs.ide.debug-2.2.4-p2metadata.xml
[INFO] Installing /var/lib/jenkins/workspace/crescendo-pipeline_master-CP6XM76MSAFTBEKNXNTUPPF3MNVQTIVFT4XWG7O5T5XCURBKSRNA/ide/debug/target/p2artifacts.xml to /var/lib/jenkins/workspace/crescendo-pipeline_master-CP6XM76MSAFTBEKNXNTUPPF3MNVQTIVFT4XWG7O5T5XCURBKSRNA/.repository/org/destecs/ide/org.destecs.ide.debug/2.2.4/org.destecs.ide.debug-2.2.4-p2artifacts.xml
[INFO] 
[INFO] --- tycho-p2-plugin:0.25.0:update-local-index (default-update-local-index) @ org.destecs.ide.debug ---
[INFO]                                                                         
[INFO] ------------------------------------------------------------------------
[INFO] Building org.destecs.ide.vdmmetadatabuilder 2.2.4
[INFO] ------------------------------------------------------------------------
[INFO] 
[INFO] --- tycho-packaging-plugin:0.25.0:build-qualifier (default-build-qualifier) @ org.destecs.ide.vdmmetadatabuilder ---
[INFO] The project's OSGi version is 2.2.4
[INFO] 
[INFO] --- tycho-packaging-plugin:0.25.0:validate-id (default-validate-id) @ org.destecs.ide.vdmmetadatabuilder ---
[INFO] 
[INFO] --- tycho-packaging-plugin:0.25.0:validate-version (default-validate-version) @ org.destecs.ide.vdmmetadatabuilder ---
[INFO] 
[INFO] --- maven-resources-plugin:2.6:resources (default-resources) @ org.destecs.ide.vdmmetadatabuilder ---
[INFO] Using 'UTF-8' encoding to copy filtered resources.
[INFO] skip non existing resourceDirectory /var/lib/jenkins/workspace/crescendo-pipeline_master-CP6XM76MSAFTBEKNXNTUPPF3MNVQTIVFT4XWG7O5T5XCURBKSRNA/ide/vdmmetadatabuilder/src/main/resources
[INFO] 
[INFO] --- tycho-compiler-plugin:0.25.0:compile (default-compile) @ org.destecs.ide.vdmmetadatabuilder ---
[INFO] Compiling 3 source files to /var/lib/jenkins/workspace/crescendo-pipeline_master-CP6XM76MSAFTBEKNXNTUPPF3MNVQTIVFT4XWG7O5T5XCURBKSRNA/ide/vdmmetadatabuilder/target/classes
[INFO] 
[INFO] --- maven-resources-plugin:2.6:testResources (default-testResources) @ org.destecs.ide.vdmmetadatabuilder ---
[INFO] Not copying test resources
[INFO] 
[INFO] --- target-platform-configuration:0.25.0:target-platform (default-target-platform) @ org.destecs.ide.vdmmetadatabuilder ---
[INFO] 
[INFO] --- tycho-packaging-plugin:0.25.0:package-plugin (default-package-plugin) @ org.destecs.ide.vdmmetadatabuilder ---
[INFO] Building jar: /var/lib/jenkins/workspace/crescendo-pipeline_master-CP6XM76MSAFTBEKNXNTUPPF3MNVQTIVFT4XWG7O5T5XCURBKSRNA/ide/vdmmetadatabuilder/target/org.destecs.ide.vdmmetadatabuilder-2.2.4.jar
[INFO] 
[INFO] --- tycho-p2-plugin:0.25.0:p2-metadata-default (default-p2-metadata-default) @ org.destecs.ide.vdmmetadatabuilder ---
[INFO] 
[INFO] --- maven-javadoc-plugin:2.9:jar (attach-javadocs) @ org.destecs.ide.vdmmetadatabuilder ---
[INFO] Skipping javadoc generation
[INFO] 
[INFO] --- maven-install-plugin:2.3.1:install (default-install) @ org.destecs.ide.vdmmetadatabuilder ---
[INFO] Installing /var/lib/jenkins/workspace/crescendo-pipeline_master-CP6XM76MSAFTBEKNXNTUPPF3MNVQTIVFT4XWG7O5T5XCURBKSRNA/ide/vdmmetadatabuilder/target/org.destecs.ide.vdmmetadatabuilder-2.2.4.jar to /var/lib/jenkins/workspace/crescendo-pipeline_master-CP6XM76MSAFTBEKNXNTUPPF3MNVQTIVFT4XWG7O5T5XCURBKSRNA/.repository/org/destecs/ide/org.destecs.ide.vdmmetadatabuilder/2.2.4/org.destecs.ide.vdmmetadatabuilder-2.2.4.jar
[INFO] Installing /var/lib/jenkins/workspace/crescendo-pipeline_master-CP6XM76MSAFTBEKNXNTUPPF3MNVQTIVFT4XWG7O5T5XCURBKSRNA/ide/vdmmetadatabuilder/pom.xml to /var/lib/jenkins/workspace/crescendo-pipeline_master-CP6XM76MSAFTBEKNXNTUPPF3MNVQTIVFT4XWG7O5T5XCURBKSRNA/.repository/org/destecs/ide/org.destecs.ide.vdmmetadatabuilder/2.2.4/org.destecs.ide.vdmmetadatabuilder-2.2.4.pom
[INFO] Installing /var/lib/jenkins/workspace/crescendo-pipeline_master-CP6XM76MSAFTBEKNXNTUPPF3MNVQTIVFT4XWG7O5T5XCURBKSRNA/ide/vdmmetadatabuilder/target/p2content.xml to /var/lib/jenkins/workspace/crescendo-pipeline_master-CP6XM76MSAFTBEKNXNTUPPF3MNVQTIVFT4XWG7O5T5XCURBKSRNA/.repository/org/destecs/ide/org.destecs.ide.vdmmetadatabuilder/2.2.4/org.destecs.ide.vdmmetadatabuilder-2.2.4-p2metadata.xml
[INFO] Installing /var/lib/jenkins/workspace/crescendo-pipeline_master-CP6XM76MSAFTBEKNXNTUPPF3MNVQTIVFT4XWG7O5T5XCURBKSRNA/ide/vdmmetadatabuilder/target/p2artifacts.xml to /var/lib/jenkins/workspace/crescendo-pipeline_master-CP6XM76MSAFTBEKNXNTUPPF3MNVQTIVFT4XWG7O5T5XCURBKSRNA/.repository/org/destecs/ide/org.destecs.ide.vdmmetadatabuilder/2.2.4/org.destecs.ide.vdmmetadatabuilder-2.2.4-p2artifacts.xml
[INFO] 
[INFO] --- tycho-p2-plugin:0.25.0:update-local-index (default-update-local-index) @ org.destecs.ide.vdmmetadatabuilder ---
[INFO]                                                                         
[INFO] ------------------------------------------------------------------------
[INFO] Building org.destecs.ide.libraries 2.2.4
[INFO] ------------------------------------------------------------------------
[INFO] 
[INFO] --- tycho-packaging-plugin:0.25.0:build-qualifier (default-build-qualifier) @ org.destecs.ide.libraries ---
[INFO] The project's OSGi version is 2.2.4
[INFO] 
[INFO] --- tycho-packaging-plugin:0.25.0:validate-id (default-validate-id) @ org.destecs.ide.libraries ---
[INFO] 
[INFO] --- tycho-packaging-plugin:0.25.0:validate-version (default-validate-version) @ org.destecs.ide.libraries ---
[INFO] 
[INFO] --- maven-resources-plugin:2.6:resources (default-resources) @ org.destecs.ide.libraries ---
[INFO] Using 'UTF-8' encoding to copy filtered resources.
[INFO] skip non existing resourceDirectory /var/lib/jenkins/workspace/crescendo-pipeline_master-CP6XM76MSAFTBEKNXNTUPPF3MNVQTIVFT4XWG7O5T5XCURBKSRNA/ide/libraries/src/main/resources
[INFO] 
[INFO] --- tycho-compiler-plugin:0.25.0:compile (default-compile) @ org.destecs.ide.libraries ---
[INFO] Compiling 10 source files to /var/lib/jenkins/workspace/crescendo-pipeline_master-CP6XM76MSAFTBEKNXNTUPPF3MNVQTIVFT4XWG7O5T5XCURBKSRNA/ide/libraries/target/classes
[INFO] 
[INFO] --- maven-resources-plugin:2.6:testResources (default-testResources) @ org.destecs.ide.libraries ---
[INFO] Not copying test resources
[INFO] 
[INFO] --- target-platform-configuration:0.25.0:target-platform (default-target-platform) @ org.destecs.ide.libraries ---
[INFO] 
[INFO] --- tycho-packaging-plugin:0.25.0:package-plugin (default-package-plugin) @ org.destecs.ide.libraries ---
[INFO] Building jar: /var/lib/jenkins/workspace/crescendo-pipeline_master-CP6XM76MSAFTBEKNXNTUPPF3MNVQTIVFT4XWG7O5T5XCURBKSRNA/ide/libraries/target/org.destecs.ide.libraries-2.2.4.jar
[INFO] 
[INFO] --- tycho-p2-plugin:0.25.0:p2-metadata-default (default-p2-metadata-default) @ org.destecs.ide.libraries ---
[INFO] 
[INFO] --- maven-javadoc-plugin:2.9:jar (attach-javadocs) @ org.destecs.ide.libraries ---
[INFO] Skipping javadoc generation
[INFO] 
[INFO] --- maven-install-plugin:2.3.1:install (default-install) @ org.destecs.ide.libraries ---
[INFO] Installing /var/lib/jenkins/workspace/crescendo-pipeline_master-CP6XM76MSAFTBEKNXNTUPPF3MNVQTIVFT4XWG7O5T5XCURBKSRNA/ide/libraries/target/org.destecs.ide.libraries-2.2.4.jar to /var/lib/jenkins/workspace/crescendo-pipeline_master-CP6XM76MSAFTBEKNXNTUPPF3MNVQTIVFT4XWG7O5T5XCURBKSRNA/.repository/org/destecs/ide/org.destecs.ide.libraries/2.2.4/org.destecs.ide.libraries-2.2.4.jar
[INFO] Installing /var/lib/jenkins/workspace/crescendo-pipeline_master-CP6XM76MSAFTBEKNXNTUPPF3MNVQTIVFT4XWG7O5T5XCURBKSRNA/ide/libraries/pom.xml to /var/lib/jenkins/workspace/crescendo-pipeline_master-CP6XM76MSAFTBEKNXNTUPPF3MNVQTIVFT4XWG7O5T5XCURBKSRNA/.repository/org/destecs/ide/org.destecs.ide.libraries/2.2.4/org.destecs.ide.libraries-2.2.4.pom
[INFO] Installing /var/lib/jenkins/workspace/crescendo-pipeline_master-CP6XM76MSAFTBEKNXNTUPPF3MNVQTIVFT4XWG7O5T5XCURBKSRNA/ide/libraries/target/p2content.xml to /var/lib/jenkins/workspace/crescendo-pipeline_master-CP6XM76MSAFTBEKNXNTUPPF3MNVQTIVFT4XWG7O5T5XCURBKSRNA/.repository/org/destecs/ide/org.destecs.ide.libraries/2.2.4/org.destecs.ide.libraries-2.2.4-p2metadata.xml
[INFO] Installing /var/lib/jenkins/workspace/crescendo-pipeline_master-CP6XM76MSAFTBEKNXNTUPPF3MNVQTIVFT4XWG7O5T5XCURBKSRNA/ide/libraries/target/p2artifacts.xml to /var/lib/jenkins/workspace/crescendo-pipeline_master-CP6XM76MSAFTBEKNXNTUPPF3MNVQTIVFT4XWG7O5T5XCURBKSRNA/.repository/org/destecs/ide/org.destecs.ide.libraries/2.2.4/org.destecs.ide.libraries-2.2.4-p2artifacts.xml
[INFO] 
[INFO] --- tycho-p2-plugin:0.25.0:update-local-index (default-update-local-index) @ org.destecs.ide.libraries ---
[INFO]                                                                         
[INFO] ------------------------------------------------------------------------
[INFO] Building org.destecs.ide.platform 2.2.4
[INFO] ------------------------------------------------------------------------
[INFO] 
[INFO] --- tycho-packaging-plugin:0.25.0:build-qualifier (default-build-qualifier) @ org.destecs.ide.platform ---
[INFO] The project's OSGi version is 2.2.4
[INFO] 
[INFO] --- tycho-packaging-plugin:0.25.0:validate-id (default-validate-id) @ org.destecs.ide.platform ---
[INFO] 
[INFO] --- tycho-packaging-plugin:0.25.0:validate-version (default-validate-version) @ org.destecs.ide.platform ---
[INFO] 
[INFO] --- git-commit-id-plugin:2.1.4:revision (default) @ org.destecs.ide.platform ---
[INFO] Downloading: http://overture.au.dk/artifactory/remote-repos/joda-time/joda-time/2.0/joda-time-2.0.pom
[INFO] Downloaded: http://overture.au.dk/artifactory/remote-repos/joda-time/joda-time/2.0/joda-time-2.0.pom (15 KB at 575.0 KB/sec)
[INFO] Downloading: http://overture.au.dk/artifactory/remote-repos/com/google/guava/guava/13.0/guava-13.0.pom
[INFO] Downloaded: http://overture.au.dk/artifactory/remote-repos/com/google/guava/guava/13.0/guava-13.0.pom (6 KB at 186.4 KB/sec)
[INFO] Downloading: http://overture.au.dk/artifactory/remote-repos/com/google/guava/guava-parent/13.0/guava-parent-13.0.pom
[INFO] Downloaded: http://overture.au.dk/artifactory/remote-repos/com/google/guava/guava-parent/13.0/guava-parent-13.0.pom (3 KB at 99.7 KB/sec)
[INFO] Downloading: http://overture.au.dk/artifactory/remote-repos/com/intellij/annotations/9.0.4/annotations-9.0.4.pom
[INFO] Downloaded: http://overture.au.dk/artifactory/remote-repos/com/intellij/annotations/9.0.4/annotations-9.0.4.pom (2 KB at 72.2 KB/sec)
[INFO] Downloading: http://overture.au.dk/artifactory/remote-repos/org/eclipse/jgit/org.eclipse.jgit/2.0.0.201206130900-r/org.eclipse.jgit-2.0.0.201206130900-r.pom
[INFO] Downloaded: http://overture.au.dk/artifactory/remote-repos/org/eclipse/jgit/org.eclipse.jgit/2.0.0.201206130900-r/org.eclipse.jgit-2.0.0.201206130900-r.pom (6 KB at 264.5 KB/sec)
[INFO] Downloading: http://overture.au.dk/artifactory/remote-repos/org/eclipse/jgit/org.eclipse.jgit-parent/2.0.0.201206130900-r/org.eclipse.jgit-parent-2.0.0.201206130900-r.pom
[INFO] Downloaded: http://overture.au.dk/artifactory/remote-repos/org/eclipse/jgit/org.eclipse.jgit-parent/2.0.0.201206130900-r/org.eclipse.jgit-parent-2.0.0.201206130900-r.pom (17 KB at 735.4 KB/sec)
[INFO] Downloading: http://overture.au.dk/artifactory/remote-repos/org/codehaus/plexus/plexus-utils/1.5.15/plexus-utils-1.5.15.jar
[INFO] Downloading: http://overture.au.dk/artifactory/remote-repos/com/google/guava/guava/13.0/guava-13.0.jar
[INFO] Downloading: http://overture.au.dk/artifactory/remote-repos/joda-time/joda-time/2.0/joda-time-2.0.jar
[INFO] Downloading: http://overture.au.dk/artifactory/remote-repos/com/intellij/annotations/9.0.4/annotations-9.0.4.jar
[INFO] Downloading: http://overture.au.dk/artifactory/remote-repos/org/eclipse/jgit/org.eclipse.jgit/2.0.0.201206130900-r/org.eclipse.jgit-2.0.0.201206130900-r.jar
[INFO] Downloaded: http://overture.au.dk/artifactory/remote-repos/com/intellij/annotations/9.0.4/annotations-9.0.4.jar (10 KB at 277.8 KB/sec)
[INFO] Downloaded: http://overture.au.dk/artifactory/remote-repos/org/codehaus/plexus/plexus-utils/1.5.15/plexus-utils-1.5.15.jar (223 KB at 2683.9 KB/sec)
[INFO] Downloaded: http://overture.au.dk/artifactory/remote-repos/joda-time/joda-time/2.0/joda-time-2.0.jar (556 KB at 5147.1 KB/sec)
[INFO] Downloaded: http://overture.au.dk/artifactory/remote-repos/com/google/guava/guava/13.0/guava-13.0.jar (1847 KB at 13579.3 KB/sec)
[INFO] Downloaded: http://overture.au.dk/artifactory/remote-repos/org/eclipse/jgit/org.eclipse.jgit/2.0.0.201206130900-r/org.eclipse.jgit-2.0.0.201206130900-r.jar (1542 KB at 5053.1 KB/sec)
[INFO] 
[INFO] --- maven-resources-plugin:2.6:resources (default-resources) @ org.destecs.ide.platform ---
[INFO] Using 'UTF-8' encoding to copy filtered resources.
[INFO] Copying 1 resource to /var/lib/jenkins/workspace/crescendo-pipeline_master-CP6XM76MSAFTBEKNXNTUPPF3MNVQTIVFT4XWG7O5T5XCURBKSRNA/ide/platform
[INFO] 
[INFO] --- tycho-compiler-plugin:0.25.0:compile (default-compile) @ org.destecs.ide.platform ---
[INFO] Compiling 2 source files to /var/lib/jenkins/workspace/crescendo-pipeline_master-CP6XM76MSAFTBEKNXNTUPPF3MNVQTIVFT4XWG7O5T5XCURBKSRNA/ide/platform/target/classes
[INFO] 
[INFO] --- maven-resources-plugin:2.6:testResources (default-testResources) @ org.destecs.ide.platform ---
[INFO] Not copying test resources
[INFO] 
[INFO] --- target-platform-configuration:0.25.0:target-platform (default-target-platform) @ org.destecs.ide.platform ---
[INFO] 
[INFO] --- tycho-packaging-plugin:0.25.0:package-plugin (default-package-plugin) @ org.destecs.ide.platform ---
[INFO] Building jar: /var/lib/jenkins/workspace/crescendo-pipeline_master-CP6XM76MSAFTBEKNXNTUPPF3MNVQTIVFT4XWG7O5T5XCURBKSRNA/ide/platform/target/org.destecs.ide.platform-2.2.4.jar
[INFO] 
[INFO] --- tycho-p2-plugin:0.25.0:p2-metadata-default (default-p2-metadata-default) @ org.destecs.ide.platform ---
[INFO] 
[INFO] --- maven-javadoc-plugin:2.9:jar (attach-javadocs) @ org.destecs.ide.platform ---
[INFO] Skipping javadoc generation
[INFO] 
[INFO] --- maven-install-plugin:2.3.1:install (default-install) @ org.destecs.ide.platform ---
[INFO] Installing /var/lib/jenkins/workspace/crescendo-pipeline_master-CP6XM76MSAFTBEKNXNTUPPF3MNVQTIVFT4XWG7O5T5XCURBKSRNA/ide/platform/target/org.destecs.ide.platform-2.2.4.jar to /var/lib/jenkins/workspace/crescendo-pipeline_master-CP6XM76MSAFTBEKNXNTUPPF3MNVQTIVFT4XWG7O5T5XCURBKSRNA/.repository/org/destecs/ide/org.destecs.ide.platform/2.2.4/org.destecs.ide.platform-2.2.4.jar
[INFO] Installing /var/lib/jenkins/workspace/crescendo-pipeline_master-CP6XM76MSAFTBEKNXNTUPPF3MNVQTIVFT4XWG7O5T5XCURBKSRNA/ide/platform/pom.xml to /var/lib/jenkins/workspace/crescendo-pipeline_master-CP6XM76MSAFTBEKNXNTUPPF3MNVQTIVFT4XWG7O5T5XCURBKSRNA/.repository/org/destecs/ide/org.destecs.ide.platform/2.2.4/org.destecs.ide.platform-2.2.4.pom
[INFO] Installing /var/lib/jenkins/workspace/crescendo-pipeline_master-CP6XM76MSAFTBEKNXNTUPPF3MNVQTIVFT4XWG7O5T5XCURBKSRNA/ide/platform/target/p2content.xml to /var/lib/jenkins/workspace/crescendo-pipeline_master-CP6XM76MSAFTBEKNXNTUPPF3MNVQTIVFT4XWG7O5T5XCURBKSRNA/.repository/org/destecs/ide/org.destecs.ide.platform/2.2.4/org.destecs.ide.platform-2.2.4-p2metadata.xml
[INFO] Installing /var/lib/jenkins/workspace/crescendo-pipeline_master-CP6XM76MSAFTBEKNXNTUPPF3MNVQTIVFT4XWG7O5T5XCURBKSRNA/ide/platform/target/p2artifacts.xml to /var/lib/jenkins/workspace/crescendo-pipeline_master-CP6XM76MSAFTBEKNXNTUPPF3MNVQTIVFT4XWG7O5T5XCURBKSRNA/.repository/org/destecs/ide/org.destecs.ide.platform/2.2.4/org.destecs.ide.platform-2.2.4-p2artifacts.xml
[INFO] 
[INFO] --- tycho-p2-plugin:0.25.0:update-local-index (default-update-local-index) @ org.destecs.ide.platform ---
[INFO]                                                                         
[INFO] ------------------------------------------------------------------------
[INFO] Building DESTECS IDE Eclipse features 2.2.4
[INFO] ------------------------------------------------------------------------
[INFO] 
[INFO] --- maven-javadoc-plugin:2.9:jar (attach-javadocs) @ features ---
[INFO] Skipping javadoc generation
[INFO] 
[INFO] --- maven-install-plugin:2.5.2:install (default-install) @ features ---
[INFO] Installing /var/lib/jenkins/workspace/crescendo-pipeline_master-CP6XM76MSAFTBEKNXNTUPPF3MNVQTIVFT4XWG7O5T5XCURBKSRNA/ide/features/pom.xml to /var/lib/jenkins/workspace/crescendo-pipeline_master-CP6XM76MSAFTBEKNXNTUPPF3MNVQTIVFT4XWG7O5T5XCURBKSRNA/.repository/org/destecs/ide/features/2.2.4/features-2.2.4.pom
[INFO]                                                                         
[INFO] ------------------------------------------------------------------------
[INFO] Building DESTECS IDE Eclipse rcp feature 2.2.4
[INFO] ------------------------------------------------------------------------
[INFO] 
[INFO] --- tycho-packaging-plugin:0.25.0:build-qualifier-aggregator (default-build-qualifier-aggregator) @ org.destecs.ide.features.rcp ---
[INFO] The project's OSGi version is 2.2.4
[INFO] 
[INFO] --- tycho-packaging-plugin:0.25.0:validate-id (default-validate-id) @ org.destecs.ide.features.rcp ---
[INFO] 
[INFO] --- tycho-packaging-plugin:0.25.0:validate-version (default-validate-version) @ org.destecs.ide.features.rcp ---
[INFO] 
[INFO] --- target-platform-configuration:0.25.0:target-platform (default-target-platform) @ org.destecs.ide.features.rcp ---
[INFO] 
[INFO] --- tycho-packaging-plugin:0.25.0:package-feature (default-package-feature) @ org.destecs.ide.features.rcp ---
[INFO] Building jar: /var/lib/jenkins/workspace/crescendo-pipeline_master-CP6XM76MSAFTBEKNXNTUPPF3MNVQTIVFT4XWG7O5T5XCURBKSRNA/ide/features/rcp/target/org.destecs.ide.features.rcp-2.2.4.jar
[INFO] 
[INFO] --- tycho-p2-plugin:0.25.0:p2-metadata-default (default-p2-metadata-default) @ org.destecs.ide.features.rcp ---
[INFO] 
[INFO] --- tycho-p2-plugin:0.25.0:feature-p2-metadata (default-feature-p2-metadata) @ org.destecs.ide.features.rcp ---
[INFO] 
[INFO] --- maven-javadoc-plugin:2.9:jar (attach-javadocs) @ org.destecs.ide.features.rcp ---
[INFO] Skipping javadoc generation
[INFO] 
[INFO] --- maven-install-plugin:2.3.1:install (default-install) @ org.destecs.ide.features.rcp ---
[INFO] Installing /var/lib/jenkins/workspace/crescendo-pipeline_master-CP6XM76MSAFTBEKNXNTUPPF3MNVQTIVFT4XWG7O5T5XCURBKSRNA/ide/features/rcp/target/org.destecs.ide.features.rcp-2.2.4.jar to /var/lib/jenkins/workspace/crescendo-pipeline_master-CP6XM76MSAFTBEKNXNTUPPF3MNVQTIVFT4XWG7O5T5XCURBKSRNA/.repository/org/destecs/ide/features/org.destecs.ide.features.rcp/2.2.4/org.destecs.ide.features.rcp-2.2.4.jar
[INFO] Installing /var/lib/jenkins/workspace/crescendo-pipeline_master-CP6XM76MSAFTBEKNXNTUPPF3MNVQTIVFT4XWG7O5T5XCURBKSRNA/ide/features/rcp/pom.xml to /var/lib/jenkins/workspace/crescendo-pipeline_master-CP6XM76MSAFTBEKNXNTUPPF3MNVQTIVFT4XWG7O5T5XCURBKSRNA/.repository/org/destecs/ide/features/org.destecs.ide.features.rcp/2.2.4/org.destecs.ide.features.rcp-2.2.4.pom
[INFO] Installing /var/lib/jenkins/workspace/crescendo-pipeline_master-CP6XM76MSAFTBEKNXNTUPPF3MNVQTIVFT4XWG7O5T5XCURBKSRNA/ide/features/rcp/target/p2content.xml to /var/lib/jenkins/workspace/crescendo-pipeline_master-CP6XM76MSAFTBEKNXNTUPPF3MNVQTIVFT4XWG7O5T5XCURBKSRNA/.repository/org/destecs/ide/features/org.destecs.ide.features.rcp/2.2.4/org.destecs.ide.features.rcp-2.2.4-p2metadata.xml
[INFO] Installing /var/lib/jenkins/workspace/crescendo-pipeline_master-CP6XM76MSAFTBEKNXNTUPPF3MNVQTIVFT4XWG7O5T5XCURBKSRNA/ide/features/rcp/target/p2artifacts.xml to /var/lib/jenkins/workspace/crescendo-pipeline_master-CP6XM76MSAFTBEKNXNTUPPF3MNVQTIVFT4XWG7O5T5XCURBKSRNA/.repository/org/destecs/ide/features/org.destecs.ide.features.rcp/2.2.4/org.destecs.ide.features.rcp-2.2.4-p2artifacts.xml
[INFO] 
[INFO] --- tycho-p2-plugin:0.25.0:update-local-index (default-update-local-index) @ org.destecs.ide.features.rcp ---
[INFO]                                                                         
[INFO] ------------------------------------------------------------------------
[INFO] Building DESTECS IDE Standalone Product 2.2.4
[INFO] ------------------------------------------------------------------------
[INFO] 
[INFO] --- tycho-packaging-plugin:0.25.0:build-qualifier-aggregator (default-build-qualifier-aggregator) @ org.destecs.ide.product ---
[INFO] The project's OSGi version is 2.2.4
[INFO] 
[INFO] --- maven-clean-plugin:2.5:clean (default-clean-1) @ org.destecs.ide.product ---
[INFO] 
[INFO] --- maven-resources-plugin:2.6:resources (default-resources) @ org.destecs.ide.product ---
[INFO] Using 'UTF-8' encoding to copy filtered resources.
[INFO] Copying 4 resources to /var/lib/jenkins/workspace/crescendo-pipeline_master-CP6XM76MSAFTBEKNXNTUPPF3MNVQTIVFT4XWG7O5T5XCURBKSRNA/ide/product/target/installer
[INFO] Copying 1 resource to /var/lib/jenkins/workspace/crescendo-pipeline_master-CP6XM76MSAFTBEKNXNTUPPF3MNVQTIVFT4XWG7O5T5XCURBKSRNA/ide/product/target/installer/x86_64
[INFO] 
[INFO] --- target-platform-configuration:0.25.0:target-platform (default-target-platform) @ org.destecs.ide.product ---
[INFO] 
[INFO] --- tycho-p2-publisher-plugin:0.25.0:publish-products (default-publish-products) @ org.destecs.ide.product ---
Error - 3 icon(s) not replaced in /tmp/p2.brandingIron2803571221993739496/launcher.exe using /var/lib/jenkins/workspace/crescendo-pipeline_master-CP6XM76MSAFTBEKNXNTUPPF3MNVQTIVFT4XWG7O5T5XCURBKSRNA/ide/product/icons/win/crescendo.ico
Error - 3 icon(s) not replaced in /tmp/p2.brandingIron8031140734186998398/launcher.exe using /var/lib/jenkins/workspace/crescendo-pipeline_master-CP6XM76MSAFTBEKNXNTUPPF3MNVQTIVFT4XWG7O5T5XCURBKSRNA/ide/product/icons/win/crescendo.ico
[INFO] 
[INFO] --- tycho-p2-publisher-plugin:0.25.0:publish-categories (default-publish-categories) @ org.destecs.ide.product ---
[INFO] 
[INFO] --- tycho-p2-publisher-plugin:0.25.0:attach-artifacts (default-attach-artifacts) @ org.destecs.ide.product ---
[INFO] 
[INFO] --- tycho-p2-repository-plugin:0.25.0:assemble-repository (default-assemble-repository) @ org.destecs.ide.product ---
[INFO] Copying resources from /var/lib/jenkins/workspace/crescendo-pipeline_master-CP6XM76MSAFTBEKNXNTUPPF3MNVQTIVFT4XWG7O5T5XCURBKSRNA/ide/product/target/classes to /var/lib/jenkins/workspace/crescendo-pipeline_master-CP6XM76MSAFTBEKNXNTUPPF3MNVQTIVFT4XWG7O5T5XCURBKSRNA/ide/product/target/repository
[WARNING] Mirror tool: Messages while mirroring artifact descriptors.: [I/O exception while reading artifact canonical: osgi.bundle,org.eclipse.ui.intro.universal,3.3.1.v20160829-1558]
[INFO] ------------------------------------------------------------------------
[INFO] Reactor Summary:
[INFO] 
[INFO] DESTECS ............................................ SUCCESS [  0.195 s]
[INFO] Core Tools ......................................... SUCCESS [  0.029 s]
[INFO] xmlrpc-extensions .................................. SUCCESS [  0.004 s]
[INFO] xmlrpc-baseextension ............................... SUCCESS [  1.226 s]
[INFO] DESTECS Maven plugins and standalone tools ......... SUCCESS [  0.008 s]
[INFO] Java Co-Simulation protocol generator .............. SUCCESS [  2.702 s]
[INFO] The Co-Simulation protocol ......................... SUCCESS [  0.510 s]
[INFO] xmlrpc-clientextension ............................. SUCCESS [  0.104 s]
[INFO] Simulation Engine .................................. SUCCESS [  0.797 s]
[INFO] xmlrpc-serverextension ............................. SUCCESS [  0.051 s]
[INFO] Co-Simulator for VDM ............................... SUCCESS [  3.455 s]
[INFO] DESTECS IDE Top-level .............................. SUCCESS [  1.172 s]
[INFO] org.destecs.ide.core ............................... SUCCESS [  4.044 s]
[INFO] DESTECS Simulation Engine .......................... SUCCESS [  6.346 s]
[INFO] org.destecs.ide.ui ................................. SUCCESS [  0.578 s]
[INFO] org.destecs.ide.debug .............................. SUCCESS [  0.745 s]
[INFO] org.destecs.ide.vdmmetadatabuilder ................. SUCCESS [  0.261 s]
[INFO] org.destecs.ide.libraries .......................... SUCCESS [  0.297 s]
[INFO] org.destecs.ide.platform ........................... SUCCESS [  3.602 s]
[INFO] DESTECS IDE Eclipse features ....................... SUCCESS [  0.005 s]
[INFO] DESTECS IDE Eclipse rcp feature .................... SUCCESS [  0.272 s]
[INFO] DESTECS IDE Standalone Product ..................... FAILURE [  2.950 s]
[INFO] ------------------------------------------------------------------------
[INFO] BUILD FAILURE
[INFO] ------------------------------------------------------------------------
[INFO] Total time: 01:08 min
[INFO] Finished at: 2017-09-17T09:54:49+02:00
[INFO] Final Memory: 154M/842M
[INFO] ------------------------------------------------------------------------
[jenkins-maven-event-spy] INFO generated /var/lib/jenkins/workspace/crescendo-pipeline_master-CP6XM76MSAFTBEKNXNTUPPF3MNVQTIVFT4XWG7O5T5XCURBKSRNA@tmp/withMaven490a0bc3/maven-spy-20170917-095340-539.log
[ERROR] Failed to execute goal org.eclipse.tycho:tycho-p2-repository-plugin:0.25.0:assemble-repository (default-assemble-repository) on project org.destecs.ide.product: Could not assemble p2 repository: Mirroring failed: Messages while mirroring artifact descriptors.: [I/O exception while reading artifact canonical: osgi.bundle,org.eclipse.ui.intro.universal,3.3.1.v20160829-1558]: No space left on device -> [Help 1]
[ERROR] 
[ERROR] To see the full stack trace of the errors, re-run Maven with the -e switch.
[ERROR] Re-run Maven using the -X switch to enable full debug logging.
[ERROR] 
[ERROR] For more information about the errors and possible solutions, please read the following articles:
[ERROR] [Help 1] http://cwiki.apache.org/confluence/display/MAVEN/MojoExecutionException
[ERROR] 
[ERROR] After correcting the problems, you can resume the build with the command
[ERROR]   mvn <goals> -rf :org.destecs.ide.product
[Pipeline] }
[withMaven] Archive artifact pom.xml under org/destecs/root/2.2.4/root-2.2.4.pom
[withMaven] Archive artifact core/pom.xml under org/destecs/core/2.2.4/core-2.2.4.pom
[withMaven] Archive artifact core/xmlrpcextensions/pom.xml under org/destecs/core/xmlrpc-extensions/2.2.4/xmlrpc-extensions-2.2.4.pom
[withMaven] Archive artifact core/xmlrpcextensions/xmlrpcbaseextension/pom.xml under org/destecs/core/xmlrpcextensions/xmlrpcbaseextension/2.2.4/xmlrpcbaseextension-2.2.4.pom
[withMaven] Archive artifact core/xmlrpcextensions/xmlrpcbaseextension/target/xmlrpcbaseextension-2.2.4.jar under org/destecs/core/xmlrpcextensions/xmlrpcbaseextension/2.2.4/xmlrpcbaseextension-2.2.4.jar
[withMaven] Archive artifact tools/pom.xml under org/destecs/tools/tool/2.2.4/tool-2.2.4.pom
[withMaven] Archive artifact tools/jprotocolgenerator/pom.xml under org/destecs/tools/jprotocolgenerator/2.2.4/jprotocolgenerator-2.2.4.pom
[withMaven] Archive artifact tools/jprotocolgenerator/target/jprotocolgenerator-2.2.4.jar under org/destecs/tools/jprotocolgenerator/2.2.4/jprotocolgenerator-2.2.4.jar
[withMaven] Archive artifact core/protocol/pom.xml under org/destecs/core/protocol/2.2.4/protocol-2.2.4.pom
[withMaven] Archive artifact core/protocol/target/protocol-2.2.4.jar under org/destecs/core/protocol/2.2.4/protocol-2.2.4.jar
[withMaven] Archive artifact core/xmlrpcextensions/xmlrpcclientextension/pom.xml under org/destecs/core/xmlrpcextensions/xmlrpcclientextension/2.2.4/xmlrpcclientextension-2.2.4.pom
[withMaven] Archive artifact core/xmlrpcextensions/xmlrpcclientextension/target/xmlrpcclientextension-2.2.4.jar under org/destecs/core/xmlrpcextensions/xmlrpcclientextension/2.2.4/xmlrpcclientextension-2.2.4.jar
[withMaven] Archive artifact core/simulationengine/pom.xml under org/destecs/core/simulationengine/2.2.4/simulationengine-2.2.4.pom
[withMaven] Archive artifact core/simulationengine/target/simulationengine-2.2.4.jar under org/destecs/core/simulationengine/2.2.4/simulationengine-2.2.4.jar
[withMaven] Archive artifact core/xmlrpcextensions/xmlrpcserverextension/pom.xml under org/destecs/core/xmlrpcextensions/xmlrpcserverextension/2.2.4/xmlrpcserverextension-2.2.4.pom
[withMaven] Archive artifact core/xmlrpcextensions/xmlrpcserverextension/target/xmlrpcserverextension-2.2.4.jar under org/destecs/core/xmlrpcextensions/xmlrpcserverextension/2.2.4/xmlrpcserverextension-2.2.4.jar
[withMaven] Archive artifact core/vdm/pom.xml under org/destecs/core/vdm/2.2.4/vdm-2.2.4.pom
[withMaven] Archive artifact core/vdm/target/vdm-2.2.4.jar under org/destecs/core/vdm/2.2.4/vdm-2.2.4.jar
[withMaven] Archive artifact ide/pom.xml under org/destecs/ide/2.2.4/ide-2.2.4.pom
[withMaven] Archive artifact ide/core/pom.xml under org/destecs/ide/org.destecs.ide.core/2.2.4/org.destecs.ide.core-2.2.4.pom
[withMaven] Archive artifact ide/core/target/org.destecs.ide.core-2.2.4.jar under org/destecs/ide/org.destecs.ide.core/2.2.4/org.destecs.ide.core-2.2.4.jar
[withMaven] Archive artifact ide/simeng/pom.xml under org/destecs/ide/org.destecs.ide.simeng/2.2.4/org.destecs.ide.simeng-2.2.4.pom
[withMaven] Archive artifact ide/simeng/target/org.destecs.ide.simeng-2.2.4.jar under org/destecs/ide/org.destecs.ide.simeng/2.2.4/org.destecs.ide.simeng-2.2.4.jar
[withMaven] Archive artifact ide/ui/pom.xml under org/destecs/ide/org.destecs.ide.ui/2.2.4/org.destecs.ide.ui-2.2.4.pom
[withMaven] Archive artifact ide/ui/target/org.destecs.ide.ui-2.2.4.jar under org/destecs/ide/org.destecs.ide.ui/2.2.4/org.destecs.ide.ui-2.2.4.jar
[withMaven] Archive artifact ide/debug/pom.xml under org/destecs/ide/org.destecs.ide.debug/2.2.4/org.destecs.ide.debug-2.2.4.pom
[withMaven] Archive artifact ide/debug/target/org.destecs.ide.debug-2.2.4.jar under org/destecs/ide/org.destecs.ide.debug/2.2.4/org.destecs.ide.debug-2.2.4.jar
[withMaven] Archive artifact ide/vdmmetadatabuilder/pom.xml under org/destecs/ide/org.destecs.ide.vdmmetadatabuilder/2.2.4/org.destecs.ide.vdmmetadatabuilder-2.2.4.pom
[withMaven] Archive artifact ide/vdmmetadatabuilder/target/org.destecs.ide.vdmmetadatabuilder-2.2.4.jar under org/destecs/ide/org.destecs.ide.vdmmetadatabuilder/2.2.4/org.destecs.ide.vdmmetadatabuilder-2.2.4.jar
[withMaven] Archive artifact ide/libraries/pom.xml under org/destecs/ide/org.destecs.ide.libraries/2.2.4/org.destecs.ide.libraries-2.2.4.pom
[withMaven] Archive artifact ide/libraries/target/org.destecs.ide.libraries-2.2.4.jar under org/destecs/ide/org.destecs.ide.libraries/2.2.4/org.destecs.ide.libraries-2.2.4.jar
[withMaven] Archive artifact ide/platform/pom.xml under org/destecs/ide/org.destecs.ide.platform/2.2.4/org.destecs.ide.platform-2.2.4.pom
[withMaven] Archive artifact ide/platform/target/org.destecs.ide.platform-2.2.4.jar under org/destecs/ide/org.destecs.ide.platform/2.2.4/org.destecs.ide.platform-2.2.4.jar
[withMaven] Archive artifact ide/features/pom.xml under org/destecs/ide/features/2.2.4/features-2.2.4.pom
[withMaven] Archive artifact ide/features/rcp/pom.xml under org/destecs/ide/features/org.destecs.ide.features.rcp/2.2.4/org.destecs.ide.features.rcp-2.2.4.pom
[withMaven] Archive artifact ide/features/rcp/target/org.destecs.ide.features.rcp-2.2.4.jar under org/destecs/ide/features/org.destecs.ide.features.rcp/2.2.4/org.destecs.ide.features.rcp-2.2.4.jar
[withMaven] Archive artifact core/simulationengine/target/simulationengine-2.2.4-sources.jar under org/destecs/core/simulationengine/2.2.4/simulationengine-2.2.4-sources.jar
[withMaven] Archive artifact core/vdm/target/vdm-2.2.4-sources.jar under org/destecs/core/vdm/2.2.4/vdm-2.2.4-sources.jar
[withMaven] Archive artifact ide/core/target/p2content.xml under org/destecs/ide/org.destecs.ide.core/2.2.4/org.destecs.ide.core-2.2.4-p2metadata.xml
[withMaven] Archive artifact ide/core/target/p2artifacts.xml under org/destecs/ide/org.destecs.ide.core/2.2.4/org.destecs.ide.core-2.2.4-p2artifacts.xml
[withMaven] Archive artifact ide/simeng/target/p2content.xml under org/destecs/ide/org.destecs.ide.simeng/2.2.4/org.destecs.ide.simeng-2.2.4-p2metadata.xml
[withMaven] Archive artifact ide/simeng/target/p2artifacts.xml under org/destecs/ide/org.destecs.ide.simeng/2.2.4/org.destecs.ide.simeng-2.2.4-p2artifacts.xml
[withMaven] Archive artifact ide/ui/target/p2content.xml under org/destecs/ide/org.destecs.ide.ui/2.2.4/org.destecs.ide.ui-2.2.4-p2metadata.xml
[withMaven] Archive artifact ide/ui/target/p2artifacts.xml under org/destecs/ide/org.destecs.ide.ui/2.2.4/org.destecs.ide.ui-2.2.4-p2artifacts.xml
[withMaven] Archive artifact ide/debug/target/p2content.xml under org/destecs/ide/org.destecs.ide.debug/2.2.4/org.destecs.ide.debug-2.2.4-p2metadata.xml
[withMaven] Archive artifact ide/debug/target/p2artifacts.xml under org/destecs/ide/org.destecs.ide.debug/2.2.4/org.destecs.ide.debug-2.2.4-p2artifacts.xml
[withMaven] Archive artifact ide/vdmmetadatabuilder/target/p2content.xml under org/destecs/ide/org.destecs.ide.vdmmetadatabuilder/2.2.4/org.destecs.ide.vdmmetadatabuilder-2.2.4-p2metadata.xml
[withMaven] Archive artifact ide/vdmmetadatabuilder/target/p2artifacts.xml under org/destecs/ide/org.destecs.ide.vdmmetadatabuilder/2.2.4/org.destecs.ide.vdmmetadatabuilder-2.2.4-p2artifacts.xml
[withMaven] Archive artifact ide/libraries/target/p2content.xml under org/destecs/ide/org.destecs.ide.libraries/2.2.4/org.destecs.ide.libraries-2.2.4-p2metadata.xml
[withMaven] Archive artifact ide/libraries/target/p2artifacts.xml under org/destecs/ide/org.destecs.ide.libraries/2.2.4/org.destecs.ide.libraries-2.2.4-p2artifacts.xml
[withMaven] Archive artifact ide/platform/target/p2content.xml under org/destecs/ide/org.destecs.ide.platform/2.2.4/org.destecs.ide.platform-2.2.4-p2metadata.xml
[withMaven] Archive artifact ide/platform/target/p2artifacts.xml under org/destecs/ide/org.destecs.ide.platform/2.2.4/org.destecs.ide.platform-2.2.4-p2artifacts.xml
[withMaven] Archive artifact ide/features/rcp/target/p2content.xml under org/destecs/ide/features/org.destecs.ide.features.rcp/2.2.4/org.destecs.ide.features.rcp-2.2.4-p2metadata.xml
[withMaven] Archive artifact ide/features/rcp/target/p2artifacts.xml under org/destecs/ide/features/org.destecs.ide.features.rcp/2.2.4/org.destecs.ide.features.rcp-2.2.4-p2artifacts.xml
ERROR: [withMaven] WARNING Exception executing Maven reporter 'Generated Artifacts Publisher' / org.jenkinsci.plugins.pipeline.maven.publishers.GeneratedArtifactsPublisher. Please report a bug associated for the component 'pipeline-maven-plugin' at https://issues.jenkins-ci.org 
java.lang.RuntimeException: Exception archiving {org/destecs/ide/features/org.destecs.ide.features.rcp/2.2.4/org.destecs.ide.features.rcp-2.2.4-p2metadata.xml=ide/features/rcp/target/p2content.xml, org/destecs/ide/org.destecs.ide.debug/2.2.4/org.destecs.ide.debug-2.2.4.jar=ide/debug/target/org.destecs.ide.debug-2.2.4.jar, org/destecs/core/xmlrpcextensions/xmlrpcbaseextension/2.2.4/xmlrpcbaseextension-2.2.4.pom=core/xmlrpcextensions/xmlrpcbaseextension/pom.xml, org/destecs/core/2.2.4/core-2.2.4.pom=core/pom.xml, org/destecs/tools/jprotocolgenerator/2.2.4/jprotocolgenerator-2.2.4.pom=tools/jprotocolgenerator/pom.xml, org/destecs/ide/org.destecs.ide.simeng/2.2.4/org.destecs.ide.simeng-2.2.4-p2artifacts.xml=ide/simeng/target/p2artifacts.xml, org/destecs/tools/tool/2.2.4/tool-2.2.4.pom=tools/pom.xml, org/destecs/ide/org.destecs.ide.vdmmetadatabuilder/2.2.4/org.destecs.ide.vdmmetadatabuilder-2.2.4.pom=ide/vdmmetadatabuilder/pom.xml, org/destecs/ide/features/org.destecs.ide.features.rcp/2.2.4/org.destecs.ide.features.rcp-2.2.4-p2artifacts.xml=ide/features/rcp/target/p2artifacts.xml, org/destecs/core/xmlrpcextensions/xmlrpcclientextension/2.2.4/xmlrpcclientextension-2.2.4.jar=core/xmlrpcextensions/xmlrpcclientextension/target/xmlrpcclientextension-2.2.4.jar, org/destecs/core/xmlrpcextensions/xmlrpcserverextension/2.2.4/xmlrpcserverextension-2.2.4.jar=core/xmlrpcextensions/xmlrpcserverextension/target/xmlrpcserverextension-2.2.4.jar, org/destecs/core/simulationengine/2.2.4/simulationengine-2.2.4-sources.jar=core/simulationengine/target/simulationengine-2.2.4-sources.jar, org/destecs/core/protocol/2.2.4/protocol-2.2.4.pom=core/protocol/pom.xml, org/destecs/ide/org.destecs.ide.core/2.2.4/org.destecs.ide.core-2.2.4-p2metadata.xml=ide/core/target/p2content.xml, org/destecs/ide/features/org.destecs.ide.features.rcp/2.2.4/org.destecs.ide.features.rcp-2.2.4.jar=ide/features/rcp/target/org.destecs.ide.features.rcp-2.2.4.jar, org/destecs/core/simulationengine/2.2.4/simulationengine-2.2.4.jar=core/simulationengine/target/simulationengine-2.2.4.jar, org/destecs/core/vdm/2.2.4/vdm-2.2.4.jar=core/vdm/target/vdm-2.2.4.jar, org/destecs/ide/org.destecs.ide.vdmmetadatabuilder/2.2.4/org.destecs.ide.vdmmetadatabuilder-2.2.4-p2artifacts.xml=ide/vdmmetadatabuilder/target/p2artifacts.xml, org/destecs/ide/org.destecs.ide.ui/2.2.4/org.destecs.ide.ui-2.2.4.pom=ide/ui/pom.xml, org/destecs/ide/org.destecs.ide.ui/2.2.4/org.destecs.ide.ui-2.2.4-p2artifacts.xml=ide/ui/target/p2artifacts.xml, org/destecs/ide/org.destecs.ide.debug/2.2.4/org.destecs.ide.debug-2.2.4-p2artifacts.xml=ide/debug/target/p2artifacts.xml, org/destecs/ide/org.destecs.ide.vdmmetadatabuilder/2.2.4/org.destecs.ide.vdmmetadatabuilder-2.2.4-p2metadata.xml=ide/vdmmetadatabuilder/target/p2content.xml, org/destecs/ide/org.destecs.ide.simeng/2.2.4/org.destecs.ide.simeng-2.2.4.jar=ide/simeng/target/org.destecs.ide.simeng-2.2.4.jar, org/destecs/ide/org.destecs.ide.platform/2.2.4/org.destecs.ide.platform-2.2.4.jar=ide/platform/target/org.destecs.ide.platform-2.2.4.jar, org/destecs/ide/org.destecs.ide.libraries/2.2.4/org.destecs.ide.libraries-2.2.4.pom=ide/libraries/pom.xml, org/destecs/ide/org.destecs.ide.core/2.2.4/org.destecs.ide.core-2.2.4.jar=ide/core/target/org.destecs.ide.core-2.2.4.jar, org/destecs/ide/org.destecs.ide.platform/2.2.4/org.destecs.ide.platform-2.2.4-p2metadata.xml=ide/platform/target/p2content.xml, org/destecs/ide/org.destecs.ide.vdmmetadatabuilder/2.2.4/org.destecs.ide.vdmmetadatabuilder-2.2.4.jar=ide/vdmmetadatabuilder/target/org.destecs.ide.vdmmetadatabuilder-2.2.4.jar, org/destecs/ide/org.destecs.ide.platform/2.2.4/org.destecs.ide.platform-2.2.4-p2artifacts.xml=ide/platform/target/p2artifacts.xml, org/destecs/core/vdm/2.2.4/vdm-2.2.4-sources.jar=core/vdm/target/vdm-2.2.4-sources.jar, org/destecs/ide/org.destecs.ide.ui/2.2.4/org.destecs.ide.ui-2.2.4-p2metadata.xml=ide/ui/target/p2content.xml, org/destecs/ide/org.destecs.ide.libraries/2.2.4/org.destecs.ide.libraries-2.2.4-p2metadata.xml=ide/libraries/target/p2content.xml, org/destecs/root/2.2.4/root-2.2.4.pom=pom.xml, org/destecs/ide/org.destecs.ide.simeng/2.2.4/org.destecs.ide.simeng-2.2.4-p2metadata.xml=ide/simeng/target/p2content.xml, org/destecs/core/xmlrpcextensions/xmlrpcserverextension/2.2.4/xmlrpcserverextension-2.2.4.pom=core/xmlrpcextensions/xmlrpcserverextension/pom.xml, org/destecs/core/xmlrpcextensions/xmlrpcbaseextension/2.2.4/xmlrpcbaseextension-2.2.4.jar=core/xmlrpcextensions/xmlrpcbaseextension/target/xmlrpcbaseextension-2.2.4.jar, org/destecs/core/xmlrpc-extensions/2.2.4/xmlrpc-extensions-2.2.4.pom=core/xmlrpcextensions/pom.xml, org/destecs/core/vdm/2.2.4/vdm-2.2.4.pom=core/vdm/pom.xml, org/destecs/ide/org.destecs.ide.platform/2.2.4/org.destecs.ide.platform-2.2.4.pom=ide/platform/pom.xml, org/destecs/ide/org.destecs.ide.simeng/2.2.4/org.destecs.ide.simeng-2.2.4.pom=ide/simeng/pom.xml, org/destecs/ide/org.destecs.ide.debug/2.2.4/org.destecs.ide.debug-2.2.4-p2metadata.xml=ide/debug/target/p2content.xml, org/destecs/ide/org.destecs.ide.core/2.2.4/org.destecs.ide.core-2.2.4.pom=ide/core/pom.xml, org/destecs/core/xmlrpcextensions/xmlrpcclientextension/2.2.4/xmlrpcclientextension-2.2.4.pom=core/xmlrpcextensions/xmlrpcclientextension/pom.xml, org/destecs/ide/org.destecs.ide.core/2.2.4/org.destecs.ide.core-2.2.4-p2artifacts.xml=ide/core/target/p2artifacts.xml, org/destecs/core/simulationengine/2.2.4/simulationengine-2.2.4.pom=core/simulationengine/pom.xml, org/destecs/ide/org.destecs.ide.debug/2.2.4/org.destecs.ide.debug-2.2.4.pom=ide/debug/pom.xml, org/destecs/ide/features/2.2.4/features-2.2.4.pom=ide/features/pom.xml, org/destecs/ide/org.destecs.ide.libraries/2.2.4/org.destecs.ide.libraries-2.2.4.jar=ide/libraries/target/org.destecs.ide.libraries-2.2.4.jar, org/destecs/core/protocol/2.2.4/protocol-2.2.4.jar=core/protocol/target/protocol-2.2.4.jar, org/destecs/ide/org.destecs.ide.ui/2.2.4/org.destecs.ide.ui-2.2.4.jar=ide/ui/target/org.destecs.ide.ui-2.2.4.jar, org/destecs/tools/jprotocolgenerator/2.2.4/jprotocolgenerator-2.2.4.jar=tools/jprotocolgenerator/target/jprotocolgenerator-2.2.4.jar, org/destecs/ide/2.2.4/ide-2.2.4.pom=ide/pom.xml, org/destecs/ide/org.destecs.ide.libraries/2.2.4/org.destecs.ide.libraries-2.2.4-p2artifacts.xml=ide/libraries/target/p2artifacts.xml, org/destecs/ide/features/org.destecs.ide.features.rcp/2.2.4/org.destecs.ide.features.rcp-2.2.4.pom=ide/features/rcp/pom.xml}
	at org.jenkinsci.plugins.pipeline.maven.publishers.GeneratedArtifactsPublisher.process(GeneratedArtifactsPublisher.java:129)
	at org.jenkinsci.plugins.pipeline.maven.MavenSpyLogProcessor.processMavenSpyLogs(MavenSpyLogProcessor.java:108)
	at org.jenkinsci.plugins.pipeline.maven.WithMavenStepExecution$Callback.finished(WithMavenStepExecution.java:859)
	at org.jenkinsci.plugins.workflow.steps.BodyExecutionCallback$TailCall.onFailure(BodyExecutionCallback.java:124)
	at org.jenkinsci.plugins.workflow.cps.CpsBodyExecution$FailureAdapter.receive(CpsBodyExecution.java:345)
	at com.cloudbees.groovy.cps.impl.ThrowBlock$1.receive(ThrowBlock.java:68)
	at com.cloudbees.groovy.cps.impl.ConstantBlock.eval(ConstantBlock.java:21)
	at com.cloudbees.groovy.cps.Next.step(Next.java:83)
	at com.cloudbees.groovy.cps.Continuable$1.call(Continuable.java:173)
	at com.cloudbees.groovy.cps.Continuable$1.call(Continuable.java:162)
	at org.codehaus.groovy.runtime.GroovyCategorySupport$ThreadCategoryInfo.use(GroovyCategorySupport.java:122)
	at org.codehaus.groovy.runtime.GroovyCategorySupport.use(GroovyCategorySupport.java:261)
	at com.cloudbees.groovy.cps.Continuable.run0(Continuable.java:162)
	at org.jenkinsci.plugins.workflow.cps.SandboxContinuable.access$001(SandboxContinuable.java:19)
	at org.jenkinsci.plugins.workflow.cps.SandboxContinuable$1.call(SandboxContinuable.java:35)
	at org.jenkinsci.plugins.workflow.cps.SandboxContinuable$1.call(SandboxContinuable.java:32)
	at org.jenkinsci.plugins.scriptsecurity.sandbox.groovy.GroovySandbox.runInSandbox(GroovySandbox.java:108)
	at org.jenkinsci.plugins.workflow.cps.SandboxContinuable.run0(SandboxContinuable.java:32)
	at org.jenkinsci.plugins.workflow.cps.CpsThread.runNextChunk(CpsThread.java:174)
	at org.jenkinsci.plugins.workflow.cps.CpsThreadGroup.run(CpsThreadGroup.java:330)
	at org.jenkinsci.plugins.workflow.cps.CpsThreadGroup.access$100(CpsThreadGroup.java:82)
	at org.jenkinsci.plugins.workflow.cps.CpsThreadGroup$2.call(CpsThreadGroup.java:242)
	at org.jenkinsci.plugins.workflow.cps.CpsThreadGroup$2.call(CpsThreadGroup.java:230)
	at org.jenkinsci.plugins.workflow.cps.CpsVmExecutorService$2.call(CpsVmExecutorService.java:64)
	at java.util.concurrent.FutureTask.run(FutureTask.java:266)
	at hudson.remoting.SingleLaneExecutorService$1.run(SingleLaneExecutorService.java:112)
	at jenkins.util.ContextResettingExecutorService$1.run(ContextResettingExecutorService.java:28)
	at java.util.concurrent.Executors$RunnableAdapter.call(Executors.java:511)
	at java.util.concurrent.FutureTask.run(FutureTask.java:266)
	at java.util.concurrent.ThreadPoolExecutor.runWorker(ThreadPoolExecutor.java:1142)
	at java.util.concurrent.ThreadPoolExecutor$Worker.run(ThreadPoolExecutor.java:617)
	at java.lang.Thread.run(Thread.java:745)
Caused by: Failed to copy /var/lib/jenkins/workspace/crescendo-pipeline_master-CP6XM76MSAFTBEKNXNTUPPF3MNVQTIVFT4XWG7O5T5XCURBKSRNA/ide/simeng/target/org.destecs.ide.simeng-2.2.4.jar to /var/lib/jenkins/jobs/crescendo-pipeline/branches/master/builds/4/archive/org/destecs/ide/org.destecs.ide.simeng/2.2.4/org.destecs.ide.simeng-2.2.4.jar due to No space left on device
	at org.apache.tools.ant.taskdefs.Copy.doFileOperations(Copy.java:914)
	at org.apache.tools.ant.taskdefs.Copy.execute(Copy.java:567)
	at hudson.Util.copyFile(Util.java:1171)
	at hudson.FilePath$42$1.visit(FilePath.java:2142)
	at hudson.util.DirScanner.scanSingle(DirScanner.java:49)
	at hudson.FilePath$ExplicitlySpecifiedDirScanner.scan(FilePath.java:2812)
	at hudson.FilePath$42.invoke(FilePath.java:2136)
	at hudson.FilePath$42.invoke(FilePath.java:2129)
	at hudson.FilePath.act(FilePath.java:997)
	at hudson.FilePath.act(FilePath.java:975)
	at hudson.FilePath.copyRecursiveTo(FilePath.java:2129)
	at jenkins.model.StandardArtifactManager.archive(StandardArtifactManager.java:61)
	at org.jenkinsci.plugins.pipeline.maven.publishers.GeneratedArtifactsPublisher.process(GeneratedArtifactsPublisher.java:125)
	... 31 more
Caused by: java.io.IOException: No space left on device
	at sun.nio.ch.FileDispatcherImpl.pwrite0(Native Method)
	at sun.nio.ch.FileDispatcherImpl.pwrite(FileDispatcherImpl.java:66)
	at sun.nio.ch.IOUtil.writeFromNativeBuffer(IOUtil.java:89)
	at sun.nio.ch.IOUtil.write(IOUtil.java:51)
	at sun.nio.ch.FileChannelImpl.writeInternal(FileChannelImpl.java:778)
	at sun.nio.ch.FileChannelImpl.write(FileChannelImpl.java:764)
	at sun.nio.ch.FileChannelImpl.transferFromFileChannel(FileChannelImpl.java:636)
	at sun.nio.ch.FileChannelImpl.transferFrom(FileChannelImpl.java:708)
	at org.apache.tools.ant.util.ResourceUtils.copyResource(ResourceUtils.java:532)
	at org.apache.tools.ant.util.FileUtils.copyFile(FileUtils.java:559)
	at org.apache.tools.ant.taskdefs.Copy.doFileOperations(Copy.java:899)
	... 43 more
[withMaven] Archive test results for Maven artifact MavenArtifact{org.destecs.core.xmlrpcextensions:xmlrpcbaseextension::2.2.4} generated by PluginInvocation{org.apache.maven.plugins:maven-surefire-plugin:2.13@test  default-test}: core/xmlrpcextensions/xmlrpcbaseextension/target/surefire-reports/*.xml
[withMaven] Jenkins JUnit Attachments Plugin not found, can't publish test attachments.Recording test results
None of the test reports contained any result
[withMaven] Archive test results for Maven artifact MavenArtifact{org.destecs.tools:jprotocolgenerator::2.2.4} generated by PluginInvocation{org.apache.maven.plugins:maven-surefire-plugin:2.13@test  default-test}: tools/jprotocolgenerator/target/surefire-reports/*.xml
[withMaven] Jenkins JUnit Attachments Plugin not found, can't publish test attachments.Recording test results
None of the test reports contained any result
[withMaven] Archive test results for Maven artifact MavenArtifact{org.destecs.core:protocol::2.2.4} generated by PluginInvocation{org.apache.maven.plugins:maven-surefire-plugin:2.13@test  default-test}: core/protocol/target/surefire-reports/*.xml
[withMaven] Jenkins JUnit Attachments Plugin not found, can't publish test attachments.Recording test results
None of the test reports contained any result
[withMaven] Archive test results for Maven artifact MavenArtifact{org.destecs.core.xmlrpcextensions:xmlrpcclientextension::2.2.4} generated by PluginInvocation{org.apache.maven.plugins:maven-surefire-plugin:2.13@test  default-test}: core/xmlrpcextensions/xmlrpcclientextension/target/surefire-reports/*.xml
[withMaven] Jenkins JUnit Attachments Plugin not found, can't publish test attachments.Recording test results
None of the test reports contained any result
[withMaven] Archive test results for Maven artifact MavenArtifact{org.destecs.core:simulationengine::2.2.4} generated by PluginInvocation{org.apache.maven.plugins:maven-surefire-plugin:2.13@test  default-test}: core/simulationengine/target/surefire-reports/*.xml
[withMaven] Jenkins JUnit Attachments Plugin not found, can't publish test attachments.Recording test results
None of the test reports contained any result
[withMaven] Archive test results for Maven artifact MavenArtifact{org.destecs.core.xmlrpcextensions:xmlrpcserverextension::2.2.4} generated by PluginInvocation{org.apache.maven.plugins:maven-surefire-plugin:2.13@test  default-test}: core/xmlrpcextensions/xmlrpcserverextension/target/surefire-reports/*.xml
[withMaven] Jenkins JUnit Attachments Plugin not found, can't publish test attachments.Recording test results
None of the test reports contained any result
[withMaven] Archive test results for Maven artifact MavenArtifact{org.destecs.core:vdm::2.2.4} generated by PluginInvocation{org.apache.maven.plugins:maven-surefire-plugin:2.13@test  default-test}: core/vdm/target/surefire-reports/*.xml
[withMaven] Jenkins JUnit Attachments Plugin not found, can't publish test attachments.Recording test results
[withMaven] Scan Tasks for Maven artifact MavenArtifact{org.destecs.core.xmlrpcextensions:xmlrpcbaseextension::2.2.4} in source directory core/xmlrpcextensions/xmlrpcbaseextension/src/main/java
[withMaven] Scan Tasks for Maven artifact MavenArtifact{org.destecs.tools:jprotocolgenerator::2.2.4} in source directory tools/jprotocolgenerator/src/main/java
[withMaven] Scan Tasks for Maven artifact MavenArtifact{org.destecs.core:protocol::2.2.4} in source directory core/protocol/src/main/java
[withMaven] Scan Tasks for Maven artifact MavenArtifact{org.destecs.core.xmlrpcextensions:xmlrpcclientextension::2.2.4} in source directory core/xmlrpcextensions/xmlrpcclientextension/src/main/java
[withMaven] Scan Tasks for Maven artifact MavenArtifact{org.destecs.core:simulationengine::2.2.4} in source directory core/simulationengine/src/main/java
[withMaven] Scan Tasks for Maven artifact MavenArtifact{org.destecs.core.xmlrpcextensions:xmlrpcserverextension::2.2.4} in source directory core/xmlrpcextensions/xmlrpcserverextension/src/main/java
[withMaven] Scan Tasks for Maven artifact MavenArtifact{org.destecs.core:vdm::2.2.4} in source directory core/vdm/src/main/java
[withMaven] Scan Tasks for Maven artifact MavenArtifact{org.destecs.ide:org.destecs.ide.core::2.2.4} in source directory ide/core/src/main/java
[withMaven] Scan Tasks for Maven artifact MavenArtifact{org.destecs.ide:org.destecs.ide.simeng::2.2.4} in source directory ide/simeng/src/main/java
[withMaven] Scan Tasks for Maven artifact MavenArtifact{org.destecs.ide:org.destecs.ide.ui::2.2.4} in source directory ide/ui/src/main/java
[withMaven] Scan Tasks for Maven artifact MavenArtifact{org.destecs.ide:org.destecs.ide.debug::2.2.4} in source directory ide/debug/src/main/java
[withMaven] Scan Tasks for Maven artifact MavenArtifact{org.destecs.ide:org.destecs.ide.vdmmetadatabuilder::2.2.4} in source directory ide/vdmmetadatabuilder/src/main/java
[withMaven] Scan Tasks for Maven artifact MavenArtifact{org.destecs.ide:org.destecs.ide.libraries::2.2.4} in source directory ide/libraries/src/main/java
[withMaven] Scan Tasks for Maven artifact MavenArtifact{org.destecs.ide:org.destecs.ide.platform::2.2.4} in source directory ide/platform/src/main/java
[TASKS] Scanning folder '/var/lib/jenkins/workspace/crescendo-pipeline_master-CP6XM76MSAFTBEKNXNTUPPF3MNVQTIVFT4XWG7O5T5XCURBKSRNA' for files matching the pattern 'core/xmlrpcextensions/xmlrpcbaseextension/src/main/java/**/*,tools/jprotocolgenerator/src/main/java/**/*,core/protocol/src/main/java/**/*,core/xmlrpcextensions/xmlrpcclientextension/src/main/java/**/*,core/simulationengine/src/main/java/**/*,core/xmlrpcextensions/xmlrpcserverextension/src/main/java/**/*,core/vdm/src/main/java/**/*,ide/core/src/main/java/**/*,ide/simeng/src/main/java/**/*,ide/ui/src/main/java/**/*,ide/debug/src/main/java/**/*,ide/vdmmetadatabuilder/src/main/java/**/*,ide/libraries/src/main/java/**/*,ide/platform/src/main/java/**/*' - excludes: null
[TASKS] Found 242 files to scan for tasks
[TASKS] Found 1 open tasks.
[TASKS] Computing warning deltas based on reference build #1
[Pipeline] // withMaven
[Pipeline] }
[Pipeline] // stage
[Pipeline] stage
[Pipeline] { (Reporting)
[Pipeline] emailextrecipients
[Pipeline] emailext
Sending email to: lausdahl@eng.au.dk
[Pipeline] }
[Pipeline] // stage
[Pipeline] }
[Pipeline] // node
[Pipeline] End of Pipeline

GitHub has been notified of this commit’s build result

ERROR: script returned exit code 1
Finished: FAILURE