UnstableConsole Output

Started calculate disk usage of build
Finished Calculation of disk usage of build in 0 seconds
Started calculate disk usage of workspace
Finished Calculation of disk usage of workspace in 0 seconds
[INFO]                                                                         
[INFO] ------------------------------------------------------------------------
[INFO] Building The VDM Type Checker 3.0.0-SNAPSHOT
[INFO] ------------------------------------------------------------------------
[INFO] 
[INFO] --- maven-enforcer-plugin:1.0:enforce (enforce-maven) @ typechecker ---
[TASKS] Scanning folder '/var/lib/jenkins/workspace/overture-development/core/typechecker' for files matching the pattern '**/*.java' - excludes: 
[TASKS] Found 150 files to scan for tasks
Found 62 open tasks.
[TASKS] Computing warning deltas based on reference build #251
[INFO] 
[INFO] --- jacoco-maven-plugin:0.7.6.201602180812:prepare-agent (jacoco-initialize) @ typechecker ---
[INFO] argLine set to -javaagent:/var/lib/jenkins/workspace/overture-development/.repository/org/jacoco/org.jacoco.agent/0.7.6.201602180812/org.jacoco.agent-0.7.6.201602180812-runtime.jar=destfile=/var/lib/jenkins/workspace/overture-development/core/typechecker/target/coverage-reports/jacoco-unit.exec,excludes=**/org/overture/ast/analysis/**/*.*:**/org/overture/ast/expressions/**/*.*:**/org/overture/ast/modules/**/*.*:**/org/overture/ast/node/**/*.*:**/org/overture/ast/patterns/**/*.*:**/org/overture/ast/statements/**/*.*:**/org/overture/ast/types/**/*.*:**/org/overture/codegen/ir/**/*:**/org/overture/ide/**/*
[INFO] 
[INFO] --- maven-resources-plugin:2.7:resources (default-resources) @ typechecker ---
[INFO] Using 'UTF-8' encoding to copy filtered resources.
[INFO] skip non existing resourceDirectory /var/lib/jenkins/workspace/overture-development/core/typechecker/src/main/resources
[INFO] 
[INFO] --- maven-compiler-plugin:3.5.1:compile (default-compile) @ typechecker ---
[INFO] Changes detected - recompiling the module!
[INFO] Compiling 138 source files to /var/lib/jenkins/workspace/overture-development/core/typechecker/target/classes
[INFO] /var/lib/jenkins/workspace/overture-development/core/typechecker/src/main/java/org/overture/typechecker/visitor/TypeCheckerDefinitionVisitor.java: Some input files use unchecked or unsafe operations.
[INFO] /var/lib/jenkins/workspace/overture-development/core/typechecker/src/main/java/org/overture/typechecker/visitor/TypeCheckerDefinitionVisitor.java: Recompile with -Xlint:unchecked for details.
[INFO] 
[INFO] --- maven-resources-plugin:2.7:testResources (default-testResources) @ typechecker ---
[INFO] Using 'UTF-8' encoding to copy filtered resources.
[INFO] Copying 2043 resources
[INFO] 
[INFO] --- maven-compiler-plugin:3.5.1:testCompile (default-testCompile) @ typechecker ---
[INFO] Changes detected - recompiling the module!
[INFO] Compiling 12 source files to /var/lib/jenkins/workspace/overture-development/core/typechecker/target/test-classes
[INFO] 
[INFO] --- maven-surefire-plugin:2.19.1:test (default-test) @ typechecker ---

-------------------------------------------------------
 T E S T S
-------------------------------------------------------
Running org.overture.typechecker.tests.external.ExternalClassesRtTypeCheckTest
Tests run: 74, Failures: 3, Errors: 0, Skipped: 0, Time elapsed: 2.532 sec <<< FAILURE! - in org.overture.typechecker.tests.external.ExternalClassesRtTypeCheckTest
test[extension-13.vpp](org.overture.typechecker.tests.external.ExternalClassesRtTypeCheckTest)  Time elapsed: 0.057 sec  <<< FAILURE!
java.lang.AssertionError: 
Errors found in file "extension-13.vpp.result"

Missing Warning:    5000 extension-13.vpp at 302:11 Definition 'dummy' not used
Unexpected Error:   2295 extension-13.vpp at 141:13 Name contains a reserved prefix
Unexpected Error:   2295 extension-13.vpp at 161:28 Name contains a reserved prefix
Missing Error:      3294 extension-13.vpp at 41:8 Only one system class permitted
Missing Error:      3134 extension-13.vpp at 45:36 Class has no constructor with these parameter types
Missing Error:      3134 extension-13.vpp at 50:37 Class has no constructor with these parameter types
Missing Error:      3134 extension-13.vpp at 55:39 Class has no constructor with these parameter types
Missing Error:      3182 extension-13.vpp at 32:24 Name 'Radio`DecodeTMC' is not in scope
Missing Error:      3290 extension-13.vpp at 32:24 Argument to setPriority must be an operation
Missing Error:      3209 extension-13.vpp at 91:14 Member HandleEvent(nat) is not in scope
Missing Error:      3209 extension-13.vpp at 92:14 Member HandleEvent(nat) is not in scope
Missing Error:      3209 extension-13.vpp at 93:14 Member HandleEvent(nat) is not in scope


test[extension-12.vpp](org.overture.typechecker.tests.external.ExternalClassesRtTypeCheckTest)  Time elapsed: 0.018 sec  <<< FAILURE!
java.lang.AssertionError: 
Errors found in file "extension-12.vpp.result"

Missing Warning:    5000 extension-12.vpp at 295:11 Definition 'dummy' not used
Unexpected Error:   2295 extension-12.vpp at 129:13 Name contains a reserved prefix
Unexpected Error:   2295 extension-12.vpp at 149:28 Name contains a reserved prefix
Missing Error:      3294 extension-12.vpp at 41:8 Only one system class permitted
Missing Error:      3134 extension-12.vpp at 45:36 Class has no constructor with these parameter types
Missing Error:      3134 extension-12.vpp at 50:37 Class has no constructor with these parameter types
Missing Error:      3134 extension-12.vpp at 55:39 Class has no constructor with these parameter types
Missing Error:      3182 extension-12.vpp at 32:24 Name 'Radio`DecodeTMC' is not in scope
Missing Error:      3290 extension-12.vpp at 32:24 Argument to setPriority must be an operation


test[extension-01.vpp](org.overture.typechecker.tests.external.ExternalClassesRtTypeCheckTest)  Time elapsed: 0.005 sec  <<< FAILURE!
java.lang.AssertionError: 
Errors found in file "extension-01.vpp.result"

Unexpected Error:   2295 extension-01.vpp at 110:13 Name contains a reserved prefix
Unexpected Error:   2295 extension-01.vpp at 130:28 Name contains a reserved prefix
Missing Error:      3182 extension-01.vpp at 32:24 Name 'Radio`DecodeTMC' is not in scope
Missing Error:      3290 extension-01.vpp at 32:24 Argument to setPriority must be an operation
Missing Error:      3134 extension-01.vpp at 265:40 Class has no constructor with these parameter types
Missing Error:      3134 extension-01.vpp at 266:41 Class has no constructor with these parameter types
Missing Error:      3134 extension-01.vpp at 272:43 Class has no constructor with these parameter types
Missing Error:      3134 extension-01.vpp at 273:41 Class has no constructor with these parameter types


Running org.overture.typechecker.tests.external.ExternalClassesPpTypeCheckTest
Tests run: 485, Failures: 0, Errors: 0, Skipped: 0, Time elapsed: 2.414 sec - in org.overture.typechecker.tests.external.ExternalClassesPpTypeCheckTest
Running org.overture.typechecker.tests.external.ExternalModulesSlTypeCheckTest
Tests run: 1216, Failures: 1, Errors: 0, Skipped: 0, Time elapsed: 3.923 sec <<< FAILURE! - in org.overture.typechecker.tests.external.ExternalModulesSlTypeCheckTest
test[letexpr-23.vdm](org.overture.typechecker.tests.external.ExternalModulesSlTypeCheckTest)  Time elapsed: 0.003 sec  <<< FAILURE!
java.lang.AssertionError: 
Errors found in file "letexpr-23.vdm.result"

Missing Warning:    5000 letexpr-23.vdm at 24:26 Definition 'c' not used
Missing Warning:    5000 letexpr-23.vdm at 32:13 Definition 'ini_i' not used
Missing Warning:    5000 letexpr-23.vdm at 28:13 Definition 'po_h' not used
Missing Warning:    5000 letexpr-23.vdm at 24:13 Definition 'pr_g' not used
Missing Warning:    5000 letexpr-23.vdm at 20:15 Definition 'iv_f' not used
Unexpected Error:   2295 letexpr-23.vdm at 20:15 Name contains a reserved prefix
Missing Error:      3139 letexpr-23.vdm at 11:14 Left hand of < is not ordered


Running org.overture.typechecker.tests.ClassesRtTypeCheckTest
Tests run: 11, Failures: 0, Errors: 0, Skipped: 0, Time elapsed: 0.585 sec - in org.overture.typechecker.tests.ClassesRtTypeCheckTest
Running org.overture.typechecker.tests.ClassesPpTypeCheckTest
Tests run: 47, Failures: 0, Errors: 0, Skipped: 0, Time elapsed: 1.09 sec - in org.overture.typechecker.tests.ClassesPpTypeCheckTest
Running org.overture.typechecker.tests.ModulesSlTypeCheckTest
Tests run: 73, Failures: 0, Errors: 0, Skipped: 0, Time elapsed: 3.062 sec - in org.overture.typechecker.tests.ModulesSlTypeCheckTest

Results :

Failed tests: 
  ExternalClassesRtTypeCheckTest>CommonTypeCheckerTest.test:74->ResultTestCase4.compareResults:107 Errors found in file "extension-01.vpp.result"

Unexpected Error:   2295 extension-01.vpp at 110:13 Name contains a reserved prefix
Unexpected Error:   2295 extension-01.vpp at 130:28 Name contains a reserved prefix
Missing Error:      3182 extension-01.vpp at 32:24 Name 'Radio`DecodeTMC' is not in scope
Missing Error:      3290 extension-01.vpp at 32:24 Argument to setPriority must be an operation
Missing Error:      3134 extension-01.vpp at 265:40 Class has no constructor with these parameter types
Missing Error:      3134 extension-01.vpp at 266:41 Class has no constructor with these parameter types
Missing Error:      3134 extension-01.vpp at 272:43 Class has no constructor with these parameter types
Missing Error:      3134 extension-01.vpp at 273:41 Class has no constructor with these parameter types

  ExternalClassesRtTypeCheckTest>CommonTypeCheckerTest.test:74->ResultTestCase4.compareResults:107 Errors found in file "extension-12.vpp.result"

Missing Warning:    5000 extension-12.vpp at 295:11 Definition 'dummy' not used
Unexpected Error:   2295 extension-12.vpp at 129:13 Name contains a reserved prefix
Unexpected Error:   2295 extension-12.vpp at 149:28 Name contains a reserved prefix
Missing Error:      3294 extension-12.vpp at 41:8 Only one system class permitted
Missing Error:      3134 extension-12.vpp at 45:36 Class has no constructor with these parameter types
Missing Error:      3134 extension-12.vpp at 50:37 Class has no constructor with these parameter types
Missing Error:      3134 extension-12.vpp at 55:39 Class has no constructor with these parameter types
Missing Error:      3182 extension-12.vpp at 32:24 Name 'Radio`DecodeTMC' is not in scope
Missing Error:      3290 extension-12.vpp at 32:24 Argument to setPriority must be an operation

  ExternalClassesRtTypeCheckTest>CommonTypeCheckerTest.test:74->ResultTestCase4.compareResults:107 Errors found in file "extension-13.vpp.result"

Missing Warning:    5000 extension-13.vpp at 302:11 Definition 'dummy' not used
Unexpected Error:   2295 extension-13.vpp at 141:13 Name contains a reserved prefix
Unexpected Error:   2295 extension-13.vpp at 161:28 Name contains a reserved prefix
Missing Error:      3294 extension-13.vpp at 41:8 Only one system class permitted
Missing Error:      3134 extension-13.vpp at 45:36 Class has no constructor with these parameter types
Missing Error:      3134 extension-13.vpp at 50:37 Class has no constructor with these parameter types
Missing Error:      3134 extension-13.vpp at 55:39 Class has no constructor with these parameter types
Missing Error:      3182 extension-13.vpp at 32:24 Name 'Radio`DecodeTMC' is not in scope
Missing Error:      3290 extension-13.vpp at 32:24 Argument to setPriority must be an operation
Missing Error:      3209 extension-13.vpp at 91:14 Member HandleEvent(nat) is not in scope
Missing Error:      3209 extension-13.vpp at 92:14 Member HandleEvent(nat) is not in scope
Missing Error:      3209 extension-13.vpp at 93:14 Member HandleEvent(nat) is not in scope

  ExternalModulesSlTypeCheckTest>CommonTypeCheckerTest.test:74->ResultTestCase4.compareResults:107 Errors found in file "letexpr-23.vdm.result"

Missing Warning:    5000 letexpr-23.vdm at 24:26 Definition 'c' not used
Missing Warning:    5000 letexpr-23.vdm at 32:13 Definition 'ini_i' not used
Missing Warning:    5000 letexpr-23.vdm at 28:13 Definition 'po_h' not used
Missing Warning:    5000 letexpr-23.vdm at 24:13 Definition 'pr_g' not used
Missing Warning:    5000 letexpr-23.vdm at 20:15 Definition 'iv_f' not used
Unexpected Error:   2295 letexpr-23.vdm at 20:15 Name contains a reserved prefix
Missing Error:      3139 letexpr-23.vdm at 11:14 Left hand of < is not ordered


Tests run: 1906, Failures: 4, Errors: 0, Skipped: 0

[ERROR] There are test failures.

Please refer to /var/lib/jenkins/workspace/overture-development/core/typechecker/target/surefire-reports for the individual test results.
[JENKINS] Recording test results
[INFO] 
[INFO] --- maven-jar-plugin:2.6:jar (default-jar) @ typechecker ---
[INFO] Building jar: /var/lib/jenkins/workspace/overture-development/core/typechecker/target/typechecker-3.0.0-SNAPSHOT.jar
[INFO] 
[INFO] --- jacoco-maven-plugin:0.7.6.201602180812:report (jacoco-site) @ typechecker ---
[INFO] Analyzed bundle 'The VDM Type Checker' with 152 classes
[INFO] 
[INFO] --- maven-javadoc-plugin:2.10.3:jar (attach-javadocs) @ typechecker ---
[INFO] 
90 warnings
[WARNING] Javadoc Warnings
[WARNING] /var/lib/jenkins/workspace/overture-development/core/typechecker/src/main/java/org/overture/typechecker/TypeChecker.java:93: warning: no @param for defs
[WARNING] protected void cyclicDependencyCheck(List<PDefinition> defs)
[WARNING] ^
[WARNING] /var/lib/jenkins/workspace/overture-development/core/typechecker/src/main/java/org/overture/typechecker/TypeChecker.java:360: warning: no @param for type
[WARNING] public static boolean isOpaque(SInvariantType type, String fromModule)
[WARNING] ^
[WARNING] /var/lib/jenkins/workspace/overture-development/core/typechecker/src/main/java/org/overture/typechecker/TypeChecker.java:360: warning: no @param for fromModule
[WARNING] public static boolean isOpaque(SInvariantType type, String fromModule)
[WARNING] ^
[WARNING] /var/lib/jenkins/workspace/overture-development/core/typechecker/src/main/java/org/overture/typechecker/TypeChecker.java:360: warning: no @return
[WARNING] public static boolean isOpaque(SInvariantType type, String fromModule)
[WARNING] ^
[WARNING] /var/lib/jenkins/workspace/overture-development/core/typechecker/src/main/java/org/overture/typechecker/ClassTypeChecker.java:54: warning: no description for @param
[WARNING] * @param classes
[WARNING] ^
[WARNING] /var/lib/jenkins/workspace/overture-development/core/typechecker/src/main/java/org/overture/typechecker/ClassTypeChecker.java:66: warning: no description for @param
[WARNING] * @param classes
[WARNING] ^
[WARNING] /var/lib/jenkins/workspace/overture-development/core/typechecker/src/main/java/org/overture/typechecker/ClassTypeChecker.java:67: warning: no description for @param
[WARNING] * @param factory
[WARNING] ^
[WARNING] /var/lib/jenkins/workspace/overture-development/core/typechecker/src/main/java/org/overture/typechecker/Environment.java:70: warning: no description for @return
[WARNING] * @return
[WARNING] ^
[WARNING] /var/lib/jenkins/workspace/overture-development/core/typechecker/src/main/java/org/overture/typechecker/Environment.java:82: warning: no @param for scope
[WARNING] protected void dupHideCheck(List<PDefinition> list, NameScope scope)
[WARNING] ^
[WARNING] /var/lib/jenkins/workspace/overture-development/core/typechecker/src/main/java/org/overture/typechecker/Environment.java:170: warning: no description for @param
[WARNING] * @param name
[WARNING] ^
[WARNING] /var/lib/jenkins/workspace/overture-development/core/typechecker/src/main/java/org/overture/typechecker/Environment.java:171: warning: no description for @param
[WARNING] * @param scope
[WARNING] ^
[WARNING] /var/lib/jenkins/workspace/overture-development/core/typechecker/src/main/java/org/overture/typechecker/Environment.java:172: warning: no description for @return
[WARNING] * @return
[WARNING] ^
[WARNING] /var/lib/jenkins/workspace/overture-development/core/typechecker/src/main/java/org/overture/typechecker/Environment.java:179: warning: no description for @param
[WARNING] * @param name
[WARNING] ^
[WARNING] /var/lib/jenkins/workspace/overture-development/core/typechecker/src/main/java/org/overture/typechecker/Environment.java:180: warning: no description for @param
[WARNING] * @param fromModule
[WARNING] ^
[WARNING] /var/lib/jenkins/workspace/overture-development/core/typechecker/src/main/java/org/overture/typechecker/Environment.java:181: warning: no description for @return
[WARNING] * @return
[WARNING] ^
[WARNING] /var/lib/jenkins/workspace/overture-development/core/typechecker/src/main/java/org/overture/typechecker/Environment.java:188: warning: no description for @return
[WARNING] * @return
[WARNING] ^
[WARNING] /var/lib/jenkins/workspace/overture-development/core/typechecker/src/main/java/org/overture/typechecker/Environment.java:195: warning: no description for @return
[WARNING] * @return
[WARNING] ^
[WARNING] /var/lib/jenkins/workspace/overture-development/core/typechecker/src/main/java/org/overture/typechecker/Environment.java:202: warning: no description for @return
[WARNING] * @return
[WARNING] ^
[WARNING] /var/lib/jenkins/workspace/overture-development/core/typechecker/src/main/java/org/overture/typechecker/Environment.java:212: warning: no description for @return
[WARNING] * @return
[WARNING] ^
[WARNING] /var/lib/jenkins/workspace/overture-development/core/typechecker/src/main/java/org/overture/typechecker/Environment.java:219: warning: no description for @return
[WARNING] * @return
[WARNING] ^
[WARNING] /var/lib/jenkins/workspace/overture-development/core/typechecker/src/main/java/org/overture/typechecker/Environment.java:226: warning: no description for @param
[WARNING] * @param name
[WARNING] ^
[WARNING] /var/lib/jenkins/workspace/overture-development/core/typechecker/src/main/java/org/overture/typechecker/Environment.java:227: warning: no description for @return
[WARNING] * @return
[WARNING] ^
[WARNING] /var/lib/jenkins/workspace/overture-development/core/typechecker/src/main/java/org/overture/typechecker/Environment.java:240: warning: no description for @param
[WARNING] * @param name
[WARNING] ^
[WARNING] /var/lib/jenkins/workspace/overture-development/core/typechecker/src/main/java/org/overture/typechecker/Environment.java:256: warning: no description for @param
[WARNING] * @param downTo
[WARNING] ^
[WARNING] /var/lib/jenkins/workspace/overture-development/core/typechecker/src/main/java/org/overture/typechecker/Environment.java:57: warning: no description for @param
[WARNING] * @param af
[WARNING] ^
[WARNING] /var/lib/jenkins/workspace/overture-development/core/typechecker/src/main/java/org/overture/typechecker/Environment.java:58: warning: no description for @param
[WARNING] * @param outer
[WARNING] ^
[WARNING] /var/lib/jenkins/workspace/overture-development/core/typechecker/src/main/java/org/overture/typechecker/ModuleTypeChecker.java:64: warning: no description for @param
[WARNING] * @param modules
[WARNING] ^
[WARNING] /var/lib/jenkins/workspace/overture-development/core/typechecker/src/main/java/org/overture/typechecker/TypeCheckInfo.java:76: warning: no description for @param
[WARNING] * @param <T>
[WARNING] ^
[WARNING] /var/lib/jenkins/workspace/overture-development/core/typechecker/src/main/java/org/overture/typechecker/TypeCheckInfo.java:77: warning: no description for @param
[WARNING] * @param key
[WARNING] ^
[WARNING] /var/lib/jenkins/workspace/overture-development/core/typechecker/src/main/java/org/overture/typechecker/TypeCheckInfo.java:78: warning: no description for @return
[WARNING] * @return
[WARNING] ^
[WARNING] /var/lib/jenkins/workspace/overture-development/core/typechecker/src/main/java/org/overture/typechecker/TypeCheckInfo.java:97: warning: no description for @param
[WARNING] * @param <T>
[WARNING] ^
[WARNING] /var/lib/jenkins/workspace/overture-development/core/typechecker/src/main/java/org/overture/typechecker/TypeCheckInfo.java:98: warning: no description for @param
[WARNING] * @param key
[WARNING] ^
[WARNING] /var/lib/jenkins/workspace/overture-development/core/typechecker/src/main/java/org/overture/typechecker/TypeCheckInfo.java:99: warning: no description for @param
[WARNING] * @param value
[WARNING] ^
[WARNING] /var/lib/jenkins/workspace/overture-development/core/typechecker/src/main/java/org/overture/typechecker/TypeCheckInfo.java:118: warning: no description for @param
[WARNING] * @param <T>
[WARNING] ^
[WARNING] /var/lib/jenkins/workspace/overture-development/core/typechecker/src/main/java/org/overture/typechecker/TypeCheckInfo.java:119: warning: no description for @param
[WARNING] * @param key
[WARNING] ^
[WARNING] /var/lib/jenkins/workspace/overture-development/core/typechecker/src/main/java/org/overture/typechecker/TypeComparator.java:151: warning: no description for @param
[WARNING] * @param to
[WARNING] ^
[WARNING] /var/lib/jenkins/workspace/overture-development/core/typechecker/src/main/java/org/overture/typechecker/TypeComparator.java:152: warning: no description for @param
[WARNING] * @param from
[WARNING] ^
[WARNING] /var/lib/jenkins/workspace/overture-development/core/typechecker/src/main/java/org/overture/typechecker/TypeComparator.java:172: warning: no description for @param
[WARNING] * @param to
[WARNING] ^
[WARNING] /var/lib/jenkins/workspace/overture-development/core/typechecker/src/main/java/org/overture/typechecker/TypeComparator.java:173: warning: no description for @param
[WARNING] * @param from
[WARNING] ^
[WARNING] /var/lib/jenkins/workspace/overture-development/core/typechecker/src/main/java/org/overture/typechecker/TypeComparator.java:588: warning: no description for @param
[WARNING] * @param sub
[WARNING] ^
[WARNING] /var/lib/jenkins/workspace/overture-development/core/typechecker/src/main/java/org/overture/typechecker/TypeComparator.java:589: warning: no description for @param
[WARNING] * @param sup
[WARNING] ^
[WARNING] /var/lib/jenkins/workspace/overture-development/core/typechecker/src/main/java/org/overture/typechecker/TypeComparator.java:990: warning: no description for @param
[WARNING] * @param type
[WARNING] ^
[WARNING] /var/lib/jenkins/workspace/overture-development/core/typechecker/src/main/java/org/overture/typechecker/TypeComparator.java:991: warning: no description for @param
[WARNING] * @param env
[WARNING] ^
[WARNING] /var/lib/jenkins/workspace/overture-development/core/typechecker/src/main/java/org/overture/typechecker/TypeComparator.java:992: warning: no description for @param
[WARNING] * @param newTypes
[WARNING] ^
[WARNING] /var/lib/jenkins/workspace/overture-development/core/typechecker/src/main/java/org/overture/typechecker/TypeComparator.java:993: warning: no description for @return
[WARNING] * @return
[WARNING] ^
[WARNING] /var/lib/jenkins/workspace/overture-development/core/typechecker/src/main/java/org/overture/typechecker/TypeComparator.java:1078: warning: no description for @param
[WARNING] * @param a
[WARNING] ^
[WARNING] /var/lib/jenkins/workspace/overture-development/core/typechecker/src/main/java/org/overture/typechecker/TypeComparator.java:1079: warning: no description for @param
[WARNING] * @param b
[WARNING] ^
[WARNING] /var/lib/jenkins/workspace/overture-development/core/typechecker/src/main/java/org/overture/typechecker/TypeComparator.java:1080: warning: no description for @return
[WARNING] * @return
[WARNING] ^
[WARNING] /var/lib/jenkins/workspace/overture-development/core/typechecker/src/main/java/org/overture/typechecker/TypeComparator.java:1185: warning: no @param for t1
[WARNING] public synchronized List<PType> narrowest(List<PType> t1, List<PType> t2)
[WARNING] ^
[WARNING] /var/lib/jenkins/workspace/overture-development/core/typechecker/src/main/java/org/overture/typechecker/TypeComparator.java:1185: warning: no @param for t2
[WARNING] public synchronized List<PType> narrowest(List<PType> t1, List<PType> t2)
[WARNING] ^
[WARNING] /var/lib/jenkins/workspace/overture-development/core/typechecker/src/main/java/org/overture/typechecker/TypeComparator.java:1185: warning: no @return
[WARNING] public synchronized List<PType> narrowest(List<PType> t1, List<PType> t2)
[WARNING] ^
[WARNING] /var/lib/jenkins/workspace/overture-development/core/typechecker/src/main/java/org/overture/typechecker/assistant/definition/PDefinitionAssistantTC.java:396: warning: no description for @param
[WARNING] * @param d
[WARNING] ^
[WARNING] /var/lib/jenkins/workspace/overture-development/core/typechecker/src/main/java/org/overture/typechecker/assistant/definition/PDefinitionAssistantTC.java:397: warning: no description for @param
[WARNING] * @param defs
[WARNING] ^
[WARNING] /var/lib/jenkins/workspace/overture-development/core/typechecker/src/main/java/org/overture/typechecker/assistant/definition/PDefinitionAssistantTC.java:398: warning: no description for @return
[WARNING] * @return
[WARNING] ^
[WARNING] /var/lib/jenkins/workspace/overture-development/core/typechecker/src/main/java/org/overture/typechecker/assistant/module/AModuleModulesAssistantTC.java:52: warning: no description for @param
[WARNING] * @param m
[WARNING] ^
[WARNING] /var/lib/jenkins/workspace/overture-development/core/typechecker/src/main/java/org/overture/typechecker/assistant/pattern/PPatternAssistantTC.java:56: warning: no description for @param
[WARNING] * @param rp
[WARNING] ^
[WARNING] /var/lib/jenkins/workspace/overture-development/core/typechecker/src/main/java/org/overture/typechecker/assistant/pattern/PPatternAssistantTC.java:57: warning: no description for @param
[WARNING] * @param ptype
[WARNING] ^
[WARNING] /var/lib/jenkins/workspace/overture-development/core/typechecker/src/main/java/org/overture/typechecker/assistant/pattern/PPatternAssistantTC.java:58: warning: no description for @param
[WARNING] * @param scope
[WARNING] ^
[WARNING] /var/lib/jenkins/workspace/overture-development/core/typechecker/src/main/java/org/overture/typechecker/assistant/pattern/PPatternAssistantTC.java:59: warning: no description for @return
[WARNING] * @return
[WARNING] ^
[WARNING] /var/lib/jenkins/workspace/overture-development/core/typechecker/src/main/java/org/overture/typechecker/assistant/type/AClassTypeAssistantTC.java:71: warning: no @param for def
[WARNING] public boolean isConstructor(PDefinition def)
[WARNING] ^
[WARNING] /var/lib/jenkins/workspace/overture-development/core/typechecker/src/main/java/org/overture/typechecker/assistant/type/AClassTypeAssistantTC.java:71: warning: no @return
[WARNING] public boolean isConstructor(PDefinition def)
[WARNING] ^
[WARNING] /var/lib/jenkins/workspace/overture-development/core/typechecker/src/main/java/org/overture/typechecker/assistant/type/AClassTypeAssistantTC.java:95: warning: no @param for env
[WARNING] public boolean inConstructor(Environment env)
[WARNING] ^
[WARNING] /var/lib/jenkins/workspace/overture-development/core/typechecker/src/main/java/org/overture/typechecker/assistant/type/AClassTypeAssistantTC.java:95: warning: no @return
[WARNING] public boolean inConstructor(Environment env)
[WARNING] ^
[WARNING] /var/lib/jenkins/workspace/overture-development/core/typechecker/src/main/java/org/overture/typechecker/visitor/AbstractTypeCheckVisitor.java:190: warning: no description for @param
[WARNING] * @param node
[WARNING] ^
[WARNING] /var/lib/jenkins/workspace/overture-development/core/typechecker/src/main/java/org/overture/typechecker/visitor/AbstractTypeCheckVisitor.java:191: warning: no description for @param
[WARNING] * @param localDefs
[WARNING] ^
[WARNING] /var/lib/jenkins/workspace/overture-development/core/typechecker/src/main/java/org/overture/typechecker/visitor/AbstractTypeCheckVisitor.java:192: warning: no description for @param
[WARNING] * @param body
[WARNING] ^
[WARNING] /var/lib/jenkins/workspace/overture-development/core/typechecker/src/main/java/org/overture/typechecker/visitor/AbstractTypeCheckVisitor.java:193: warning: no description for @param
[WARNING] * @param question
[WARNING] ^
[WARNING] /var/lib/jenkins/workspace/overture-development/core/typechecker/src/main/java/org/overture/typechecker/visitor/AbstractTypeCheckVisitor.java:194: warning: no description for @return
[WARNING] * @return
[WARNING] ^
[WARNING] /var/lib/jenkins/workspace/overture-development/core/typechecker/src/main/java/org/overture/typechecker/visitor/AbstractTypeCheckVisitor.java:195: warning: no description for @throws
[WARNING] * @throws AnalysisException
[WARNING] ^
[WARNING] /var/lib/jenkins/workspace/overture-development/core/typechecker/src/main/java/org/overture/typechecker/visitor/AbstractTypeCheckVisitor.java:240: warning: no description for @param
[WARNING] * @param node
[WARNING] ^
[WARNING] /var/lib/jenkins/workspace/overture-development/core/typechecker/src/main/java/org/overture/typechecker/visitor/AbstractTypeCheckVisitor.java:241: warning: no description for @param
[WARNING] * @param nodeLocation
[WARNING] ^
[WARNING] /var/lib/jenkins/workspace/overture-development/core/typechecker/src/main/java/org/overture/typechecker/visitor/AbstractTypeCheckVisitor.java:242: warning: no description for @param
[WARNING] * @param bind
[WARNING] ^
[WARNING] /var/lib/jenkins/workspace/overture-development/core/typechecker/src/main/java/org/overture/typechecker/visitor/AbstractTypeCheckVisitor.java:243: warning: no description for @param
[WARNING] * @param suchThat
[WARNING] ^
[WARNING] /var/lib/jenkins/workspace/overture-development/core/typechecker/src/main/java/org/overture/typechecker/visitor/AbstractTypeCheckVisitor.java:244: warning: no description for @param
[WARNING] * @param body
[WARNING] ^
[WARNING] /var/lib/jenkins/workspace/overture-development/core/typechecker/src/main/java/org/overture/typechecker/visitor/AbstractTypeCheckVisitor.java:245: warning: no description for @param
[WARNING] * @param question
[WARNING] ^
[WARNING] /var/lib/jenkins/workspace/overture-development/core/typechecker/src/main/java/org/overture/typechecker/visitor/AbstractTypeCheckVisitor.java:247: warning: no description for @throws
[WARNING] * @throws AnalysisException
[WARNING] ^
[WARNING] /var/lib/jenkins/workspace/overture-development/core/typechecker/src/main/java/org/overture/typechecker/visitor/AbstractTypeCheckVisitor.java:310: warning: no @param for annotations
[WARNING] protected void beforeAnnotations(List<PAnnotation> annotations, INode node, TypeCheckInfo question) throws AnalysisException
[WARNING] ^
[WARNING] /var/lib/jenkins/workspace/overture-development/core/typechecker/src/main/java/org/overture/typechecker/visitor/AbstractTypeCheckVisitor.java:310: warning: no @param for node
[WARNING] protected void beforeAnnotations(List<PAnnotation> annotations, INode node, TypeCheckInfo question) throws AnalysisException
[WARNING] ^
[WARNING] /var/lib/jenkins/workspace/overture-development/core/typechecker/src/main/java/org/overture/typechecker/visitor/AbstractTypeCheckVisitor.java:310: warning: no @param for question
[WARNING] protected void beforeAnnotations(List<PAnnotation> annotations, INode node, TypeCheckInfo question) throws AnalysisException
[WARNING] ^
[WARNING] /var/lib/jenkins/workspace/overture-development/core/typechecker/src/main/java/org/overture/typechecker/visitor/AbstractTypeCheckVisitor.java:310: warning: no @throws for org.overture.ast.analysis.AnalysisException
[WARNING] protected void beforeAnnotations(List<PAnnotation> annotations, INode node, TypeCheckInfo question) throws AnalysisException
[WARNING] ^
[WARNING] /var/lib/jenkins/workspace/overture-development/core/typechecker/src/main/java/org/overture/typechecker/visitor/AbstractTypeCheckVisitor.java:356: warning: no @param for annotations
[WARNING] protected void afterAnnotations(List<PAnnotation> annotations, INode node, TypeCheckInfo question) throws AnalysisException
[WARNING] ^
[WARNING] /var/lib/jenkins/workspace/overture-development/core/typechecker/src/main/java/org/overture/typechecker/visitor/AbstractTypeCheckVisitor.java:356: warning: no @param for node
[WARNING] protected void afterAnnotations(List<PAnnotation> annotations, INode node, TypeCheckInfo question) throws AnalysisException
[WARNING] ^
[WARNING] /var/lib/jenkins/workspace/overture-development/core/typechecker/src/main/java/org/overture/typechecker/visitor/AbstractTypeCheckVisitor.java:356: warning: no @param for question
[WARNING] protected void afterAnnotations(List<PAnnotation> annotations, INode node, TypeCheckInfo question) throws AnalysisException
[WARNING] ^
[WARNING] /var/lib/jenkins/workspace/overture-development/core/typechecker/src/main/java/org/overture/typechecker/visitor/AbstractTypeCheckVisitor.java:356: warning: no @throws for org.overture.ast.analysis.AnalysisException
[WARNING] protected void afterAnnotations(List<PAnnotation> annotations, INode node, TypeCheckInfo question) throws AnalysisException
[WARNING] ^
[WARNING] /var/lib/jenkins/workspace/overture-development/core/typechecker/src/main/java/org/overture/typechecker/visitor/TypeCheckerExpVisitor.java:2947: warning: no description for @throws
[WARNING] * @throws AnalysisException
[WARNING] ^
[WARNING] /var/lib/jenkins/workspace/overture-development/core/typechecker/src/main/java/org/overture/typechecker/visitor/TypeCheckerExpVisitor.java:2969: warning: no description for @throws
[WARNING] * @throws AnalysisException
[WARNING] ^
[WARNING] /var/lib/jenkins/workspace/overture-development/core/typechecker/src/main/java/org/overture/typechecker/visitor/TypeCheckerExpVisitor.java:3690: warning: no description for @param
[WARNING] * @param node
[WARNING] ^
[WARNING] /var/lib/jenkins/workspace/overture-development/core/typechecker/src/main/java/org/overture/typechecker/visitor/TypeCheckerExpVisitor.java:3691: warning: no description for @param
[WARNING] * @param measure
[WARNING] ^
[WARNING] /var/lib/jenkins/workspace/overture-development/core/typechecker/src/main/java/org/overture/typechecker/visitor/TypeCheckerExpVisitor.java:3692: warning: no description for @param
[WARNING] * @param close
[WARNING] ^
[WARNING] /var/lib/jenkins/workspace/overture-development/core/typechecker/src/main/java/org/overture/typechecker/visitor/TypeCheckerExpVisitor.java:3693: warning: no description for @return
[WARNING] * @return
[WARNING] ^
[INFO] Building jar: /var/lib/jenkins/workspace/overture-development/core/typechecker/target/typechecker-3.0.0-SNAPSHOT-javadoc.jar
[INFO] 
[INFO] --- maven-jarsigner-plugin:1.2:sign (sign) @ typechecker ---
[INFO] Disabled
[INFO] 
[INFO] --- maven-install-plugin:2.5.2:install (default-install) @ typechecker ---
[INFO] Installing /var/lib/jenkins/workspace/overture-development/core/typechecker/target/typechecker-3.0.0-SNAPSHOT.jar to /var/lib/jenkins/workspace/overture-development/.repository/org/overturetool/core/typechecker/3.0.0-SNAPSHOT/typechecker-3.0.0-SNAPSHOT.jar
[INFO] Installing /var/lib/jenkins/workspace/overture-development/core/typechecker/pom.xml to /var/lib/jenkins/workspace/overture-development/.repository/org/overturetool/core/typechecker/3.0.0-SNAPSHOT/typechecker-3.0.0-SNAPSHOT.pom
[INFO] Installing /var/lib/jenkins/workspace/overture-development/core/typechecker/target/typechecker-3.0.0-SNAPSHOT-javadoc.jar to /var/lib/jenkins/workspace/overture-development/.repository/org/overturetool/core/typechecker/3.0.0-SNAPSHOT/typechecker-3.0.0-SNAPSHOT-javadoc.jar