Not builtConsole Output

[WARNING] Failed to notify spy hudson.maven.Maven3Builder$JenkinsEventSpy: java.util.concurrent.ExecutionException: Invalid object ID 88 iota=114
[WARNING] Failed to notify spy hudson.maven.Maven3Builder$JenkinsEventSpy: java.util.concurrent.ExecutionException: Invalid object ID 39 iota=114
[INFO]                                                                         
[INFO] ------------------------------------------------------------------------
[INFO] Building The VDM Type Checker 3.0.0-SNAPSHOT
[INFO] ------------------------------------------------------------------------
[INFO] 
[INFO] --- maven-enforcer-plugin:1.0:enforce (enforce-maven) @ typechecker ---
[WARNING] Failed to notify spy hudson.maven.Maven3Builder$JenkinsEventSpy: java.util.concurrent.ExecutionException: Invalid object ID 39 iota=114
[INFO] 
[INFO] --- jacoco-maven-plugin:0.7.6.201602180812:prepare-agent (jacoco-initialize) @ typechecker ---
[INFO] argLine set to -javaagent:/var/lib/jenkins/workspace/overture-development/.repository/org/jacoco/org.jacoco.agent/0.7.6.201602180812/org.jacoco.agent-0.7.6.201602180812-runtime.jar=destfile=/var/lib/jenkins/workspace/overture-development/core/typechecker/target/coverage-reports/jacoco-unit.exec,excludes=**/org/overture/ast/analysis/**/*.*:**/org/overture/ast/expressions/**/*.*:**/org/overture/ast/modules/**/*.*:**/org/overture/ast/node/**/*.*:**/org/overture/ast/patterns/**/*.*:**/org/overture/ast/statements/**/*.*:**/org/overture/ast/types/**/*.*:**/org/overture/codegen/ir/**/*:**/org/overture/ide/**/*
Started
Running as SYSTEM
Build failed before it gets to this module
Started calculate disk usage of build
Finished Calculation of disk usage of build in 0 seconds
Started calculate disk usage of workspace
Finished Calculation of disk usage of workspace in 0 seconds
Finished: NOT_BUILT