UnstableConsole Output

Started calculate disk usage of build
Finished Calculation of disk usage of build in 0 seconds
Started calculate disk usage of workspace
Finished Calculation of disk usage of workspace in 0 seconds
[INFO]                                                                         
[INFO] ------------------------------------------------------------------------
[INFO] Building The Java Code Generator 2.7.5-SNAPSHOT
[INFO] ------------------------------------------------------------------------
[INFO] 
[INFO] --- maven-enforcer-plugin:1.0:enforce (enforce-maven) @ javagen ---
[INFO] 
[INFO] --- jacoco-maven-plugin:0.7.6.201602180812:prepare-agent (jacoco-initialize) @ javagen ---
[INFO] argLine set to -javaagent:/var/lib/jenkins/workspace/overture-pvj-main/.repository/org/jacoco/org.jacoco.agent/0.7.6.201602180812/org.jacoco.agent-0.7.6.201602180812-runtime.jar=destfile=/var/lib/jenkins/workspace/overture-pvj-main/core/codegen/javagen/target/coverage-reports/jacoco-unit.exec,excludes=**/org/overture/ast/analysis/**/*.*:**/org/overture/ast/expressions/**/*.*:**/org/overture/ast/modules/**/*.*:**/org/overture/ast/node/**/*.*:**/org/overture/ast/patterns/**/*.*:**/org/overture/ast/statements/**/*.*:**/org/overture/ast/types/**/*.*:**/org/overture/codegen/ir/**/*:**/org/overture/ide/**/*
[INFO] 
[INFO] --- maven-resources-plugin:2.7:resources (default-resources) @ javagen ---
[INFO] Using 'UTF-8' encoding to copy filtered resources.
[INFO] Copying 184 resources
[INFO] 
[INFO] --- maven-compiler-plugin:3.5.1:compile (default-compile) @ javagen ---
[INFO] Changes detected - recompiling the module!
[INFO] Compiling 34 source files to /var/lib/jenkins/workspace/overture-pvj-main/core/codegen/javagen/target/classes
[INFO] 
[INFO] --- maven-resources-plugin:2.7:testResources (default-testResources) @ javagen ---
[INFO] Using 'UTF-8' encoding to copy filtered resources.
[INFO] Copying 2082 resources
[INFO] 
[INFO] --- maven-compiler-plugin:3.5.1:testCompile (default-testCompile) @ javagen ---
[INFO] Changes detected - recompiling the module!
[INFO] Compiling 51 source files to /var/lib/jenkins/workspace/overture-pvj-main/core/codegen/javagen/target/test-classes
[INFO] 
[INFO] --- maven-surefire-plugin:2.19.1:test (default-test) @ javagen ---

-------------------------------------------------------
 T E S T S
-------------------------------------------------------
Running org.overture.codegen.tests.other.IRTest
Tests run: 8, Failures: 0, Errors: 0, Skipped: 0, Time elapsed: 1.12 sec - in org.overture.codegen.tests.other.IRTest
Running org.overture.codegen.tests.other.ClassesToSkipParsingTest
Tests run: 9, Failures: 0, Errors: 0, Skipped: 0, Time elapsed: 0.022 sec - in org.overture.codegen.tests.other.ClassesToSkipParsingTest
Running org.overture.codegen.tests.other.UtilsTest
Tests run: 8, Failures: 0, Errors: 0, Skipped: 0, Time elapsed: 0.008 sec - in org.overture.codegen.tests.other.UtilsTest
Running org.overture.codegen.tests.other.VarShadowingTest
Tests run: 37, Failures: 0, Errors: 0, Skipped: 0, Time elapsed: 1.472 sec - in org.overture.codegen.tests.other.VarShadowingTest
Running org.overture.codegen.tests.other.UnsupportedJavaCodeGenTest
Tests run: 23, Failures: 0, Errors: 0, Skipped: 0, Time elapsed: 1.47 sec - in org.overture.codegen.tests.other.UnsupportedJavaCodeGenTest
Running org.overture.codegen.tests.exec.ConfiguredStringJavaGenTest
Tests run: 29, Failures: 0, Errors: 0, Skipped: 0, Time elapsed: 28.31 sec - in org.overture.codegen.tests.exec.ConfiguredStringJavaGenTest
Running org.overture.codegen.tests.exec.ComplexExpJavaGenTest
Tests run: 174, Failures: 0, Errors: 0, Skipped: 0, Time elapsed: 162.49 sec - in org.overture.codegen.tests.exec.ComplexExpJavaGenTest
Running org.overture.codegen.tests.exec.ClassicJavaGenTest
Tests run: 2, Failures: 1, Errors: 0, Skipped: 0, Time elapsed: 2.987 sec <<< FAILURE! - in org.overture.codegen.tests.exec.ClassicJavaGenTest
test[CashDispenserPP.vdmpp](org.overture.codegen.tests.exec.ClassicJavaGenTest)  Time elapsed: 1.789 sec  <<< FAILURE!
java.lang.AssertionError: 
Generated Java code did not compile: 
/var/lib/jenkins/workspace/overture-pvj-main/core/codegen/javagen/target/ClassicJavaGenTest/CashDispenserPP.vdmpp/CentralResource.java:47: error: cannot find symbol
				if ( 	super.IsLegalCard(accountId
				     	     ^
  symbol: method IsLegalCard(Number,Number)
/var/lib/jenkins/workspace/overture-pvj-main/core/codegen/javagen/target/ClassicJavaGenTest/CashDispenserPP.vdmpp/CentralResource.java:70: error: cannot find symbol
				if ( 	super.IsLegalCard(accountId
				     	     ^
  symbol: method IsLegalCard(Number,Number)
/var/lib/jenkins/workspace/overture-pvj-main/core/codegen/javagen/target/ClassicJavaGenTest/CashDispenserPP.vdmpp/Till.java:42: error: cannot find symbol
			final Boolean cardLegal = 	super.IsLegalCard();
			                          	     ^
  symbol: method IsLegalCard()
Note: /var/lib/jenkins/workspace/overture-pvj-main/core/codegen/javagen/target/ClassicJavaGenTest/CashDispenserPP.vdmpp/Account.java uses unchecked or unsafe operations.
Note: Recompile with -Xlint:unchecked for details.
3 errors

Running org.overture.codegen.tests.exec.SpecificationJavaGenTest
Tests run: 81, Failures: 0, Errors: 0, Skipped: 0, Time elapsed: 59.471 sec - in org.overture.codegen.tests.exec.SpecificationJavaGenTest
Running org.overture.codegen.tests.exec.PackageJavaGenTest
Tests run: 5, Failures: 0, Errors: 0, Skipped: 0, Time elapsed: 4.597 sec - in org.overture.codegen.tests.exec.PackageJavaGenTest
Running org.overture.codegen.tests.exec.PatternJavaGenTest
Tests run: 68, Failures: 0, Errors: 0, Skipped: 0, Time elapsed: 63.175 sec - in org.overture.codegen.tests.exec.PatternJavaGenTest
Running org.overture.codegen.tests.exec.BindJavaGenTest
Tests run: 11, Failures: 0, Errors: 0, Skipped: 0, Time elapsed: 10.31 sec - in org.overture.codegen.tests.exec.BindJavaGenTest
Running org.overture.codegen.tests.exec.PrePostJavaGenTest
Tests run: 10, Failures: 0, Errors: 0, Skipped: 0, Time elapsed: 9.33 sec - in org.overture.codegen.tests.exec.PrePostJavaGenTest
Running org.overture.codegen.tests.exec.ExpJavaGenTest
Tests run: 126, Failures: 0, Errors: 0, Skipped: 0, Time elapsed: 105.3 sec - in org.overture.codegen.tests.exec.ExpJavaGenTest
Running org.overture.codegen.tests.exec.UnionTypeJavaGenTest
Tests run: 51, Failures: 0, Errors: 0, Skipped: 0, Time elapsed: 45.784 sec - in org.overture.codegen.tests.exec.UnionTypeJavaGenTest
Running org.overture.codegen.tests.exec.TracesVerdictJavaGenTest
Tests run: 6, Failures: 0, Errors: 0, Skipped: 0, Time elapsed: 6.633 sec - in org.overture.codegen.tests.exec.TracesVerdictJavaGenTest
Running org.overture.codegen.tests.exec.ConcurrencyJavaGenTest
Tests run: 17, Failures: 0, Errors: 0, Skipped: 0, Time elapsed: 17.386 sec - in org.overture.codegen.tests.exec.ConcurrencyJavaGenTest
Running org.overture.codegen.tests.exec.TracesStateJavaGenTest
Tests run: 8, Failures: 0, Errors: 0, Skipped: 0, Time elapsed: 8.305 sec - in org.overture.codegen.tests.exec.TracesStateJavaGenTest
Running org.overture.codegen.tests.exec.IsExpJavaGenTest
Tests run: 21, Failures: 0, Errors: 0, Skipped: 0, Time elapsed: 18.03 sec - in org.overture.codegen.tests.exec.IsExpJavaGenTest
Running org.overture.codegen.tests.exec.ConfiguredCloningJavaGenTest
Tests run: 3, Failures: 1, Errors: 0, Skipped: 0, Time elapsed: 3.471 sec <<< FAILURE! - in org.overture.codegen.tests.exec.ConfiguredCloningJavaGenTest
test[CashDispenserPP.vdmpp](org.overture.codegen.tests.exec.ConfiguredCloningJavaGenTest)  Time elapsed: 1.497 sec  <<< FAILURE!
java.lang.AssertionError: 
Generated Java code did not compile: 
/var/lib/jenkins/workspace/overture-pvj-main/core/codegen/javagen/target/ConfiguredCloningJavaGenTest/CashDispenserPP.vdmpp/CentralResource.java:47: error: cannot find symbol
				if ( 	super.IsLegalCard(accountId
				     	     ^
  symbol: method IsLegalCard(Number,Number)
/var/lib/jenkins/workspace/overture-pvj-main/core/codegen/javagen/target/ConfiguredCloningJavaGenTest/CashDispenserPP.vdmpp/CentralResource.java:70: error: cannot find symbol
				if ( 	super.IsLegalCard(accountId
				     	     ^
  symbol: method IsLegalCard(Number,Number)
/var/lib/jenkins/workspace/overture-pvj-main/core/codegen/javagen/target/ConfiguredCloningJavaGenTest/CashDispenserPP.vdmpp/Till.java:42: error: cannot find symbol
			final Boolean cardLegal = 	super.IsLegalCard();
			                          	     ^
  symbol: method IsLegalCard()
Note: /var/lib/jenkins/workspace/overture-pvj-main/core/codegen/javagen/target/ConfiguredCloningJavaGenTest/CashDispenserPP.vdmpp/Account.java uses unchecked or unsafe operations.
Note: Recompile with -Xlint:unchecked for details.
3 errors

Running org.overture.codegen.tests.exec.RtJavaGenTest
Tests run: 3, Failures: 0, Errors: 0, Skipped: 0, Time elapsed: 2.68 sec - in org.overture.codegen.tests.exec.RtJavaGenTest
Running org.overture.codegen.tests.exec.TracesExpansionJavaGenTest
Tests run: 22, Failures: 0, Errors: 0, Skipped: 0, Time elapsed: 23.203 sec - in org.overture.codegen.tests.exec.TracesExpansionJavaGenTest
Running org.overture.codegen.tests.exec.SlJavaGenTest
Tests run: 22, Failures: 0, Errors: 0, Skipped: 0, Time elapsed: 19.378 sec - in org.overture.codegen.tests.exec.SlJavaGenTest
Running org.overture.codegen.tests.exec.TracesSlJavaGenTest
Tests run: 12, Failures: 0, Errors: 0, Skipped: 0, Time elapsed: 11.496 sec - in org.overture.codegen.tests.exec.TracesSlJavaGenTest
Running org.overture.codegen.tests.exec.ConcurrencyClassicJavaGenTest
Tests run: 1, Failures: 1, Errors: 0, Skipped: 0, Time elapsed: 2.543 sec <<< FAILURE! - in org.overture.codegen.tests.exec.ConcurrencyClassicJavaGenTest
test[POP3_LogBased_Test1.vdmpp](org.overture.codegen.tests.exec.ConcurrencyClassicJavaGenTest)  Time elapsed: 2.542 sec  <<< FAILURE!
java.lang.AssertionError: 
Generated Java code did not compile: 
/var/lib/jenkins/workspace/overture-pvj-main/core/codegen/javagen/target/ConcurrencyClassicJavaGenTest/POP3_LogBased_Test1.vdmpp/POP3Server.java:458: error: cannot find symbol
				final POP3Message oldMsg = 					((POP3Message) Utils.get(	super.GetUserMessages(user
				                           					                         	     ^
  symbol: method GetUserMessages(String)
/var/lib/jenkins/workspace/overture-pvj-main/core/codegen/javagen/target/ConcurrencyClassicJavaGenTest/POP3_LogBased_Test1.vdmpp/POP3Server.java:465: error: cannot find symbol
, SeqUtil.mod(	super.GetUserMessages(user
              	     ^
  symbol: method GetUserMessages(String)
/var/lib/jenkins/workspace/overture-pvj-main/core/codegen/javagen/target/ConcurrencyClassicJavaGenTest/POP3_LogBased_Test1.vdmpp/POP3Server.java:536: error: cannot find symbol
				final VDMSeq oldMsgs = 	super.GetUserMessages(user
				                       	     ^
  symbol: method GetUserMessages(String)
Note: Some input files use unchecked or unsafe operations.
Note: Recompile with -Xlint:unchecked for details.
3 errors

Running org.overture.codegen.tests.exec.FunctionValueJavaGenTest
Tests run: 18, Failures: 0, Errors: 0, Skipped: 0, Time elapsed: 16.136 sec - in org.overture.codegen.tests.exec.FunctionValueJavaGenTest
Running org.overture.codegen.tests.output.IsExpOutputTest
Tests run: 21, Failures: 0, Errors: 0, Skipped: 0, Time elapsed: 0.631 sec - in org.overture.codegen.tests.output.IsExpOutputTest
Running org.overture.codegen.tests.output.TracesStateOutputTest
Tests run: 8, Failures: 0, Errors: 0, Skipped: 0, Time elapsed: 0.24 sec - in org.overture.codegen.tests.output.TracesStateOutputTest
Running org.overture.codegen.tests.output.BindOutputTest
Tests run: 11, Failures: 0, Errors: 0, Skipped: 0, Time elapsed: 0.31 sec - in org.overture.codegen.tests.output.BindOutputTest
Running org.overture.codegen.tests.output.ClassicOutputTest
Tests run: 2, Failures: 0, Errors: 0, Skipped: 0, Time elapsed: 0.38 sec - in org.overture.codegen.tests.output.ClassicOutputTest
Running org.overture.codegen.tests.output.RtOutputTest
Tests run: 3, Failures: 0, Errors: 0, Skipped: 0, Time elapsed: 0.059 sec - in org.overture.codegen.tests.output.RtOutputTest
Running org.overture.codegen.tests.output.TracesVerdictOutputTest
Tests run: 6, Failures: 0, Errors: 0, Skipped: 0, Time elapsed: 0.157 sec - in org.overture.codegen.tests.output.TracesVerdictOutputTest
Running org.overture.codegen.tests.output.PatternOutputTest
Tests run: 68, Failures: 0, Errors: 0, Skipped: 0, Time elapsed: 1.073 sec - in org.overture.codegen.tests.output.PatternOutputTest
Running org.overture.codegen.tests.output.TracesSlOutputTest
Tests run: 12, Failures: 0, Errors: 0, Skipped: 0, Time elapsed: 0.24 sec - in org.overture.codegen.tests.output.TracesSlOutputTest
Running org.overture.codegen.tests.output.ConfiguredStringOutputTest
Tests run: 29, Failures: 0, Errors: 0, Skipped: 0, Time elapsed: 0.345 sec - in org.overture.codegen.tests.output.ConfiguredStringOutputTest
Running org.overture.codegen.tests.output.ComplexExpOutputTest
Tests run: 174, Failures: 0, Errors: 0, Skipped: 0, Time elapsed: 2.412 sec - in org.overture.codegen.tests.output.ComplexExpOutputTest
Running org.overture.codegen.tests.output.NameNormalisingOutputTest
Tests run: 11, Failures: 0, Errors: 0, Skipped: 0, Time elapsed: 0.126 sec - in org.overture.codegen.tests.output.NameNormalisingOutputTest
Running org.overture.codegen.tests.output.ConcurrencyClassicOutputTest
Tests run: 1, Failures: 0, Errors: 0, Skipped: 0, Time elapsed: 1.067 sec - in org.overture.codegen.tests.output.ConcurrencyClassicOutputTest
Running org.overture.codegen.tests.output.SystemClassOutputTest
Tests run: 3, Failures: 0, Errors: 0, Skipped: 0, Time elapsed: 0.066 sec - in org.overture.codegen.tests.output.SystemClassOutputTest
Running org.overture.codegen.tests.output.FunctionValueOutputTest
Tests run: 18, Failures: 0, Errors: 0, Skipped: 0, Time elapsed: 0.278 sec - in org.overture.codegen.tests.output.FunctionValueOutputTest
Running org.overture.codegen.tests.output.ExpOutputTest
Tests run: 126, Failures: 0, Errors: 0, Skipped: 0, Time elapsed: 0.096 sec - in org.overture.codegen.tests.output.ExpOutputTest
Running org.overture.codegen.tests.output.SlOutputTest
Tests run: 22, Failures: 0, Errors: 0, Skipped: 0, Time elapsed: 0.341 sec - in org.overture.codegen.tests.output.SlOutputTest
Running org.overture.codegen.tests.output.PrePostOutputTest
Tests run: 10, Failures: 0, Errors: 0, Skipped: 0, Time elapsed: 0.118 sec - in org.overture.codegen.tests.output.PrePostOutputTest
Running org.overture.codegen.tests.output.PackageOutputTest
Tests run: 5, Failures: 0, Errors: 0, Skipped: 0, Time elapsed: 0.05 sec - in org.overture.codegen.tests.output.PackageOutputTest
Running org.overture.codegen.tests.output.SpecificationOutputTest
Tests run: 81, Failures: 0, Errors: 0, Skipped: 0, Time elapsed: 1.124 sec - in org.overture.codegen.tests.output.SpecificationOutputTest
Running org.overture.codegen.tests.output.UnionTypeOutputTest
Tests run: 51, Failures: 0, Errors: 0, Skipped: 0, Time elapsed: 0.835 sec - in org.overture.codegen.tests.output.UnionTypeOutputTest
Running org.overture.codegen.tests.output.ConfiguredCloningOutputTest
Tests run: 3, Failures: 0, Errors: 0, Skipped: 0, Time elapsed: 0.395 sec - in org.overture.codegen.tests.output.ConfiguredCloningOutputTest
Running org.overture.codegen.tests.output.TracesExpansionOutputTest
Tests run: 22, Failures: 0, Errors: 0, Skipped: 0, Time elapsed: 0.437 sec - in org.overture.codegen.tests.output.TracesExpansionOutputTest
Running org.overture.codegen.tests.output.ConcurrencyOutputTest
Tests run: 17, Failures: 0, Errors: 0, Skipped: 0, Time elapsed: 0.526 sec - in org.overture.codegen.tests.output.ConcurrencyOutputTest

Results :

Failed tests: 
  ClassicJavaGenTest>CheckerTestBase.test:93->JavaGenTestBase.genSourcesAndCompile:124->CheckerTestBase.compile:170 Generated Java code did not compile: 
/var/lib/jenkins/workspace/overture-pvj-main/core/codegen/javagen/target/ClassicJavaGenTest/CashDispenserPP.vdmpp/CentralResource.java:47: error: cannot find symbol
				if ( 	super.IsLegalCard(accountId
				     	     ^
  symbol: method IsLegalCard(Number,Number)
/var/lib/jenkins/workspace/overture-pvj-main/core/codegen/javagen/target/ClassicJavaGenTest/CashDispenserPP.vdmpp/CentralResource.java:70: error: cannot find symbol
				if ( 	super.IsLegalCard(accountId
				     	     ^
  symbol: method IsLegalCard(Number,Number)
/var/lib/jenkins/workspace/overture-pvj-main/core/codegen/javagen/target/ClassicJavaGenTest/CashDispenserPP.vdmpp/Till.java:42: error: cannot find symbol
			final Boolean cardLegal = 	super.IsLegalCard();
			                          	     ^
  symbol: method IsLegalCard()
Note: /var/lib/jenkins/workspace/overture-pvj-main/core/codegen/javagen/target/ClassicJavaGenTest/CashDispenserPP.vdmpp/Account.java uses unchecked or unsafe operations.
Note: Recompile with -Xlint:unchecked for details.
3 errors
  ConcurrencyClassicJavaGenTest>CheckerTestBase.test:93->JavaGenTestBase.genSourcesAndCompile:124->CheckerTestBase.compile:170 Generated Java code did not compile: 
/var/lib/jenkins/workspace/overture-pvj-main/core/codegen/javagen/target/ConcurrencyClassicJavaGenTest/POP3_LogBased_Test1.vdmpp/POP3Server.java:458: error: cannot find symbol
				final POP3Message oldMsg = 					((POP3Message) Utils.get(	super.GetUserMessages(user
				                           					                         	     ^
  symbol: method GetUserMessages(String)
/var/lib/jenkins/workspace/overture-pvj-main/core/codegen/javagen/target/ConcurrencyClassicJavaGenTest/POP3_LogBased_Test1.vdmpp/POP3Server.java:465: error: cannot find symbol
, SeqUtil.mod(	super.GetUserMessages(user
              	     ^
  symbol: method GetUserMessages(String)
/var/lib/jenkins/workspace/overture-pvj-main/core/codegen/javagen/target/ConcurrencyClassicJavaGenTest/POP3_LogBased_Test1.vdmpp/POP3Server.java:536: error: cannot find symbol
				final VDMSeq oldMsgs = 	super.GetUserMessages(user
				                       	     ^
  symbol: method GetUserMessages(String)
Note: Some input files use unchecked or unsafe operations.
Note: Recompile with -Xlint:unchecked for details.
3 errors
  ConfiguredCloningJavaGenTest>CheckerTestBase.test:93->JavaGenTestBase.genSourcesAndCompile:124->CheckerTestBase.compile:170 Generated Java code did not compile: 
/var/lib/jenkins/workspace/overture-pvj-main/core/codegen/javagen/target/ConfiguredCloningJavaGenTest/CashDispenserPP.vdmpp/CentralResource.java:47: error: cannot find symbol
				if ( 	super.IsLegalCard(accountId
				     	     ^
  symbol: method IsLegalCard(Number,Number)
/var/lib/jenkins/workspace/overture-pvj-main/core/codegen/javagen/target/ConfiguredCloningJavaGenTest/CashDispenserPP.vdmpp/CentralResource.java:70: error: cannot find symbol
				if ( 	super.IsLegalCard(accountId
				     	     ^
  symbol: method IsLegalCard(Number,Number)
/var/lib/jenkins/workspace/overture-pvj-main/core/codegen/javagen/target/ConfiguredCloningJavaGenTest/CashDispenserPP.vdmpp/Till.java:42: error: cannot find symbol
			final Boolean cardLegal = 	super.IsLegalCard();
			                          	     ^
  symbol: method IsLegalCard()
Note: /var/lib/jenkins/workspace/overture-pvj-main/core/codegen/javagen/target/ConfiguredCloningJavaGenTest/CashDispenserPP.vdmpp/Account.java uses unchecked or unsafe operations.
Note: Recompile with -Xlint:unchecked for details.
3 errors

Tests run: 1479, Failures: 3, Errors: 0, Skipped: 0

[ERROR] There are test failures.

Please refer to /var/lib/jenkins/workspace/overture-pvj-main/core/codegen/javagen/target/surefire-reports for the individual test results.
[JENKINS] Recording test results
[INFO] 
[INFO] --- maven-jar-plugin:2.6:jar (default-jar) @ javagen ---
[INFO] Building jar: /var/lib/jenkins/workspace/overture-pvj-main/core/codegen/javagen/target/javagen-2.7.5-SNAPSHOT.jar
[INFO] 
[INFO] --- jacoco-maven-plugin:0.7.6.201602180812:report (jacoco-site) @ javagen ---
[INFO] Analyzed bundle 'The Java Code Generator' with 32 classes
[INFO] 
[INFO] --- maven-javadoc-plugin:2.10.3:jar (attach-javadocs) @ javagen ---
[INFO] Skipping javadoc generation
[INFO] 
[INFO] --- maven-install-plugin:2.5.2:install (default-install) @ javagen ---
[INFO] Installing /var/lib/jenkins/workspace/overture-pvj-main/core/codegen/javagen/target/javagen-2.7.5-SNAPSHOT.jar to /var/lib/jenkins/workspace/overture-pvj-main/.repository/org/overturetool/core/codegen/javagen/2.7.5-SNAPSHOT/javagen-2.7.5-SNAPSHOT.jar
[INFO] Installing /var/lib/jenkins/workspace/overture-pvj-main/core/codegen/javagen/pom.xml to /var/lib/jenkins/workspace/overture-pvj-main/.repository/org/overturetool/core/codegen/javagen/2.7.5-SNAPSHOT/javagen-2.7.5-SNAPSHOT.pom