SuccessConsole Output

Started calculate disk usage of build
Finished Calculation of disk usage of build in 0 seconds
Started calculate disk usage of workspace
Finished Calculation of disk usage of workspace in 0 seconds
[INFO]                                                                         
[INFO] ------------------------------------------------------------------------
[INFO] Building The VDM to Isabelle Translator 2.6.5-SNAPSHOT
[INFO] ------------------------------------------------------------------------
[INFO] 
[INFO] --- maven-enforcer-plugin:1.0:enforce (enforce-maven) @ isagen ---
[TASKS] Scanning folder '/var/lib/jenkins/workspace/overture-test/core/codegen/isagen' for files matching the pattern '**/*.java' - excludes: **/target/*
[TASKS] Found 16 files to scan for tasks
Found 3 open tasks.
[TASKS] Computing warning deltas based on reference build #197
[INFO] 
[INFO] --- jacoco-maven-plugin:0.7.6.201602180812:prepare-agent (jacoco-initialize) @ isagen ---
[INFO] argLine set to -javaagent:/var/lib/jenkins/workspace/overture-test/.repository/org/jacoco/org.jacoco.agent/0.7.6.201602180812/org.jacoco.agent-0.7.6.201602180812-runtime.jar=destfile=/var/lib/jenkins/workspace/overture-test/core/codegen/isagen/target/coverage-reports/jacoco-unit.exec,excludes=**/org/overture/ast/analysis/**/*.*:**/org/overture/ast/expressions/**/*.*:**/org/overture/ast/modules/**/*.*:**/org/overture/ast/node/**/*.*:**/org/overture/ast/patterns/**/*.*:**/org/overture/ast/statements/**/*.*:**/org/overture/ast/types/**/*.*:**/org/overture/codegen/ir/**/*:**/org/overture/ide/**/*
[INFO] 
[INFO] --- astcreator-plugin:1.6.8:generate (generate-ast) @ isagen ---
[INFO] Preparing for tree generation...
[INFO] Configuring extension
[INFO] 	Extension base dependency is: "org.overturetool.core.codegen:ir"
[INFO] 	Searching for base dependency artifact
[INFO] 	Extension base artifact found - exstracting base tree definition files
[INFO] 	Setting base definition files to:
[INFO] 		base: /var/lib/jenkins/workspace/overture-test/core/codegen/isagen/target/ir.ast
[INFO] 		base tostring: /var/lib/jenkins/workspace/overture-test/core/codegen/isagen/target/ir.ast.tostring
[INFO] 	Extension base artifact configured.
[INFO] Checking if generation required.
[INFO] Full AST generation needed
[INFO] Generating...
[INFO] Generator starting with input: /var/lib/jenkins/workspace/overture-test/core/codegen/isagen/target/ir.ast
[INFO] Generator starting with extension input: /var/lib/jenkins/workspace/overture-test/core/codegen/isagen/src/main/resources/isair.ast
Generating base and extension tree, standby ... 
Extension tree only: true
Adding aspect fields: PIRBase.{sourceNode,tag,metaData}
WARNING: Using SubProduction class found without using package name. SImportsIRBase
WARNING: Using SubProduction class found without using package name. SImportIRBase
Adding aspect fields: SImportIRBase.{name,renamed,fromModuleName}
Adding aspect fields: SValueImportBase.{importType}
WARNING: Using SubProduction class found without using package name. SExportsIRBase
WARNING: Using SubProduction class found without using package name. SExportIRBase
Adding aspect fields: SExportIRBase.{decl}
WARNING: Using SubProduction class found without using package name. SPatternIRBase
WARNING: Using SubProduction class found without using package name. SBindIRBase
Adding aspect fields: SBindIRBase.{pattern}
WARNING: Using SubProduction class found without using package name. SMultipleBindIRBase
Adding aspect fields: SMultipleBindIRBase.{patterns}
WARNING: Using SubProduction class found without using package name. SNameIRBase
WARNING: Using SubProduction class found without using package name. SDeclIRBase
Adding aspect fields: SClassDeclBase.{globalMetaData,package,dependencies,access,abstract,static,name,fields,invariant,methods,functions,traces,superNames,thread,innerClasses,interfaces,typeDecls,perSyncs,mutexSyncs}
WARNING: Using SubProduction class found without using package name. SStateDesignatorIRBase
Adding aspect fields: SStateDesignatorIRBase.{type}
WARNING: Using SubProduction class found without using package name. SObjectDesignatorIRBase
WARNING: Using SubProduction class found without using package name. SLocalParamIRBase
WARNING: Using SubProduction class found without using package name. SStmIRBase
Adding aspect fields: SCallStmBase.{type,isStatic,name,args}
WARNING: Using SubProduction class found without using package name. SLetBeStIRBase
WARNING: Using SubProduction class found without using package name. SExpIRBase
Adding aspect fields: SExpIRBase.{type}
WARNING: Using SubProduction class found without using package name. SModifierIRBase
Adding aspect fields: SIsExpBase.{exp}
Adding aspect fields: SVarExpBase.{isLambda,isLocal,name}
Adding aspect fields: SQuantifierExpBase.{bindList,predicate}
Adding aspect fields: SBinaryExpBase.{left,right}
Adding aspect fields: SUnaryExpBase.{exp}
WARNING: Using SubProduction class found without using package name. STypeIRBase
Adding aspect fields: STypeIRBase.{optional,namedInvType}
Adding aspect fields: SSetTypeBase.{empty,setOf}
Adding aspect fields: SSeqTypeBase.{empty,seq1,seqOf}
Adding aspect fields: SMapTypeBase.{empty,injective,from,to}
WARNING: Using SubProduction class found without using package name. STermIRBase
WARNING: Using SubProduction class found without using package name. STraceDeclIRBase
WARNING: Using SubProduction class found without using package name. STraceCoreDeclIRBase
Retry Create interfaces - with 15 not yet created interfaces.
Done creating interfaces
Generating toString add on...
WARNING: Using SubProduction class found without using package name. SDeclIRBase
Done creating interfaces
Generating toString add on...
Failed to lookup tostring addition with %AIsaclassClassIR @ line 8 38:53
***********************************************
AST Creator Extensions
***********************************************
Generating enumerations...
Generating analysis visitors...
Analysis...Answer...Question...Question-Answer...Depth-First...
Writing sources to the file system, standby ... 
Destination: /var/lib/jenkins/workspace/overture-test/core/codegen/isagen/target/generated-sources/astCreator
Copying base classes to destination...
Writing source files.:
..............
File write completed in 0 secs
Created AST with extensions.
[INFO] 
[INFO] --- build-helper-maven-plugin:1.10:add-source (add-source) @ isagen ---
[INFO] Source directory: /var/lib/jenkins/workspace/overture-test/core/codegen/isagen/target/generated-sources/astCreator added.
[INFO] 
[INFO] --- maven-resources-plugin:2.7:resources (default-resources) @ isagen ---
[INFO] Using 'UTF-8' encoding to copy filtered resources.
[INFO] Copying 65 resources
[INFO] 
[INFO] --- maven-compiler-plugin:3.5.1:compile (default-compile) @ isagen ---
[INFO] Changes detected - recompiling the module!
[INFO] Compiling 24 source files to /var/lib/jenkins/workspace/overture-test/core/codegen/isagen/target/classes
[parsing started RegularFileObject[/var/lib/jenkins/workspace/overture-test/core/codegen/isagen/target/generated-sources/astCreator/org/overture/cgisa/isair/analysis/AnalysisIsaAdaptor.java]]
[parsing completed 1ms]
[parsing started RegularFileObject[/var/lib/jenkins/workspace/overture-test/core/codegen/isagen/target/generated-sources/astCreator/org/overture/cgisa/isair/node/SIsaDeclIR.java]]
[parsing completed 0ms]
[parsing started RegularFileObject[/var/lib/jenkins/workspace/overture-test/core/codegen/isagen/src/main/java/org/overturetool/cgisa/IsaTranslations.java]]
[parsing completed 1ms]
[parsing started RegularFileObject[/var/lib/jenkins/workspace/overture-test/core/codegen/isagen/target/generated-sources/astCreator/org/overture/cgisa/isair/analysis/AnswerIsaAdaptor.java]]
[parsing completed 0ms]
[parsing started RegularFileObject[/var/lib/jenkins/workspace/overture-test/core/codegen/isagen/target/generated-sources/astCreator/org/overture/cgisa/isair/declarations/AMrFuncGroupDeclIR.java]]
[parsing completed 1ms]
[parsing started RegularFileObject[/var/lib/jenkins/workspace/overture-test/core/codegen/isagen/src/main/java/org/overturetool/cgisa/utils/IsSeqOfCharTypeVisitor.java]]
[parsing completed 0ms]
[parsing started RegularFileObject[/var/lib/jenkins/workspace/overture-test/core/codegen/isagen/target/generated-sources/astCreator/org/overture/cgisa/isair/analysis/QuestionAnswerIsaAdaptor.java]]
[parsing completed 0ms]
[parsing started RegularFileObject[/var/lib/jenkins/workspace/overture-test/core/codegen/isagen/target/generated-sources/astCreator/org/overture/cgisa/isair/analysis/intf/IIsaAnalysis.java]]
[parsing completed 0ms]
[parsing started RegularFileObject[/var/lib/jenkins/workspace/overture-test/core/codegen/isagen/target/generated-sources/astCreator/org/overture/cgisa/isair/analysis/DepthFirstAnalysisIsaAdaptor.java]]
[parsing completed 18ms]
[parsing started RegularFileObject[/var/lib/jenkins/workspace/overture-test/core/codegen/isagen/src/main/java/org/overturetool/cgisa/utils/IsCharTypeVisitor.java]]
[parsing completed 0ms]
[parsing started RegularFileObject[/var/lib/jenkins/workspace/overture-test/core/codegen/isagen/target/generated-sources/astCreator/org/overture/cgisa/isair/node/SIsaDeclDeclBase.java]]
[parsing completed 0ms]
[parsing started RegularFileObject[/var/lib/jenkins/workspace/overture-test/core/codegen/isagen/target/generated-sources/astCreator/org/overture/cgisa/isair/node/PIsaIRBase.java]]
[parsing completed 1ms]
[parsing started RegularFileObject[/var/lib/jenkins/workspace/overture-test/core/codegen/isagen/src/main/java/org/overturetool/cgisa/utils/IsMethodTypeVisitor.java]]
[parsing completed 0ms]
[parsing started RegularFileObject[/var/lib/jenkins/workspace/overture-test/core/codegen/isagen/src/main/java/org/overturetool/cgisa/IsaChecks.java]]
[parsing completed 0ms]
[parsing started RegularFileObject[/var/lib/jenkins/workspace/overture-test/core/codegen/isagen/src/main/java/org/overturetool/cgisa/transformations/Dependencies.java]]
[parsing completed 0ms]
[parsing started RegularFileObject[/var/lib/jenkins/workspace/overture-test/core/codegen/isagen/src/main/java/org/overturetool/cgisa/transformations/GroupMutRecs.java]]
[parsing completed 1ms]
[parsing started RegularFileObject[/var/lib/jenkins/workspace/overture-test/core/codegen/isagen/src/main/java/org/overturetool/cgisa/IsaGen.java]]
[parsing completed 0ms]
[parsing started RegularFileObject[/var/lib/jenkins/workspace/overture-test/core/codegen/isagen/target/generated-sources/astCreator/org/overture/cgisa/isair/analysis/QuestionIsaAdaptor.java]]
[parsing completed 0ms]
[parsing started RegularFileObject[/var/lib/jenkins/workspace/overture-test/core/codegen/isagen/target/generated-sources/astCreator/org/overture/cgisa/isair/analysis/intf/IIsaAnswer.java]]
[parsing completed 0ms]
[parsing started RegularFileObject[/var/lib/jenkins/workspace/overture-test/core/codegen/isagen/src/main/java/org/overturetool/cgisa/transformations/StateInit.java]]
[parsing completed 0ms]
[parsing started RegularFileObject[/var/lib/jenkins/workspace/overture-test/core/codegen/isagen/src/main/java/org/overturetool/cgisa/transformations/SortDependencies.java]]
[parsing completed 0ms]
[parsing started RegularFileObject[/var/lib/jenkins/workspace/overture-test/core/codegen/isagen/target/generated-sources/astCreator/org/overture/cgisa/isair/analysis/intf/IIsaQuestionAnswer.java]]
[parsing completed 0ms]
[parsing started RegularFileObject[/var/lib/jenkins/workspace/overture-test/core/codegen/isagen/target/generated-sources/astCreator/org/overture/cgisa/isair/node/PIsaIR.java]]
[parsing completed 0ms]
[parsing started RegularFileObject[/var/lib/jenkins/workspace/overture-test/core/codegen/isagen/target/generated-sources/astCreator/org/overture/cgisa/isair/analysis/intf/IIsaQuestion.java]]
[parsing completed 0ms]
[search path for source files: /var/lib/jenkins/workspace/overture-test/core/codegen/isagen/src/main/java,/var/lib/jenkins/workspace/overture-test/core/codegen/isagen/target/generated-sources/astCreator,/var/lib/jenkins/workspace/overture-test/core/codegen/isagen/target/generated-sources/annotations]
[search path for class files: /usr/lib/jvm/java-8-oracle/jre/lib/resources.jar,/usr/lib/jvm/java-8-oracle/jre/lib/rt.jar,/usr/lib/jvm/java-8-oracle/jre/lib/sunrsasign.jar,/usr/lib/jvm/java-8-oracle/jre/lib/jsse.jar,/usr/lib/jvm/java-8-oracle/jre/lib/jce.jar,/usr/lib/jvm/java-8-oracle/jre/lib/charsets.jar,/usr/lib/jvm/java-8-oracle/jre/lib/jfr.jar,/usr/lib/jvm/java-8-oracle/jre/classes,/usr/lib/jvm/java-8-oracle/jre/lib/ext/jfxrt.jar,/usr/lib/jvm/java-8-oracle/jre/lib/ext/nashorn.jar,/usr/lib/jvm/java-8-oracle/jre/lib/ext/sunjce_provider.jar,/usr/lib/jvm/java-8-oracle/jre/lib/ext/sunec.jar,/usr/lib/jvm/java-8-oracle/jre/lib/ext/cldrdata.jar,/usr/lib/jvm/java-8-oracle/jre/lib/ext/sunpkcs11.jar,/usr/lib/jvm/java-8-oracle/jre/lib/ext/localedata.jar,/usr/lib/jvm/java-8-oracle/jre/lib/ext/dnsns.jar,/usr/lib/jvm/java-8-oracle/jre/lib/ext/jaccess.jar,/usr/lib/jvm/java-8-oracle/jre/lib/ext/zipfs.jar,/var/lib/jenkins/workspace/overture-test/core/codegen/isagen/target/classes,/var/lib/jenkins/workspace/overture-test/core/ast/target/ast-2.6.5-SNAPSHOT.jar,/var/lib/jenkins/workspace/overture-test/core/codegen/platform/target/platform-2.6.5-SNAPSHOT.jar,/var/lib/jenkins/workspace/overture-test/core/parser/target/parser-2.6.5-SNAPSHOT.jar,/var/lib/jenkins/workspace/overture-test/core/typechecker/target/typechecker-2.6.5-SNAPSHOT.jar,/var/lib/jenkins/workspace/overture-test/core/interpreter/target/interpreter-2.6.5-SNAPSHOT.jar,/var/lib/jenkins/workspace/overture-test/core/pog/target/pog-2.6.5-SNAPSHOT.jar,/var/lib/jenkins/workspace/overture-test/core/prettyprinting/prettyprinter/target/prettyprinter-2.6.5-SNAPSHOT.jar,/var/lib/jenkins/workspace/overture-test/core/testframework/target/testframework-2.6.5-SNAPSHOT.jar,/var/lib/jenkins/workspace/overture-test/.repository/org/apache/velocity/velocity/1.7/velocity-1.7.jar,/var/lib/jenkins/workspace/overture-test/.repository/commons-collections/commons-collections/3.2.1/commons-collections-3.2.1.jar,/var/lib/jenkins/workspace/overture-test/.repository/commons-lang/commons-lang/2.4/commons-lang-2.4.jar,/var/lib/jenkins/workspace/overture-test/core/combinatorialtesting/ctruntime/target/ctruntime-2.6.5-SNAPSHOT.jar,/var/lib/jenkins/workspace/overture-test/core/combinatorialtesting/ctutils/target/ctutils-2.6.5-SNAPSHOT.jar,/var/lib/jenkins/workspace/overture-test/.repository/log4j/log4j/1.2.17/log4j-1.2.17.jar,/var/lib/jenkins/workspace/overture-test/core/codegen/ir/target/ir-2.6.5-SNAPSHOT.jar,/var/lib/jenkins/workspace/overture-test/.repository/commons-io/commons-io/2.4/commons-io-2.4.jar,/var/lib/jenkins/workspace/overture-test/.repository/org/apache/commons/commons-collections4/4.0/commons-collections4-4.0.jar,/var/lib/jenkins/workspace/overture-test/.repository/com/google/code/gson/gson/2.2.4/gson-2.2.4.jar,/var/lib/jenkins/workspace/overture-test/.repository/junit/junit/4.11/junit-4.11.jar,/var/lib/jenkins/workspace/overture-test/.repository/org/hamcrest/hamcrest-core/1.3/hamcrest-core-1.3.jar,/var/lib/jenkins/workspace/overture-test/.repository/org/jgrapht/jgrapht-core/0.9.0/jgrapht-core-0.9.0.jar,.]
[loading ZipFileIndexFileObject[/var/lib/jenkins/workspace/overture-test/core/codegen/ir/target/ir-2.6.5-SNAPSHOT.jar(org/overture/codegen/ir/analysis/AnalysisException.class)]]
[loading ZipFileIndexFileObject[/var/lib/jenkins/workspace/overture-test/core/codegen/ir/target/ir-2.6.5-SNAPSHOT.jar(org/overture/codegen/ir/analysis/intf/IAnalysis.class)]]
[loading ZipFileIndexFileObject[/var/lib/jenkins/workspace/overture-test/core/codegen/ir/target/ir-2.6.5-SNAPSHOT.jar(org/overture/codegen/ir/analysis/AnalysisAdaptor.class)]]
[loading ZipFileIndexFileObject[/usr/lib/jvm/java-8-oracle/lib/ct.sym(META-INF/sym/rt.jar/java/lang/Object.class)]]
[loading ZipFileIndexFileObject[/usr/lib/jvm/java-8-oracle/lib/ct.sym(META-INF/sym/rt.jar/java/lang/SuppressWarnings.class)]]
[loading ZipFileIndexFileObject[/var/lib/jenkins/workspace/overture-test/core/ast/target/ast-2.6.5-SNAPSHOT.jar(org/overture/ast/util/ClonableString.class)]]
[loading ZipFileIndexFileObject[/var/lib/jenkins/workspace/overture-test/core/codegen/ir/target/ir-2.6.5-SNAPSHOT.jar(org/overture/codegen/ir/analysis/intf/IQuestion.class)]]
[loading ZipFileIndexFileObject[/usr/lib/jvm/java-8-oracle/lib/ct.sym(META-INF/sym/rt.jar/java/util/HashMap.class)]]
[loading ZipFileIndexFileObject[/var/lib/jenkins/workspace/overture-test/core/ast/target/ast-2.6.5-SNAPSHOT.jar(org/overture/ast/util/Utils.class)]]
[loading ZipFileIndexFileObject[/var/lib/jenkins/workspace/overture-test/core/codegen/ir/target/ir-2.6.5-SNAPSHOT.jar(org/overture/codegen/ir/INode.class)]]
[loading ZipFileIndexFileObject[/usr/lib/jvm/java-8-oracle/lib/ct.sym(META-INF/sym/rt.jar/java/util/Vector.class)]]
[loading ZipFileIndexFileObject[/usr/lib/jvm/java-8-oracle/lib/ct.sym(META-INF/sym/rt.jar/java/util/Map.class)]]
[loading ZipFileIndexFileObject[/usr/lib/jvm/java-8-oracle/lib/ct.sym(META-INF/sym/rt.jar/java/lang/Boolean.class)]]
[loading ZipFileIndexFileObject[/usr/lib/jvm/java-8-oracle/lib/ct.sym(META-INF/sym/rt.jar/java/lang/String.class)]]
[loading ZipFileIndexFileObject[/var/lib/jenkins/workspace/overture-test/core/codegen/ir/target/ir-2.6.5-SNAPSHOT.jar(org/overture/codegen/ir/NodeList.class)]]
[loading ZipFileIndexFileObject[/var/lib/jenkins/workspace/overture-test/core/codegen/ir/target/ir-2.6.5-SNAPSHOT.jar(org/overture/codegen/ir/SourceNode.class)]]
[loading ZipFileIndexFileObject[/usr/lib/jvm/java-8-oracle/lib/ct.sym(META-INF/sym/rt.jar/java/util/LinkedList.class)]]
[loading ZipFileIndexFileObject[/usr/lib/jvm/java-8-oracle/lib/ct.sym(META-INF/sym/rt.jar/java/util/List.class)]]
[loading ZipFileIndexFileObject[/var/lib/jenkins/workspace/overture-test/core/codegen/ir/target/ir-2.6.5-SNAPSHOT.jar(org/overture/codegen/ir/analysis/intf/IAnswer.class)]]
[loading ZipFileIndexFileObject[/var/lib/jenkins/workspace/overture-test/core/codegen/ir/target/ir-2.6.5-SNAPSHOT.jar(org/overture/codegen/ir/declarations/AFuncDeclIR.class)]]
[loading ZipFileIndexFileObject[/var/lib/jenkins/workspace/overture-test/core/codegen/ir/target/ir-2.6.5-SNAPSHOT.jar(org/overture/codegen/ir/analysis/intf/IQuestionAnswer.class)]]
[loading ZipFileIndexFileObject[/var/lib/jenkins/workspace/overture-test/core/codegen/ir/target/ir-2.6.5-SNAPSHOT.jar(org/overture/codegen/ir/SDeclIRBase.class)]]
[loading ZipFileIndexFileObject[/var/lib/jenkins/workspace/overture-test/core/codegen/ir/target/ir-2.6.5-SNAPSHOT.jar(org/overture/codegen/ir/SDeclIR.class)]]
[loading ZipFileIndexFileObject[/var/lib/jenkins/workspace/overture-test/core/codegen/ir/target/ir-2.6.5-SNAPSHOT.jar(org/overture/codegen/ir/PIR.class)]]
[loading ZipFileIndexFileObject[/var/lib/jenkins/workspace/overture-test/core/codegen/ir/target/ir-2.6.5-SNAPSHOT.jar(org/overture/codegen/ir/PIRBase.class)]]
[loading ZipFileIndexFileObject[/var/lib/jenkins/workspace/overture-test/core/codegen/ir/target/ir-2.6.5-SNAPSHOT.jar(org/overture/codegen/ir/Node.class)]]
[loading ZipFileIndexFileObject[/usr/lib/jvm/java-8-oracle/lib/ct.sym(META-INF/sym/rt.jar/java/lang/Cloneable.class)]]
[loading ZipFileIndexFileObject[/usr/lib/jvm/java-8-oracle/lib/ct.sym(META-INF/sym/rt.jar/java/io/Serializable.class)]]
[loading ZipFileIndexFileObject[/usr/lib/jvm/java-8-oracle/lib/ct.sym(META-INF/sym/rt.jar/java/lang/Comparable.class)]]
[loading ZipFileIndexFileObject[/usr/lib/jvm/java-8-oracle/lib/ct.sym(META-INF/sym/rt.jar/java/io/StringWriter.class)]]
[loading ZipFileIndexFileObject[/usr/lib/jvm/java-8-oracle/lib/ct.sym(META-INF/sym/rt.jar/java/util/Iterator.class)]]
[loading ZipFileIndexFileObject[/var/lib/jenkins/workspace/overture-test/core/ast/target/ast-2.6.5-SNAPSHOT.jar(org/overture/ast/definitions/AImplicitFunctionDefinition.class)]]
[loading ZipFileIndexFileObject[/var/lib/jenkins/workspace/overture-test/core/codegen/ir/target/ir-2.6.5-SNAPSHOT.jar(org/overture/codegen/ir/SExpIR.class)]]
[loading ZipFileIndexFileObject[/var/lib/jenkins/workspace/overture-test/core/codegen/ir/target/ir-2.6.5-SNAPSHOT.jar(org/overture/codegen/ir/SMultipleBindIR.class)]]
[loading ZipFileIndexFileObject[/var/lib/jenkins/workspace/overture-test/core/codegen/ir/target/ir-2.6.5-SNAPSHOT.jar(org/overture/codegen/ir/STypeIR.class)]]
[loading ZipFileIndexFileObject[/var/lib/jenkins/workspace/overture-test/core/codegen/ir/target/ir-2.6.5-SNAPSHOT.jar(org/overture/codegen/ir/declarations/AFieldDeclIR.class)]]
[loading ZipFileIndexFileObject[/var/lib/jenkins/workspace/overture-test/core/codegen/ir/target/ir-2.6.5-SNAPSHOT.jar(org/overture/codegen/ir/declarations/AFormalParamLocalParamIR.class)]]
[loading ZipFileIndexFileObject[/var/lib/jenkins/workspace/overture-test/core/codegen/ir/target/ir-2.6.5-SNAPSHOT.jar(org/overture/codegen/ir/declarations/ANamedTypeDeclIR.class)]]
[loading ZipFileIndexFileObject[/var/lib/jenkins/workspace/overture-test/core/codegen/ir/target/ir-2.6.5-SNAPSHOT.jar(org/overture/codegen/ir/declarations/ARecordDeclIR.class)]]
[loading ZipFileIndexFileObject[/var/lib/jenkins/workspace/overture-test/core/codegen/ir/target/ir-2.6.5-SNAPSHOT.jar(org/overture/codegen/ir/declarations/ATypeDeclIR.class)]]
[loading ZipFileIndexFileObject[/var/lib/jenkins/workspace/overture-test/core/codegen/ir/target/ir-2.6.5-SNAPSHOT.jar(org/overture/codegen/ir/expressions/AApplyExpIR.class)]]
[loading ZipFileIndexFileObject[/var/lib/jenkins/workspace/overture-test/core/codegen/ir/target/ir-2.6.5-SNAPSHOT.jar(org/overture/codegen/ir/types/AMethodTypeIR.class)]]
[loading ZipFileIndexFileObject[/var/lib/jenkins/workspace/overture-test/core/codegen/ir/target/ir-2.6.5-SNAPSHOT.jar(org/overture/codegen/ir/types/AVoidTypeIR.class)]]
[loading ZipFileIndexFileObject[/var/lib/jenkins/workspace/overture-test/core/codegen/platform/target/platform-2.6.5-SNAPSHOT.jar(org/overture/codegen/merging/MergeVisitor.class)]]
[loading ZipFileIndexFileObject[/var/lib/jenkins/workspace/overture-test/core/codegen/platform/target/platform-2.6.5-SNAPSHOT.jar(org/overture/codegen/merging/TemplateCallable.class)]]
[loading ZipFileIndexFileObject[/var/lib/jenkins/workspace/overture-test/core/codegen/platform/target/platform-2.6.5-SNAPSHOT.jar(org/overture/codegen/merging/TemplateManager.class)]]
[loading ZipFileIndexFileObject[/var/lib/jenkins/workspace/overture-test/core/codegen/ir/target/ir-2.6.5-SNAPSHOT.jar(org/overture/codegen/ir/expressions/AFieldExpIR.class)]]
[loading ZipFileIndexFileObject[/var/lib/jenkins/workspace/overture-test/core/codegen/ir/target/ir-2.6.5-SNAPSHOT.jar(org/overture/codegen/ir/analysis/AnswerAdaptor.class)]]
[loading ZipFileIndexFileObject[/var/lib/jenkins/workspace/overture-test/core/codegen/ir/target/ir-2.6.5-SNAPSHOT.jar(org/overture/codegen/ir/types/ASeqSeqTypeIR.class)]]
[loading ZipFileIndexFileObject[/var/lib/jenkins/workspace/overture-test/core/codegen/ir/target/ir-2.6.5-SNAPSHOT.jar(org/overture/codegen/ir/analysis/QuestionAnswerAdaptor.class)]]
[loading ZipFileIndexFileObject[/var/lib/jenkins/workspace/overture-test/core/codegen/ir/target/ir-2.6.5-SNAPSHOT.jar(org/overture/codegen/ir/expressions/AFloorUnaryExpIR.class)]]
[loading ZipFileIndexFileObject[/var/lib/jenkins/workspace/overture-test/core/codegen/ir/target/ir-2.6.5-SNAPSHOT.jar(org/overture/codegen/ir/expressions/AMissingMemberRuntimeErrorExpIR.class)]]
[loading ZipFileIndexFileObject[/var/lib/jenkins/workspace/overture-test/core/codegen/ir/target/ir-2.6.5-SNAPSHOT.jar(org/overture/codegen/ir/expressions/AQuoteLiteralExpIR.class)]]
[loading ZipFileIndexFileObject[/var/lib/jenkins/workspace/overture-test/core/codegen/ir/target/ir-2.6.5-SNAPSHOT.jar(org/overture/codegen/ir/types/AIntNumericBasicTypeIR.class)]]
[loading ZipFileIndexFileObject[/var/lib/jenkins/workspace/overture-test/core/codegen/ir/target/ir-2.6.5-SNAPSHOT.jar(org/overture/codegen/ir/statements/AMapCompAddStmIR.class)]]
[loading ZipFileIndexFileObject[/var/lib/jenkins/workspace/overture-test/core/codegen/ir/target/ir-2.6.5-SNAPSHOT.jar(org/overture/codegen/ir/types/SMapTypeIR.class)]]
[loading ZipFileIndexFileObject[/var/lib/jenkins/workspace/overture-test/core/codegen/ir/target/ir-2.6.5-SNAPSHOT.jar(org/overture/codegen/ir/utils/PExternalType.class)]]
[loading ZipFileIndexFileObject[/var/lib/jenkins/workspace/overture-test/core/codegen/ir/target/ir-2.6.5-SNAPSHOT.jar(org/overture/codegen/ir/utils/AHeaderLetBeStIR.class)]]
[loading ZipFileIndexFileObject[/var/lib/jenkins/workspace/overture-test/core/codegen/ir/target/ir-2.6.5-SNAPSHOT.jar(org/overture/codegen/ir/patterns/ABoolPatternIR.class)]]
[loading ZipFileIndexFileObject[/var/lib/jenkins/workspace/overture-test/core/codegen/ir/target/ir-2.6.5-SNAPSHOT.jar(org/overture/codegen/ir/types/AMapMapTypeIR.class)]]
[loading ZipFileIndexFileObject[/usr/lib/jvm/java-8-oracle/lib/ct.sym(META-INF/sym/rt.jar/java/lang/Integer.class)]]
[loading ZipFileIndexFileObject[/var/lib/jenkins/workspace/overture-test/core/codegen/ir/target/ir-2.6.5-SNAPSHOT.jar(org/overture/codegen/ir/declarations/AValueExportIR.class)]]
[loading ZipFileIndexFileObject[/var/lib/jenkins/workspace/overture-test/core/codegen/ir/target/ir-2.6.5-SNAPSHOT.jar(org/overture/codegen/ir/patterns/ATypeMultipleBindIR.class)]]
[loading ZipFileIndexFileObject[/var/lib/jenkins/workspace/overture-test/core/codegen/ir/target/ir-2.6.5-SNAPSHOT.jar(org/overture/codegen/ir/expressions/ARealIsExpIR.class)]]
[loading ZipFileIndexFileObject[/var/lib/jenkins/workspace/overture-test/core/codegen/ir/target/ir-2.6.5-SNAPSHOT.jar(org/overture/codegen/ir/expressions/AAssignExpExpIR.class)]]
[loading ZipFileIndexFileObject[/usr/lib/jvm/java-8-oracle/lib/ct.sym(META-INF/sym/rt.jar/java/lang/Long.class)]]
[loading ZipFileIndexFileObject[/var/lib/jenkins/workspace/overture-test/core/codegen/ir/target/ir-2.6.5-SNAPSHOT.jar(org/overture/codegen/ir/SImportIR.class)]]
[loading ZipFileIndexFileObject[/var/lib/jenkins/workspace/overture-test/core/codegen/ir/target/ir-2.6.5-SNAPSHOT.jar(org/overture/codegen/ir/declarations/ARenamedDeclIR.class)]]
[loading ZipFileIndexFileObject[/var/lib/jenkins/workspace/overture-test/core/codegen/ir/target/ir-2.6.5-SNAPSHOT.jar(org/overture/codegen/ir/expressions/ACharLiteralExpIR.class)]]
[loading ZipFileIndexFileObject[/var/lib/jenkins/workspace/overture-test/core/codegen/ir/target/ir-2.6.5-SNAPSHOT.jar(org/overture/codegen/ir/expressions/ANotUnaryExpIR.class)]]
[loading ZipFileIndexFileObject[/var/lib/jenkins/workspace/overture-test/core/codegen/ir/target/ir-2.6.5-SNAPSHOT.jar(org/overture/codegen/ir/statements/AAssignmentStmIR.class)]]
[loading ZipFileIndexFileObject[/var/lib/jenkins/workspace/overture-test/core/codegen/ir/target/ir-2.6.5-SNAPSHOT.jar(org/overture/codegen/ir/expressions/SLiteralExpIR.class)]]
[loading ZipFileIndexFileObject[/var/lib/jenkins/workspace/overture-test/core/codegen/ir/target/ir-2.6.5-SNAPSHOT.jar(org/overture/codegen/ir/expressions/AAddrEqualsBinaryExpIR.class)]]
[loading ZipFileIndexFileObject[/var/lib/jenkins/workspace/overture-test/core/codegen/ir/target/ir-2.6.5-SNAPSHOT.jar(org/overture/codegen/ir/types/ARealBasicTypeWrappersTypeIR.class)]]
[loading ZipFileIndexFileObject[/var/lib/jenkins/workspace/overture-test/core/codegen/ir/target/ir-2.6.5-SNAPSHOT.jar(org/overture/codegen/ir/expressions/APreIncExpIR.class)]]
[loading ZipFileIndexFileObject[/var/lib/jenkins/workspace/overture-test/core/codegen/ir/target/ir-2.6.5-SNAPSHOT.jar(org/overture/codegen/ir/expressions/ARecordModExpIR.class)]]
[loading ZipFileIndexFileObject[/var/lib/jenkins/workspace/overture-test/core/codegen/ir/target/ir-2.6.5-SNAPSHOT.jar(org/overture/codegen/ir/statements/AMetaStmIR.class)]]
[loading ZipFileIndexFileObject[/var/lib/jenkins/workspace/overture-test/core/codegen/ir/target/ir-2.6.5-SNAPSHOT.jar(org/overture/codegen/ir/traces/ARepeatTraceDeclIR.class)]]
[loading ZipFileIndexFileObject[/var/lib/jenkins/workspace/overture-test/core/codegen/ir/target/ir-2.6.5-SNAPSHOT.jar(org/overture/codegen/ir/statements/AExpStmIR.class)]]
[loading ZipFileIndexFileObject[/var/lib/jenkins/workspace/overture-test/core/codegen/ir/target/ir-2.6.5-SNAPSHOT.jar(org/overture/codegen/ir/traces/AApplyExpTraceCoreDeclIR.class)]]
[loading ZipFileIndexFileObject[/var/lib/jenkins/workspace/overture-test/core/codegen/ir/target/ir-2.6.5-SNAPSHOT.jar(org/overture/codegen/ir/SExportsIR.class)]]
[loading ZipFileIndexFileObject[/var/lib/jenkins/workspace/overture-test/core/codegen/ir/target/ir-2.6.5-SNAPSHOT.jar(org/overture/codegen/ir/expressions/ASetUnionBinaryExpIR.class)]]
[loading ZipFileIndexFileObject[/var/lib/jenkins/workspace/overture-test/core/codegen/ir/target/ir-2.6.5-SNAPSHOT.jar(org/overture/codegen/ir/types/SSetTypeIR.class)]]
[loading ZipFileIndexFileObject[/var/lib/jenkins/workspace/overture-test/core/codegen/ir/target/ir-2.6.5-SNAPSHOT.jar(org/overture/codegen/ir/expressions/AIsolationUnaryExpIR.class)]]
[loading ZipFileIndexFileObject[/var/lib/jenkins/workspace/overture-test/core/codegen/ir/target/ir-2.6.5-SNAPSHOT.jar(org/overture/codegen/ir/expressions/APreCondRuntimeErrorExpIR.class)]]
[loading ZipFileIndexFileObject[/var/lib/jenkins/workspace/overture-test/core/codegen/ir/target/ir-2.6.5-SNAPSHOT.jar(org/overture/codegen/ir/expressions/AMapUnionBinaryExpIR.class)]]
[loading ZipFileIndexFileObject[/var/lib/jenkins/workspace/overture-test/core/codegen/ir/target/ir-2.6.5-SNAPSHOT.jar(org/overture/codegen/ir/expressions/APreDecExpIR.class)]]
[loading ZipFileIndexFileObject[/var/lib/jenkins/workspace/overture-test/core/codegen/ir/target/ir-2.6.5-SNAPSHOT.jar(org/overture/codegen/ir/expressions/SAltExpExpIR.class)]]
[loading ZipFileIndexFileObject[/var/lib/jenkins/workspace/overture-test/core/codegen/ir/target/ir-2.6.5-SNAPSHOT.jar(org/overture/codegen/ir/expressions/APostIncExpIR.class)]]
[loading ZipFileIndexFileObject[/var/lib/jenkins/workspace/overture-test/core/codegen/ir/target/ir-2.6.5-SNAPSHOT.jar(org/overture/codegen/ir/expressions/AElemsUnaryExpIR.class)]]
[loading ZipFileIndexFileObject[/var/lib/jenkins/workspace/overture-test/core/codegen/ir/target/ir-2.6.5-SNAPSHOT.jar(org/overture/codegen/ir/expressions/AFuncIterationBinaryExpIR.class)]]
[loading ZipFileIndexFileObject[/var/lib/jenkins/workspace/overture-test/core/codegen/ir/target/ir-2.6.5-SNAPSHOT.jar(org/overture/codegen/ir/expressions/ATimeExpIR.class)]]
[loading ZipFileIndexFileObject[/var/lib/jenkins/workspace/overture-test/core/codegen/ir/target/ir-2.6.5-SNAPSHOT.jar(org/overture/codegen/ir/types/ANatBasicTypeWrappersTypeIR.class)]]
[loading ZipFileIndexFileObject[/var/lib/jenkins/workspace/overture-test/core/codegen/ir/target/ir-2.6.5-SNAPSHOT.jar(org/overture/codegen/ir/statements/ACallObjectStmIR.class)]]
[loading ZipFileIndexFileObject[/var/lib/jenkins/workspace/overture-test/core/codegen/ir/target/ir-2.6.5-SNAPSHOT.jar(org/overture/codegen/ir/SNameIR.class)]]
[loading ZipFileIndexFileObject[/var/lib/jenkins/workspace/overture-test/core/codegen/ir/target/ir-2.6.5-SNAPSHOT.jar(org/overture/codegen/ir/declarations/SValueImportIR.class)]]
[loading ZipFileIndexFileObject[/var/lib/jenkins/workspace/overture-test/core/codegen/ir/target/ir-2.6.5-SNAPSHOT.jar(org/overture/codegen/ir/patterns/AStringPatternIR.class)]]
[loading ZipFileIndexFileObject[/var/lib/jenkins/workspace/overture-test/core/codegen/ir/target/ir-2.6.5-SNAPSHOT.jar(org/overture/codegen/ir/expressions/ASuperVarExpIR.class)]]
[loading ZipFileIndexFileObject[/var/lib/jenkins/workspace/overture-test/core/codegen/ir/target/ir-2.6.5-SNAPSHOT.jar(org/overture/codegen/ir/expressions/AAddrNotEqualsBinaryExpIR.class)]]
[loading ZipFileIndexFileObject[/var/lib/jenkins/workspace/overture-test/core/codegen/ir/target/ir-2.6.5-SNAPSHOT.jar(org/overture/codegen/ir/declarations/AInterfaceDeclIR.class)]]
[loading ZipFileIndexFileObject[/var/lib/jenkins/workspace/overture-test/core/codegen/ir/target/ir-2.6.5-SNAPSHOT.jar(org/overture/codegen/ir/statements/AApplyObjectDesignatorIR.class)]]
[loading ZipFileIndexFileObject[/var/lib/jenkins/workspace/overture-test/core/codegen/ir/target/ir-2.6.5-SNAPSHOT.jar(org/overture/codegen/ir/expressions/ANotEqualsBinaryExpIR.class)]]
[loading ZipFileIndexFileObject[/var/lib/jenkins/workspace/overture-test/core/codegen/ir/target/ir-2.6.5-SNAPSHOT.jar(org/overture/codegen/ir/expressions/ADivideNumericBinaryExpIR.class)]]
[loading ZipFileIndexFileObject[/var/lib/jenkins/workspace/overture-test/core/codegen/ir/target/ir-2.6.5-SNAPSHOT.jar(org/overture/codegen/ir/expressions/ACasesExpIR.class)]]
[loading ZipFileIndexFileObject[/var/lib/jenkins/workspace/overture-test/core/codegen/ir/target/ir-2.6.5-SNAPSHOT.jar(org/overture/codegen/ir/statements/AReturnStmIR.class)]]
[loading ZipFileIndexFileObject[/var/lib/jenkins/workspace/overture-test/core/codegen/ir/target/ir-2.6.5-SNAPSHOT.jar(org/overture/codegen/ir/name/ATypeNameIR.class)]]
[loading ZipFileIndexFileObject[/var/lib/jenkins/workspace/overture-test/core/codegen/ir/target/ir-2.6.5-SNAPSHOT.jar(org/overture/codegen/ir/expressions/ALenUnaryExpIR.class)]]
[loading ZipFileIndexFileObject[/var/lib/jenkins/workspace/overture-test/core/codegen/ir/target/ir-2.6.5-SNAPSHOT.jar(org/overture/codegen/ir/expressions/AThreadIdExpIR.class)]]
[loading ZipFileIndexFileObject[/var/lib/jenkins/workspace/overture-test/core/codegen/ir/target/ir-2.6.5-SNAPSHOT.jar(org/overture/codegen/ir/statements/ASelfObjectDesignatorIR.class)]]
[loading ZipFileIndexFileObject[/var/lib/jenkins/workspace/overture-test/core/codegen/ir/target/ir-2.6.5-SNAPSHOT.jar(org/overture/codegen/ir/statements/AForLoopStmIR.class)]]
[loading ZipFileIndexFileObject[/var/lib/jenkins/workspace/overture-test/core/codegen/ir/target/ir-2.6.5-SNAPSHOT.jar(org/overture/codegen/ir/expressions/SUnaryExpIR.class)]]
[loading ZipFileIndexFileObject[/var/lib/jenkins/workspace/overture-test/core/codegen/ir/target/ir-2.6.5-SNAPSHOT.jar(org/overture/codegen/ir/patterns/ASeqBindIR.class)]]
[loading ZipFileIndexFileObject[/var/lib/jenkins/workspace/overture-test/core/codegen/ir/target/ir-2.6.5-SNAPSHOT.jar(org/overture/codegen/ir/types/ATupleTypeIR.class)]]
[loading ZipFileIndexFileObject[/var/lib/jenkins/workspace/overture-test/core/codegen/ir/target/ir-2.6.5-SNAPSHOT.jar(org/overture/codegen/ir/expressions/AMkBasicExpIR.class)]]
[loading ZipFileIndexFileObject[/var/lib/jenkins/workspace/overture-test/core/codegen/ir/target/ir-2.6.5-SNAPSHOT.jar(org/overture/codegen/ir/expressions/SSeqExpIR.class)]]
[loading ZipFileIndexFileObject[/var/lib/jenkins/workspace/overture-test/core/codegen/ir/target/ir-2.6.5-SNAPSHOT.jar(org/overture/codegen/ir/expressions/ALetBeStNoBindingRuntimeErrorExpIR.class)]]
[loading ZipFileIndexFileObject[/var/lib/jenkins/workspace/overture-test/core/codegen/ir/target/ir-2.6.5-SNAPSHOT.jar(org/overture/codegen/ir/expressions/ADomainResToBinaryExpIR.class)]]
[loading ZipFileIndexFileObject[/var/lib/jenkins/workspace/overture-test/core/codegen/ir/target/ir-2.6.5-SNAPSHOT.jar(org/overture/codegen/ir/traces/ALetDefBindingTraceDeclIR.class)]]
[loading ZipFileIndexFileObject[/var/lib/jenkins/workspace/overture-test/core/codegen/ir/target/ir-2.6.5-SNAPSHOT.jar(org/overture/codegen/ir/statements/AContinueStmIR.class)]]
[loading ZipFileIndexFileObject[/var/lib/jenkins/workspace/overture-test/core/codegen/ir/target/ir-2.6.5-SNAPSHOT.jar(org/overture/codegen/ir/expressions/APlusNumericBinaryExpIR.class)]]
[loading ZipFileIndexFileObject[/var/lib/jenkins/workspace/overture-test/core/codegen/ir/target/ir-2.6.5-SNAPSHOT.jar(org/overture/codegen/ir/expressions/APostDecExpIR.class)]]
[loading ZipFileIndexFileObject[/var/lib/jenkins/workspace/overture-test/core/codegen/ir/target/ir-2.6.5-SNAPSHOT.jar(org/overture/codegen/ir/statements/AAbstractBodyStmIR.class)]]
[loading ZipFileIndexFileObject[/var/lib/jenkins/workspace/overture-test/core/codegen/ir/target/ir-2.6.5-SNAPSHOT.jar(org/overture/codegen/ir/expressions/SVarExpIR.class)]]
[loading ZipFileIndexFileObject[/var/lib/jenkins/workspace/overture-test/core/codegen/ir/target/ir-2.6.5-SNAPSHOT.jar(org/overture/codegen/ir/expressions/ANatIsExpIR.class)]]
[loading ZipFileIndexFileObject[/var/lib/jenkins/workspace/overture-test/core/codegen/ir/target/ir-2.6.5-SNAPSHOT.jar(org/overture/codegen/ir/declarations/ABusClassDeclIR.class)]]
[loading ZipFileIndexFileObject[/var/lib/jenkins/workspace/overture-test/core/codegen/ir/target/ir-2.6.5-SNAPSHOT.jar(org/overture/codegen/ir/statements/ALetBeStStmIR.class)]]
[loading ZipFileIndexFileObject[/var/lib/jenkins/workspace/overture-test/core/codegen/ir/target/ir-2.6.5-SNAPSHOT.jar(org/overture/codegen/ir/expressions/ADistIntersectUnaryExpIR.class)]]
[loading ZipFileIndexFileObject[/var/lib/jenkins/workspace/overture-test/core/codegen/ir/target/ir-2.6.5-SNAPSHOT.jar(org/overture/codegen/ir/expressions/SBinaryExpIR.class)]]
[loading ZipFileIndexFileObject[/var/lib/jenkins/workspace/overture-test/core/codegen/ir/target/ir-2.6.5-SNAPSHOT.jar(org/overture/codegen/ir/declarations/AValueValueImportIR.class)]]
[loading ZipFileIndexFileObject[/var/lib/jenkins/workspace/overture-test/core/codegen/ir/target/ir-2.6.5-SNAPSHOT.jar(org/overture/codegen/ir/expressions/ASetIntersectBinaryExpIR.class)]]
[loading ZipFileIndexFileObject[/var/lib/jenkins/workspace/overture-test/core/codegen/ir/target/ir-2.6.5-SNAPSHOT.jar(org/overture/codegen/ir/expressions/ASameClassExpIR.class)]]
[loading ZipFileIndexFileObject[/var/lib/jenkins/workspace/overture-test/core/codegen/ir/target/ir-2.6.5-SNAPSHOT.jar(org/overture/codegen/ir/declarations/ATypeExportIR.class)]]
[loading ZipFileIndexFileObject[/var/lib/jenkins/workspace/overture-test/core/codegen/ir/target/ir-2.6.5-SNAPSHOT.jar(org/overture/codegen/ir/expressions/ARealLiteralExpIR.class)]]
[loading ZipFileIndexFileObject[/var/lib/jenkins/workspace/overture-test/core/codegen/ir/target/ir-2.6.5-SNAPSHOT.jar(org/overture/codegen/ir/expressions/AHistoryExpIR.class)]]
[loading ZipFileIndexFileObject[/var/lib/jenkins/workspace/overture-test/core/codegen/ir/target/ir-2.6.5-SNAPSHOT.jar(org/overture/codegen/ir/declarations/AModuleDeclIR.class)]]
[loading ZipFileIndexFileObject[/var/lib/jenkins/workspace/overture-test/core/codegen/ir/target/ir-2.6.5-SNAPSHOT.jar(org/overture/codegen/ir/expressions/SQuantifierExpIR.class)]]
[loading ZipFileIndexFileObject[/var/lib/jenkins/workspace/overture-test/core/codegen/ir/target/ir-2.6.5-SNAPSHOT.jar(org/overture/codegen/ir/statements/AInvCheckStmIR.class)]]
[loading ZipFileIndexFileObject[/var/lib/jenkins/workspace/overture-test/core/codegen/ir/target/ir-2.6.5-SNAPSHOT.jar(org/overture/codegen/ir/types/AQuoteTypeIR.class)]]
[loading ZipFileIndexFileObject[/var/lib/jenkins/workspace/overture-test/core/codegen/ir/target/ir-2.6.5-SNAPSHOT.jar(org/overture/codegen/ir/types/ARatNumericBasicTypeIR.class)]]
[loading ZipFileIndexFileObject[/var/lib/jenkins/workspace/overture-test/core/codegen/ir/target/ir-2.6.5-SNAPSHOT.jar(org/overture/codegen/ir/declarations/AFromModuleImportsIR.class)]]
[loading ZipFileIndexFileObject[/var/lib/jenkins/workspace/overture-test/core/codegen/ir/target/ir-2.6.5-SNAPSHOT.jar(org/overture/codegen/ir/expressions/SRuntimeErrorExpIR.class)]]
[loading ZipFileIndexFileObject[/var/lib/jenkins/workspace/overture-test/core/codegen/ir/target/ir-2.6.5-SNAPSHOT.jar(org/overture/codegen/ir/statements/AStackDeclStmIR.class)]]
[loading ZipFileIndexFileObject[/var/lib/jenkins/workspace/overture-test/core/codegen/ir/target/ir-2.6.5-SNAPSHOT.jar(org/overture/codegen/ir/statements/ANewObjectDesignatorIR.class)]]
[loading ZipFileIndexFileObject[/var/lib/jenkins/workspace/overture-test/core/codegen/ir/target/ir-2.6.5-SNAPSHOT.jar(org/overture/codegen/ir/types/AErrorTypeIR.class)]]
[loading ZipFileIndexFileObject[/var/lib/jenkins/workspace/overture-test/core/codegen/ir/target/ir-2.6.5-SNAPSHOT.jar(org/overture/codegen/ir/traces/ABracketedExpTraceCoreDeclIR.class)]]
[loading ZipFileIndexFileObject[/var/lib/jenkins/workspace/overture-test/core/codegen/ir/target/ir-2.6.5-SNAPSHOT.jar(org/overture/codegen/ir/statements/ASkipStmIR.class)]]
[loading ZipFileIndexFileObject[/var/lib/jenkins/workspace/overture-test/core/codegen/ir/target/ir-2.6.5-SNAPSHOT.jar(org/overture/codegen/ir/expressions/APatternMatchRuntimeErrorExpIR.class)]]
[loading ZipFileIndexFileObject[/var/lib/jenkins/workspace/overture-test/core/codegen/ir/target/ir-2.6.5-SNAPSHOT.jar(org/overture/codegen/ir/declarations/AVarDeclIR.class)]]
[loading ZipFileIndexFileObject[/var/lib/jenkins/workspace/overture-test/core/codegen/ir/target/ir-2.6.5-SNAPSHOT.jar(org/overture/codegen/ir/statements/AForAllStmIR.class)]]
[loading ZipFileIndexFileObject[/var/lib/jenkins/workspace/overture-test/core/codegen/ir/target/ir-2.6.5-SNAPSHOT.jar(org/overture/codegen/ir/traces/AConcurrentExpTraceCoreDeclIR.class)]]
[loading ZipFileIndexFileObject[/var/lib/jenkins/workspace/overture-test/core/codegen/ir/target/ir-2.6.5-SNAPSHOT.jar(org/overture/codegen/ir/types/ASetSetTypeIR.class)]]
[loading ZipFileIndexFileObject[/var/lib/jenkins/workspace/overture-test/core/codegen/ir/target/ir-2.6.5-SNAPSHOT.jar(org/overture/codegen/ir/statements/ASetCompAddStmIR.class)]]
[loading ZipFileIndexFileObject[/var/lib/jenkins/workspace/overture-test/core/codegen/ir/target/ir-2.6.5-SNAPSHOT.jar(org/overture/codegen/ir/types/ARecordTypeIR.class)]]
[loading ZipFileIndexFileObject[/var/lib/jenkins/workspace/overture-test/core/codegen/ir/target/ir-2.6.5-SNAPSHOT.jar(org/overture/codegen/ir/patterns/AIntPatternIR.class)]]
[loading ZipFileIndexFileObject[/var/lib/jenkins/workspace/overture-test/core/codegen/ir/target/ir-2.6.5-SNAPSHOT.jar(org/overture/codegen/ir/types/AClassTypeIR.class)]]
[loading ZipFileIndexFileObject[/var/lib/jenkins/workspace/overture-test/core/codegen/ir/target/ir-2.6.5-SNAPSHOT.jar(org/overture/codegen/ir/statements/AAtomicStmIR.class)]]
[loading ZipFileIndexFileObject[/var/lib/jenkins/workspace/overture-test/core/codegen/ir/target/ir-2.6.5-SNAPSHOT.jar(org/overture/codegen/ir/traces/AInstanceTraceDeclIR.class)]]
[loading ZipFileIndexFileObject[/var/lib/jenkins/workspace/overture-test/core/codegen/ir/target/ir-2.6.5-SNAPSHOT.jar(org/overture/codegen/ir/statements/ACallObjectExpStmIR.class)]]
[loading ZipFileIndexFileObject[/var/lib/jenkins/workspace/overture-test/core/codegen/ir/target/ir-2.6.5-SNAPSHOT.jar(org/overture/codegen/ir/expressions/ALessNumericBinaryExpIR.class)]]
[loading ZipFileIndexFileObject[/var/lib/jenkins/workspace/overture-test/core/codegen/ir/target/ir-2.6.5-SNAPSHOT.jar(org/overture/codegen/ir/statements/AMapSeqStateDesignatorIR.class)]]
[loading ZipFileIndexFileObject[/var/lib/jenkins/workspace/overture-test/core/codegen/ir/target/ir-2.6.5-SNAPSHOT.jar(org/overture/codegen/ir/statements/AStartStmIR.class)]]
[loading ZipFileIndexFileObject[/var/lib/jenkins/workspace/overture-test/core/codegen/ir/target/ir-2.6.5-SNAPSHOT.jar(org/overture/codegen/ir/expressions/ASelfExpIR.class)]]
[loading ZipFileIndexFileObject[/var/lib/jenkins/workspace/overture-test/core/codegen/ir/target/ir-2.6.5-SNAPSHOT.jar(org/overture/codegen/ir/expressions/ANotImplementedExpIR.class)]]
[loading ZipFileIndexFileObject[/var/lib/jenkins/workspace/overture-test/core/codegen/ir/target/ir-2.6.5-SNAPSHOT.jar(org/overture/codegen/ir/expressions/AFieldNumberExpIR.class)]]
[loading ZipFileIndexFileObject[/var/lib/jenkins/workspace/overture-test/core/codegen/ir/target/ir-2.6.5-SNAPSHOT.jar(org/overture/codegen/ir/expressions/ANat1IsExpIR.class)]]
[loading ZipFileIndexFileObject[/var/lib/jenkins/workspace/overture-test/core/codegen/ir/target/ir-2.6.5-SNAPSHOT.jar(org/overture/codegen/ir/expressions/ADistMergeUnaryExpIR.class)]]
[loading ZipFileIndexFileObject[/var/lib/jenkins/workspace/overture-test/core/codegen/ir/target/ir-2.6.5-SNAPSHOT.jar(org/overture/codegen/ir/SImportsIR.class)]]
[loading ZipFileIndexFileObject[/var/lib/jenkins/workspace/overture-test/core/codegen/ir/target/ir-2.6.5-SNAPSHOT.jar(org/overture/codegen/ir/declarations/SClassDeclIR.class)]]
[loading ZipFileIndexFileObject[/var/lib/jenkins/workspace/overture-test/core/codegen/ir/target/ir-2.6.5-SNAPSHOT.jar(org/overture/codegen/ir/expressions/APowerNumericBinaryExpIR.class)]]
[loading ZipFileIndexFileObject[/var/lib/jenkins/workspace/overture-test/core/codegen/ir/target/ir-2.6.5-SNAPSHOT.jar(org/overture/codegen/ir/declarations/AMethodDeclIR.class)]]
[loading ZipFileIndexFileObject[/var/lib/jenkins/workspace/overture-test/core/codegen/ir/target/ir-2.6.5-SNAPSHOT.jar(org/overture/codegen/ir/declarations/AOperationExportIR.class)]]
[loading ZipFileIndexFileObject[/var/lib/jenkins/workspace/overture-test/core/codegen/ir/target/ir-2.6.5-SNAPSHOT.jar(org/overture/codegen/ir/expressions/APlusUnaryExpIR.class)]]
[loading ZipFileIndexFileObject[/var/lib/jenkins/workspace/overture-test/core/codegen/ir/target/ir-2.6.5-SNAPSHOT.jar(org/overture/codegen/ir/expressions/ADistConcatUnaryExpIR.class)]]
[loading ZipFileIndexFileObject[/var/lib/jenkins/workspace/overture-test/core/codegen/ir/target/ir-2.6.5-SNAPSHOT.jar(org/overture/codegen/ir/expressions/AReverseUnaryExpIR.class)]]
[loading ZipFileIndexFileObject[/var/lib/jenkins/workspace/overture-test/core/codegen/ir/target/ir-2.6.5-SNAPSHOT.jar(org/overture/codegen/ir/patterns/ASeqMultipleBindIR.class)]]
[loading ZipFileIndexFileObject[/var/lib/jenkins/workspace/overture-test/core/codegen/ir/target/ir-2.6.5-SNAPSHOT.jar(org/overture/codegen/ir/expressions/AExistsQuantifierExpIR.class)]]
[loading ZipFileIndexFileObject[/var/lib/jenkins/workspace/overture-test/core/codegen/ir/target/ir-2.6.5-SNAPSHOT.jar(org/overture/codegen/ir/expressions/ASeqToStringUnaryExpIR.class)]]
[loading ZipFileIndexFileObject[/var/lib/jenkins/workspace/overture-test/core/codegen/ir/target/ir-2.6.5-SNAPSHOT.jar(org/overture/codegen/ir/expressions/ARangeResByBinaryExpIR.class)]]
[loading ZipFileIndexFileObject[/var/lib/jenkins/workspace/overture-test/core/codegen/ir/target/ir-2.6.5-SNAPSHOT.jar(org/overture/codegen/ir/expressions/AEnumSetExpIR.class)]]
[loading ZipFileIndexFileObject[/var/lib/jenkins/workspace/overture-test/core/codegen/ir/target/ir-2.6.5-SNAPSHOT.jar(org/overture/codegen/ir/expressions/ANullExpIR.class)]]
[loading ZipFileIndexFileObject[/var/lib/jenkins/workspace/overture-test/core/codegen/ir/target/ir-2.6.5-SNAPSHOT.jar(org/overture/codegen/ir/expressions/AInSetBinaryExpIR.class)]]
[loading ZipFileIndexFileObject[/var/lib/jenkins/workspace/overture-test/core/codegen/ir/target/ir-2.6.5-SNAPSHOT.jar(org/overture/codegen/ir/declarations/APersyncDeclIR.class)]]
[loading ZipFileIndexFileObject[/var/lib/jenkins/workspace/overture-test/core/codegen/ir/target/ir-2.6.5-SNAPSHOT.jar(org/overture/codegen/ir/expressions/AIndicesUnaryExpIR.class)]]
[loading ZipFileIndexFileObject[/var/lib/jenkins/workspace/overture-test/core/codegen/ir/target/ir-2.6.5-SNAPSHOT.jar(org/overture/codegen/ir/traces/ALetBeStBindingTraceDeclIR.class)]]
[loading ZipFileIndexFileObject[/var/lib/jenkins/workspace/overture-test/core/codegen/ir/target/ir-2.6.5-SNAPSHOT.jar(org/overture/codegen/ir/expressions/ATupleCompatibilityExpIR.class)]]
[loading ZipFileIndexFileObject[/var/lib/jenkins/workspace/overture-test/core/codegen/ir/target/ir-2.6.5-SNAPSHOT.jar(org/overture/codegen/ir/types/ANat1NumericBasicTypeIR.class)]]
[loading ZipFileIndexFileObject[/var/lib/jenkins/workspace/overture-test/core/codegen/ir/target/ir-2.6.5-SNAPSHOT.jar(org/overture/codegen/ir/expressions/ACompSetExpIR.class)]]
[loading ZipFileIndexFileObject[/var/lib/jenkins/workspace/overture-test/core/codegen/ir/target/ir-2.6.5-SNAPSHOT.jar(org/overture/codegen/ir/patterns/ANullPatternIR.class)]]
[loading ZipFileIndexFileObject[/var/lib/jenkins/workspace/overture-test/core/codegen/ir/target/ir-2.6.5-SNAPSHOT.jar(org/overture/codegen/ir/types/AIntBasicTypeWrappersTypeIR.class)]]
[loading ZipFileIndexFileObject[/var/lib/jenkins/workspace/overture-test/core/codegen/ir/target/ir-2.6.5-SNAPSHOT.jar(org/overture/codegen/ir/statements/SAltStmStmIR.class)]]
[loading ZipFileIndexFileObject[/var/lib/jenkins/workspace/overture-test/core/codegen/ir/target/ir-2.6.5-SNAPSHOT.jar(org/overture/codegen/ir/expressions/AGreaterEqualNumericBinaryExpIR.class)]]
[loading ZipFileIndexFileObject[/var/lib/jenkins/workspace/overture-test/core/codegen/ir/target/ir-2.6.5-SNAPSHOT.jar(org/overture/codegen/ir/expressions/ATupleIsExpIR.class)]]
[loading ZipFileIndexFileObject[/var/lib/jenkins/workspace/overture-test/core/codegen/ir/target/ir-2.6.5-SNAPSHOT.jar(org/overture/codegen/ir/expressions/AOrBoolBinaryExpIR.class)]]
[loading ZipFileIndexFileObject[/var/lib/jenkins/workspace/overture-test/core/ast/target/ast-2.6.5-SNAPSHOT.jar(org/overture/ast/types/PType.class)]]
[loading ZipFileIndexFileObject[/var/lib/jenkins/workspace/overture-test/core/codegen/ir/target/ir-2.6.5-SNAPSHOT.jar(org/overture/codegen/ir/types/ATokenBasicTypeIR.class)]]
[loading ZipFileIndexFileObject[/var/lib/jenkins/workspace/overture-test/core/codegen/ir/target/ir-2.6.5-SNAPSHOT.jar(org/overture/codegen/ir/statements/AIncrementStmIR.class)]]
[loading ZipFileIndexFileObject[/var/lib/jenkins/workspace/overture-test/core/codegen/ir/target/ir-2.6.5-SNAPSHOT.jar(org/overture/codegen/ir/expressions/SBoolBinaryExpIR.class)]]
[loading ZipFileIndexFileObject[/var/lib/jenkins/workspace/overture-test/core/codegen/ir/target/ir-2.6.5-SNAPSHOT.jar(org/overture/codegen/ir/expressions/ATokenIsExpIR.class)]]
[loading ZipFileIndexFileObject[/var/lib/jenkins/workspace/overture-test/core/codegen/ir/target/ir-2.6.5-SNAPSHOT.jar(org/overture/codegen/ir/statements/ANonDeterministicBlockStmIR.class)]]
[loading ZipFileIndexFileObject[/var/lib/jenkins/workspace/overture-test/core/codegen/ir/target/ir-2.6.5-SNAPSHOT.jar(org/overture/codegen/ir/statements/ADecrementStmIR.class)]]
[loading ZipFileIndexFileObject[/var/lib/jenkins/workspace/overture-test/core/codegen/ir/target/ir-2.6.5-SNAPSHOT.jar(org/overture/codegen/ir/declarations/AModuleExportsIR.class)]]
[loading ZipFileIndexFileObject[/var/lib/jenkins/workspace/overture-test/core/codegen/ir/target/ir-2.6.5-SNAPSHOT.jar(org/overture/codegen/ir/statements/AIfStmIR.class)]]
[loading ZipFileIndexFileObject[/var/lib/jenkins/workspace/overture-test/core/codegen/ir/target/ir-2.6.5-SNAPSHOT.jar(org/overture/codegen/ir/expressions/AMapIterationBinaryExpIR.class)]]
[loading ZipFileIndexFileObject[/var/lib/jenkins/workspace/overture-test/core/codegen/ir/target/ir-2.6.5-SNAPSHOT.jar(org/overture/codegen/ir/utils/AInfoExternalType.class)]]
[loading ZipFileIndexFileObject[/var/lib/jenkins/workspace/overture-test/core/codegen/ir/target/ir-2.6.5-SNAPSHOT.jar(org/overture/codegen/ir/statements/ATryStmIR.class)]]
[loading ZipFileIndexFileObject[/var/lib/jenkins/workspace/overture-test/core/codegen/ir/target/ir-2.6.5-SNAPSHOT.jar(org/overture/codegen/ir/expressions/AUndefinedExpIR.class)]]
[loading ZipFileIndexFileObject[/var/lib/jenkins/workspace/overture-test/core/codegen/ir/target/ir-2.6.5-SNAPSHOT.jar(org/overture/codegen/ir/expressions/ACastUnaryExpIR.class)]]
[loading ZipFileIndexFileObject[/var/lib/jenkins/workspace/overture-test/core/codegen/ir/target/ir-2.6.5-SNAPSHOT.jar(org/overture/codegen/ir/STraceCoreDeclIR.class)]]
[loading ZipFileIndexFileObject[/var/lib/jenkins/workspace/overture-test/core/codegen/ir/target/ir-2.6.5-SNAPSHOT.jar(org/overture/codegen/ir/expressions/AAndBoolBinaryExpIR.class)]]
[loading ZipFileIndexFileObject[/var/lib/jenkins/workspace/overture-test/core/codegen/ir/target/ir-2.6.5-SNAPSHOT.jar(org/overture/codegen/ir/patterns/ASetBindIR.class)]]
[loading ZipFileIndexFileObject[/var/lib/jenkins/workspace/overture-test/core/codegen/ir/target/ir-2.6.5-SNAPSHOT.jar(org/overture/codegen/ir/types/AUnionTypeIR.class)]]
[loading ZipFileIndexFileObject[/var/lib/jenkins/workspace/overture-test/core/codegen/ir/target/ir-2.6.5-SNAPSHOT.jar(org/overture/codegen/ir/expressions/ANewExpIR.class)]]
[loading ZipFileIndexFileObject[/var/lib/jenkins/workspace/overture-test/core/codegen/ir/target/ir-2.6.5-SNAPSHOT.jar(org/overture/codegen/ir/expressions/AEqualsBinaryExpIR.class)]]
[loading ZipFileIndexFileObject[/var/lib/jenkins/workspace/overture-test/core/codegen/ir/target/ir-2.6.5-SNAPSHOT.jar(org/overture/codegen/ir/patterns/AQuotePatternIR.class)]]
[loading ZipFileIndexFileObject[/var/lib/jenkins/workspace/overture-test/core/codegen/ir/target/ir-2.6.5-SNAPSHOT.jar(org/overture/codegen/ir/declarations/AStateDeclIR.class)]]
[loading ZipFileIndexFileObject[/usr/lib/jvm/java-8-oracle/lib/ct.sym(META-INF/sym/rt.jar/java/lang/Character.class)]]
[loading ZipFileIndexFileObject[/var/lib/jenkins/workspace/overture-test/core/codegen/ir/target/ir-2.6.5-SNAPSHOT.jar(org/overture/codegen/ir/expressions/ABoolIsExpIR.class)]]
[loading ZipFileIndexFileObject[/var/lib/jenkins/workspace/overture-test/core/codegen/ir/target/ir-2.6.5-SNAPSHOT.jar(org/overture/codegen/ir/IToken.class)]]
[loading ZipFileIndexFileObject[/var/lib/jenkins/workspace/overture-test/core/codegen/ir/target/ir-2.6.5-SNAPSHOT.jar(org/overture/codegen/ir/expressions/AGreaterNumericBinaryExpIR.class)]]
[loading ZipFileIndexFileObject[/var/lib/jenkins/workspace/overture-test/core/codegen/ir/target/ir-2.6.5-SNAPSHOT.jar(org/overture/codegen/ir/declarations/AMutexSyncDeclIR.class)]]
[loading ZipFileIndexFileObject[/var/lib/jenkins/workspace/overture-test/core/codegen/ir/target/ir-2.6.5-SNAPSHOT.jar(org/overture/codegen/ir/expressions/AMethodInstantiationExpIR.class)]]
[loading ZipFileIndexFileObject[/var/lib/jenkins/workspace/overture-test/core/codegen/ir/target/ir-2.6.5-SNAPSHOT.jar(org/overture/codegen/ir/expressions/AAnonymousClassExpIR.class)]]
[loading ZipFileIndexFileObject[/var/lib/jenkins/workspace/overture-test/core/codegen/ir/target/ir-2.6.5-SNAPSHOT.jar(org/overture/codegen/ir/types/ABoolBasicTypeWrappersTypeIR.class)]]
[loading ZipFileIndexFileObject[/var/lib/jenkins/workspace/overture-test/core/codegen/ir/target/ir-2.6.5-SNAPSHOT.jar(org/overture/codegen/ir/statements/AThrowStmIR.class)]]
[loading ZipFileIndexFileObject[/var/lib/jenkins/workspace/overture-test/core/codegen/ir/target/ir-2.6.5-SNAPSHOT.jar(org/overture/codegen/ir/expressions/AMapDomainUnaryExpIR.class)]]
[loading ZipFileIndexFileObject[/var/lib/jenkins/workspace/overture-test/core/codegen/ir/target/ir-2.6.5-SNAPSHOT.jar(org/overture/codegen/ir/statements/SCallStmIR.class)]]
[loading ZipFileIndexFileObject[/var/lib/jenkins/workspace/overture-test/core/codegen/ir/target/ir-2.6.5-SNAPSHOT.jar(org/overture/codegen/ir/expressions/ATailUnaryExpIR.class)]]
[loading ZipFileIndexFileObject[/usr/lib/jvm/java-8-oracle/lib/ct.sym(META-INF/sym/rt.jar/java/util/Set.class)]]
[loading ZipFileIndexFileObject[/var/lib/jenkins/workspace/overture-test/core/codegen/ir/target/ir-2.6.5-SNAPSHOT.jar(org/overture/codegen/ir/declarations/AThreadDeclIR.class)]]
[loading ZipFileIndexFileObject[/var/lib/jenkins/workspace/overture-test/core/codegen/ir/target/ir-2.6.5-SNAPSHOT.jar(org/overture/codegen/ir/declarations/AFunctionValueImportIR.class)]]
[loading ZipFileIndexFileObject[/var/lib/jenkins/workspace/overture-test/core/codegen/ir/target/ir-2.6.5-SNAPSHOT.jar(org/overture/codegen/ir/statements/AWhileStmIR.class)]]
[loading ZipFileIndexFileObject[/var/lib/jenkins/workspace/overture-test/core/codegen/ir/target/ir-2.6.5-SNAPSHOT.jar(org/overture/codegen/ir/expressions/AModNumericBinaryExpIR.class)]]
[loading ZipFileIndexFileObject[/var/lib/jenkins/workspace/overture-test/core/codegen/ir/target/ir-2.6.5-SNAPSHOT.jar(org/overture/codegen/ir/statements/ALocalPatternAssignmentStmIR.class)]]
[loading ZipFileIndexFileObject[/var/lib/jenkins/workspace/overture-test/core/codegen/ir/target/ir-2.6.5-SNAPSHOT.jar(org/overture/codegen/ir/types/ANatNumericBasicTypeIR.class)]]
[loading ZipFileIndexFileObject[/var/lib/jenkins/workspace/overture-test/core/codegen/ir/target/ir-2.6.5-SNAPSHOT.jar(org/overture/codegen/ir/types/SSeqTypeIR.class)]]
[loading ZipFileIndexFileObject[/var/lib/jenkins/workspace/overture-test/core/codegen/ir/target/ir-2.6.5-SNAPSHOT.jar(org/overture/codegen/ir/patterns/ACharPatternIR.class)]]
[loading ZipFileIndexFileObject[/var/lib/jenkins/workspace/overture-test/core/codegen/ir/target/ir-2.6.5-SNAPSHOT.jar(org/overture/codegen/ir/types/SBasicTypeWrappersTypeIR.class)]]
[loading ZipFileIndexFileObject[/var/lib/jenkins/workspace/overture-test/core/codegen/ir/target/ir-2.6.5-SNAPSHOT.jar(org/overture/codegen/ir/expressions/AEnumMapExpIR.class)]]
[loading ZipFileIndexFileObject[/var/lib/jenkins/workspace/overture-test/core/codegen/ir/target/ir-2.6.5-SNAPSHOT.jar(org/overture/codegen/ir/statements/ASuperCallStmIR.class)]]
[loading ZipFileIndexFileObject[/usr/lib/jvm/java-8-oracle/lib/ct.sym(META-INF/sym/rt.jar/java/lang/Double.class)]]
[loading ZipFileIndexFileObject[/var/lib/jenkins/workspace/overture-test/core/codegen/ir/target/ir-2.6.5-SNAPSHOT.jar(org/overture/codegen/ir/expressions/ATernaryIfExpIR.class)]]
[loading ZipFileIndexFileObject[/var/lib/jenkins/workspace/overture-test/core/codegen/ir/target/ir-2.6.5-SNAPSHOT.jar(org/overture/codegen/ir/statements/AMapSeqUpdateStmIR.class)]]
[loading ZipFileIndexFileObject[/var/lib/jenkins/workspace/overture-test/core/codegen/ir/target/ir-2.6.5-SNAPSHOT.jar(org/overture/codegen/ir/expressions/AExists1QuantifierExpIR.class)]]
[loading ZipFileIndexFileObject[/var/lib/jenkins/workspace/overture-test/core/codegen/ir/target/ir-2.6.5-SNAPSHOT.jar(org/overture/codegen/ir/declarations/AOperationValueImportIR.class)]]
[loading ZipFileIndexFileObject[/usr/lib/jvm/java-8-oracle/lib/ct.sym(META-INF/sym/rt.jar/java/util/ArrayList.class)]]
[loading ZipFileIndexFileObject[/var/lib/jenkins/workspace/overture-test/core/codegen/ir/target/ir-2.6.5-SNAPSHOT.jar(org/overture/codegen/ir/statements/ACaseAltStmStmIR.class)]]
[loading ZipFileIndexFileObject[/var/lib/jenkins/workspace/overture-test/core/codegen/ir/target/ir-2.6.5-SNAPSHOT.jar(org/overture/codegen/ir/expressions/ABoolLiteralExpIR.class)]]
[loading ZipFileIndexFileObject[/var/lib/jenkins/workspace/overture-test/core/codegen/ir/target/ir-2.6.5-SNAPSHOT.jar(org/overture/codegen/ir/traces/ATraceDeclTermIR.class)]]
[loading ZipFileIndexFileObject[/var/lib/jenkins/workspace/overture-test/core/codegen/ir/target/ir-2.6.5-SNAPSHOT.jar(org/overture/codegen/ir/expressions/AMapSeqGetExpIR.class)]]
[loading ZipFileIndexFileObject[/var/lib/jenkins/workspace/overture-test/core/codegen/ir/target/ir-2.6.5-SNAPSHOT.jar(org/overture/codegen/ir/statements/AAssignToExpStmIR.class)]]
[loading ZipFileIndexFileObject[/var/lib/jenkins/workspace/overture-test/core/codegen/ir/target/ir-2.6.5-SNAPSHOT.jar(org/overture/codegen/ir/statements/AErrorStmIR.class)]]
[loading ZipFileIndexFileObject[/var/lib/jenkins/workspace/overture-test/core/codegen/ir/target/ir-2.6.5-SNAPSHOT.jar(org/overture/codegen/ir/patterns/ARecordPatternIR.class)]]
[loading ZipFileIndexFileObject[/var/lib/jenkins/workspace/overture-test/core/codegen/ir/target/ir-2.6.5-SNAPSHOT.jar(org/overture/codegen/ir/types/ARealNumericBasicTypeIR.class)]]
[loading ZipFileIndexFileObject[/var/lib/jenkins/workspace/overture-test/core/codegen/ir/target/ir-2.6.5-SNAPSHOT.jar(org/overture/codegen/ir/expressions/AMapletExpIR.class)]]
[loading ZipFileIndexFileObject[/var/lib/jenkins/workspace/overture-test/core/codegen/ir/target/ir-2.6.5-SNAPSHOT.jar(org/overture/codegen/ir/expressions/AStringLiteralExpIR.class)]]
[loading ZipFileIndexFileObject[/var/lib/jenkins/workspace/overture-test/core/codegen/ir/target/ir-2.6.5-SNAPSHOT.jar(org/overture/codegen/ir/STraceDeclIR.class)]]
[loading ZipFileIndexFileObject[/var/lib/jenkins/workspace/overture-test/core/codegen/ir/target/ir-2.6.5-SNAPSHOT.jar(org/overture/codegen/ir/types/AObjectTypeIR.class)]]
[loading ZipFileIndexFileObject[/var/lib/jenkins/workspace/overture-test/core/codegen/ir/target/ir-2.6.5-SNAPSHOT.jar(org/overture/codegen/ir/statements/AStartlistStmIR.class)]]
[loading ZipFileIndexFileObject[/var/lib/jenkins/workspace/overture-test/core/codegen/ir/target/ir-2.6.5-SNAPSHOT.jar(org/overture/codegen/ir/SPatternIR.class)]]
[loading ZipFileIndexFileObject[/var/lib/jenkins/workspace/overture-test/core/codegen/ir/target/ir-2.6.5-SNAPSHOT.jar(org/overture/codegen/ir/expressions/AIotaRuntimeErrorExpIR.class)]]
[loading ZipFileIndexFileObject[/var/lib/jenkins/workspace/overture-test/core/codegen/ir/target/ir-2.6.5-SNAPSHOT.jar(org/overture/codegen/ir/expressions/AIntLiteralExpIR.class)]]
[loading ZipFileIndexFileObject[/var/lib/jenkins/workspace/overture-test/core/codegen/ir/target/ir-2.6.5-SNAPSHOT.jar(org/overture/codegen/ir/patterns/ASetMultipleBindIR.class)]]
[loading ZipFileIndexFileObject[/var/lib/jenkins/workspace/overture-test/core/codegen/ir/target/ir-2.6.5-SNAPSHOT.jar(org/overture/codegen/ir/declarations/ASystemClassDeclIR.class)]]
[loading ZipFileIndexFileObject[/var/lib/jenkins/workspace/overture-test/core/codegen/ir/target/ir-2.6.5-SNAPSHOT.jar(org/overture/codegen/ir/STermIR.class)]]
[loading ZipFileIndexFileObject[/var/lib/jenkins/workspace/overture-test/core/codegen/ir/target/ir-2.6.5-SNAPSHOT.jar(org/overture/codegen/ir/statements/AIdentifierObjectDesignatorIR.class)]]
[loading ZipFileIndexFileObject[/var/lib/jenkins/workspace/overture-test/core/codegen/ir/target/ir-2.6.5-SNAPSHOT.jar(org/overture/codegen/ir/statements/AExitStmIR.class)]]
[loading ZipFileIndexFileObject[/var/lib/jenkins/workspace/overture-test/core/codegen/ir/target/ir-2.6.5-SNAPSHOT.jar(org/overture/codegen/ir/expressions/ACompBinaryExpIR.class)]]
[loading ZipFileIndexFileObject[/var/lib/jenkins/workspace/overture-test/core/codegen/ir/target/ir-2.6.5-SNAPSHOT.jar(org/overture/codegen/ir/types/AUnknownTypeIR.class)]]
[loading ZipFileIndexFileObject[/var/lib/jenkins/workspace/overture-test/core/codegen/ir/target/ir-2.6.5-SNAPSHOT.jar(org/overture/codegen/ir/expressions/AMinusUnaryExpIR.class)]]
[loading ZipFileIndexFileObject[/var/lib/jenkins/workspace/overture-test/core/codegen/ir/target/ir-2.6.5-SNAPSHOT.jar(org/overture/codegen/ir/expressions/ACompMapExpIR.class)]]
[loading ZipFileIndexFileObject[/var/lib/jenkins/workspace/overture-test/core/codegen/ir/target/ir-2.6.5-SNAPSHOT.jar(org/overture/codegen/ir/SBindIR.class)]]
[loading ZipFileIndexFileObject[/var/lib/jenkins/workspace/overture-test/core/codegen/ir/target/ir-2.6.5-SNAPSHOT.jar(org/overture/codegen/ir/declarations/AModuleImportsIR.class)]]
[loading ZipFileIndexFileObject[/var/lib/jenkins/workspace/overture-test/core/codegen/ir/target/ir-2.6.5-SNAPSHOT.jar(org/overture/codegen/ir/expressions/ARemNumericBinaryExpIR.class)]]
[loading ZipFileIndexFileObject[/var/lib/jenkins/workspace/overture-test/core/codegen/ir/target/ir-2.6.5-SNAPSHOT.jar(org/overture/codegen/ir/expressions/SSetExpIR.class)]]
[loading ZipFileIndexFileObject[/var/lib/jenkins/workspace/overture-test/core/codegen/ir/target/ir-2.6.5-SNAPSHOT.jar(org/overture/codegen/ir/expressions/ARangeResToBinaryExpIR.class)]]
[loading ZipFileIndexFileObject[/var/lib/jenkins/workspace/overture-test/core/codegen/ir/target/ir-2.6.5-SNAPSHOT.jar(org/overture/codegen/ir/expressions/AExplicitVarExpIR.class)]]
[loading ZipFileIndexFileObject[/var/lib/jenkins/workspace/overture-test/core/codegen/ir/target/ir-2.6.5-SNAPSHOT.jar(org/overture/codegen/ir/expressions/AIntIsExpIR.class)]]
[loading ZipFileIndexFileObject[/var/lib/jenkins/workspace/overture-test/core/codegen/ir/target/ir-2.6.5-SNAPSHOT.jar(org/overture/codegen/ir/statements/AFieldStateDesignatorIR.class)]]
[loading ZipFileIndexFileObject[/var/lib/jenkins/workspace/overture-test/core/codegen/ir/target/ir-2.6.5-SNAPSHOT.jar(org/overture/codegen/ir/statements/APeriodicStmIR.class)]]
[loading ZipFileIndexFileObject[/var/lib/jenkins/workspace/overture-test/core/codegen/ir/target/ir-2.6.5-SNAPSHOT.jar(org/overture/codegen/ir/types/SBasicTypeIR.class)]]
[loading ZipFileIndexFileObject[/var/lib/jenkins/workspace/overture-test/core/codegen/ir/target/ir-2.6.5-SNAPSHOT.jar(org/overture/codegen/ir/expressions/SMapExpIR.class)]]
[loading ZipFileIndexFileObject[/var/lib/jenkins/workspace/overture-test/core/codegen/ir/target/ir-2.6.5-SNAPSHOT.jar(org/overture/codegen/ir/types/ANat1BasicTypeWrappersTypeIR.class)]]
[loading ZipFileIndexFileObject[/var/lib/jenkins/workspace/overture-test/core/codegen/ir/target/ir-2.6.5-SNAPSHOT.jar(org/overture/codegen/ir/statements/APlainCallStmIR.class)]]
[loading ZipFileIndexFileObject[/var/lib/jenkins/workspace/overture-test/core/codegen/ir/target/ir-2.6.5-SNAPSHOT.jar(org/overture/codegen/ir/declarations/AAllImportIR.class)]]
[loading ZipFileIndexFileObject[/var/lib/jenkins/workspace/overture-test/core/codegen/ir/target/ir-2.6.5-SNAPSHOT.jar(org/overture/codegen/ir/statements/AElseIfStmIR.class)]]
[loading ZipFileIndexFileObject[/var/lib/jenkins/workspace/overture-test/core/codegen/ir/target/ir-2.6.5-SNAPSHOT.jar(org/overture/codegen/ir/SObjectDesignatorIR.class)]]
[loading ZipFileIndexFileObject[/var/lib/jenkins/workspace/overture-test/core/codegen/ir/target/ir-2.6.5-SNAPSHOT.jar(org/overture/codegen/ir/expressions/AAbsUnaryExpIR.class)]]
[loading ZipFileIndexFileObject[/var/lib/jenkins/workspace/overture-test/core/codegen/ir/target/ir-2.6.5-SNAPSHOT.jar(org/overture/codegen/ir/SLetBeStIR.class)]]
[loading ZipFileIndexFileObject[/var/lib/jenkins/workspace/overture-test/core/codegen/ir/target/ir-2.6.5-SNAPSHOT.jar(org/overture/codegen/ir/expressions/AExternalExpIR.class)]]
[loading ZipFileIndexFileObject[/var/lib/jenkins/workspace/overture-test/core/codegen/ir/target/ir-2.6.5-SNAPSHOT.jar(org/overture/codegen/ir/patterns/AIgnorePatternIR.class)]]
[loading ZipFileIndexFileObject[/var/lib/jenkins/workspace/overture-test/core/codegen/ir/target/ir-2.6.5-SNAPSHOT.jar(org/overture/codegen/ir/expressions/ASetDifferenceBinaryExpIR.class)]]
[loading ZipFileIndexFileObject[/var/lib/jenkins/workspace/overture-test/core/codegen/ir/target/ir-2.6.5-SNAPSHOT.jar(org/overture/codegen/ir/statements/AFieldObjectDesignatorIR.class)]]
[loading ZipFileIndexFileObject[/var/lib/jenkins/workspace/overture-test/core/codegen/ir/target/ir-2.6.5-SNAPSHOT.jar(org/overture/codegen/ir/expressions/AEnumSeqExpIR.class)]]
[loading ZipFileIndexFileObject[/var/lib/jenkins/workspace/overture-test/core/codegen/ir/target/ir-2.6.5-SNAPSHOT.jar(org/overture/codegen/ir/expressions/ACharIsExpIR.class)]]
[loading ZipFileIndexFileObject[/var/lib/jenkins/workspace/overture-test/core/codegen/ir/target/ir-2.6.5-SNAPSHOT.jar(org/overture/codegen/ir/expressions/ATimesNumericBinaryExpIR.class)]]
[loading ZipFileIndexFileObject[/var/lib/jenkins/workspace/overture-test/core/codegen/ir/target/ir-2.6.5-SNAPSHOT.jar(org/overture/codegen/ir/expressions/ACardUnaryExpIR.class)]]
[loading ZipFileIndexFileObject[/var/lib/jenkins/workspace/overture-test/core/codegen/ir/target/ir-2.6.5-SNAPSHOT.jar(org/overture/codegen/ir/expressions/ATupleExpIR.class)]]
[loading ZipFileIndexFileObject[/var/lib/jenkins/workspace/overture-test/core/codegen/ir/target/ir-2.6.5-SNAPSHOT.jar(org/overture/codegen/ir/types/SNumericBasicTypeIR.class)]]
[loading ZipFileIndexFileObject[/var/lib/jenkins/workspace/overture-test/core/codegen/ir/target/ir-2.6.5-SNAPSHOT.jar(org/overture/codegen/ir/expressions/ARatIsExpIR.class)]]
[loading ZipFileIndexFileObject[/var/lib/jenkins/workspace/overture-test/core/codegen/ir/target/ir-2.6.5-SNAPSHOT.jar(org/overture/codegen/ir/expressions/ASetProperSubsetBinaryExpIR.class)]]
[loading ZipFileIndexFileObject[/var/lib/jenkins/workspace/overture-test/core/codegen/ir/target/ir-2.6.5-SNAPSHOT.jar(org/overture/codegen/ir/expressions/AMapOverrideBinaryExpIR.class)]]
[loading ZipFileIndexFileObject[/var/lib/jenkins/workspace/overture-test/core/codegen/ir/target/ir-2.6.5-SNAPSHOT.jar(org/overture/codegen/ir/statements/ABlockStmIR.class)]]
[loading ZipFileIndexFileObject[/var/lib/jenkins/workspace/overture-test/core/codegen/ir/target/ir-2.6.5-SNAPSHOT.jar(org/overture/codegen/ir/declarations/ATypeImportIR.class)]]
[loading ZipFileIndexFileObject[/var/lib/jenkins/workspace/overture-test/core/codegen/ir/target/ir-2.6.5-SNAPSHOT.jar(org/overture/codegen/ir/statements/ACyclesStmIR.class)]]
[loading ZipFileIndexFileObject[/var/lib/jenkins/workspace/overture-test/core/codegen/ir/target/ir-2.6.5-SNAPSHOT.jar(org/overture/codegen/ir/types/ATemplateTypeIR.class)]]
[loading ZipFileIndexFileObject[/var/lib/jenkins/workspace/overture-test/core/codegen/ir/target/ir-2.6.5-SNAPSHOT.jar(org/overture/codegen/ir/statements/ASeqCompAddStmIR.class)]]
[loading ZipFileIndexFileObject[/var/lib/jenkins/workspace/overture-test/core/codegen/ir/target/ir-2.6.5-SNAPSHOT.jar(org/overture/codegen/ir/expressions/AIotaExpIR.class)]]
[loading ZipFileIndexFileObject[/var/lib/jenkins/workspace/overture-test/core/codegen/ir/target/ir-2.6.5-SNAPSHOT.jar(org/overture/codegen/ir/expressions/AForAllQuantifierExpIR.class)]]
[loading ZipFileIndexFileObject[/var/lib/jenkins/workspace/overture-test/core/codegen/ir/target/ir-2.6.5-SNAPSHOT.jar(org/overture/codegen/ir/patterns/ATypeBindIR.class)]]
[loading ZipFileIndexFileObject[/var/lib/jenkins/workspace/overture-test/core/codegen/ir/target/ir-2.6.5-SNAPSHOT.jar(org/overture/codegen/ir/declarations/ACpuClassDeclIR.class)]]
[loading ZipFileIndexFileObject[/var/lib/jenkins/workspace/overture-test/core/codegen/ir/target/ir-2.6.5-SNAPSHOT.jar(org/overture/codegen/ir/statements/ABreakStmIR.class)]]
[loading ZipFileIndexFileObject[/var/lib/jenkins/workspace/overture-test/core/codegen/ir/target/ir-2.6.5-SNAPSHOT.jar(org/overture/codegen/ir/types/AExternalTypeIR.class)]]
[loading ZipFileIndexFileObject[/var/lib/jenkins/workspace/overture-test/core/codegen/ir/target/ir-2.6.5-SNAPSHOT.jar(org/overture/codegen/ir/expressions/AMapRangeUnaryExpIR.class)]]
[loading ZipFileIndexFileObject[/var/lib/jenkins/workspace/overture-test/core/codegen/ir/target/ir-2.6.5-SNAPSHOT.jar(org/overture/codegen/ir/expressions/ADistUnionUnaryExpIR.class)]]
[loading ZipFileIndexFileObject[/var/lib/jenkins/workspace/overture-test/core/codegen/ir/target/ir-2.6.5-SNAPSHOT.jar(org/overture/codegen/ir/expressions/AMapInverseUnaryExpIR.class)]]
[loading ZipFileIndexFileObject[/var/lib/jenkins/workspace/overture-test/core/codegen/ir/target/ir-2.6.5-SNAPSHOT.jar(org/overture/codegen/ir/statements/ACasesStmIR.class)]]
[loading ZipFileIndexFileObject[/var/lib/jenkins/workspace/overture-test/core/codegen/ir/target/ir-2.6.5-SNAPSHOT.jar(org/overture/codegen/ir/expressions/AStringToSeqUnaryExpIR.class)]]
[loading ZipFileIndexFileObject[/var/lib/jenkins/workspace/overture-test/core/codegen/ir/target/ir-2.6.5-SNAPSHOT.jar(org/overture/codegen/ir/declarations/AAllExportIR.class)]]
[loading ZipFileIndexFileObject[/var/lib/jenkins/workspace/overture-test/core/codegen/ir/target/ir-2.6.5-SNAPSHOT.jar(org/overture/codegen/ir/declarations/ACatchClauseDeclIR.class)]]
[loading ZipFileIndexFileObject[/var/lib/jenkins/workspace/overture-test/core/codegen/ir/target/ir-2.6.5-SNAPSHOT.jar(org/overture/codegen/ir/patterns/AIdentifierPatternIR.class)]]
[loading ZipFileIndexFileObject[/var/lib/jenkins/workspace/overture-test/core/codegen/ir/target/ir-2.6.5-SNAPSHOT.jar(org/overture/codegen/ir/SStmIR.class)]]
[loading ZipFileIndexFileObject[/var/lib/jenkins/workspace/overture-test/core/codegen/ir/target/ir-2.6.5-SNAPSHOT.jar(org/overture/codegen/ir/name/ATokenNameIR.class)]]
[loading ZipFileIndexFileObject[/var/lib/jenkins/workspace/overture-test/core/codegen/ir/target/ir-2.6.5-SNAPSHOT.jar(org/overture/codegen/ir/expressions/APowerSetUnaryExpIR.class)]]
[loading ZipFileIndexFileObject[/var/lib/jenkins/workspace/overture-test/core/codegen/ir/target/ir-2.6.5-SNAPSHOT.jar(org/overture/codegen/ir/types/ARatBasicTypeWrappersTypeIR.class)]]
[loading ZipFileIndexFileObject[/var/lib/jenkins/workspace/overture-test/core/codegen/ir/target/ir-2.6.5-SNAPSHOT.jar(org/overture/codegen/ir/SModifierIR.class)]]
[loading ZipFileIndexFileObject[/var/lib/jenkins/workspace/overture-test/core/codegen/ir/target/ir-2.6.5-SNAPSHOT.jar(org/overture/codegen/ir/expressions/AHeadUnaryExpIR.class)]]
[loading ZipFileIndexFileObject[/var/lib/jenkins/workspace/overture-test/core/codegen/ir/target/ir-2.6.5-SNAPSHOT.jar(org/overture/codegen/ir/expressions/ASeqConcatBinaryExpIR.class)]]
[loading ZipFileIndexFileObject[/var/lib/jenkins/workspace/overture-test/core/codegen/ir/target/ir-2.6.5-SNAPSHOT.jar(org/overture/codegen/ir/statements/AIdentifierStateDesignatorIR.class)]]
[loading ZipFileIndexFileObject[/var/lib/jenkins/workspace/overture-test/core/codegen/ir/target/ir-2.6.5-SNAPSHOT.jar(org/overture/codegen/ir/expressions/ALetDefExpIR.class)]]
[loading ZipFileIndexFileObject[/var/lib/jenkins/workspace/overture-test/core/codegen/ir/target/ir-2.6.5-SNAPSHOT.jar(org/overture/codegen/ir/expressions/ARangeSetExpIR.class)]]
[loading ZipFileIndexFileObject[/var/lib/jenkins/workspace/overture-test/core/codegen/ir/target/ir-2.6.5-SNAPSHOT.jar(org/overture/codegen/ir/expressions/AXorBoolBinaryExpIR.class)]]
[loading ZipFileIndexFileObject[/var/lib/jenkins/workspace/overture-test/core/codegen/ir/target/ir-2.6.5-SNAPSHOT.jar(org/overture/codegen/ir/analysis/DepthFirstAnalysisAdaptor.class)]]
[loading ZipFileIndexFileObject[/var/lib/jenkins/workspace/overture-test/core/codegen/ir/target/ir-2.6.5-SNAPSHOT.jar(org/overture/codegen/ir/statements/AForIndexStmIR.class)]]
[loading ZipFileIndexFileObject[/var/lib/jenkins/workspace/overture-test/core/codegen/ir/target/ir-2.6.5-SNAPSHOT.jar(org/overture/codegen/ir/expressions/ASubtractNumericBinaryExpIR.class)]]
[loading ZipFileIndexFileObject[/var/lib/jenkins/workspace/overture-test/core/codegen/ir/target/ir-2.6.5-SNAPSHOT.jar(org/overture/codegen/ir/declarations/ADefaultClassDeclIR.class)]]
[loading ZipFileIndexFileObject[/var/lib/jenkins/workspace/overture-test/core/codegen/ir/target/ir-2.6.5-SNAPSHOT.jar(org/overture/codegen/ir/expressions/ALetBeStExpIR.class)]]
[loading ZipFileIndexFileObject[/var/lib/jenkins/workspace/overture-test/core/codegen/ir/target/ir-2.6.5-SNAPSHOT.jar(org/overture/codegen/ir/expressions/AIsOfClassExpIR.class)]]
[loading ZipFileIndexFileObject[/var/lib/jenkins/workspace/overture-test/core/codegen/ir/target/ir-2.6.5-SNAPSHOT.jar(org/overture/codegen/ir/expressions/ASameBaseClassExpIR.class)]]
[loading ZipFileIndexFileObject[/var/lib/jenkins/workspace/overture-test/core/codegen/ir/target/ir-2.6.5-SNAPSHOT.jar(org/overture/codegen/ir/expressions/AIdentifierVarExpIR.class)]]
[loading ZipFileIndexFileObject[/var/lib/jenkins/workspace/overture-test/core/codegen/ir/target/ir-2.6.5-SNAPSHOT.jar(org/overture/codegen/ir/expressions/ACaseAltExpExpIR.class)]]
[loading ZipFileIndexFileObject[/var/lib/jenkins/workspace/overture-test/core/codegen/ir/target/ir-2.6.5-SNAPSHOT.jar(org/overture/codegen/ir/expressions/AIntDivNumericBinaryExpIR.class)]]
[loading ZipFileIndexFileObject[/var/lib/jenkins/workspace/overture-test/core/codegen/ir/target/ir-2.6.5-SNAPSHOT.jar(org/overture/codegen/ir/expressions/ASubSeqExpIR.class)]]
[loading ZipFileIndexFileObject[/var/lib/jenkins/workspace/overture-test/core/codegen/ir/target/ir-2.6.5-SNAPSHOT.jar(org/overture/codegen/ir/expressions/AGeneralIsExpIR.class)]]
[loading ZipFileIndexFileObject[/var/lib/jenkins/workspace/overture-test/core/codegen/ir/target/ir-2.6.5-SNAPSHOT.jar(org/overture/codegen/ir/expressions/AIsOfBaseClassExpIR.class)]]
[loading ZipFileIndexFileObject[/var/lib/jenkins/workspace/overture-test/core/codegen/ir/target/ir-2.6.5-SNAPSHOT.jar(org/overture/codegen/ir/expressions/ADomainResByBinaryExpIR.class)]]
[loading ZipFileIndexFileObject[/var/lib/jenkins/workspace/overture-test/core/codegen/ir/target/ir-2.6.5-SNAPSHOT.jar(org/overture/codegen/ir/types/AStringTypeIR.class)]]
[loading ZipFileIndexFileObject[/var/lib/jenkins/workspace/overture-test/core/codegen/ir/target/ir-2.6.5-SNAPSHOT.jar(org/overture/codegen/ir/patterns/ATuplePatternIR.class)]]
[loading ZipFileIndexFileObject[/var/lib/jenkins/workspace/overture-test/core/codegen/ir/target/ir-2.6.5-SNAPSHOT.jar(org/overture/codegen/ir/expressions/ALessEqualNumericBinaryExpIR.class)]]
[loading ZipFileIndexFileObject[/var/lib/jenkins/workspace/overture-test/core/codegen/ir/target/ir-2.6.5-SNAPSHOT.jar(org/overture/codegen/ir/patterns/ARealPatternIR.class)]]
[loading ZipFileIndexFileObject[/var/lib/jenkins/workspace/overture-test/core/codegen/ir/target/ir-2.6.5-SNAPSHOT.jar(org/overture/codegen/ir/expressions/ARecordModifierIR.class)]]
[loading ZipFileIndexFileObject[/var/lib/jenkins/workspace/overture-test/core/codegen/ir/target/ir-2.6.5-SNAPSHOT.jar(org/overture/codegen/ir/SExportIR.class)]]
[loading ZipFileIndexFileObject[/var/lib/jenkins/workspace/overture-test/core/codegen/ir/target/ir-2.6.5-SNAPSHOT.jar(org/overture/codegen/ir/types/ACharBasicTypeWrappersTypeIR.class)]]
[loading ZipFileIndexFileObject[/var/lib/jenkins/workspace/overture-test/core/codegen/ir/target/ir-2.6.5-SNAPSHOT.jar(org/overture/codegen/ir/SStateDesignatorIR.class)]]
[loading ZipFileIndexFileObject[/var/lib/jenkins/workspace/overture-test/core/codegen/ir/target/ir-2.6.5-SNAPSHOT.jar(org/overture/codegen/ir/declarations/AFunctionExportIR.class)]]
[loading ZipFileIndexFileObject[/var/lib/jenkins/workspace/overture-test/core/codegen/ir/target/ir-2.6.5-SNAPSHOT.jar(org/overture/codegen/ir/types/ABoolBasicTypeIR.class)]]
[loading ZipFileIndexFileObject[/var/lib/jenkins/workspace/overture-test/core/codegen/ir/target/ir-2.6.5-SNAPSHOT.jar(org/overture/codegen/ir/types/ACharBasicTypeIR.class)]]
[loading ZipFileIndexFileObject[/var/lib/jenkins/workspace/overture-test/core/codegen/ir/target/ir-2.6.5-SNAPSHOT.jar(org/overture/codegen/ir/statements/ANotImplementedStmIR.class)]]
[loading ZipFileIndexFileObject[/var/lib/jenkins/workspace/overture-test/core/codegen/ir/target/ir-2.6.5-SNAPSHOT.jar(org/overture/codegen/ir/expressions/ATupleSizeExpIR.class)]]
[loading ZipFileIndexFileObject[/var/lib/jenkins/workspace/overture-test/core/codegen/ir/target/ir-2.6.5-SNAPSHOT.jar(org/overture/codegen/ir/statements/ARaiseErrorStmIR.class)]]
[loading ZipFileIndexFileObject[/var/lib/jenkins/workspace/overture-test/core/codegen/ir/target/ir-2.6.5-SNAPSHOT.jar(org/overture/codegen/ir/expressions/SNumericBinaryExpIR.class)]]
[loading ZipFileIndexFileObject[/var/lib/jenkins/workspace/overture-test/core/codegen/ir/target/ir-2.6.5-SNAPSHOT.jar(org/overture/codegen/ir/expressions/SIsExpIR.class)]]
[loading ZipFileIndexFileObject[/var/lib/jenkins/workspace/overture-test/core/codegen/ir/target/ir-2.6.5-SNAPSHOT.jar(org/overture/codegen/ir/expressions/ALambdaExpIR.class)]]
[loading ZipFileIndexFileObject[/var/lib/jenkins/workspace/overture-test/core/codegen/ir/target/ir-2.6.5-SNAPSHOT.jar(org/overture/codegen/ir/expressions/ASetSubsetBinaryExpIR.class)]]
[loading ZipFileIndexFileObject[/var/lib/jenkins/workspace/overture-test/core/codegen/ir/target/ir-2.6.5-SNAPSHOT.jar(org/overture/codegen/ir/expressions/ASeqModificationBinaryExpIR.class)]]
[loading ZipFileIndexFileObject[/var/lib/jenkins/workspace/overture-test/core/codegen/ir/target/ir-2.6.5-SNAPSHOT.jar(org/overture/codegen/ir/expressions/ACompSeqExpIR.class)]]
[loading ZipFileIndexFileObject[/var/lib/jenkins/workspace/overture-test/core/codegen/ir/target/ir-2.6.5-SNAPSHOT.jar(org/overture/codegen/ir/expressions/ATypeArgExpIR.class)]]
[loading ZipFileIndexFileObject[/var/lib/jenkins/workspace/overture-test/core/codegen/ir/target/ir-2.6.5-SNAPSHOT.jar(org/overture/codegen/ir/declarations/ANamedTraceDeclIR.class)]]
[loading ZipFileIndexFileObject[/var/lib/jenkins/workspace/overture-test/core/codegen/ir/target/ir-2.6.5-SNAPSHOT.jar(org/overture/codegen/ir/expressions/ADeRefExpIR.class)]]
[loading ZipFileIndexFileObject[/var/lib/jenkins/workspace/overture-test/core/codegen/ir/target/ir-2.6.5-SNAPSHOT.jar(org/overture/codegen/ir/SLocalParamIR.class)]]
[loading ZipFileIndexFileObject[/var/lib/jenkins/workspace/overture-test/core/codegen/ir/target/ir-2.6.5-SNAPSHOT.jar(org/overture/codegen/ir/statements/ADurationStmIR.class)]]
[loading ZipFileIndexFileObject[/var/lib/jenkins/workspace/overture-test/core/codegen/ir/target/ir-2.6.5-SNAPSHOT.jar(org/overture/codegen/ir/types/AInterfaceTypeIR.class)]]
[loading ZipFileIndexFileObject[/usr/lib/jvm/java-8-oracle/lib/ct.sym(META-INF/sym/rt.jar/java/util/HashSet.class)]]
[loading ZipFileIndexFileObject[/var/lib/jenkins/workspace/overture-test/.repository/org/apache/commons/commons-collections4/4.0/commons-collections4-4.0.jar(org/apache/commons/collections4/map/HashedMap.class)]]
[loading ZipFileIndexFileObject[/var/lib/jenkins/workspace/overture-test/.repository/org/jgrapht/jgrapht-core/0.9.0/jgrapht-core-0.9.0.jar(org/jgrapht/DirectedGraph.class)]]
[loading ZipFileIndexFileObject[/var/lib/jenkins/workspace/overture-test/.repository/org/jgrapht/jgrapht-core/0.9.0/jgrapht-core-0.9.0.jar(org/jgrapht/graph/DefaultDirectedGraph.class)]]
[loading ZipFileIndexFileObject[/var/lib/jenkins/workspace/overture-test/.repository/org/jgrapht/jgrapht-core/0.9.0/jgrapht-core-0.9.0.jar(org/jgrapht/graph/DefaultEdge.class)]]
[loading ZipFileIndexFileObject[/var/lib/jenkins/workspace/overture-test/.repository/org/jgrapht/jgrapht-core/0.9.0/jgrapht-core-0.9.0.jar(org/jgrapht/alg/StrongConnectivityInspector.class)]]
[loading ZipFileIndexFileObject[/var/lib/jenkins/workspace/overture-test/core/codegen/platform/target/platform-2.6.5-SNAPSHOT.jar(org/overture/codegen/trans/ITotalTransformation.class)]]
[loading ZipFileIndexFileObject[/var/lib/jenkins/workspace/overture-test/core/ast/target/ast-2.6.5-SNAPSHOT.jar(org/overture/ast/analysis/AnalysisException.class)]]
[loading ZipFileIndexFileObject[/var/lib/jenkins/workspace/overture-test/core/ast/target/ast-2.6.5-SNAPSHOT.jar(org/overture/ast/expressions/PExp.class)]]
[loading ZipFileIndexFileObject[/var/lib/jenkins/workspace/overture-test/core/codegen/platform/target/platform-2.6.5-SNAPSHOT.jar(org/overture/codegen/ir/CodeGenBase.class)]]
[loading ZipFileIndexFileObject[/var/lib/jenkins/workspace/overture-test/core/codegen/platform/target/platform-2.6.5-SNAPSHOT.jar(org/overture/codegen/ir/IRStatus.class)]]
[loading ZipFileIndexFileObject[/var/lib/jenkins/workspace/overture-test/core/codegen/platform/target/platform-2.6.5-SNAPSHOT.jar(org/overture/codegen/ir/VdmNodeInfo.class)]]
[loading ZipFileIndexFileObject[/var/lib/jenkins/workspace/overture-test/core/codegen/platform/target/platform-2.6.5-SNAPSHOT.jar(org/overture/codegen/utils/GeneratedData.class)]]
[loading ZipFileIndexFileObject[/var/lib/jenkins/workspace/overture-test/core/codegen/platform/target/platform-2.6.5-SNAPSHOT.jar(org/overture/codegen/utils/GeneratedModule.class)]]
[loading ZipFileIndexFileObject[/var/lib/jenkins/workspace/overture-test/core/codegen/platform/target/platform-2.6.5-SNAPSHOT.jar(org/overture/codegen/ir/IREventCoordinator.class)]]
[loading ZipFileIndexFileObject[/var/lib/jenkins/workspace/overture-test/core/codegen/ir/target/ir-2.6.5-SNAPSHOT.jar(org/overture/codegen/ir/analysis/QuestionAdaptor.class)]]
[loading ZipFileIndexFileObject[/var/lib/jenkins/workspace/overture-test/core/codegen/platform/target/platform-2.6.5-SNAPSHOT.jar(org/overture/codegen/ir/IRInfo.class)]]
[loading ZipFileIndexFileObject[/usr/lib/jvm/java-8-oracle/lib/ct.sym(META-INF/sym/rt.jar/java/lang/annotation/Target.class)]]
[loading ZipFileIndexFileObject[/usr/lib/jvm/java-8-oracle/lib/ct.sym(META-INF/sym/rt.jar/java/lang/annotation/ElementType.class)]]
[loading ZipFileIndexFileObject[/usr/lib/jvm/java-8-oracle/lib/ct.sym(META-INF/sym/rt.jar/java/lang/annotation/Retention.class)]]
[loading ZipFileIndexFileObject[/usr/lib/jvm/java-8-oracle/lib/ct.sym(META-INF/sym/rt.jar/java/lang/annotation/RetentionPolicy.class)]]
[loading ZipFileIndexFileObject[/usr/lib/jvm/java-8-oracle/lib/ct.sym(META-INF/sym/rt.jar/java/lang/annotation/Annotation.class)]]
[loading ZipFileIndexFileObject[/usr/lib/jvm/java-8-oracle/lib/ct.sym(META-INF/sym/rt.jar/java/lang/Override.class)]]
[checking org.overture.cgisa.isair.analysis.AnalysisIsaAdaptor]
[loading ZipFileIndexFileObject[/usr/lib/jvm/java-8-oracle/lib/ct.sym(META-INF/sym/rt.jar/java/lang/Error.class)]]
[loading ZipFileIndexFileObject[/usr/lib/jvm/java-8-oracle/lib/ct.sym(META-INF/sym/rt.jar/java/lang/Exception.class)]]
[loading ZipFileIndexFileObject[/usr/lib/jvm/java-8-oracle/lib/ct.sym(META-INF/sym/rt.jar/java/lang/Throwable.class)]]
[loading ZipFileIndexFileObject[/usr/lib/jvm/java-8-oracle/lib/ct.sym(META-INF/sym/rt.jar/java/lang/RuntimeException.class)]]
[loading ZipFileIndexFileObject[/usr/lib/jvm/java-8-oracle/lib/ct.sym(META-INF/sym/rt.jar/java/lang/AutoCloseable.class)]]
[wrote RegularFileObject[/var/lib/jenkins/workspace/overture-test/core/codegen/isagen/target/classes/org/overture/cgisa/isair/analysis/AnalysisIsaAdaptor.class]]
[checking org.overture.cgisa.isair.analysis.intf.IIsaAnalysis]
[wrote RegularFileObject[/var/lib/jenkins/workspace/overture-test/core/codegen/isagen/target/classes/org/overture/cgisa/isair/analysis/intf/IIsaAnalysis.class]]
[checking org.overture.cgisa.isair.declarations.AMrFuncGroupDeclIR]
[loading ZipFileIndexFileObject[/usr/lib/jvm/java-8-oracle/lib/ct.sym(META-INF/sym/rt.jar/java/lang/Class.class)]]
[loading ZipFileIndexFileObject[/usr/lib/jvm/java-8-oracle/lib/ct.sym(META-INF/sym/rt.jar/java/util/AbstractMap.class)]]
[loading ZipFileIndexFileObject[/usr/lib/jvm/java-8-oracle/lib/ct.sym(META-INF/sym/rt.jar/java/lang/Byte.class)]]
[loading ZipFileIndexFileObject[/usr/lib/jvm/java-8-oracle/lib/ct.sym(META-INF/sym/rt.jar/java/lang/Short.class)]]
[loading ZipFileIndexFileObject[/usr/lib/jvm/java-8-oracle/lib/ct.sym(META-INF/sym/rt.jar/java/lang/Float.class)]]
[loading ZipFileIndexFileObject[/usr/lib/jvm/java-8-oracle/lib/ct.sym(META-INF/sym/rt.jar/java/lang/Void.class)]]
[loading ZipFileIndexFileObject[/usr/lib/jvm/java-8-oracle/lib/ct.sym(META-INF/sym/rt.jar/java/lang/CharSequence.class)]]
[loading ZipFileIndexFileObject[/usr/lib/jvm/java-8-oracle/lib/ct.sym(META-INF/sym/rt.jar/java/util/Collection.class)]]
[loading ZipFileIndexFileObject[/usr/lib/jvm/java-8-oracle/lib/ct.sym(META-INF/sym/rt.jar/java/util/AbstractSequentialList.class)]]
[loading ZipFileIndexFileObject[/usr/lib/jvm/java-8-oracle/lib/ct.sym(META-INF/sym/rt.jar/java/util/AbstractList.class)]]
[loading ZipFileIndexFileObject[/usr/lib/jvm/java-8-oracle/lib/ct.sym(META-INF/sym/rt.jar/java/util/AbstractCollection.class)]]
[loading ZipFileIndexFileObject[/usr/lib/jvm/java-8-oracle/lib/ct.sym(META-INF/sym/rt.jar/java/lang/Iterable.class)]]
[loading ZipFileIndexFileObject[/usr/lib/jvm/java-8-oracle/lib/ct.sym(META-INF/sym/rt.jar/java/util/Deque.class)]]
[loading ZipFileIndexFileObject[/usr/lib/jvm/java-8-oracle/lib/ct.sym(META-INF/sym/rt.jar/java/util/Queue.class)]]
[checking org.overture.cgisa.isair.node.SIsaDeclDeclBase]
[loading ZipFileIndexFileObject[/usr/lib/jvm/java-8-oracle/lib/ct.sym(META-INF/sym/rt.jar/java/lang/StringBuilder.class)]]
[loading ZipFileIndexFileObject[/usr/lib/jvm/java-8-oracle/lib/ct.sym(META-INF/sym/rt.jar/java/lang/AbstractStringBuilder.class)]]
[loading ZipFileIndexFileObject[/usr/lib/jvm/java-8-oracle/lib/ct.sym(META-INF/sym/rt.jar/java/lang/Appendable.class)]]
[loading ZipFileIndexFileObject[/usr/lib/jvm/java-8-oracle/lib/ct.sym(META-INF/sym/rt.jar/java/lang/StringBuffer.class)]]
[wrote RegularFileObject[/var/lib/jenkins/workspace/overture-test/core/codegen/isagen/target/classes/org/overture/cgisa/isair/declarations/AMrFuncGroupDeclIR.class]]
[wrote RegularFileObject[/var/lib/jenkins/workspace/overture-test/core/codegen/isagen/target/classes/org/overture/cgisa/isair/node/SIsaDeclDeclBase.class]]
[checking org.overture.cgisa.isair.node.SIsaDeclIR]
[wrote RegularFileObject[/var/lib/jenkins/workspace/overture-test/core/codegen/isagen/target/classes/org/overture/cgisa/isair/node/SIsaDeclIR.class]]
[checking org.overture.cgisa.isair.node.PIsaIR]
[wrote RegularFileObject[/var/lib/jenkins/workspace/overture-test/core/codegen/isagen/target/classes/org/overture/cgisa/isair/node/PIsaIR.class]]
[checking org.overturetool.cgisa.IsaTranslations]
[loading ZipFileIndexFileObject[/var/lib/jenkins/workspace/overture-test/core/codegen/platform/target/platform-2.6.5-SNAPSHOT.jar(org/overture/codegen/merging/MergeCoordinator.class)]]
[loading ZipFileIndexFileObject[/usr/lib/jvm/java-8-oracle/lib/ct.sym(META-INF/sym/rt.jar/java/io/Writer.class)]]
[loading ZipFileIndexFileObject[/usr/lib/jvm/java-8-oracle/lib/ct.sym(META-INF/sym/rt.jar/java/io/Closeable.class)]]
[loading ZipFileIndexFileObject[/usr/lib/jvm/java-8-oracle/lib/ct.sym(META-INF/sym/rt.jar/java/io/Flushable.class)]]
[loading ZipFileIndexFileObject[/var/lib/jenkins/workspace/overture-test/core/codegen/ir/target/ir-2.6.5-SNAPSHOT.jar(org/overture/codegen/ir/SLocalParamIRBase.class)]]
[loading ZipFileIndexFileObject[/var/lib/jenkins/workspace/overture-test/core/ast/target/ast-2.6.5-SNAPSHOT.jar(org/overture/ast/node/INode.class)]]
[loading ZipFileIndexFileObject[/var/lib/jenkins/workspace/overture-test/core/ast/target/ast-2.6.5-SNAPSHOT.jar(org/overture/ast/definitions/SFunctionDefinitionBase.class)]]
[loading ZipFileIndexFileObject[/var/lib/jenkins/workspace/overture-test/core/ast/target/ast-2.6.5-SNAPSHOT.jar(org/overture/ast/definitions/PDefinitionBase.class)]]
[loading ZipFileIndexFileObject[/var/lib/jenkins/workspace/overture-test/core/ast/target/ast-2.6.5-SNAPSHOT.jar(org/overture/ast/node/Node.class)]]
[loading ZipFileIndexFileObject[/var/lib/jenkins/workspace/overture-test/core/ast/target/ast-2.6.5-SNAPSHOT.jar(org/overture/ast/definitions/SFunctionDefinition.class)]]
[loading ZipFileIndexFileObject[/var/lib/jenkins/workspace/overture-test/core/ast/target/ast-2.6.5-SNAPSHOT.jar(org/overture/ast/definitions/PDefinition.class)]]
[loading ZipFileIndexFileObject[/var/lib/jenkins/workspace/overture-test/core/ast/target/ast-2.6.5-SNAPSHOT.jar(org/overture/ast/patterns/APatternTypePair.class)]]
[loading ZipFileIndexFileObject[/var/lib/jenkins/workspace/overture-test/core/ast/target/ast-2.6.5-SNAPSHOT.jar(org/overture/ast/patterns/PPairBase.class)]]
[loading ZipFileIndexFileObject[/var/lib/jenkins/workspace/overture-test/core/ast/target/ast-2.6.5-SNAPSHOT.jar(org/overture/ast/patterns/PPair.class)]]
[loading ZipFileIndexFileObject[/var/lib/jenkins/workspace/overture-test/core/ast/target/ast-2.6.5-SNAPSHOT.jar(org/overture/ast/patterns/PPattern.class)]]
[loading ZipFileIndexFileObject[/usr/lib/jvm/java-8-oracle/lib/ct.sym(META-INF/sym/rt.jar/java/lang/reflect/GenericDeclaration.class)]]
[loading ZipFileIndexFileObject[/usr/lib/jvm/java-8-oracle/lib/ct.sym(META-INF/sym/rt.jar/java/lang/reflect/AnnotatedElement.class)]]
[loading ZipFileIndexFileObject[/usr/lib/jvm/java-8-oracle/lib/ct.sym(META-INF/sym/rt.jar/java/lang/reflect/Type.class)]]
[loading ZipFileIndexFileObject[/var/lib/jenkins/workspace/overture-test/core/codegen/ir/target/ir-2.6.5-SNAPSHOT.jar(org/overture/codegen/ir/STypeIRBase.class)]]
[wrote RegularFileObject[/var/lib/jenkins/workspace/overture-test/core/codegen/isagen/target/classes/org/overturetool/cgisa/IsaTranslations.class]]
[checking org.overturetool.cgisa.IsaChecks]
[loading ZipFileIndexFileObject[/var/lib/jenkins/workspace/overture-test/core/codegen/ir/target/ir-2.6.5-SNAPSHOT.jar(org/overture/codegen/ir/SExpIRBase.class)]]
[wrote RegularFileObject[/var/lib/jenkins/workspace/overture-test/core/codegen/isagen/target/classes/org/overturetool/cgisa/IsaChecks.class]]
[checking org.overture.cgisa.isair.analysis.AnswerIsaAdaptor]
[wrote RegularFileObject[/var/lib/jenkins/workspace/overture-test/core/codegen/isagen/target/classes/org/overture/cgisa/isair/analysis/AnswerIsaAdaptor.class]]
[checking org.overture.cgisa.isair.analysis.intf.IIsaAnswer]
[wrote RegularFileObject[/var/lib/jenkins/workspace/overture-test/core/codegen/isagen/target/classes/org/overture/cgisa/isair/analysis/intf/IIsaAnswer.class]]
[checking org.overturetool.cgisa.utils.IsSeqOfCharTypeVisitor]
[loading ZipFileIndexFileObject[/var/lib/jenkins/workspace/overture-test/core/codegen/ir/target/ir-2.6.5-SNAPSHOT.jar(org/overture/codegen/ir/types/SSeqTypeBase.class)]]
[wrote RegularFileObject[/var/lib/jenkins/workspace/overture-test/core/codegen/isagen/target/classes/org/overturetool/cgisa/utils/IsSeqOfCharTypeVisitor.class]]
[checking org.overture.cgisa.isair.analysis.QuestionAnswerIsaAdaptor]
[wrote RegularFileObject[/var/lib/jenkins/workspace/overture-test/core/codegen/isagen/target/classes/org/overture/cgisa/isair/analysis/QuestionAnswerIsaAdaptor.class]]
[checking org.overture.cgisa.isair.analysis.intf.IIsaQuestionAnswer]
[wrote RegularFileObject[/var/lib/jenkins/workspace/overture-test/core/codegen/isagen/target/classes/org/overture/cgisa/isair/analysis/intf/IIsaQuestionAnswer.class]]
[checking org.overture.cgisa.isair.analysis.DepthFirstAnalysisIsaAdaptor]
[loading ZipFileIndexFileObject[/var/lib/jenkins/workspace/overture-test/core/codegen/ir/target/ir-2.6.5-SNAPSHOT.jar(org/overture/codegen/ir/SImportsIRBase.class)]]
[loading ZipFileIndexFileObject[/var/lib/jenkins/workspace/overture-test/core/codegen/ir/target/ir-2.6.5-SNAPSHOT.jar(org/overture/codegen/ir/SImportIRBase.class)]]
[loading ZipFileIndexFileObject[/var/lib/jenkins/workspace/overture-test/core/codegen/ir/target/ir-2.6.5-SNAPSHOT.jar(org/overture/codegen/ir/declarations/SValueImportBase.class)]]
[loading ZipFileIndexFileObject[/var/lib/jenkins/workspace/overture-test/core/codegen/ir/target/ir-2.6.5-SNAPSHOT.jar(org/overture/codegen/ir/SNameIRBase.class)]]
[loading ZipFileIndexFileObject[/var/lib/jenkins/workspace/overture-test/core/codegen/ir/target/ir-2.6.5-SNAPSHOT.jar(org/overture/codegen/ir/SExportsIRBase.class)]]
[loading ZipFileIndexFileObject[/var/lib/jenkins/workspace/overture-test/core/codegen/ir/target/ir-2.6.5-SNAPSHOT.jar(org/overture/codegen/ir/SExportIRBase.class)]]
[loading ZipFileIndexFileObject[/var/lib/jenkins/workspace/overture-test/core/codegen/ir/target/ir-2.6.5-SNAPSHOT.jar(org/overture/codegen/ir/SPatternIRBase.class)]]
[loading ZipFileIndexFileObject[/var/lib/jenkins/workspace/overture-test/core/codegen/ir/target/ir-2.6.5-SNAPSHOT.jar(org/overture/codegen/ir/SBindIRBase.class)]]
[loading ZipFileIndexFileObject[/var/lib/jenkins/workspace/overture-test/core/codegen/ir/target/ir-2.6.5-SNAPSHOT.jar(org/overture/codegen/ir/SMultipleBindIRBase.class)]]
[loading ZipFileIndexFileObject[/var/lib/jenkins/workspace/overture-test/core/codegen/ir/target/ir-2.6.5-SNAPSHOT.jar(org/overture/codegen/ir/STermIRBase.class)]]
[loading ZipFileIndexFileObject[/var/lib/jenkins/workspace/overture-test/core/codegen/ir/target/ir-2.6.5-SNAPSHOT.jar(org/overture/codegen/ir/declarations/SClassDeclBase.class)]]
[loading ZipFileIndexFileObject[/var/lib/jenkins/workspace/overture-test/core/codegen/ir/target/ir-2.6.5-SNAPSHOT.jar(org/overture/codegen/ir/SStateDesignatorIRBase.class)]]
[loading ZipFileIndexFileObject[/var/lib/jenkins/workspace/overture-test/core/codegen/ir/target/ir-2.6.5-SNAPSHOT.jar(org/overture/codegen/ir/SObjectDesignatorIRBase.class)]]
[loading ZipFileIndexFileObject[/var/lib/jenkins/workspace/overture-test/core/codegen/ir/target/ir-2.6.5-SNAPSHOT.jar(org/overture/codegen/ir/SStmIRBase.class)]]
[loading ZipFileIndexFileObject[/var/lib/jenkins/workspace/overture-test/core/codegen/ir/target/ir-2.6.5-SNAPSHOT.jar(org/overture/codegen/ir/SLetBeStIRBase.class)]]
[loading ZipFileIndexFileObject[/var/lib/jenkins/workspace/overture-test/core/codegen/ir/target/ir-2.6.5-SNAPSHOT.jar(org/overture/codegen/ir/statements/SAltStmStmBase.class)]]
[loading ZipFileIndexFileObject[/var/lib/jenkins/workspace/overture-test/core/codegen/ir/target/ir-2.6.5-SNAPSHOT.jar(org/overture/codegen/ir/statements/SCallStmBase.class)]]
[loading ZipFileIndexFileObject[/var/lib/jenkins/workspace/overture-test/core/codegen/ir/target/ir-2.6.5-SNAPSHOT.jar(org/overture/codegen/ir/SModifierIRBase.class)]]
[loading ZipFileIndexFileObject[/var/lib/jenkins/workspace/overture-test/core/codegen/ir/target/ir-2.6.5-SNAPSHOT.jar(org/overture/codegen/ir/expressions/SAltExpExpBase.class)]]
[loading ZipFileIndexFileObject[/var/lib/jenkins/workspace/overture-test/core/codegen/ir/target/ir-2.6.5-SNAPSHOT.jar(org/overture/codegen/ir/expressions/SIsExpBase.class)]]
[loading ZipFileIndexFileObject[/var/lib/jenkins/workspace/overture-test/core/codegen/ir/target/ir-2.6.5-SNAPSHOT.jar(org/overture/codegen/ir/expressions/SRuntimeErrorExpBase.class)]]
[loading ZipFileIndexFileObject[/var/lib/jenkins/workspace/overture-test/core/codegen/ir/target/ir-2.6.5-SNAPSHOT.jar(org/overture/codegen/ir/expressions/SVarExpBase.class)]]
[loading ZipFileIndexFileObject[/var/lib/jenkins/workspace/overture-test/core/codegen/ir/target/ir-2.6.5-SNAPSHOT.jar(org/overture/codegen/ir/expressions/SLiteralExpBase.class)]]
[loading ZipFileIndexFileObject[/var/lib/jenkins/workspace/overture-test/core/codegen/ir/target/ir-2.6.5-SNAPSHOT.jar(org/overture/codegen/ir/expressions/SQuantifierExpBase.class)]]
[loading ZipFileIndexFileObject[/var/lib/jenkins/workspace/overture-test/core/codegen/ir/target/ir-2.6.5-SNAPSHOT.jar(org/overture/codegen/ir/expressions/SBinaryExpBase.class)]]
[loading ZipFileIndexFileObject[/var/lib/jenkins/workspace/overture-test/core/codegen/ir/target/ir-2.6.5-SNAPSHOT.jar(org/overture/codegen/ir/expressions/SNumericBinaryBase.class)]]
[loading ZipFileIndexFileObject[/var/lib/jenkins/workspace/overture-test/core/codegen/ir/target/ir-2.6.5-SNAPSHOT.jar(org/overture/codegen/ir/expressions/SBoolBinaryBase.class)]]
[loading ZipFileIndexFileObject[/var/lib/jenkins/workspace/overture-test/core/codegen/ir/target/ir-2.6.5-SNAPSHOT.jar(org/overture/codegen/ir/expressions/SUnaryExpBase.class)]]
[loading ZipFileIndexFileObject[/var/lib/jenkins/workspace/overture-test/core/codegen/ir/target/ir-2.6.5-SNAPSHOT.jar(org/overture/codegen/ir/expressions/SSeqExpBase.class)]]
[loading ZipFileIndexFileObject[/var/lib/jenkins/workspace/overture-test/core/codegen/ir/target/ir-2.6.5-SNAPSHOT.jar(org/overture/codegen/ir/expressions/SSetExpBase.class)]]
[loading ZipFileIndexFileObject[/var/lib/jenkins/workspace/overture-test/core/codegen/ir/target/ir-2.6.5-SNAPSHOT.jar(org/overture/codegen/ir/expressions/SMapExpBase.class)]]
[loading ZipFileIndexFileObject[/var/lib/jenkins/workspace/overture-test/core/codegen/ir/target/ir-2.6.5-SNAPSHOT.jar(org/overture/codegen/ir/utils/PExternalTypeBase.class)]]
[loading ZipFileIndexFileObject[/var/lib/jenkins/workspace/overture-test/core/codegen/ir/target/ir-2.6.5-SNAPSHOT.jar(org/overture/codegen/ir/types/SBasicTypeWrappersTypeBase.class)]]
[loading ZipFileIndexFileObject[/var/lib/jenkins/workspace/overture-test/core/codegen/ir/target/ir-2.6.5-SNAPSHOT.jar(org/overture/codegen/ir/types/SSetTypeBase.class)]]
[loading ZipFileIndexFileObject[/var/lib/jenkins/workspace/overture-test/core/codegen/ir/target/ir-2.6.5-SNAPSHOT.jar(org/overture/codegen/ir/types/SMapTypeBase.class)]]
[loading ZipFileIndexFileObject[/var/lib/jenkins/workspace/overture-test/core/codegen/ir/target/ir-2.6.5-SNAPSHOT.jar(org/overture/codegen/ir/types/SBasicTypeBase.class)]]
[loading ZipFileIndexFileObject[/var/lib/jenkins/workspace/overture-test/core/codegen/ir/target/ir-2.6.5-SNAPSHOT.jar(org/overture/codegen/ir/types/SNumericBasicBase.class)]]
[loading ZipFileIndexFileObject[/var/lib/jenkins/workspace/overture-test/core/codegen/ir/target/ir-2.6.5-SNAPSHOT.jar(org/overture/codegen/ir/STraceDeclIRBase.class)]]
[loading ZipFileIndexFileObject[/var/lib/jenkins/workspace/overture-test/core/codegen/ir/target/ir-2.6.5-SNAPSHOT.jar(org/overture/codegen/ir/STraceCoreDeclIRBase.class)]]
[wrote RegularFileObject[/var/lib/jenkins/workspace/overture-test/core/codegen/isagen/target/classes/org/overture/cgisa/isair/analysis/DepthFirstAnalysisIsaAdaptor.class]]
[checking org.overturetool.cgisa.utils.IsCharTypeVisitor]
[wrote RegularFileObject[/var/lib/jenkins/workspace/overture-test/core/codegen/isagen/target/classes/org/overturetool/cgisa/utils/IsCharTypeVisitor.class]]
[checking org.overture.cgisa.isair.node.PIsaIRBase]
[wrote RegularFileObject[/var/lib/jenkins/workspace/overture-test/core/codegen/isagen/target/classes/org/overture/cgisa/isair/node/PIsaIRBase.class]]
[checking org.overturetool.cgisa.utils.IsMethodTypeVisitor]
[wrote RegularFileObject[/var/lib/jenkins/workspace/overture-test/core/codegen/isagen/target/classes/org/overturetool/cgisa/utils/IsMethodTypeVisitor.class]]
[checking org.overturetool.cgisa.transformations.Dependencies]
[loading ZipFileIndexFileObject[/var/lib/jenkins/workspace/overture-test/.repository/org/jgrapht/jgrapht-core/0.9.0/jgrapht-core-0.9.0.jar(org/jgrapht/EdgeFactory.class)]]
[loading ZipFileIndexFileObject[/var/lib/jenkins/workspace/overture-test/.repository/org/jgrapht/jgrapht-core/0.9.0/jgrapht-core-0.9.0.jar(org/jgrapht/graph/AbstractBaseGraph.class)]]
[loading ZipFileIndexFileObject[/var/lib/jenkins/workspace/overture-test/.repository/org/jgrapht/jgrapht-core/0.9.0/jgrapht-core-0.9.0.jar(org/jgrapht/graph/AbstractGraph.class)]]
[loading ZipFileIndexFileObject[/var/lib/jenkins/workspace/overture-test/.repository/org/jgrapht/jgrapht-core/0.9.0/jgrapht-core-0.9.0.jar(org/jgrapht/Graph.class)]]
[loading ZipFileIndexFileObject[/var/lib/jenkins/workspace/overture-test/.repository/org/apache/commons/commons-collections4/4.0/commons-collections4-4.0.jar(org/apache/commons/collections4/map/AbstractHashedMap.class)]]
[loading ZipFileIndexFileObject[/usr/lib/jvm/java-8-oracle/lib/ct.sym(META-INF/sym/rt.jar/java/util/AbstractSet.class)]]
[wrote RegularFileObject[/var/lib/jenkins/workspace/overture-test/core/codegen/isagen/target/classes/org/overturetool/cgisa/transformations/Dependencies$1.class]]
[wrote RegularFileObject[/var/lib/jenkins/workspace/overture-test/core/codegen/isagen/target/classes/org/overturetool/cgisa/transformations/Dependencies.class]]
[checking org.overturetool.cgisa.transformations.GroupMutRecs]
[wrote RegularFileObject[/var/lib/jenkins/workspace/overture-test/core/codegen/isagen/target/classes/org/overturetool/cgisa/transformations/GroupMutRecs.class]]
[checking org.overturetool.cgisa.IsaGen]
[loading ZipFileIndexFileObject[/var/lib/jenkins/workspace/overture-test/core/codegen/platform/target/platform-2.6.5-SNAPSHOT.jar(org/overture/codegen/ir/IRSettings.class)]]
[loading ZipFileIndexFileObject[/var/lib/jenkins/workspace/overture-test/core/codegen/platform/target/platform-2.6.5-SNAPSHOT.jar(org/overture/codegen/utils/Generated.class)]]
[loading ZipFileIndexFileObject[/var/lib/jenkins/workspace/overture-test/core/codegen/platform/target/platform-2.6.5-SNAPSHOT.jar(org/overture/codegen/ir/IRGenerator.class)]]
[loading ZipFileIndexFileObject[/var/lib/jenkins/workspace/overture-test/core/ast/target/ast-2.6.5-SNAPSHOT.jar(org/overture/ast/analysis/intf/IQuestionAnswer.class)]]
[loading ZipFileIndexFileObject[/var/lib/jenkins/workspace/overture-test/core/ast/target/ast-2.6.5-SNAPSHOT.jar(org/overture/ast/analysis/intf/IQuestion.class)]]
[loading ZipFileIndexFileObject[/var/lib/jenkins/workspace/overture-test/core/codegen/platform/target/platform-2.6.5-SNAPSHOT.jar(org/overture/codegen/ir/IrNodeInfo.class)]]
[wrote RegularFileObject[/var/lib/jenkins/workspace/overture-test/core/codegen/isagen/target/classes/org/overturetool/cgisa/IsaGen.class]]
[checking org.overture.cgisa.isair.analysis.QuestionIsaAdaptor]
[wrote RegularFileObject[/var/lib/jenkins/workspace/overture-test/core/codegen/isagen/target/classes/org/overture/cgisa/isair/analysis/QuestionIsaAdaptor.class]]
[checking org.overture.cgisa.isair.analysis.intf.IIsaQuestion]
[wrote RegularFileObject[/var/lib/jenkins/workspace/overture-test/core/codegen/isagen/target/classes/org/overture/cgisa/isair/analysis/intf/IIsaQuestion.class]]
[checking org.overturetool.cgisa.transformations.StateInit]
[loading ZipFileIndexFileObject[/var/lib/jenkins/workspace/overture-test/core/codegen/platform/target/platform-2.6.5-SNAPSHOT.jar(org/overture/codegen/assistant/DeclAssistantIR.class)]]
[loading ZipFileIndexFileObject[/var/lib/jenkins/workspace/overture-test/core/codegen/platform/target/platform-2.6.5-SNAPSHOT.jar(org/overture/codegen/assistant/AssistantBase.class)]]
[wrote RegularFileObject[/var/lib/jenkins/workspace/overture-test/core/codegen/isagen/target/classes/org/overturetool/cgisa/transformations/StateInit.class]]
[checking org.overturetool.cgisa.transformations.SortDependencies]
[wrote RegularFileObject[/var/lib/jenkins/workspace/overture-test/core/codegen/isagen/target/classes/org/overturetool/cgisa/transformations/SortDependencies.class]]
[total 341ms]
[INFO] 
[INFO] --- maven-resources-plugin:2.7:testResources (default-testResources) @ isagen ---
[INFO] Using 'UTF-8' encoding to copy filtered resources.
[INFO] Copying 144 resources
[INFO] 
[INFO] --- maven-compiler-plugin:3.5.1:testCompile (default-testCompile) @ isagen ---
[INFO] Changes detected - recompiling the module!
[INFO] Compiling 6 source files to /var/lib/jenkins/workspace/overture-test/core/codegen/isagen/target/test-classes
[parsing started RegularFileObject[/var/lib/jenkins/workspace/overture-test/core/codegen/isagen/src/test/java/org/overturetool/cgisa/IsaGenParamTest.java]]
[parsing completed 0ms]
[parsing started RegularFileObject[/var/lib/jenkins/workspace/overture-test/core/codegen/isagen/src/test/java/org/overturetool/cgisa/AdHoc.java]]
[parsing completed 0ms]
[parsing started RegularFileObject[/var/lib/jenkins/workspace/overture-test/core/codegen/isagen/src/test/java/org/overturetool/cgisa/CgIsaTestResult.java]]
[parsing completed 0ms]
[parsing started RegularFileObject[/var/lib/jenkins/workspace/overture-test/core/codegen/isagen/src/test/java/org/overturetool/cgisa/AbsExpTest.java]]
[parsing completed 1ms]
[parsing started RegularFileObject[/var/lib/jenkins/workspace/overture-test/core/codegen/isagen/src/test/java/org/overturetool/cgisa/IsaGenFileExpTest.java]]
[parsing completed 0ms]
[parsing started RegularFileObject[/var/lib/jenkins/workspace/overture-test/core/codegen/isagen/src/test/java/org/overturetool/cgisa/IsaGenModelTest.java]]
[parsing completed 0ms]
[search path for source files: /var/lib/jenkins/workspace/overture-test/core/codegen/isagen/src/test/java,/var/lib/jenkins/workspace/overture-test/core/codegen/isagen/target/generated-test-sources/test-annotations]
[search path for class files: /usr/lib/jvm/java-8-oracle/jre/lib/resources.jar,/usr/lib/jvm/java-8-oracle/jre/lib/rt.jar,/usr/lib/jvm/java-8-oracle/jre/lib/sunrsasign.jar,/usr/lib/jvm/java-8-oracle/jre/lib/jsse.jar,/usr/lib/jvm/java-8-oracle/jre/lib/jce.jar,/usr/lib/jvm/java-8-oracle/jre/lib/charsets.jar,/usr/lib/jvm/java-8-oracle/jre/lib/jfr.jar,/usr/lib/jvm/java-8-oracle/jre/classes,/usr/lib/jvm/java-8-oracle/jre/lib/ext/jfxrt.jar,/usr/lib/jvm/java-8-oracle/jre/lib/ext/nashorn.jar,/usr/lib/jvm/java-8-oracle/jre/lib/ext/sunjce_provider.jar,/usr/lib/jvm/java-8-oracle/jre/lib/ext/sunec.jar,/usr/lib/jvm/java-8-oracle/jre/lib/ext/cldrdata.jar,/usr/lib/jvm/java-8-oracle/jre/lib/ext/sunpkcs11.jar,/usr/lib/jvm/java-8-oracle/jre/lib/ext/localedata.jar,/usr/lib/jvm/java-8-oracle/jre/lib/ext/dnsns.jar,/usr/lib/jvm/java-8-oracle/jre/lib/ext/jaccess.jar,/usr/lib/jvm/java-8-oracle/jre/lib/ext/zipfs.jar,/var/lib/jenkins/workspace/overture-test/core/codegen/isagen/target/test-classes,/var/lib/jenkins/workspace/overture-test/core/codegen/isagen/target/classes,/var/lib/jenkins/workspace/overture-test/core/ast/target/ast-2.6.5-SNAPSHOT.jar,/var/lib/jenkins/workspace/overture-test/core/codegen/platform/target/platform-2.6.5-SNAPSHOT.jar,/var/lib/jenkins/workspace/overture-test/core/parser/target/parser-2.6.5-SNAPSHOT.jar,/var/lib/jenkins/workspace/overture-test/core/typechecker/target/typechecker-2.6.5-SNAPSHOT.jar,/var/lib/jenkins/workspace/overture-test/core/interpreter/target/interpreter-2.6.5-SNAPSHOT.jar,/var/lib/jenkins/workspace/overture-test/core/pog/target/pog-2.6.5-SNAPSHOT.jar,/var/lib/jenkins/workspace/overture-test/core/prettyprinting/prettyprinter/target/prettyprinter-2.6.5-SNAPSHOT.jar,/var/lib/jenkins/workspace/overture-test/core/testframework/target/testframework-2.6.5-SNAPSHOT.jar,/var/lib/jenkins/workspace/overture-test/.repository/org/apache/velocity/velocity/1.7/velocity-1.7.jar,/var/lib/jenkins/workspace/overture-test/.repository/commons-collections/commons-collections/3.2.1/commons-collections-3.2.1.jar,/var/lib/jenkins/workspace/overture-test/.repository/commons-lang/commons-lang/2.4/commons-lang-2.4.jar,/var/lib/jenkins/workspace/overture-test/core/combinatorialtesting/ctruntime/target/ctruntime-2.6.5-SNAPSHOT.jar,/var/lib/jenkins/workspace/overture-test/core/combinatorialtesting/ctutils/target/ctutils-2.6.5-SNAPSHOT.jar,/var/lib/jenkins/workspace/overture-test/.repository/log4j/log4j/1.2.17/log4j-1.2.17.jar,/var/lib/jenkins/workspace/overture-test/core/codegen/ir/target/ir-2.6.5-SNAPSHOT.jar,/var/lib/jenkins/workspace/overture-test/core/testing/framework/target/framework-2.6.5-SNAPSHOT.jar,/var/lib/jenkins/workspace/overture-test/.repository/commons-io/commons-io/2.4/commons-io-2.4.jar,/var/lib/jenkins/workspace/overture-test/.repository/org/apache/commons/commons-collections4/4.0/commons-collections4-4.0.jar,/var/lib/jenkins/workspace/overture-test/.repository/com/google/code/gson/gson/2.2.4/gson-2.2.4.jar,/var/lib/jenkins/workspace/overture-test/.repository/junit/junit/4.11/junit-4.11.jar,/var/lib/jenkins/workspace/overture-test/.repository/org/hamcrest/hamcrest-core/1.3/hamcrest-core-1.3.jar,/var/lib/jenkins/workspace/overture-test/.repository/org/jgrapht/jgrapht-core/0.9.0/jgrapht-core-0.9.0.jar,.]
[loading ZipFileIndexFileObject[/var/lib/jenkins/workspace/overture-test/.repository/junit/junit/4.11/junit-4.11.jar(org/junit/Assert.class)]]
[loading ZipFileIndexFileObject[/usr/lib/jvm/java-8-oracle/lib/ct.sym(META-INF/sym/rt.jar/java/lang/Object.class)]]
[loading ZipFileIndexFileObject[/usr/lib/jvm/java-8-oracle/lib/ct.sym(META-INF/sym/rt.jar/java/lang/reflect/Type.class)]]
[loading ZipFileIndexFileObject[/usr/lib/jvm/java-8-oracle/lib/ct.sym(META-INF/sym/rt.jar/java/util/Arrays.class)]]
[loading ZipFileIndexFileObject[/usr/lib/jvm/java-8-oracle/lib/ct.sym(META-INF/sym/rt.jar/java/util/Collection.class)]]
[loading ZipFileIndexFileObject[/usr/lib/jvm/java-8-oracle/lib/ct.sym(META-INF/sym/rt.jar/java/util/LinkedList.class)]]
[loading ZipFileIndexFileObject[/usr/lib/jvm/java-8-oracle/lib/ct.sym(META-INF/sym/rt.jar/java/util/List.class)]]
[loading ZipFileIndexFileObject[/var/lib/jenkins/workspace/overture-test/.repository/junit/junit/4.11/junit-4.11.jar(org/junit/Assume.class)]]
[loading ZipFileIndexFileObject[/var/lib/jenkins/workspace/overture-test/.repository/junit/junit/4.11/junit-4.11.jar(org/junit/runner/RunWith.class)]]
[loading ZipFileIndexFileObject[/var/lib/jenkins/workspace/overture-test/.repository/junit/junit/4.11/junit-4.11.jar(org/junit/runners/Parameterized.class)]]
[loading ZipFileIndexFileObject[/var/lib/jenkins/workspace/overture-test/.repository/junit/junit/4.11/junit-4.11.jar(org/junit/runners/Parameterized$Parameters.class)]]
[loading ZipFileIndexFileObject[/var/lib/jenkins/workspace/overture-test/core/ast/target/ast-2.6.5-SNAPSHOT.jar(org/overture/ast/analysis/AnalysisException.class)]]
[loading ZipFileIndexFileObject[/var/lib/jenkins/workspace/overture-test/core/ast/target/ast-2.6.5-SNAPSHOT.jar(org/overture/ast/modules/AModuleModules.class)]]
[loading ZipFileIndexFileObject[/var/lib/jenkins/workspace/overture-test/core/ast/target/ast-2.6.5-SNAPSHOT.jar(org/overture/ast/node/INode.class)]]
[loading ZipFileIndexFileObject[/var/lib/jenkins/workspace/overture-test/core/codegen/platform/target/platform-2.6.5-SNAPSHOT.jar(org/overture/codegen/utils/GeneratedData.class)]]
[loading ZipFileIndexFileObject[/var/lib/jenkins/workspace/overture-test/core/codegen/platform/target/platform-2.6.5-SNAPSHOT.jar(org/overture/codegen/utils/GeneratedModule.class)]]
[loading ZipFileIndexFileObject[/var/lib/jenkins/workspace/overture-test/core/testing/framework/target/framework-2.6.5-SNAPSHOT.jar(org/overture/core/testing/ParamStandardTest.class)]]
[loading ZipFileIndexFileObject[/var/lib/jenkins/workspace/overture-test/core/testing/framework/target/framework-2.6.5-SNAPSHOT.jar(org/overture/core/testing/PathsProvider.class)]]
[loading ZipFileIndexFileObject[/var/lib/jenkins/workspace/overture-test/.repository/com/google/code/gson/gson/2.2.4/gson-2.2.4.jar(com/google/gson/reflect/TypeToken.class)]]
[loading ZipFileIndexFileObject[/var/lib/jenkins/workspace/overture-test/core/testing/framework/target/framework-2.6.5-SNAPSHOT.jar(org/overture/core/testing/AbsResultTest.class)]]
[loading ZipFileIndexFileObject[/usr/lib/jvm/java-8-oracle/lib/ct.sym(META-INF/sym/rt.jar/java/lang/String.class)]]
[loading ZipFileIndexFileObject[/usr/lib/jvm/java-8-oracle/lib/ct.sym(META-INF/sym/rt.jar/java/io/File.class)]]
[loading ZipFileIndexFileObject[/usr/lib/jvm/java-8-oracle/lib/ct.sym(META-INF/sym/rt.jar/java/util/Set.class)]]
[loading ZipFileIndexFileObject[/var/lib/jenkins/workspace/overture-test/.repository/junit/junit/4.11/junit-4.11.jar(org/junit/Test.class)]]
[loading ZipFileIndexFileObject[/var/lib/jenkins/workspace/overture-test/core/ast/target/ast-2.6.5-SNAPSHOT.jar(org/overture/ast/lex/Dialect.class)]]
[loading ZipFileIndexFileObject[/var/lib/jenkins/workspace/overture-test/core/codegen/platform/target/platform-2.6.5-SNAPSHOT.jar(org/overture/codegen/ir/IrNodeInfo.class)]]
[loading ZipFileIndexFileObject[/var/lib/jenkins/workspace/overture-test/core/codegen/platform/target/platform-2.6.5-SNAPSHOT.jar(org/overture/codegen/printer/MsgPrinter.class)]]
[loading ZipFileIndexFileObject[/var/lib/jenkins/workspace/overture-test/core/codegen/platform/target/platform-2.6.5-SNAPSHOT.jar(org/overture/codegen/utils/GeneralCodeGenUtils.class)]]
[loading ZipFileIndexFileObject[/var/lib/jenkins/workspace/overture-test/core/testing/framework/target/framework-2.6.5-SNAPSHOT.jar(org/overture/core/testing/ParseTcFacade.class)]]
[loading ZipFileIndexFileObject[/var/lib/jenkins/workspace/overture-test/core/codegen/ir/target/ir-2.6.5-SNAPSHOT.jar(org/overture/codegen/ir/analysis/AnalysisException.class)]]
[loading ZipFileIndexFileObject[/var/lib/jenkins/workspace/overture-test/core/ast/target/ast-2.6.5-SNAPSHOT.jar(org/overture/ast/expressions/PExp.class)]]
[loading ZipFileIndexFileObject[/usr/lib/jvm/java-8-oracle/lib/ct.sym(META-INF/sym/rt.jar/java/io/IOException.class)]]
[loading ZipFileIndexFileObject[/var/lib/jenkins/workspace/overture-test/.repository/commons-io/commons-io/2.4/commons-io-2.4.jar(org/apache/commons/io/FileUtils.class)]]
[loading ZipFileIndexFileObject[/var/lib/jenkins/workspace/overture-test/core/testing/framework/target/framework-2.6.5-SNAPSHOT.jar(org/overture/core/testing/ParamFineGrainTest.class)]]
[loading ZipFileIndexFileObject[/var/lib/jenkins/workspace/overture-test/.repository/junit/junit/4.11/junit-4.11.jar(org/junit/Ignore.class)]]
[loading ZipFileIndexFileObject[/usr/lib/jvm/java-8-oracle/lib/ct.sym(META-INF/sym/rt.jar/java/lang/annotation/Retention.class)]]
[loading ZipFileIndexFileObject[/usr/lib/jvm/java-8-oracle/lib/ct.sym(META-INF/sym/rt.jar/java/lang/annotation/RetentionPolicy.class)]]
[loading ZipFileIndexFileObject[/usr/lib/jvm/java-8-oracle/lib/ct.sym(META-INF/sym/rt.jar/java/lang/annotation/Target.class)]]
[loading ZipFileIndexFileObject[/usr/lib/jvm/java-8-oracle/lib/ct.sym(META-INF/sym/rt.jar/java/lang/annotation/ElementType.class)]]
[loading ZipFileIndexFileObject[/usr/lib/jvm/java-8-oracle/lib/ct.sym(META-INF/sym/rt.jar/java/lang/annotation/Annotation.class)]]
[loading ZipFileIndexFileObject[/usr/lib/jvm/java-8-oracle/lib/ct.sym(META-INF/sym/rt.jar/java/lang/Class.class)]]
[loading ZipFileIndexFileObject[/var/lib/jenkins/workspace/overture-test/.repository/junit/junit/4.11/junit-4.11.jar(org/junit/runners/Suite.class)]]
[loading ZipFileIndexFileObject[/var/lib/jenkins/workspace/overture-test/.repository/junit/junit/4.11/junit-4.11.jar(org/junit/runners/ParentRunner.class)]]
[loading ZipFileIndexFileObject[/usr/lib/jvm/java-8-oracle/lib/ct.sym(META-INF/sym/rt.jar/java/lang/Override.class)]]
[checking org.overturetool.cgisa.IsaGenParamTest]
[loading ZipFileIndexFileObject[/usr/lib/jvm/java-8-oracle/lib/ct.sym(META-INF/sym/rt.jar/java/io/Serializable.class)]]
[loading ZipFileIndexFileObject[/var/lib/jenkins/workspace/overture-test/core/parser/target/parser-2.6.5-SNAPSHOT.jar(org/overture/parser/syntax/ParserException.class)]]
[loading ZipFileIndexFileObject[/var/lib/jenkins/workspace/overture-test/core/parser/target/parser-2.6.5-SNAPSHOT.jar(org/overture/parser/lex/LexException.class)]]
[loading ZipFileIndexFileObject[/usr/lib/jvm/java-8-oracle/lib/ct.sym(META-INF/sym/rt.jar/java/io/FileNotFoundException.class)]]
[loading ZipFileIndexFileObject[/usr/lib/jvm/java-8-oracle/lib/ct.sym(META-INF/sym/rt.jar/java/lang/AutoCloseable.class)]]
[loading ZipFileIndexFileObject[/usr/lib/jvm/java-8-oracle/lib/ct.sym(META-INF/sym/rt.jar/java/lang/Byte.class)]]
[loading ZipFileIndexFileObject[/usr/lib/jvm/java-8-oracle/lib/ct.sym(META-INF/sym/rt.jar/java/lang/Character.class)]]
[loading ZipFileIndexFileObject[/usr/lib/jvm/java-8-oracle/lib/ct.sym(META-INF/sym/rt.jar/java/lang/Short.class)]]
[loading ZipFileIndexFileObject[/usr/lib/jvm/java-8-oracle/lib/ct.sym(META-INF/sym/rt.jar/java/lang/Long.class)]]
[loading ZipFileIndexFileObject[/usr/lib/jvm/java-8-oracle/lib/ct.sym(META-INF/sym/rt.jar/java/lang/Float.class)]]
[loading ZipFileIndexFileObject[/usr/lib/jvm/java-8-oracle/lib/ct.sym(META-INF/sym/rt.jar/java/lang/Integer.class)]]
[loading ZipFileIndexFileObject[/usr/lib/jvm/java-8-oracle/lib/ct.sym(META-INF/sym/rt.jar/java/lang/Double.class)]]
[loading ZipFileIndexFileObject[/usr/lib/jvm/java-8-oracle/lib/ct.sym(META-INF/sym/rt.jar/java/lang/Boolean.class)]]
[loading ZipFileIndexFileObject[/usr/lib/jvm/java-8-oracle/lib/ct.sym(META-INF/sym/rt.jar/java/lang/Void.class)]]
[loading RegularFileObject[/var/lib/jenkins/workspace/overture-test/core/codegen/isagen/target/classes/org/overturetool/cgisa/IsaGen.class]]
[loading ZipFileIndexFileObject[/var/lib/jenkins/workspace/overture-test/core/codegen/platform/target/platform-2.6.5-SNAPSHOT.jar(org/overture/codegen/ir/CodeGenBase.class)]]
[loading ZipFileIndexFileObject[/var/lib/jenkins/workspace/overture-test/core/codegen/platform/target/platform-2.6.5-SNAPSHOT.jar(org/overture/codegen/ir/IREventCoordinator.class)]]
[loading ZipFileIndexFileObject[/usr/lib/jvm/java-8-oracle/lib/ct.sym(META-INF/sym/rt.jar/java/lang/Exception.class)]]
[loading ZipFileIndexFileObject[/usr/lib/jvm/java-8-oracle/lib/ct.sym(META-INF/sym/rt.jar/java/lang/Throwable.class)]]
[loading ZipFileIndexFileObject[/usr/lib/jvm/java-8-oracle/lib/ct.sym(META-INF/sym/rt.jar/java/lang/Comparable.class)]]
[loading ZipFileIndexFileObject[/usr/lib/jvm/java-8-oracle/lib/ct.sym(META-INF/sym/rt.jar/java/lang/CharSequence.class)]]
[loading ZipFileIndexFileObject[/usr/lib/jvm/java-8-oracle/lib/ct.sym(META-INF/sym/rt.jar/java/util/AbstractSequentialList.class)]]
[loading ZipFileIndexFileObject[/usr/lib/jvm/java-8-oracle/lib/ct.sym(META-INF/sym/rt.jar/java/util/AbstractList.class)]]
[loading ZipFileIndexFileObject[/usr/lib/jvm/java-8-oracle/lib/ct.sym(META-INF/sym/rt.jar/java/util/AbstractCollection.class)]]
[loading ZipFileIndexFileObject[/usr/lib/jvm/java-8-oracle/lib/ct.sym(META-INF/sym/rt.jar/java/lang/Iterable.class)]]
[loading ZipFileIndexFileObject[/var/lib/jenkins/workspace/overture-test/core/ast/target/ast-2.6.5-SNAPSHOT.jar(org/overture/ast/modules/PModulesBase.class)]]
[loading ZipFileIndexFileObject[/var/lib/jenkins/workspace/overture-test/core/ast/target/ast-2.6.5-SNAPSHOT.jar(org/overture/ast/node/Node.class)]]
[loading ZipFileIndexFileObject[/var/lib/jenkins/workspace/overture-test/core/codegen/platform/target/platform-2.6.5-SNAPSHOT.jar(org/overture/codegen/utils/Generated.class)]]
[loading ZipFileIndexFileObject[/usr/lib/jvm/java-8-oracle/lib/ct.sym(META-INF/sym/rt.jar/java/lang/StringBuilder.class)]]
[loading ZipFileIndexFileObject[/usr/lib/jvm/java-8-oracle/lib/ct.sym(META-INF/sym/rt.jar/java/lang/StringBuffer.class)]]
[loading ZipFileIndexFileObject[/usr/lib/jvm/java-8-oracle/lib/ct.sym(META-INF/sym/rt.jar/java/lang/AbstractStringBuilder.class)]]
[loading ZipFileIndexFileObject[/usr/lib/jvm/java-8-oracle/lib/ct.sym(META-INF/sym/rt.jar/java/lang/Appendable.class)]]
[loading ZipFileIndexFileObject[/var/lib/jenkins/workspace/overture-test/core/codegen/platform/target/platform-2.6.5-SNAPSHOT.jar(org/overture/codegen/ir/VdmNodeInfo.class)]]
[loading ZipFileIndexFileObject[/usr/lib/jvm/java-8-oracle/lib/ct.sym(META-INF/sym/rt.jar/java/lang/Error.class)]]
[loading ZipFileIndexFileObject[/usr/lib/jvm/java-8-oracle/lib/ct.sym(META-INF/sym/rt.jar/java/lang/RuntimeException.class)]]
[loading ZipFileIndexFileObject[/usr/lib/jvm/java-8-oracle/lib/ct.sym(META-INF/sym/rt.jar/java/util/Iterator.class)]]
[wrote RegularFileObject[/var/lib/jenkins/workspace/overture-test/core/codegen/isagen/target/test-classes/org/overturetool/cgisa/IsaGenParamTest$1.class]]
[wrote RegularFileObject[/var/lib/jenkins/workspace/overture-test/core/codegen/isagen/target/test-classes/org/overturetool/cgisa/IsaGenParamTest.class]]
[checking org.overturetool.cgisa.CgIsaTestResult]
[wrote RegularFileObject[/var/lib/jenkins/workspace/overture-test/core/codegen/isagen/target/test-classes/org/overturetool/cgisa/CgIsaTestResult.class]]
[checking org.overturetool.cgisa.AdHoc]
[loading ZipFileIndexFileObject[/usr/lib/jvm/java-8-oracle/lib/ct.sym(META-INF/sym/rt.jar/java/net/URI.class)]]
[loading ZipFileIndexFileObject[/var/lib/jenkins/workspace/overture-test/core/codegen/platform/target/platform-2.6.5-SNAPSHOT.jar(org/overture/codegen/printer/AbstractPrinter.class)]]
[loading ZipFileIndexFileObject[/usr/lib/jvm/java-8-oracle/lib/ct.sym(META-INF/sym/rt.jar/java/util/Locale.class)]]
[loading ZipFileIndexFileObject[/var/lib/jenkins/workspace/overture-test/core/parser/target/parser-2.6.5-SNAPSHOT.jar(org/overture/parser/messages/LocatedException.class)]]
[loading ZipFileIndexFileObject[/var/lib/jenkins/workspace/overture-test/core/parser/target/parser-2.6.5-SNAPSHOT.jar(org/overture/parser/messages/NumberedException.class)]]
[wrote RegularFileObject[/var/lib/jenkins/workspace/overture-test/core/codegen/isagen/target/test-classes/org/overturetool/cgisa/AdHoc.class]]
[checking org.overturetool.cgisa.AbsExpTest]
[wrote RegularFileObject[/var/lib/jenkins/workspace/overture-test/core/codegen/isagen/target/test-classes/org/overturetool/cgisa/AbsExpTest.class]]
[checking org.overturetool.cgisa.IsaGenFileExpTest]
[wrote RegularFileObject[/var/lib/jenkins/workspace/overture-test/core/codegen/isagen/target/test-classes/org/overturetool/cgisa/IsaGenFileExpTest$1.class]]
[wrote RegularFileObject[/var/lib/jenkins/workspace/overture-test/core/codegen/isagen/target/test-classes/org/overturetool/cgisa/IsaGenFileExpTest.class]]
[checking org.overturetool.cgisa.IsaGenModelTest]
[wrote RegularFileObject[/var/lib/jenkins/workspace/overture-test/core/codegen/isagen/target/test-classes/org/overturetool/cgisa/IsaGenModelTest.class]]
[total 54ms]
[INFO] 
[INFO] --- maven-surefire-plugin:2.19.1:test (default-test) @ isagen ---

-------------------------------------------------------
 T E S T S
-------------------------------------------------------
Running org.overturetool.cgisa.IsaGenFileExpTest
Tests run: 24, Failures: 0, Errors: 0, Skipped: 0, Time elapsed: 2.038 sec - in org.overturetool.cgisa.IsaGenFileExpTest
Running org.overturetool.cgisa.IsaGenModelTest
Tests run: 1, Failures: 0, Errors: 0, Skipped: 1, Time elapsed: 0 sec - in org.overturetool.cgisa.IsaGenModelTest
Running org.overturetool.cgisa.IsaGenParamTest
Tests run: 48, Failures: 0, Errors: 0, Skipped: 2, Time elapsed: 0.573 sec - in org.overturetool.cgisa.IsaGenParamTest

Results :

Tests run: 73, Failures: 0, Errors: 0, Skipped: 3

[JENKINS] Recording test results
[INFO] 
[INFO] --- maven-jar-plugin:2.6:jar (default-jar) @ isagen ---
[INFO] Building jar: /var/lib/jenkins/workspace/overture-test/core/codegen/isagen/target/isagen-2.6.5-SNAPSHOT.jar
[INFO] 
[INFO] --- jacoco-maven-plugin:0.7.6.201602180812:report (jacoco-site) @ isagen ---
[INFO] Analyzed bundle 'The VDM to Isabelle Translator' with 19 classes
[INFO] 
[INFO] --- maven-javadoc-plugin:2.10.3:jar (attach-javadocs) @ isagen ---
[INFO] 
4 warnings
[WARNING] Javadoc Warnings
[WARNING] /var/lib/jenkins/workspace/overture-test/core/codegen/isagen/src/main/java/org/overturetool/cgisa/transformations/GroupMutRecs.java:28: error: package org.overture.cgisa.isair.analysis does not exist
[WARNING] import org.overture.cgisa.isair.analysis.DepthFirstAnalysisIsaAdaptor;
[WARNING] ^
[WARNING] /var/lib/jenkins/workspace/overture-test/core/codegen/isagen/src/main/java/org/overturetool/cgisa/transformations/GroupMutRecs.java:29: error: package org.overture.cgisa.isair.declarations does not exist
[WARNING] import org.overture.cgisa.isair.declarations.AMrFuncGroupDeclIR;
[WARNING] ^
[WARNING] /var/lib/jenkins/workspace/overture-test/core/codegen/isagen/src/main/java/org/overturetool/cgisa/transformations/GroupMutRecs.java:40: error: cannot find symbol
[WARNING] public class GroupMutRecs extends DepthFirstAnalysisIsaAdaptor implements
[WARNING] ^
[WARNING] symbol: class DepthFirstAnalysisIsaAdaptor
[WARNING] /var/lib/jenkins/workspace/overture-test/core/codegen/isagen/src/main/java/org/overturetool/cgisa/IsaGen.java:88: warning: no description for @throws
[WARNING] * @throws AnalysisException
[WARNING] ^
[INFO] Building jar: /var/lib/jenkins/workspace/overture-test/core/codegen/isagen/target/isagen-2.6.5-SNAPSHOT-javadoc.jar
[INFO] 
[INFO] --- maven-install-plugin:2.5.2:install (default-install) @ isagen ---
[INFO] Installing /var/lib/jenkins/workspace/overture-test/core/codegen/isagen/target/isagen-2.6.5-SNAPSHOT.jar to /var/lib/jenkins/workspace/overture-test/.repository/org/overturetool/core/codegen/isagen/2.6.5-SNAPSHOT/isagen-2.6.5-SNAPSHOT.jar
[INFO] Installing /var/lib/jenkins/workspace/overture-test/core/codegen/isagen/pom.xml to /var/lib/jenkins/workspace/overture-test/.repository/org/overturetool/core/codegen/isagen/2.6.5-SNAPSHOT/isagen-2.6.5-SNAPSHOT.pom
[INFO] Installing /var/lib/jenkins/workspace/overture-test/core/codegen/isagen/target/isagen-2.6.5-SNAPSHOT-javadoc.jar to /var/lib/jenkins/workspace/overture-test/.repository/org/overturetool/core/codegen/isagen/2.6.5-SNAPSHOT/isagen-2.6.5-SNAPSHOT-javadoc.jar