AbortedConsole Output

Skipping 901 KB.. Full Log
GBgqihikoFqS8/OK83NS9ZwhNEghAwQwghQWAACwxA+XYgAAAA==[WARNING] ^
[WARNING] /var/lib/jenkins/workspace/overturetool_ncb_development/core/interpreter/src/main/java/org/overture/interpreter/assistant/expression/PExpAssistantInterpreter.java:50: warning: no description for @param
[WARNING] * @param exp
[WARNING] ^
[WARNING] /var/lib/jenkins/workspace/overturetool_ncb_development/core/interpreter/src/main/java/org/overture/interpreter/assistant/definition/PDefinitionAssistantInterpreter.java:62: warning: no description for @param
[WARNING] * @param def
[WARNING] ^
[WARNING] /var/lib/jenkins/workspace/overturetool_ncb_development/core/interpreter/src/main/java/org/overture/interpreter/assistant/module/AModuleModulesAssistantInterpreter.java:144: warning: no description for @param
[WARNING] * @param m
[WARNING] ^
[WARNING] /var/lib/jenkins/workspace/overturetool_ncb_development/core/interpreter/src/main/java/org/overture/interpreter/assistant/module/AModuleModulesAssistantInterpreter.java:145: warning: no description for @param
[WARNING] * @param initialContext
[WARNING] ^
[WARNING] /var/lib/jenkins/workspace/overturetool_ncb_development/core/interpreter/src/main/java/org/overture/interpreter/assistant/pattern/PPatternAssistantInterpreter.java:82: warning: no description for @param
[WARNING] * @param pattern
[WARNING] ^
[WARNING] /var/lib/jenkins/workspace/overturetool_ncb_development/core/interpreter/src/main/java/org/overture/interpreter/assistant/pattern/PPatternAssistantInterpreter.java:98: warning: no description for @param
[WARNING] * @param pattern
[WARNING] ^
[WARNING] /var/lib/jenkins/workspace/overturetool_ncb_development/core/interpreter/src/main/java/org/overture/interpreter/eval/ExpressionEvaluator.java:249: warning: no description for @param
[WARNING] * @param node
[WARNING] ^
[WARNING] /var/lib/jenkins/workspace/overturetool_ncb_development/core/interpreter/src/main/java/org/overture/interpreter/eval/ExpressionEvaluator.java:250: warning: no description for @param
[WARNING] * @param val
[WARNING] ^
[WARNING] /var/lib/jenkins/workspace/overturetool_ncb_development/core/interpreter/src/main/java/org/overture/interpreter/eval/ExpressionEvaluator.java:251: warning: no description for @param
[WARNING] * @param ctxt
[WARNING] ^
[WARNING] /var/lib/jenkins/workspace/overturetool_ncb_development/core/interpreter/src/main/java/org/overture/interpreter/eval/ExpressionEvaluator.java:252: warning: no description for @return
[WARNING] * @return
[WARNING] ^
[WARNING] /var/lib/jenkins/workspace/overturetool_ncb_development/core/interpreter/src/main/java/org/overture/interpreter/eval/ExpressionEvaluator.java:253: warning: no description for @throws
[WARNING] * @throws AnalysisException
[WARNING] ^
[WARNING] /var/lib/jenkins/workspace/overturetool_ncb_development/core/interpreter/src/main/java/org/overture/interpreter/eval/ExpressionEvaluator.java:698: warning: no description for @param
[WARNING] * @param node
[WARNING] ^
[WARNING] /var/lib/jenkins/workspace/overturetool_ncb_development/core/interpreter/src/main/java/org/overture/interpreter/eval/ExpressionEvaluator.java:699: warning: no description for @param
[WARNING] * @param ifLocation
[WARNING] ^
[WARNING] /var/lib/jenkins/workspace/overturetool_ncb_development/core/interpreter/src/main/java/org/overture/interpreter/eval/ExpressionEvaluator.java:700: warning: no description for @param
[WARNING] * @param testExp
[WARNING] ^
[WARNING] /var/lib/jenkins/workspace/overturetool_ncb_development/core/interpreter/src/main/java/org/overture/interpreter/eval/ExpressionEvaluator.java:701: warning: no description for @param
[WARNING] * @param thenNode
[WARNING] ^
[WARNING] /var/lib/jenkins/workspace/overturetool_ncb_development/core/interpreter/src/main/java/org/overture/interpreter/eval/ExpressionEvaluator.java:702: warning: no description for @param
[WARNING] * @param elseIfNodeList
[WARNING] ^
[WARNING] /var/lib/jenkins/workspace/overturetool_ncb_development/core/interpreter/src/main/java/org/overture/interpreter/eval/ExpressionEvaluator.java:703: warning: no description for @param
[WARNING] * @param elseNode
[WARNING] ^
[WARNING] /var/lib/jenkins/workspace/overturetool_ncb_development/core/interpreter/src/main/java/org/overture/interpreter/eval/ExpressionEvaluator.java:704: warning: no description for @param
[WARNING] * @param ctxt
[WARNING] ^
[WARNING] /var/lib/jenkins/workspace/overturetool_ncb_development/core/interpreter/src/main/java/org/overture/interpreter/eval/ExpressionEvaluator.java:705: warning: no description for @return
[WARNING] * @return
[WARNING] ^
[WARNING] /var/lib/jenkins/workspace/overturetool_ncb_development/core/interpreter/src/main/java/org/overture/interpreter/eval/ExpressionEvaluator.java:706: warning: no description for @throws
[WARNING] * @throws AnalysisException
[WARNING] ^
[WARNING] /var/lib/jenkins/workspace/overturetool_ncb_development/core/interpreter/src/main/java/org/overture/interpreter/eval/ExpressionEvaluator.java:746: warning: no description for @param
[WARNING] * @param node
[WARNING] ^
[WARNING] /var/lib/jenkins/workspace/overturetool_ncb_development/core/interpreter/src/main/java/org/overture/interpreter/eval/ExpressionEvaluator.java:747: warning: no description for @param
[WARNING] * @param location
[WARNING] ^
[WARNING] /var/lib/jenkins/workspace/overturetool_ncb_development/core/interpreter/src/main/java/org/overture/interpreter/eval/ExpressionEvaluator.java:748: warning: no description for @param
[WARNING] * @param test
[WARNING] ^
[WARNING] /var/lib/jenkins/workspace/overturetool_ncb_development/core/interpreter/src/main/java/org/overture/interpreter/eval/ExpressionEvaluator.java:749: warning: no description for @param
[WARNING] * @param then
[WARNING] ^
[WARNING] /var/lib/jenkins/workspace/overturetool_ncb_development/core/interpreter/src/main/java/org/overture/interpreter/eval/ExpressionEvaluator.java:750: warning: no description for @param
[WARNING] * @param ctxt
[WARNING] ^
[WARNING] /var/lib/jenkins/workspace/overturetool_ncb_development/core/interpreter/src/main/java/org/overture/interpreter/eval/ExpressionEvaluator.java:751: warning: no description for @return
[WARNING] * @return
[WARNING] ^
[WARNING] /var/lib/jenkins/workspace/overturetool_ncb_development/core/interpreter/src/main/java/org/overture/interpreter/eval/ExpressionEvaluator.java:752: warning: no description for @throws
[WARNING] * @throws AnalysisException
[WARNING] ^
[WARNING] /var/lib/jenkins/workspace/overturetool_ncb_development/core/interpreter/src/main/java/org/overture/interpreter/scheduler/SharedStateListner.java:45: warning: no description for @param
[WARNING] * @param name
[WARNING] ^
[WARNING] /var/lib/jenkins/workspace/overturetool_ncb_development/core/interpreter/src/main/java/org/overture/interpreter/scheduler/SharedStateListner.java:46: warning: no description for @return
[WARNING] * @return
[WARNING] ^
[WARNING] /var/lib/jenkins/workspace/overturetool_ncb_development/core/interpreter/src/main/java/org/overture/interpreter/scheduler/SharedStateListner.java:55: warning: no description for @param
[WARNING] * @param target
[WARNING] ^
[WARNING] /var/lib/jenkins/workspace/overturetool_ncb_development/core/interpreter/src/main/java/org/overture/interpreter/scheduler/SharedStateListner.java:56: warning: no description for @return
[WARNING] * @return
[WARNING] ^
[WARNING] /var/lib/jenkins/workspace/overturetool_ncb_development/core/interpreter/src/main/java/org/overture/interpreter/messages/rtlog/RTLogger.java:55: warning: no description for @param
[WARNING] * @param on
[WARNING] ^
[WARNING] /var/lib/jenkins/workspace/overturetool_ncb_development/core/interpreter/src/main/java/org/overture/interpreter/messages/rtlog/RTLogger.java:70: warning: no description for @param
[WARNING] * @param message
[WARNING] ^
[WARNING] /var/lib/jenkins/workspace/overturetool_ncb_development/core/interpreter/src/main/java/org/overture/interpreter/messages/rtlog/RTLogger.java:92: warning: no description for @throws
[WARNING] * @throws FileNotFoundException
[WARNING] ^
[WARNING] /var/lib/jenkins/workspace/overturetool_ncb_development/core/interpreter/src/main/java/org/overture/interpreter/messages/rtlog/RTLogger.java:112: warning: no description for @return
[WARNING] * @return
[WARNING] ^
[WARNING] /var/lib/jenkins/workspace/overturetool_ncb_development/core/interpreter/src/main/java/org/overture/interpreter/messages/rtlog/RTLogger.java:122: warning: no description for @param
[WARNING] * @param close
[WARNING] ^
[WARNING] /var/lib/jenkins/workspace/overturetool_ncb_development/core/interpreter/src/main/java/org/overture/interpreter/traces/TestSequence.java:55: warning: no description for @param
[WARNING] * @param result
[WARNING] ^
[WARNING] /var/lib/jenkins/workspace/overturetool_ncb_development/core/interpreter/src/main/java/org/overture/interpreter/traces/TestSequence.java:56: warning: no description for @param
[WARNING] * @param test
[WARNING] ^
[WARNING] /var/lib/jenkins/workspace/overturetool_ncb_development/core/interpreter/src/main/java/org/overture/interpreter/traces/TestSequence.java:57: warning: no description for @param
[WARNING] * @param n
[WARNING] ^
[WARNING] /var/lib/jenkins/workspace/overturetool_ncb_development/core/interpreter/src/main/java/org/overture/interpreter/traces/TestSequence.java:102: warning: no description for @param
[WARNING] * @param other
[WARNING] ^
[WARNING] /var/lib/jenkins/workspace/overturetool_ncb_development/core/interpreter/src/main/java/org/overture/interpreter/solver/IConstraintSolver.java:21: warning: no description for @param
[WARNING] * @param name
[WARNING] ^
[WARNING] /var/lib/jenkins/workspace/overturetool_ncb_development/core/interpreter/src/main/java/org/overture/interpreter/solver/IConstraintSolver.java:22: warning: no description for @param
[WARNING] * @param impldef
[WARNING] ^
[WARNING] /var/lib/jenkins/workspace/overturetool_ncb_development/core/interpreter/src/main/java/org/overture/interpreter/solver/IConstraintSolver.java:23: warning: no description for @param
[WARNING] * @param stateExps
[WARNING] ^
[WARNING] /var/lib/jenkins/workspace/overturetool_ncb_development/core/interpreter/src/main/java/org/overture/interpreter/solver/IConstraintSolver.java:24: warning: no description for @param
[WARNING] * @param argExps
[WARNING] ^
[WARNING] /var/lib/jenkins/workspace/overturetool_ncb_development/core/interpreter/src/main/java/org/overture/interpreter/solver/IConstraintSolver.java:25: warning: no description for @param
[WARNING] * @param out
[WARNING] ^
[WARNING] /var/lib/jenkins/workspace/overturetool_ncb_development/core/interpreter/src/main/java/org/overture/interpreter/solver/IConstraintSolver.java:26: warning: no description for @param
[WARNING] * @param err
[WARNING] ^
[WARNING] /var/lib/jenkins/workspace/overturetool_ncb_development/core/interpreter/src/main/java/org/overture/interpreter/solver/IConstraintSolver.java:27: warning: no description for @return
[WARNING] * @return
[WARNING] ^
[WARNING] /var/lib/jenkins/workspace/overturetool_ncb_development/core/interpreter/src/main/java/org/overture/interpreter/solver/IConstraintSolver.java:28: warning: no description for @throws
[WARNING] * @throws Exception
[WARNING] ^
[WARNING] /var/lib/jenkins/workspace/overturetool_ncb_development/core/interpreter/src/main/java/org/overture/interpreter/solver/IConstraintSolver.java:40: warning: no description for @param
[WARNING] * @param name
[WARNING] ^
[WARNING] /var/lib/jenkins/workspace/overturetool_ncb_development/core/interpreter/src/main/java/org/overture/interpreter/solver/IConstraintSolver.java:41: warning: no description for @param
[WARNING] * @param body
[WARNING] ^
[WARNING] /var/lib/jenkins/workspace/overturetool_ncb_development/core/interpreter/src/main/java/org/overture/interpreter/solver/IConstraintSolver.java:42: warning: no description for @param
[WARNING] * @param result
[WARNING] ^
[WARNING] /var/lib/jenkins/workspace/overturetool_ncb_development/core/interpreter/src/main/java/org/overture/interpreter/solver/IConstraintSolver.java:43: warning: no description for @param
[WARNING] * @param stateExps
[WARNING] ^
[WARNING] /var/lib/jenkins/workspace/overturetool_ncb_development/core/interpreter/src/main/java/org/overture/interpreter/solver/IConstraintSolver.java:44: warning: no description for @param
[WARNING] * @param argExps
[WARNING] ^
[WARNING] /var/lib/jenkins/workspace/overturetool_ncb_development/core/interpreter/src/main/java/org/overture/interpreter/solver/IConstraintSolver.java:45: warning: no description for @param
[WARNING] * @param out
[WARNING] ^
[WARNING] /var/lib/jenkins/workspace/overturetool_ncb_development/core/interpreter/src/main/java/org/overture/interpreter/solver/IConstraintSolver.java:46: warning: no description for @param
[WARNING] * @param err
[WARNING] ^
[WARNING] /var/lib/jenkins/workspace/overturetool_ncb_development/core/interpreter/src/main/java/org/overture/interpreter/solver/IConstraintSolver.java:47: warning: no description for @return
[WARNING] * @return
[WARNING] ^
[WARNING] /var/lib/jenkins/workspace/overturetool_ncb_development/core/interpreter/src/main/java/org/overture/interpreter/solver/IConstraintSolver.java:48: warning: no description for @throws
[WARNING] * @throws Exception
[WARNING] ^
[WARNING] /var/lib/jenkins/workspace/overturetool_ncb_development/core/interpreter/src/main/java/org/overture/interpreter/values/Value.java:120: warning: no description for @return
[WARNING] * @return
[WARNING] ^
[WARNING] /var/lib/jenkins/workspace/overturetool_ncb_development/core/interpreter/src/main/java/org/overture/interpreter/values/Value.java:162: warning: no description for @throws
[WARNING] * @throws AnalysisException
[WARNING] ^
[WARNING] /var/lib/jenkins/workspace/overturetool_ncb_development/core/interpreter/src/main/java/org/overture/interpreter/values/Value.java:281: warning: no description for @throws
[WARNING] * @throws ValueException
[WARNING] ^
[WARNING] /var/lib/jenkins/workspace/overturetool_ncb_development/core/interpreter/src/main/java/org/overture/interpreter/values/Value.java:282: warning: no description for @throws
[WARNING] * @throws AnalysisException
[WARNING] ^
[WARNING] /var/lib/jenkins/workspace/overturetool_ncb_development/core/interpreter/src/main/java/org/overture/interpreter/values/ValueMap.java:109: warning: no @return
[WARNING] public List<Map<Value, Value>> permutedMaps()
[WARNING] ^
[WARNING] /var/lib/jenkins/workspace/overturetool_ncb_development/core/interpreter/src/main/java/org/overture/interpreter/commands/CommandReader.java:146: warning: no description for @return
[WARNING] * @return
[WARNING] ^
[WARNING] /var/lib/jenkins/workspace/overturetool_ncb_development/core/interpreter/src/main/java/org/overture/interpreter/commands/CommandReader.java:631: warning: no description for @throws
[WARNING] * @throws Exception
[WARNING] ^
[WARNING] /var/lib/jenkins/workspace/overturetool_ncb_development/core/interpreter/src/main/java/org/overture/interpreter/commands/CommandReader.java:633: warning: no @param for line
[WARNING] protected boolean doCreate(String line) throws Exception
[WARNING] ^
[WARNING] /var/lib/jenkins/workspace/overturetool_ncb_development/core/interpreter/src/main/java/org/overture/interpreter/commands/CommandReader.java:633: warning: no @return
[WARNING] protected boolean doCreate(String line) throws Exception
[WARNING] ^
[WARNING] /var/lib/jenkins/workspace/overturetool_ncb_development/core/interpreter/src/main/java/org/overture/interpreter/commands/CommandReader.java:639: warning: no description for @throws
[WARNING] * @throws Exception
[WARNING] ^
[WARNING] /var/lib/jenkins/workspace/overturetool_ncb_development/core/interpreter/src/main/java/org/overture/interpreter/commands/CommandReader.java:641: warning: no @param for line
[WARNING] protected boolean doDefault(String line) throws Exception
[WARNING] ^
[WARNING] /var/lib/jenkins/workspace/overturetool_ncb_development/core/interpreter/src/main/java/org/overture/interpreter/commands/CommandReader.java:641: warning: no @return
[WARNING] protected boolean doDefault(String line) throws Exception
[WARNING] ^
[WARNING] /var/lib/jenkins/workspace/overturetool_ncb_development/core/interpreter/src/main/java/org/overture/interpreter/commands/CommandReader.java:1313: warning: no @param for line
[WARNING] protected boolean notAvailable(String line)
[WARNING] ^
[WARNING] /var/lib/jenkins/workspace/overturetool_ncb_development/core/interpreter/src/main/java/org/overture/interpreter/commands/CommandReader.java:1313: warning: no @return
[WARNING] protected boolean notAvailable(String line)
[WARNING] ^
[WARNING] /var/lib/jenkins/workspace/overturetool_ncb_development/core/interpreter/src/main/java/org/overture/interpreter/runtime/Breakpoint.java:223: warning: no description for @param
[WARNING] * @param ctxt
[WARNING] ^
[WARNING] /var/lib/jenkins/workspace/overturetool_ncb_development/core/interpreter/src/main/java/org/overture/interpreter/runtime/Breakpoint.java:250: warning: no description for @param
[WARNING] * @param ctxt
[WARNING] ^
[WARNING] /var/lib/jenkins/workspace/overturetool_ncb_development/core/interpreter/src/main/java/org/overture/interpreter/runtime/Breakpoint.java:251: warning: no description for @return
[WARNING] * @return
[WARNING] ^
[WARNING] /var/lib/jenkins/workspace/overturetool_ncb_development/core/interpreter/src/main/java/org/overture/interpreter/runtime/Breakpoint.java:262: warning: no description for @param
[WARNING] * @param ctxt
[WARNING] ^
[WARNING] /var/lib/jenkins/workspace/overturetool_ncb_development/core/interpreter/src/main/java/org/overture/interpreter/runtime/Breakpoint.java:263: warning: no description for @return
[WARNING] * @return
[WARNING] ^
[WARNING] /var/lib/jenkins/workspace/overturetool_ncb_development/core/interpreter/src/main/java/org/overture/interpreter/runtime/Breakpoint.java:86: warning: no description for @throws
[WARNING] * @throws ParserException
[WARNING] ^
[WARNING] /var/lib/jenkins/workspace/overturetool_ncb_development/core/interpreter/src/main/java/org/overture/interpreter/runtime/Breakpoint.java:87: warning: no description for @throws
[WARNING] * @throws LexException
[WARNING] ^
[WARNING] /var/lib/jenkins/workspace/overturetool_ncb_development/core/interpreter/src/main/java/org/overture/interpreter/runtime/Context.java:106: warning: no description for @param
[WARNING] * @param dbgp
[WARNING] ^
[WARNING] /var/lib/jenkins/workspace/overturetool_ncb_development/core/interpreter/src/main/java/org/overture/interpreter/runtime/Context.java:137: warning: no description for @return
[WARNING] * @return
[WARNING] ^
[WARNING] /var/lib/jenkins/workspace/overturetool_ncb_development/core/interpreter/src/main/java/org/overture/interpreter/runtime/Context.java:150: warning: no description for @return
[WARNING] * @return
[WARNING] ^
[WARNING] /var/lib/jenkins/workspace/overturetool_ncb_development/core/interpreter/src/main/java/org/overture/interpreter/runtime/Context.java:276: warning: no description for @param
[WARNING] * @param name
[WARNING] ^
[WARNING] /var/lib/jenkins/workspace/overturetool_ncb_development/core/interpreter/src/main/java/org/overture/interpreter/runtime/Context.java:277: warning: no description for @return
[WARNING] * @return
[WARNING] ^
[WARNING] /var/lib/jenkins/workspace/overturetool_ncb_development/core/interpreter/src/main/java/org/overture/interpreter/runtime/Interpreter.java:127: warning: no description for @return
[WARNING] * @return
[WARNING] ^
[WARNING] /var/lib/jenkins/workspace/overturetool_ncb_development/core/interpreter/src/main/java/org/overture/interpreter/runtime/Interpreter.java:137: warning: no description for @return
[WARNING] * @return
[WARNING] ^
[WARNING] /var/lib/jenkins/workspace/overturetool_ncb_development/core/interpreter/src/main/java/org/overture/interpreter/runtime/Interpreter.java:148: warning: no description for @return
[WARNING] * @return
[WARNING] ^
[WARNING] /var/lib/jenkins/workspace/overturetool_ncb_development/core/interpreter/src/main/java/org/overture/interpreter/runtime/Interpreter.java:156: warning: no description for @return
[WARNING] * @return
[WARNING] ^
[WARNING] /var/lib/jenkins/workspace/overturetool_ncb_development/core/interpreter/src/main/java/org/overture/interpreter/runtime/Interpreter.java:158: warning: no @param for module
[WARNING] abstract public Environment getGlobalEnvironment(String module);
[WARNING] ^
[WARNING] /var/lib/jenkins/workspace/overturetool_ncb_development/core/interpreter/src/main/java/org/overture/interpreter/runtime/Interpreter.java:191: warning: no description for @throws
[WARNING] * @throws Exception
[WARNING] ^
[WARNING] /var/lib/jenkins/workspace/overturetool_ncb_development/core/interpreter/src/main/java/org/overture/interpreter/runtime/Interpreter.java:201: warning: no description for @param
[WARNING] * @param dbgp
[WARNING] ^
[WARNING] /var/lib/jenkins/workspace/overturetool_ncb_development/core/interpreter/src/main/java/org/overture/interpreter/runtime/Interpreter.java:210: warning: no description for @param
[WARNING] * @param dbgp
[WARNING] ^
[WARNING] /var/lib/jenkins/workspace/overturetool_ncb_development/core/interpreter/src/main/java/org/overture/interpreter/runtime/Interpreter.java:288: warning: no description for @param
[WARNING] * @param src
[WARNING] ^
[WARNING] /var/lib/jenkins/workspace/overturetool_ncb_development/core/interpreter/src/main/java/org/overture/interpreter/runtime/Interpreter.java:289: warning: no description for @return
[WARNING] * @return
[WARNING] ^
[WARNING] /var/lib/jenkins/workspace/overturetool_ncb_development/core/interpreter/src/main/java/org/overture/interpreter/runtime/Interpreter.java:300: warning: no description for @param
[WARNING] * @param file
[WARNING] ^
[WARNING] /var/lib/jenkins/workspace/overturetool_ncb_development/core/interpreter/src/main/java/org/overture/interpreter/runtime/Interpreter.java:301: warning: no description for @param
[WARNING] * @param line
[WARNING] ^
[INFO] Building jar: /var/lib/jenkins/workspace/overturetool_ncb_development/core/interpreter/target/interpreter-2.7.5-SNAPSHOT-javadoc.jar
[INFO] 
[INFO] -------------< org.overturetool.core:combinatorialtesting >-------------
[INFO] Building Combinatorial Testing 2.7.5-SNAPSHOT                    [15/35]
[INFO] --------------------------------[ pom ]---------------------------------
[INFO] 
[INFO] --- maven-enforcer-plugin:1.0:enforce (enforce-maven) @ combinatorialtesting ---
[INFO] 
[INFO] --- jacoco-maven-plugin:0.7.6.201602180812:prepare-agent (jacoco-initialize) @ combinatorialtesting ---
[INFO] argLine set to -javaagent:/var/lib/jenkins/workspace/overturetool_ncb_development/.repository/org/jacoco/org.jacoco.agent/0.7.6.201602180812/org.jacoco.agent-0.7.6.201602180812-runtime.jar=destfile=/var/lib/jenkins/workspace/overturetool_ncb_development/core/combinatorialtesting/target/coverage-reports/jacoco-unit.exec,excludes=**/org/overture/ast/analysis/**/*.*:**/org/overture/ast/expressions/**/*.*:**/org/overture/ast/modules/**/*.*:**/org/overture/ast/node/**/*.*:**/org/overture/ast/patterns/**/*.*:**/org/overture/ast/statements/**/*.*:**/org/overture/ast/types/**/*.*:**/org/overture/codegen/ir/**/*:**/org/overture/ide/**/*
[INFO] 
[INFO] --- jacoco-maven-plugin:0.7.6.201602180812:report (jacoco-site) @ combinatorialtesting ---
[INFO] Skipping JaCoCo execution due to missing execution data file:/var/lib/jenkins/workspace/overturetool_ncb_development/core/combinatorialtesting/target/coverage-reports/jacoco-unit.exec
[INFO] 
[INFO] --- maven-javadoc-plugin:2.10.3:jar (attach-javadocs) @ combinatorialtesting ---
[INFO] Not executing Javadoc as the project is not a Java classpath-capable package
[INFO] 
[INFO] ---------< org.overturetool.core.combinatorialtesting:ctutils >---------
[INFO] Building Combinatorial Testing Utilities 2.7.5-SNAPSHOT          [16/35]
[INFO] --------------------------------[ jar ]---------------------------------
[INFO] 
[INFO] --- maven-enforcer-plugin:1.0:enforce (enforce-maven) @ ctutils ---
[INFO] 
[INFO] --- jacoco-maven-plugin:0.7.6.201602180812:prepare-agent (jacoco-initialize) @ ctutils ---
[INFO] argLine set to -javaagent:/var/lib/jenkins/workspace/overturetool_ncb_development/.repository/org/jacoco/org.jacoco.agent/0.7.6.201602180812/org.jacoco.agent-0.7.6.201602180812-runtime.jar=destfile=/var/lib/jenkins/workspace/overturetool_ncb_development/core/combinatorialtesting/ctutils/target/coverage-reports/jacoco-unit.exec,excludes=**/org/overture/ast/analysis/**/*.*:**/org/overture/ast/expressions/**/*.*:**/org/overture/ast/modules/**/*.*:**/org/overture/ast/node/**/*.*:**/org/overture/ast/patterns/**/*.*:**/org/overture/ast/statements/**/*.*:**/org/overture/ast/types/**/*.*:**/org/overture/codegen/ir/**/*:**/org/overture/ide/**/*
[INFO] 
[INFO] --- maven-resources-plugin:2.7:resources (default-resources) @ ctutils ---
[INFO] Using 'UTF-8' encoding to copy filtered resources.
[INFO] skip non existing resourceDirectory /var/lib/jenkins/workspace/overturetool_ncb_development/core/combinatorialtesting/ctutils/src/main/resources
[INFO] 
[INFO] --- maven-compiler-plugin:3.5.1:compile (default-compile) @ ctutils ---
[INFO] Nothing to compile - all classes are up to date
[INFO] 
[INFO] --- maven-resources-plugin:2.7:testResources (default-testResources) @ ctutils ---
[INFO] Using 'UTF-8' encoding to copy filtered resources.
[INFO] skip non existing resourceDirectory /var/lib/jenkins/workspace/overturetool_ncb_development/core/combinatorialtesting/ctutils/src/test/resources
[INFO] 
[INFO] --- maven-compiler-plugin:3.5.1:testCompile (default-testCompile) @ ctutils ---
[INFO] No sources to compile
[INFO] 
[INFO] --- maven-surefire-plugin:2.19.1:test (default-test) @ ctutils ---
[INFO] No tests to run.
[INFO] 
[INFO] --- maven-jar-plugin:2.6:jar (default-jar) @ ctutils ---
[INFO] Building jar: /var/lib/jenkins/workspace/overturetool_ncb_development/core/combinatorialtesting/ctutils/target/ctutils-2.7.5-SNAPSHOT.jar
[INFO] 
[INFO] --- jacoco-maven-plugin:0.7.6.201602180812:report (jacoco-site) @ ctutils ---
[INFO] Skipping JaCoCo execution due to missing execution data file:/var/lib/jenkins/workspace/overturetool_ncb_development/core/combinatorialtesting/ctutils/target/coverage-reports/jacoco-unit.exec
[INFO] 
[INFO] --- maven-javadoc-plugin:2.10.3:jar (attach-javadocs) @ ctutils ---
[WARNING] Javadoc Warnings
[WARNING] Picked up JAVA_TOOL_OPTIONS: -Dmaven.ext.class.path="/var/lib/jenkins/workspace/overturetool_ncb_development@tmp/withMaven5a1ec836/pipeline-maven-spy.jar" -Dorg.jenkinsci.plugins.pipeline.maven.reportsFolder="/var/lib/jenkins/workspace/overturetool_ncb_development@tmp/withMaven5a1ec836"
[INFO] Building jar: /var/lib/jenkins/workspace/overturetool_ncb_development/core/combinatorialtesting/ctutils/target/ctutils-2.7.5-SNAPSHOT-javadoc.jar
[INFO] 
[INFO] --------< org.overturetool.core.combinatorialtesting:ctruntime >--------
[INFO] Building Combinatorial Testing Runtime 2.7.5-SNAPSHOT            [17/35]
[INFO] --------------------------------[ jar ]---------------------------------
[INFO] 
[INFO] --- maven-enforcer-plugin:1.0:enforce (enforce-maven) @ ctruntime ---
[INFO] 
[INFO] --- jacoco-maven-plugin:0.7.6.201602180812:prepare-agent (jacoco-initialize) @ ctruntime ---
[INFO] argLine set to -javaagent:/var/lib/jenkins/workspace/overturetool_ncb_development/.repository/org/jacoco/org.jacoco.agent/0.7.6.201602180812/org.jacoco.agent-0.7.6.201602180812-runtime.jar=destfile=/var/lib/jenkins/workspace/overturetool_ncb_development/core/combinatorialtesting/ctruntime/target/coverage-reports/jacoco-unit.exec,excludes=**/org/overture/ast/analysis/**/*.*:**/org/overture/ast/expressions/**/*.*:**/org/overture/ast/modules/**/*.*:**/org/overture/ast/node/**/*.*:**/org/overture/ast/patterns/**/*.*:**/org/overture/ast/statements/**/*.*:**/org/overture/ast/types/**/*.*:**/org/overture/codegen/ir/**/*:**/org/overture/ide/**/*
[INFO] 
[INFO] --- maven-resources-plugin:2.7:resources (default-resources) @ ctruntime ---
[INFO] Using 'UTF-8' encoding to copy filtered resources.
[INFO] skip non existing resourceDirectory /var/lib/jenkins/workspace/overturetool_ncb_development/core/combinatorialtesting/ctruntime/src/main/resources
[INFO] 
[INFO] --- maven-compiler-plugin:3.5.1:compile (default-compile) @ ctruntime ---
[INFO] Nothing to compile - all classes are up to date
[INFO] 
[INFO] --- maven-resources-plugin:2.7:testResources (default-testResources) @ ctruntime ---
[INFO] Using 'UTF-8' encoding to copy filtered resources.
[INFO] Copying 60 resources
[INFO] 
[INFO] --- maven-compiler-plugin:3.5.1:testCompile (default-testCompile) @ ctruntime ---
[INFO] Changes detected - recompiling the module!
[INFO] Compiling 6 source files to /var/lib/jenkins/workspace/overturetool_ncb_development/core/combinatorialtesting/ctruntime/target/test-classes
[INFO] 
[INFO] --- maven-surefire-plugin:2.19.1:test (default-test) @ ctruntime ---

-------------------------------------------------------
 T E S T S
-------------------------------------------------------
Picked up JAVA_TOOL_OPTIONS: -Dmaven.ext.class.path="/var/lib/jenkins/workspace/overturetool_ncb_development@tmp/withMaven5a1ec836/pipeline-maven-spy.jar" -Dorg.jenkinsci.plugins.pipeline.maven.reportsFolder="/var/lib/jenkins/workspace/overturetool_ncb_development@tmp/withMaven5a1ec836" 
Running org.overture.ct.ctruntime.tests.CtNoReductionPpTestCase
Tests run: 5, Failures: 0, Errors: 0, Skipped: 0, Time elapsed: 5.932 sec - in org.overture.ct.ctruntime.tests.CtNoReductionPpTestCase
Running org.overture.ct.ctruntime.tests.CtMultiFileNoReductionSlTestCase
Tests run: 1, Failures: 0, Errors: 0, Skipped: 0, Time elapsed: 0.539 sec - in org.overture.ct.ctruntime.tests.CtMultiFileNoReductionSlTestCase
Running org.overture.ct.ctruntime.tests.CtNoReductionSlTestCase
Tests run: 20, Failures: 0, Errors: 0, Skipped: 0, Time elapsed: 11.41 sec - in org.overture.ct.ctruntime.tests.CtNoReductionSlTestCase
Running org.overture.ct.ctruntime.tests.CtRandomReductionSlTestCase
Tests run: 9, Failures: 0, Errors: 0, Skipped: 0, Time elapsed: 4.42 sec - in org.overture.ct.ctruntime.tests.CtRandomReductionSlTestCase

Results :

Tests run: 35, Failures: 0, Errors: 0, Skipped: 0

[INFO] 
[INFO] --- maven-jar-plugin:2.6:jar (default-jar) @ ctruntime ---
[INFO] Building jar: /var/lib/jenkins/workspace/overturetool_ncb_development/core/combinatorialtesting/ctruntime/target/ctruntime-2.7.5-SNAPSHOT.jar
[INFO] 
[INFO] --- jacoco-maven-plugin:0.7.6.201602180812:report (jacoco-site) @ ctruntime ---
[INFO] Analyzed bundle 'Combinatorial Testing Runtime' with 26 classes
[INFO] 
[INFO] --- maven-javadoc-plugin:2.10.3:jar (attach-javadocs) @ ctruntime ---
[INFO] 
2 warnings
[WARNING] Javadoc Warnings
[WARNING] Picked up JAVA_TOOL_OPTIONS: -Dmaven.ext.class.path="/var/lib/jenkins/workspace/overturetool_ncb_development@tmp/withMaven5a1ec836/pipeline-maven-spy.jar" -Dorg.jenkinsci.plugins.pipeline.maven.reportsFolder="/var/lib/jenkins/workspace/overturetool_ncb_development@tmp/withMaven5a1ec836"
[WARNING] /var/lib/jenkins/workspace/overturetool_ncb_development/core/combinatorialtesting/ctruntime/src/main/java/org/overture/ct/ctruntime/TraceInterpreter.java:416: warning: no description for @param
[WARNING] * @param mtd
[WARNING] ^
[WARNING] /var/lib/jenkins/workspace/overturetool_ncb_development/core/combinatorialtesting/ctruntime/src/main/java/org/overture/ct/ctruntime/TraceInterpreter.java:417: warning: no description for @param
[WARNING] * @param test
[WARNING] ^
[INFO] Building jar: /var/lib/jenkins/workspace/overturetool_ncb_development/core/combinatorialtesting/ctruntime/target/ctruntime-2.7.5-SNAPSHOT-javadoc.jar
[INFO] 
[INFO] ---------------------< org.overturetool.core:npp >----------------------
[INFO] Building New Pretty Printer 2.7.5-SNAPSHOT                       [18/35]
[INFO] --------------------------------[ jar ]---------------------------------
[INFO] 
[INFO] --- maven-enforcer-plugin:1.0:enforce (enforce-maven) @ npp ---
[INFO] 
[INFO] --- jacoco-maven-plugin:0.7.6.201602180812:prepare-agent (jacoco-initialize) @ npp ---
[INFO] argLine set to -javaagent:/var/lib/jenkins/workspace/overturetool_ncb_development/.repository/org/jacoco/org.jacoco.agent/0.7.6.201602180812/org.jacoco.agent-0.7.6.201602180812-runtime.jar=destfile=/var/lib/jenkins/workspace/overturetool_ncb_development/core/prettyprinting/npp/target/coverage-reports/jacoco-unit.exec,excludes=**/org/overture/ast/analysis/**/*.*:**/org/overture/ast/expressions/**/*.*:**/org/overture/ast/modules/**/*.*:**/org/overture/ast/node/**/*.*:**/org/overture/ast/patterns/**/*.*:**/org/overture/ast/statements/**/*.*:**/org/overture/ast/types/**/*.*:**/org/overture/codegen/ir/**/*:**/org/overture/ide/**/*
[INFO] 
[INFO] --- maven-resources-plugin:2.7:resources (default-resources) @ npp ---
[INFO] Using 'UTF-8' encoding to copy filtered resources.
[INFO] skip non existing resourceDirectory /var/lib/jenkins/workspace/overturetool_ncb_development/core/prettyprinting/npp/src/main/resources
[INFO] 
[INFO] --- maven-compiler-plugin:3.5.1:compile (default-compile) @ npp ---
[INFO] Nothing to compile - all classes are up to date
[INFO] 
[INFO] --- maven-resources-plugin:2.7:testResources (default-testResources) @ npp ---
[INFO] Using 'UTF-8' encoding to copy filtered resources.
[INFO] Copying 1 resource
[INFO] 
[INFO] --- maven-compiler-plugin:3.5.1:testCompile (default-testCompile) @ npp ---
[INFO] Changes detected - recompiling the module!
[INFO] Compiling 5 source files to /var/lib/jenkins/workspace/overturetool_ncb_development/core/prettyprinting/npp/target/test-classes
[INFO] 
[INFO] --- maven-surefire-plugin:2.19.1:test (default-test) @ npp ---

-------------------------------------------------------
 T E S T S
-------------------------------------------------------
Picked up JAVA_TOOL_OPTIONS: -Dmaven.ext.class.path="/var/lib/jenkins/workspace/overturetool_ncb_development@tmp/withMaven5a1ec836/pipeline-maven-spy.jar" -Dorg.jenkinsci.plugins.pipeline.maven.reportsFolder="/var/lib/jenkins/workspace/overturetool_ncb_development@tmp/withMaven5a1ec836" 
Running org.overture.core.npp.ExpressionNppTest
Tests run: 22, Failures: 0, Errors: 0, Skipped: 0, Time elapsed: 0.404 sec - in org.overture.core.npp.ExpressionNppTest
Running org.overture.core.npp.VdmSymbolTableTest
Tests run: 67, Failures: 0, Errors: 0, Skipped: 0, Time elapsed: 0.059 sec - in org.overture.core.npp.VdmSymbolTableTest
Running org.overture.core.npp.CommonStringManipsTest
Tests run: 1, Failures: 0, Errors: 0, Skipped: 0, Time elapsed: 0 sec - in org.overture.core.npp.CommonStringManipsTest
Running org.overture.core.npp.IndentTrackerTest
Tests run: 7, Failures: 0, Errors: 0, Skipped: 0, Time elapsed: 0.005 sec - in org.overture.core.npp.IndentTrackerTest

Results :

Tests run: 97, Failures: 0, Errors: 0, Skipped: 0

[INFO] 
[INFO] --- maven-jar-plugin:2.6:jar (default-jar) @ npp ---
[INFO] Building jar: /var/lib/jenkins/workspace/overturetool_ncb_development/core/prettyprinting/npp/target/npp-2.7.5-SNAPSHOT.jar
[INFO] 
[INFO] --- jacoco-maven-plugin:0.7.6.201602180812:report (jacoco-site) @ npp ---
[INFO] Analyzed bundle 'New Pretty Printer' with 5 classes
[INFO] 
[INFO] --- maven-javadoc-plugin:2.10.3:jar (attach-javadocs) @ npp ---
[WARNING] Javadoc Warnings
[WARNING] Picked up JAVA_TOOL_OPTIONS: -Dmaven.ext.class.path="/var/lib/jenkins/workspace/overturetool_ncb_development@tmp/withMaven5a1ec836/pipeline-maven-spy.jar" -Dorg.jenkinsci.plugins.pipeline.maven.reportsFolder="/var/lib/jenkins/workspace/overturetool_ncb_development@tmp/withMaven5a1ec836"
[INFO] Building jar: /var/lib/jenkins/workspace/overturetool_ncb_development/core/prettyprinting/npp/target/npp-2.7.5-SNAPSHOT-javadoc.jar
[INFO] 
[INFO] ---------------< org.overturetool.core:commandlinetool >----------------
[INFO] Building Overture Core Command Line Tool 2.7.5-SNAPSHOT          [19/35]
[INFO] --------------------------------[ jar ]---------------------------------
[INFO] Downloading from remote-repos: http://overture.au.dk/artifactory/remote-repos/org/apache/maven/plugins/maven-shade-plugin/2.4.3/maven-shade-plugin-2.4.3.pom
[INFO] Downloaded from remote-repos: http://overture.au.dk/artifactory/remote-repos/org/apache/maven/plugins/maven-shade-plugin/2.4.3/maven-shade-plugin-2.4.3.pom (8.5 kB at 197 kB/s)
[INFO] Downloading from remote-repos: http://overture.au.dk/artifactory/remote-repos/org/apache/maven/plugins/maven-shade-plugin/2.4.3/maven-shade-plugin-2.4.3.jar
[INFO] Downloaded from remote-repos: http://overture.au.dk/artifactory/remote-repos/org/apache/maven/plugins/maven-shade-plugin/2.4.3/maven-shade-plugin-2.4.3.jar (104 kB at 3.7 MB/s)
[INFO] Downloading from remote-repos: http://overture.au.dk/artifactory/remote-repos/org/apache/maven/plugins/maven-assembly-plugin/2.6/maven-assembly-plugin-2.6.pom
[INFO] Downloaded from remote-repos: http://overture.au.dk/artifactory/remote-repos/org/apache/maven/plugins/maven-assembly-plugin/2.6/maven-assembly-plugin-2.6.pom (16 kB at 687 kB/s)
[INFO] Downloading from remote-repos: http://overture.au.dk/artifactory/remote-repos/org/apache/maven/plugins/maven-assembly-plugin/2.6/maven-assembly-plugin-2.6.jar
[INFO] Downloaded from remote-repos: http://overture.au.dk/artifactory/remote-repos/org/apache/maven/plugins/maven-assembly-plugin/2.6/maven-assembly-plugin-2.6.jar (246 kB at 6.1 MB/s)
[INFO] 
[INFO] --- maven-enforcer-plugin:1.0:enforce (enforce-maven) @ commandlinetool ---
[INFO] 
[INFO] --- jacoco-maven-plugin:0.7.6.201602180812:prepare-agent (jacoco-initialize) @ commandlinetool ---
[INFO] argLine set to -javaagent:/var/lib/jenkins/workspace/overturetool_ncb_development/.repository/org/jacoco/org.jacoco.agent/0.7.6.201602180812/org.jacoco.agent-0.7.6.201602180812-runtime.jar=destfile=/var/lib/jenkins/workspace/overturetool_ncb_development/core/commandline/target/coverage-reports/jacoco-unit.exec,excludes=**/org/overture/ast/analysis/**/*.*:**/org/overture/ast/expressions/**/*.*:**/org/overture/ast/modules/**/*.*:**/org/overture/ast/node/**/*.*:**/org/overture/ast/patterns/**/*.*:**/org/overture/ast/statements/**/*.*:**/org/overture/ast/types/**/*.*:**/org/overture/codegen/ir/**/*:**/org/overture/ide/**/*
[INFO] 
[INFO] --- maven-resources-plugin:2.7:resources (default-resources) @ commandlinetool ---
[INFO] Using 'UTF-8' encoding to copy filtered resources.
[INFO] Copying 2 resources to /var/lib/jenkins/workspace/overturetool_ncb_development/core/commandline/target
[INFO] Copying 2 resources to /var/lib/jenkins/workspace/overturetool_ncb_development/core/commandline/target/classes
[INFO] 
[INFO] --- maven-compiler-plugin:3.5.1:compile (default-compile) @ commandlinetool ---
[INFO] No sources to compile
[INFO] 
[INFO] --- maven-resources-plugin:2.7:testResources (default-testResources) @ commandlinetool ---
[INFO] Using 'UTF-8' encoding to copy filtered resources.
[INFO] skip non existing resourceDirectory /var/lib/jenkins/workspace/overturetool_ncb_development/core/commandline/src/test/resources
[INFO] 
[INFO] --- maven-compiler-plugin:3.5.1:testCompile (default-testCompile) @ commandlinetool ---
[INFO] No sources to compile
[INFO] 
[INFO] --- maven-surefire-plugin:2.19.1:test (default-test) @ commandlinetool ---
[INFO] No tests to run.
[INFO] 
[INFO] --- maven-jar-plugin:2.6:jar (default-jar) @ commandlinetool ---
[INFO] Building jar: /var/lib/jenkins/workspace/overturetool_ncb_development/core/commandline/target/commandlinetool-2.7.5-SNAPSHOT.jar
[INFO] 
[INFO] --- jacoco-maven-plugin:0.7.6.201602180812:report (jacoco-site) @ commandlinetool ---
[INFO] Skipping JaCoCo execution due to missing execution data file:/var/lib/jenkins/workspace/overturetool_ncb_development/core/commandline/target/coverage-reports/jacoco-unit.exec
[INFO] 
[INFO] --- maven-javadoc-plugin:2.10.3:jar (attach-javadocs) @ commandlinetool ---
[INFO] 
[INFO] --- maven-shade-plugin:2.4.3:shade (default) @ commandlinetool ---
[INFO] Downloading from remote-repos: http://overture.au.dk/artifactory/remote-repos/org/apache/maven/maven-compat/3.0/maven-compat-3.0.pom
[INFO] Downloaded from remote-repos: http://overture.au.dk/artifactory/remote-repos/org/apache/maven/maven-compat/3.0/maven-compat-3.0.pom (4.0 kB at 183 kB/s)
[INFO] Downloading from remote-repos: http://overture.au.dk/artifactory/remote-repos/org/ow2/asm/asm/5.0.2/asm-5.0.2.pom
[INFO] Downloaded from remote-repos: http://overture.au.dk/artifactory/remote-repos/org/ow2/asm/asm/5.0.2/asm-5.0.2.pom (1.9 kB at 92 kB/s)
[INFO] Downloading from remote-repos: http://overture.au.dk/artifactory/remote-repos/org/ow2/asm/asm-parent/5.0.2/asm-parent-5.0.2.pom
[INFO] Downloaded from remote-repos: http://overture.au.dk/artifactory/remote-repos/org/ow2/asm/asm-parent/5.0.2/asm-parent-5.0.2.pom (5.5 kB at 239 kB/s)
[INFO] Downloading from remote-repos: http://overture.au.dk/artifactory/remote-repos/org/ow2/asm/asm-commons/5.0.2/asm-commons-5.0.2.pom
[INFO] Downloaded from remote-repos: http://overture.au.dk/artifactory/remote-repos/org/ow2/asm/asm-commons/5.0.2/asm-commons-5.0.2.pom (2.1 kB at 95 kB/s)
[INFO] Downloading from remote-repos: http://overture.au.dk/artifactory/remote-repos/org/ow2/asm/asm-tree/5.0.2/asm-tree-5.0.2.pom
[INFO] Downloaded from remote-repos: http://overture.au.dk/artifactory/remote-repos/org/ow2/asm/asm-tree/5.0.2/asm-tree-5.0.2.pom (2.1 kB at 110 kB/s)
[INFO] Downloading from remote-repos: http://overture.au.dk/artifactory/remote-repos/org/jdom/jdom/1.1/jdom-1.1.pom
[INFO] Downloaded from remote-repos: http://overture.au.dk/artifactory/remote-repos/org/jdom/jdom/1.1/jdom-1.1.pom (2.2 kB at 104 kB/s)
[INFO] Downloading from remote-repos: http://overture.au.dk/artifactory/remote-repos/org/vafer/jdependency/1.1/jdependency-1.1.pom
[INFO] Downloaded from remote-repos: http://overture.au.dk/artifactory/remote-repos/org/vafer/jdependency/1.1/jdependency-1.1.pom (11 kB at 515 kB/s)
[INFO] Downloading from remote-repos: http://overture.au.dk/artifactory/remote-repos/org/ow2/asm/asm/5.0.4/asm-5.0.4.pom
[INFO] Downloaded from remote-repos: http://overture.au.dk/artifactory/remote-repos/org/ow2/asm/asm/5.0.4/asm-5.0.4.pom (1.9 kB at 92 kB/s)
[INFO] Downloading from remote-repos: http://overture.au.dk/artifactory/remote-repos/org/ow2/asm/asm-analysis/5.0.4/asm-analysis-5.0.4.pom
[INFO] Downloaded from remote-repos: http://overture.au.dk/artifactory/remote-repos/org/ow2/asm/asm-analysis/5.0.4/asm-analysis-5.0.4.pom (2.1 kB at 55 kB/s)
[INFO] Downloading from remote-repos: http://overture.au.dk/artifactory/remote-repos/org/ow2/asm/asm-tree/5.0.4/asm-tree-5.0.4.pom
[INFO] Downloaded from remote-repos: http://overture.au.dk/artifactory/remote-repos/org/ow2/asm/asm-tree/5.0.4/asm-tree-5.0.4.pom (2.1 kB at 116 kB/s)
[INFO] Downloading from remote-repos: http://overture.au.dk/artifactory/remote-repos/org/ow2/asm/asm-commons/5.0.4/asm-commons-5.0.4.pom
[INFO] Downloaded from remote-repos: http://overture.au.dk/artifactory/remote-repos/org/ow2/asm/asm-commons/5.0.4/asm-commons-5.0.4.pom (2.1 kB at 70 kB/s)
[INFO] Downloading from remote-repos: http://overture.au.dk/artifactory/remote-repos/org/ow2/asm/asm-util/5.0.4/asm-util-5.0.4.pom
[INFO] Downloaded from remote-repos: http://overture.au.dk/artifactory/remote-repos/org/ow2/asm/asm-util/5.0.4/asm-util-5.0.4.pom (2.1 kB at 104 kB/s)
[INFO] Downloading from remote-repos: http://overture.au.dk/artifactory/remote-repos/com/google/guava/guava/11.0.2/guava-11.0.2.pom
[INFO] Downloaded from remote-repos: http://overture.au.dk/artifactory/remote-repos/com/google/guava/guava/11.0.2/guava-11.0.2.pom (5.5 kB at 288 kB/s)
[INFO] Downloading from remote-repos: http://overture.au.dk/artifactory/remote-repos/com/google/guava/guava-parent/11.0.2/guava-parent-11.0.2.pom
[INFO] Downloaded from remote-repos: http://overture.au.dk/artifactory/remote-repos/com/google/guava/guava-parent/11.0.2/guava-parent-11.0.2.pom (2.0 kB at 93 kB/s)
[INFO] Downloading from remote-repos: http://overture.au.dk/artifactory/remote-repos/com/google/code/findbugs/jsr305/1.3.9/jsr305-1.3.9.pom
[INFO] Downloaded from remote-repos: http://overture.au.dk/artifactory/remote-repos/com/google/code/findbugs/jsr305/1.3.9/jsr305-1.3.9.pom (965 B at 24 kB/s)
[INFO] Downloading from remote-repos: http://overture.au.dk/artifactory/remote-repos/org/apache/maven/maven-compat/3.0/maven-compat-3.0.jar
[INFO] Downloading from remote-repos: http://overture.au.dk/artifactory/remote-repos/org/ow2/asm/asm/5.0.2/asm-5.0.2.jar
[INFO] Downloading from remote-repos: http://overture.au.dk/artifactory/remote-repos/org/ow2/asm/asm-commons/5.0.2/asm-commons-5.0.2.jar
[INFO] Downloading from remote-repos: http://overture.au.dk/artifactory/remote-repos/org/ow2/asm/asm-tree/5.0.2/asm-tree-5.0.2.jar
[INFO] Downloading from remote-repos: http://overture.au.dk/artifactory/remote-repos/org/jdom/jdom/1.1/jdom-1.1.jar
[INFO] Downloaded from remote-repos: http://overture.au.dk/artifactory/remote-repos/org/ow2/asm/asm/5.0.2/asm-5.0.2.jar (53 kB at 1.4 MB/s)
[INFO] Downloading from remote-repos: http://overture.au.dk/artifactory/remote-repos/org/vafer/jdependency/1.1/jdependency-1.1.jar
[INFO] Downloaded from remote-repos: http://overture.au.dk/artifactory/remote-repos/org/ow2/asm/asm-commons/5.0.2/asm-commons-5.0.2.jar (42 kB at 970 kB/s)
[INFO] Downloading from remote-repos: http://overture.au.dk/artifactory/remote-repos/org/ow2/asm/asm-analysis/5.0.4/asm-analysis-5.0.4.jar
[INFO] Downloaded from remote-repos: http://overture.au.dk/artifactory/remote-repos/org/apache/maven/maven-compat/3.0/maven-compat-3.0.jar (285 kB at 5.4 MB/s)
[INFO] Downloading from remote-repos: http://overture.au.dk/artifactory/remote-repos/org/ow2/asm/asm-util/5.0.4/asm-util-5.0.4.jar
[INFO] Downloaded from remote-repos: http://overture.au.dk/artifactory/remote-repos/org/jdom/jdom/1.1/jdom-1.1.jar (153 kB at 2.8 MB/s)
[INFO] Downloading from remote-repos: http://overture.au.dk/artifactory/remote-repos/com/google/guava/guava/11.0.2/guava-11.0.2.jar
[INFO] Downloaded from remote-repos: http://overture.au.dk/artifactory/remote-repos/org/ow2/asm/asm-tree/5.0.2/asm-tree-5.0.2.jar (29 kB at 519 kB/s)
[INFO] Downloading from remote-repos: http://overture.au.dk/artifactory/remote-repos/com/google/code/findbugs/jsr305/1.3.9/jsr305-1.3.9.jar
[INFO] Downloaded from remote-repos: http://overture.au.dk/artifactory/remote-repos/org/ow2/asm/asm-analysis/5.0.4/asm-analysis-5.0.4.jar (20 kB at 341 kB/s)
[INFO] Downloaded from remote-repos: http://overture.au.dk/artifactory/remote-repos/org/vafer/jdependency/1.1/jdependency-1.1.jar (22 kB at 349 kB/s)
[INFO] Downloaded from remote-repos: http://overture.au.dk/artifactory/remote-repos/org/ow2/asm/asm-util/5.0.4/asm-util-5.0.4.jar (43 kB at 456 kB/s)
[INFO] Downloaded from remote-repos: http://overture.au.dk/artifactory/remote-repos/com/google/code/findbugs/jsr305/1.3.9/jsr305-1.3.9.jar (33 kB at 333 kB/s)
[INFO] Downloaded from remote-repos: http://overture.au.dk/artifactory/remote-repos/com/google/guava/guava/11.0.2/guava-11.0.2.jar (1.6 MB at 9.6 MB/s)
[INFO] Including org.overturetool.core:ast:jar:2.7.5-SNAPSHOT in the shaded jar.
[INFO] Including org.overturetool.core:parser:jar:2.7.5-SNAPSHOT in the shaded jar.
[INFO] Including org.overturetool.core:typechecker:jar:2.7.5-SNAPSHOT in the shaded jar.
[INFO] Including org.overturetool.core:pog:jar:2.7.5-SNAPSHOT in the shaded jar.
[INFO] Including com.google.code.gson:gson:jar:2.2.4 in the shaded jar.
[INFO] Including org.overturetool.core.prettyprinting:prettyprinter:jar:2.7.5-SNAPSHOT in the shaded jar.
[INFO] Including commons-io:commons-io:jar:2.4 in the shaded jar.
[INFO] Including org.apache.commons:commons-collections4:jar:4.0 in the shaded jar.
[INFO] Including org.overturetool.core:testframework:jar:2.7.5-SNAPSHOT in the shaded jar.
[INFO] Including org.overturetool.core:interpreter:jar:2.7.5-SNAPSHOT in the shaded jar.
[INFO] Replacing /var/lib/jenkins/workspace/overturetool_ncb_development/core/commandline/target/Overture-2.7.5-SNAPSHOT.jar with /var/lib/jenkins/workspace/overturetool_ncb_development/core/commandline/target/commandlinetool-2.7.5-SNAPSHOT-shaded.jar
[INFO] 
[INFO] --- maven-antrun-plugin:1.8:run (set-executable-bit) @ commandlinetool ---
[INFO] Executing tasks

main:
[INFO] Executed tasks
[INFO] 
[INFO] --- maven-assembly-plugin:2.6:single (make-my-jar-with-dependencies) @ commandlinetool ---
[INFO] Downloading from remote-repos: http://overture.au.dk/artifactory/remote-repos/org/codehaus/plexus/plexus-interpolation/1.22/plexus-interpolation-1.22.pom
[INFO] Downloaded from remote-repos: http://overture.au.dk/artifactory/remote-repos/org/codehaus/plexus/plexus-interpolation/1.22/plexus-interpolation-1.22.pom (1.5 kB at 67 kB/s)
[INFO] Downloading from remote-repos: http://overture.au.dk/artifactory/remote-repos/org/codehaus/plexus/plexus-archiver/3.0.1/plexus-archiver-3.0.1.pom
[INFO] Downloaded from remote-repos: http://overture.au.dk/artifactory/remote-repos/org/codehaus/plexus/plexus-archiver/3.0.1/plexus-archiver-3.0.1.pom (5.8 kB at 252 kB/s)
[INFO] Downloading from remote-repos: http://overture.au.dk/artifactory/remote-repos/org/codehaus/plexus/plexus-io/2.6/plexus-io-2.6.pom
[INFO] Downloaded from remote-repos: http://overture.au.dk/artifactory/remote-repos/org/codehaus/plexus/plexus-io/2.6/plexus-io-2.6.pom (3.9 kB at 179 kB/s)
[INFO] Downloading from remote-repos: http://overture.au.dk/artifactory/remote-repos/org/iq80/snappy/snappy/0.3/snappy-0.3.pom
[INFO] Downloaded from remote-repos: http://overture.au.dk/artifactory/remote-repos/org/iq80/snappy/snappy/0.3/snappy-0.3.pom (14 kB at 512 kB/s)
[INFO] Downloading from remote-repos: http://overture.au.dk/artifactory/remote-repos/org/apache/maven/shared/file-management/1.1/file-management-1.1.pom
[INFO] Downloaded from remote-repos: http://overture.au.dk/artifactory/remote-repos/org/apache/maven/shared/file-management/1.1/file-management-1.1.pom (2.7 kB at 81 kB/s)
[INFO] Downloading from remote-repos: http://overture.au.dk/artifactory/remote-repos/org/apache/maven/shared/maven-shared-components/4/maven-shared-components-4.pom
[INFO] Downloaded from remote-repos: http://overture.au.dk/artifactory/remote-repos/org/apache/maven/shared/maven-shared-components/4/maven-shared-components-4.pom (2.2 kB at 110 kB/s)
[INFO] Downloading from remote-repos: http://overture.au.dk/artifactory/remote-repos/org/apache/maven/shared/maven-shared-io/1.0/maven-shared-io-1.0.pom
[INFO] Downloaded from remote-repos: http://overture.au.dk/artifactory/remote-repos/org/apache/maven/shared/maven-shared-io/1.0/maven-shared-io-1.0.pom (3.0 kB at 121 kB/s)
[INFO] Downloading from remote-repos: http://overture.au.dk/artifactory/remote-repos/org/codehaus/plexus/plexus-utils/1.2/plexus-utils-1.2.pom
[INFO] Downloaded from remote-repos: http://overture.au.dk/artifactory/remote-repos/org/codehaus/plexus/plexus-utils/1.2/plexus-utils-1.2.pom (767 B at 30 kB/s)
[INFO] Downloading from remote-repos: http://overture.au.dk/artifactory/remote-repos/org/codehaus/plexus/plexus/1.0.5/plexus-1.0.5.pom
[INFO] Downloaded from remote-repos: http://overture.au.dk/artifactory/remote-repos/org/codehaus/plexus/plexus/1.0.5/plexus-1.0.5.pom (5.9 kB at 283 kB/s)
[INFO] Downloading from remote-repos: http://overture.au.dk/artifactory/remote-repos/org/apache/maven/shared/maven-filtering/1.3/maven-filtering-1.3.pom
[INFO] Downloaded from remote-repos: http://overture.au.dk/artifactory/remote-repos/org/apache/maven/shared/maven-filtering/1.3/maven-filtering-1.3.pom (6.2 kB at 282 kB/s)
[INFO] Downloading from remote-repos: http://overture.au.dk/artifactory/remote-repos/org/codehaus/plexus/plexus-utils/3.0.18/plexus-utils-3.0.18.pom
[INFO] Downloaded from remote-repos: http://overture.au.dk/artifactory/remote-repos/org/codehaus/plexus/plexus-utils/3.0.18/plexus-utils-3.0.18.pom (3.4 kB at 117 kB/s)
[INFO] Downloading from remote-repos: http://overture.au.dk/artifactory/remote-repos/org/codehaus/plexus/plexus-utils/3.0.21/plexus-utils-3.0.21.pom
[INFO] Downloaded from remote-repos: http://overture.au.dk/artifactory/remote-repos/org/codehaus/plexus/plexus-utils/3.0.21/plexus-utils-3.0.21.pom (3.8 kB at 81 kB/s)
[INFO] Downloading from remote-repos: http://overture.au.dk/artifactory/remote-repos/org/apache/maven/shared/maven-repository-builder/1.0/maven-repository-builder-1.0.pom
[INFO] Downloaded from remote-repos: http://overture.au.dk/artifactory/remote-repos/org/apache/maven/shared/maven-repository-builder/1.0/maven-repository-builder-1.0.pom (4.6 kB at 240 kB/s)
[INFO] Downloading from remote-repos: http://overture.au.dk/artifactory/remote-repos/org/codehaus/plexus/plexus-interpolation/1.22/plexus-interpolation-1.22.jar
[INFO] Downloading from remote-repos: http://overture.au.dk/artifactory/remote-repos/org/codehaus/plexus/plexus-archiver/3.0.1/plexus-archiver-3.0.1.jar
[INFO] Downloading from remote-repos: http://overture.au.dk/artifactory/remote-repos/org/iq80/snappy/snappy/0.3/snappy-0.3.jar
[INFO] Downloading from remote-repos: http://overture.au.dk/artifactory/remote-repos/org/apache/maven/shared/file-management/1.1/file-management-1.1.jar
[INFO] Downloaded from remote-repos: http://overture.au.dk/artifactory/remote-repos/org/codehaus/plexus/plexus-interpolation/1.22/plexus-interpolation-1.22.jar (77 kB at 1.5 MB/s)
[INFO] Downloading from remote-repos: http://overture.au.dk/artifactory/remote-repos/org/apache/maven/shared/maven-filtering/1.3/maven-filtering-1.3.jar
[INFO] Downloading from remote-repos: http://overture.au.dk/artifactory/remote-repos/org/codehaus/plexus/plexus-io/2.6/plexus-io-2.6.jar
[INFO] Downloaded from remote-repos: http://overture.au.dk/artifactory/remote-repos/org/iq80/snappy/snappy/0.3/snappy-0.3.jar (49 kB at 827 kB/s)
[INFO] Downloading from remote-repos: http://overture.au.dk/artifactory/remote-repos/org/codehaus/plexus/plexus-utils/3.0.21/plexus-utils-3.0.21.jar
[INFO] Downloaded from remote-repos: http://overture.au.dk/artifactory/remote-repos/org/apache/maven/shared/file-management/1.1/file-management-1.1.jar (31 kB at 557 kB/s)
[INFO] Downloading from remote-repos: http://overture.au.dk/artifactory/remote-repos/org/apache/maven/shared/maven-repository-builder/1.0/maven-repository-builder-1.0.jar
[INFO] Downloaded from remote-repos: http://overture.au.dk/artifactory/remote-repos/org/codehaus/plexus/plexus-io/2.6/plexus-io-2.6.jar (84 kB at 2.4 MB/s)
[INFO] Downloaded from remote-repos: http://overture.au.dk/artifactory/remote-repos/org/codehaus/plexus/plexus-archiver/3.0.1/plexus-archiver-3.0.1.jar (381 kB at 4.1 MB/s)
[INFO] Downloaded from remote-repos: http://overture.au.dk/artifactory/remote-repos/org/apache/maven/shared/maven-filtering/1.3/maven-filtering-1.3.jar (51 kB at 800 kB/s)
[INFO] Downloaded from remote-repos: http://overture.au.dk/artifactory/remote-repos/org/apache/maven/shared/maven-repository-builder/1.0/maven-repository-builder-1.0.jar (22 kB at 409 kB/s)
[INFO] Downloaded from remote-repos: http://overture.au.dk/artifactory/remote-repos/org/codehaus/plexus/plexus-utils/3.0.21/plexus-utils-3.0.21.jar (245 kB at 2.9 MB/s)
[INFO] Building jar: /var/lib/jenkins/workspace/overturetool_ncb_development/core/commandline/target/commandlinetool-2.7.5-SNAPSHOT-jar-with-dependencies.jar
[INFO] 
[INFO] -------------------< org.overturetool.core:codegen >--------------------
[INFO] Building Code Generation 2.7.5-SNAPSHOT                          [20/35]
[INFO] --------------------------------[ pom ]---------------------------------
[INFO] 
[INFO] --- maven-enforcer-plugin:1.0:enforce (enforce-maven) @ codegen ---
[INFO] 
[INFO] --- jacoco-maven-plugin:0.7.6.201602180812:prepare-agent (jacoco-initialize) @ codegen ---
[INFO] argLine set to -javaagent:/var/lib/jenkins/workspace/overturetool_ncb_development/.repository/org/jacoco/org.jacoco.agent/0.7.6.201602180812/org.jacoco.agent-0.7.6.201602180812-runtime.jar=destfile=/var/lib/jenkins/workspace/overturetool_ncb_development/core/codegen/target/coverage-reports/jacoco-unit.exec,excludes=**/org/overture/ast/analysis/**/*.*:**/org/overture/ast/expressions/**/*.*:**/org/overture/ast/modules/**/*.*:**/org/overture/ast/node/**/*.*:**/org/overture/ast/patterns/**/*.*:**/org/overture/ast/statements/**/*.*:**/org/overture/ast/types/**/*.*:**/org/overture/codegen/ir/**/*:**/org/overture/ide/**/*
[INFO] 
[INFO] --- jacoco-maven-plugin:0.7.6.201602180812:report (jacoco-site) @ codegen ---
[INFO] Skipping JaCoCo execution due to missing execution data file:/var/lib/jenkins/workspace/overturetool_ncb_development/core/codegen/target/coverage-reports/jacoco-unit.exec
[INFO] 
[INFO] --- maven-javadoc-plugin:2.10.3:jar (attach-javadocs) @ codegen ---
[INFO] Not executing Javadoc as the project is not a Java classpath-capable package
[INFO] 
[INFO] ------------------< org.overturetool.core.codegen:ir >------------------
[INFO] Building The Intermediate Representation Tree 2.7.5-SNAPSHOT     [21/35]
[INFO] --------------------------------[ jar ]---------------------------------
[INFO] 
[INFO] --- maven-enforcer-plugin:1.0:enforce (enforce-maven) @ ir ---
[INFO] 
[INFO] --- jacoco-maven-plugin:0.7.6.201602180812:prepare-agent (jacoco-initialize) @ ir ---
[INFO] argLine set to -javaagent:/var/lib/jenkins/workspace/overturetool_ncb_development/.repository/org/jacoco/org.jacoco.agent/0.7.6.201602180812/org.jacoco.agent-0.7.6.201602180812-runtime.jar=destfile=/var/lib/jenkins/workspace/overturetool_ncb_development/core/codegen/ir/target/coverage-reports/jacoco-unit.exec,excludes=**/org/overture/ast/analysis/**/*.*:**/org/overture/ast/expressions/**/*.*:**/org/overture/ast/modules/**/*.*:**/org/overture/ast/node/**/*.*:**/org/overture/ast/patterns/**/*.*:**/org/overture/ast/statements/**/*.*:**/org/overture/ast/types/**/*.*:**/org/overture/codegen/ir/**/*:**/org/overture/ide/**/*
[INFO] 
[INFO] --- astcreator-plugin:1.6.8:generate (java) @ ir ---
[INFO] Preparing for tree generation...
[INFO] Checking if generation required.
[INFO] All up to date
[INFO] 
[INFO] --- build-helper-maven-plugin:1.10:add-source (add-source) @ ir ---
[INFO] Source directory: /var/lib/jenkins/workspace/overturetool_ncb_development/core/codegen/ir/target/generated-sources/astCreator added.
[INFO] 
[INFO] --- maven-resources-plugin:2.7:resources (default-resources) @ ir ---
[INFO] Using 'UTF-8' encoding to copy filtered resources.
[INFO] Copying 2 resources
[INFO] 
[INFO] --- maven-compiler-plugin:3.5.1:compile (default-compile) @ ir ---
[INFO] Nothing to compile - all classes are up to date
[INFO] 
[INFO] --- maven-resources-plugin:2.7:testResources (default-testResources) @ ir ---
[INFO] Using 'UTF-8' encoding to copy filtered resources.
[INFO] skip non existing resourceDirectory /var/lib/jenkins/workspace/overturetool_ncb_development/core/codegen/ir/src/test/resources
[INFO] 
[INFO] --- maven-compiler-plugin:3.5.1:testCompile (default-testCompile) @ ir ---
[INFO] No sources to compile
[INFO] 
[INFO] --- maven-surefire-plugin:2.19.1:test (default-test) @ ir ---
[INFO] No tests to run.
[INFO] 
[INFO] --- maven-jar-plugin:2.6:jar (default-jar) @ ir ---
[INFO] Building jar: /var/lib/jenkins/workspace/overturetool_ncb_development/core/codegen/ir/target/ir-2.7.5-SNAPSHOT.jar
[INFO] 
[INFO] --- jacoco-maven-plugin:0.7.6.201602180812:report (jacoco-site) @ ir ---
[INFO] Skipping JaCoCo execution due to missing execution data file:/var/lib/jenkins/workspace/overturetool_ncb_development/core/codegen/ir/target/coverage-reports/jacoco-unit.exec
[INFO] 
[INFO] --- maven-javadoc-plugin:2.10.3:jar (attach-javadocs) @ ir ---
[INFO] 
4 warnings
[WARNING] Javadoc Warnings
[WARNING] Picked up JAVA_TOOL_OPTIONS: -Dmaven.ext.class.path="/var/lib/jenkins/workspace/overturetool_ncb_development@tmp/withMaven5a1ec836/pipeline-maven-spy.jar" -Dorg.jenkinsci.plugins.pipeline.maven.reportsFolder="/var/lib/jenkins/workspace/overturetool_ncb_development@tmp/withMaven5a1ec836"
[WARNING] /var/lib/jenkins/workspace/overturetool_ncb_development/core/codegen/ir/src/main/java/org/overture/codegen/ir/IrToStringUtil.java:3: error: package org.overture.codegen.ir.declarations does not exist
[WARNING] import org.overture.codegen.ir.declarations.AVarDeclIR;
[WARNING] ^
[WARNING] /var/lib/jenkins/workspace/overturetool_ncb_development/core/codegen/ir/src/main/java/org/overture/codegen/ir/IrToStringUtil.java:4: error: package org.overture.codegen.ir.statements does not exist
[WARNING] import org.overture.codegen.ir.statements.ABlockStmIR;
[WARNING] ^
[WARNING] /var/lib/jenkins/workspace/overturetool_ncb_development/core/codegen/ir/src/main/java/org/overture/codegen/ir/IrToStringUtil.java:8: error: cannot find symbol
[WARNING] public static String getSimpleBlockString(ABlockStmIR node)
[WARNING] ^
[WARNING] symbol:   class ABlockStmIR
[WARNING] location: class IrToStringUtil
[WARNING] /var/lib/jenkins/workspace/overturetool_ncb_development/core/codegen/ir/src/main/java/org/overture/codegen/ir/IrToStringUtil.java:24: error: cannot find symbol
[WARNING] public static String getBlockSimpleBlockString(ABlockStmIR node)
[WARNING] ^
[WARNING] symbol:   class ABlockStmIR
[WARNING] location: class IrToStringUtil
[INFO] Building jar: /var/lib/jenkins/workspace/overturetool_ncb_development/core/codegen/ir/target/ir-2.7.5-SNAPSHOT-javadoc.jar
[INFO] 
[INFO] ---------------< org.overturetool.core.codegen:platform >---------------
[INFO] Building The Code Generation Platform 2.7.5-SNAPSHOT             [22/35]
[INFO] --------------------------------[ jar ]---------------------------------
[INFO] 
[INFO] --- maven-enforcer-plugin:1.0:enforce (enforce-maven) @ platform ---
[INFO] 
[INFO] --- jacoco-maven-plugin:0.7.6.201602180812:prepare-agent (jacoco-initialize) @ platform ---
[INFO] argLine set to -javaagent:/var/lib/jenkins/workspace/overturetool_ncb_development/.repository/org/jacoco/org.jacoco.agent/0.7.6.201602180812/org.jacoco.agent-0.7.6.201602180812-runtime.jar=destfile=/var/lib/jenkins/workspace/overturetool_ncb_development/core/codegen/platform/target/coverage-reports/jacoco-unit.exec,excludes=**/org/overture/ast/analysis/**/*.*:**/org/overture/ast/expressions/**/*.*:**/org/overture/ast/modules/**/*.*:**/org/overture/ast/node/**/*.*:**/org/overture/ast/patterns/**/*.*:**/org/overture/ast/statements/**/*.*:**/org/overture/ast/types/**/*.*:**/org/overture/codegen/ir/**/*:**/org/overture/ide/**/*
[INFO] 
[INFO] --- maven-resources-plugin:2.7:resources (default-resources) @ platform ---
[INFO] Using 'UTF-8' encoding to copy filtered resources.
[INFO] Copying 1 resource
[INFO] 
[INFO] --- maven-compiler-plugin:3.5.1:compile (default-compile) @ platform ---
[INFO] Nothing to compile - all classes are up to date
[INFO] 
[INFO] --- maven-resources-plugin:2.7:testResources (default-testResources) @ platform ---
[INFO] Using 'UTF-8' encoding to copy filtered resources.
[INFO] Copying 12 resources
[INFO] 
[INFO] --- maven-compiler-plugin:3.5.1:testCompile (default-testCompile) @ platform ---
[INFO] Changes detected - recompiling the module!
[INFO] Compiling 5 source files to /var/lib/jenkins/workspace/overturetool_ncb_development/core/codegen/platform/target/test-classes
[INFO] 
[INFO] --- maven-surefire-plugin:2.19.1:test (default-test) @ platform ---

-------------------------------------------------------
 T E S T S
-------------------------------------------------------
Picked up JAVA_TOOL_OPTIONS: -Dmaven.ext.class.path="/var/lib/jenkins/workspace/overturetool_ncb_development@tmp/withMaven5a1ec836/pipeline-maven-spy.jar" -Dorg.jenkinsci.plugins.pipeline.maven.reportsFolder="/var/lib/jenkins/workspace/overturetool_ncb_development@tmp/withMaven5a1ec836" 
Running org.overture.codegen.tests.LocalVarTest
Tests run: 11, Failures: 0, Errors: 0, Skipped: 0, Time elapsed: 2.024 sec - in org.overture.codegen.tests.LocalVarTest
Running org.overture.codegen.tests.util.DeclAssistantTest
Tests run: 3, Failures: 0, Errors: 0, Skipped: 0, Time elapsed: 0.008 sec - in org.overture.codegen.tests.util.DeclAssistantTest
Running org.overture.codegen.tests.TemplateManagerTest
Tests run: 3, Failures: 0, Errors: 0, Skipped: 0, Time elapsed: 0.322 sec - in org.overture.codegen.tests.TemplateManagerTest

Results :

Tests run: 17, Failures: 0, Errors: 0, Skipped: 0

[INFO] 
[INFO] --- maven-jar-plugin:2.6:jar (default-jar) @ platform ---
[INFO] Building jar: /var/lib/jenkins/workspace/overturetool_ncb_development/core/codegen/platform/target/platform-2.7.5-SNAPSHOT.jar
[INFO] 
[INFO] --- jacoco-maven-plugin:0.7.6.201602180812:report (jacoco-site) @ platform ---
[INFO] Analyzed bundle 'The Code Generation Platform' with 158 classes
[INFO] 
[INFO] --- maven-javadoc-plugin:2.10.3:jar (attach-javadocs) @ platform ---
Sending interrupt signal to process
[ERROR] MavenReportException: Error while generating Javadoc: 
Exit code: 143 - Picked up JAVA_TOOL_OPTIONS: -Dmaven.ext.class.path="/var/lib/jenkins/workspace/overturetool_ncb_development@tmp/withMaven5a1ec836/pipeline-maven-spy.jar" -Dorg.jenkinsci.plugins.pipeline.maven.reportsFolder="/var/lib/jenkins/workspace/overturetool_ncb_development@tmp/withMaven5a1ec836" 
/var/lib/jenkins/workspace/overturetool_ncb_development/core/codegen/platform/src/main/java/org/overture/codegen/merging/MergeVisitor.java:77: warning: no description for @param
	 * @param userCallables
	   ^
/var/lib/jenkins/workspace/overturetool_ncb_development/core/codegen/platform/src/main/java/org/overture/codegen/merging/MergeVisitor.java:60: warning: no description for @param
	 * @param templateManager
	   ^
/var/lib/jenkins/workspace/overturetool_ncb_development/core/codegen/platform/src/main/java/org/overture/codegen/merging/MergeVisitor.java:61: warning: no description for @param
	 * @param templateCallables
	   ^
/var/lib/jenkins/workspace/overturetool_ncb_development/core/codegen/platform/src/main/java/org/overture/codegen/merging/TemplateManager.java:75: warning: no description for @param
	 * @param templateLoadRef
	   ^

Command line was: /usr/lib/jvm/java-8-oracle/jre/../bin/javadoc @options @packages

Refer to the generated Javadoc files in '/var/lib/jenkins/workspace/overturetool_ncb_development/core/codegen/platform/target/apidocs' dir.

org.apache.maven.reporting.MavenReportException: 
Exit code: 143 - Picked up JAVA_TOOL_OPTIONS: -Dmaven.ext.class.path="/var/lib/jenkins/workspace/overturetool_ncb_development@tmp/withMaven5a1ec836/pipeline-maven-spy.jar" -Dorg.jenkinsci.plugins.pipeline.maven.reportsFolder="/var/lib/jenkins/workspace/overturetool_ncb_development@tmp/withMaven5a1ec836" 
/var/lib/jenkins/workspace/overturetool_ncb_development/core/codegen/platform/src/main/java/org/overture/codegen/merging/MergeVisitor.java:77: warning: no description for @param
	 * @param userCallables
	   ^
/var/lib/jenkins/workspace/overturetool_ncb_development/core/codegen/platform/src/main/java/org/overture/codegen/merging/MergeVisitor.java:60: warning: no description for @param
	 * @param templateManager
	   ^
/var/lib/jenkins/workspace/overturetool_ncb_development/core/codegen/platform/src/main/java/org/overture/codegen/merging/MergeVisitor.java:61: warning: no description for @param
	 * @param templateCallables
	   ^
/var/lib/jenkins/workspace/overturetool_ncb_development/core/codegen/platform/src/main/java/org/overture/codegen/merging/TemplateManager.java:75: warning: no description for @param
	 * @param templateLoadRef
	   ^

Command line was: /usr/lib/jvm/java-8-oracle/jre/../bin/javadoc @options @packages

Refer to the generated Javadoc files in '/var/lib/jenkins/workspace/overturetool_ncb_development/core/codegen/platform/target/apidocs' dir.

    at org.apache.maven.plugin.javadoc.AbstractJavadocMojo.executeJavadocCommandLine (AbstractJavadocMojo.java:5163)
    at org.apache.maven.plugin.javadoc.AbstractJavadocMojo.executeReport (AbstractJavadocMojo.java:2075)
    at org.apache.maven.plugin.javadoc.JavadocJar.execute (JavadocJar.java:188)
    at org.apache.maven.plugin.DefaultBuildPluginManager.executeMojo (DefaultBuildPluginManager.java:137)
    at org.apache.maven.lifecycle.internal.MojoExecutor.execute (MojoExecutor.java:210)
    at org.apache.maven.lifecycle.internal.MojoExecutor.execute (MojoExecutor.java:156)
    at org.apache.maven.lifecycle.internal.MojoExecutor.execute (MojoExecutor.java:148)
    at org.apache.maven.lifecycle.internal.LifecycleModuleBuilder.buildProject (LifecycleModuleBuilder.java:117)
    at org.apache.maven.lifecycle.internal.LifecycleModuleBuilder.buildProject (LifecycleModuleBuilder.java:81)
    at org.apache.maven.lifecycle.internal.builder.singlethreaded.SingleThreadedBuilder.build (SingleThreadedBuilder.java:56)
    at org.apache.maven.lifecycle.internal.LifecycleStarter.execute (LifecycleStarter.java:128)
    at org.apache.maven.DefaultMaven.doExecute (DefaultMaven.java:305)
    at org.apache.maven.DefaultMaven.doExecute (DefaultMaven.java:192)
    at org.apache.maven.DefaultMaven.execute (DefaultMaven.java:105)
    at org.apache.maven.cli.MavenCli.execute (MavenCli.java:956)
    at org.apache.maven.cli.MavenCli.doMain (MavenCli.java:288)
    at org.apache.maven.cli.MavenCli.main (MavenCli.java:192)
    at sun.reflect.NativeMethodAccessorImpl.invoke0 (Native Method)
    at sun.reflect.NativeMethodAccessorImpl.invoke (NativeMethodAccessorImpl.java:62)
    at sun.reflect.DelegatingMethodAccessorImpl.invoke (DelegatingMethodAccessorImpl.java:43)
    at java.lang.reflect.Method.invoke (Method.java:498)
    at org.codehaus.plexus.classworlds.launcher.Launcher.launchEnhanced (Launcher.java:289)
    at org.codehaus.plexus.classworlds.launcher.Launcher.launch (Launcher.java:229)
    at org.codehaus.plexus.classworlds.launcher.Launcher.mainWithExitCode (Launcher.java:415)
    at org.codehaus.plexus.classworlds.launcher.Launcher.main (Launcher.java:356)
[INFO] Building jar: /var/lib/jenkins/workspace/overturetool_ncb_development/core/codegen/platform/target/platform-2.7.5-SNAPSHOT-javadoc.jar
script returned exit code 143
[Pipeline] }
[withMaven] One or multiple Maven executions have been ignored by the Jenkins Pipeline Maven Plugin because they have been interrupted before completion (1). See Pipeline Maven Plugin FAQ for more details.
[Pipeline] // withMaven
[Pipeline] }
[Pipeline] // stage
[Pipeline] stage
[Pipeline] { (Clean up workspace)
[Pipeline] cleanWs
[WS-CLEANUP] Deleting project workspace...
[WS-CLEANUP] Deferred wipeout is used...
[WS-CLEANUP] done
[Pipeline] }
[Pipeline] // stage
[Pipeline] stage
[Pipeline] { (Reporting)
[Pipeline] emailextrecipients
Not sending mail to user ncdmz\jasim with no permission to view overturetool » ncb/development #142Not sending mail to user nick.battle@gmail.com with no permission to view overturetool » ncb/development #142[Pipeline] emailext
Sending email to: hugodsmacedo@gmail.com
[Pipeline] }
[Pipeline] // stage
[Pipeline] }
[Pipeline] // node
[Pipeline] End of Pipeline

GitHub has been notified of this commit’s build result

Finished: ABORTED