AbortedConsole Output

Skipping 1,532 KB.. Full Log
overturetool_ncb_development/.repository/org/jacoco/org.jacoco.agent/0.7.6.201602180812/org.jacoco.agent-0.7.6.201602180812-runtime.jar=destfile=/var/lib/jenkins/workspace/overturetool_ncb_development/core/testing/target/coverage-reports/jacoco-unit.exec,excludes=**/org/overture/ast/analysis/**/*.*:**/org/overture/ast/expressions/**/*.*:**/org/overture/ast/modules/**/*.*:**/org/overture/ast/node/**/*.*:**/org/overture/ast/patterns/**/*.*:**/org/overture/ast/statements/**/*.*:**/org/overture/ast/types/**/*.*:**/org/overture/codegen/ir/**/*:**/org/overture/ide/**/*
[INFO] 
[INFO] --- jacoco-maven-plugin:0.7.6.201602180812:report (jacoco-site) @ testing ---
[INFO] Skipping JaCoCo execution due to missing execution data file:/var/lib/jenkins/workspace/overturetool_ncb_development/core/testing/target/coverage-reports/jacoco-unit.exec
[INFO] 
[INFO] --- maven-javadoc-plugin:2.10.3:jar (attach-javadocs) @ testing ---
[INFO] Not executing Javadoc as the project is not a Java classpath-capable package
[INFO] 
[INFO] --- maven-jarsigner-plugin:1.2:sign (sign) @ testing ---
[INFO] Disabled
[INFO] 
[INFO] --- maven-install-plugin:2.5.2:install (default-install) @ testing ---
[INFO] Installing /var/lib/jenkins/workspace/overturetool_ncb_development/core/testing/pom.xml to /var/lib/jenkins/workspace/overturetool_ncb_development/.repository/org/overturetool/core/testing/3.0.1-SNAPSHOT/testing-3.0.1-SNAPSHOT.pom
[INFO] 
[INFO] --------------< org.overturetool.core.testing:framework >---------------
[INFO] Building Overture Testing Framework 3.0.1-SNAPSHOT                [9/84]
[INFO] --------------------------------[ jar ]---------------------------------
[INFO] 
[INFO] --- maven-enforcer-plugin:1.0:enforce (enforce-maven) @ framework ---
[INFO] 
[INFO] --- jacoco-maven-plugin:0.7.6.201602180812:prepare-agent (jacoco-initialize) @ framework ---
[INFO] argLine set to -javaagent:/var/lib/jenkins/workspace/overturetool_ncb_development/.repository/org/jacoco/org.jacoco.agent/0.7.6.201602180812/org.jacoco.agent-0.7.6.201602180812-runtime.jar=destfile=/var/lib/jenkins/workspace/overturetool_ncb_development/core/testing/framework/target/coverage-reports/jacoco-unit.exec,excludes=**/org/overture/ast/analysis/**/*.*:**/org/overture/ast/expressions/**/*.*:**/org/overture/ast/modules/**/*.*:**/org/overture/ast/node/**/*.*:**/org/overture/ast/patterns/**/*.*:**/org/overture/ast/statements/**/*.*:**/org/overture/ast/types/**/*.*:**/org/overture/codegen/ir/**/*:**/org/overture/ide/**/*
[INFO] 
[INFO] --- maven-resources-plugin:2.7:resources (default-resources) @ framework ---
[INFO] Using 'UTF-8' encoding to copy filtered resources.
[INFO] skip non existing resourceDirectory /var/lib/jenkins/workspace/overturetool_ncb_development/core/testing/framework/src/main/resources
[INFO] 
[INFO] --- maven-compiler-plugin:3.5.1:compile (default-compile) @ framework ---
[INFO] Nothing to compile - all classes are up to date
[INFO] 
[INFO] --- maven-resources-plugin:2.7:testResources (default-testResources) @ framework ---
[INFO] Using 'UTF-8' encoding to copy filtered resources.
[INFO] skip non existing resourceDirectory /var/lib/jenkins/workspace/overturetool_ncb_development/core/testing/framework/src/test/resources
[INFO] 
[INFO] --- maven-compiler-plugin:3.5.1:testCompile (default-testCompile) @ framework ---
[INFO] No sources to compile
[INFO] 
[INFO] --- maven-surefire-plugin:2.19.1:test (default-test) @ framework ---
[INFO] No tests to run.
[INFO] 
[INFO] --- maven-jar-plugin:2.6:jar (default-jar) @ framework ---
[INFO] 
[INFO] --- jacoco-maven-plugin:0.7.6.201602180812:report (jacoco-site) @ framework ---
[INFO] Skipping JaCoCo execution due to missing execution data file:/var/lib/jenkins/workspace/overturetool_ncb_development/core/testing/framework/target/coverage-reports/jacoco-unit.exec
[INFO] 
[INFO] --- maven-javadoc-plugin:2.10.3:jar (attach-javadocs) @ framework ---
[INFO] 
7 errors
36 warnings
[ERROR] MavenReportException: Error while generating Javadoc: 
Exit code: 1 - Picked up JAVA_TOOL_OPTIONS: -Dmaven.ext.class.path="/var/lib/jenkins/workspace/overturetool_ncb_development@tmp/withMaven948c4b2e/pipeline-maven-spy.jar" -Dorg.jenkinsci.plugins.pipeline.maven.reportsFolder="/var/lib/jenkins/workspace/overturetool_ncb_development@tmp/withMaven948c4b2e" 
/var/lib/jenkins/workspace/overturetool_ncb_development/core/testing/framework/src/main/java/org/overture/core/testing/AbsResultTest.java:65: warning: no description for @throws
     * @throws IOException
       ^
/var/lib/jenkins/workspace/overturetool_ncb_development/core/testing/framework/src/main/java/org/overture/core/testing/AbsResultTest.java:66: warning: no description for @throws
     * @throws FileNotFoundException
       ^
/var/lib/jenkins/workspace/overturetool_ncb_development/core/testing/framework/src/main/java/org/overture/core/testing/AbsResultTest.java:102: error: bad use of '>'
     * <code>testing.update.[maven-module].[test-class].[testcase/input-file]>. <br>
                                                                             ^
/var/lib/jenkins/workspace/overturetool_ncb_development/core/testing/framework/src/main/java/org/overture/core/testing/AbsResultTest.java:102: error: element not closed: code
     * <code>testing.update.[maven-module].[test-class].[testcase/input-file]>. <br>
       ^
/var/lib/jenkins/workspace/overturetool_ncb_development/core/testing/framework/src/main/java/org/overture/core/testing/AbsResultTest.java:114: error: self-closing element not allowed
     * <p/>>
       ^
/var/lib/jenkins/workspace/overturetool_ncb_development/core/testing/framework/src/main/java/org/overture/core/testing/AbsResultTest.java:114: error: bad use of '>'
     * <p/>>
           ^
/var/lib/jenkins/workspace/overturetool_ncb_development/core/testing/framework/src/main/java/org/overture/core/testing/AbsResultTest.java:118: warning: no @return
    protected String getTestResultUpdateMessage() {
                     ^
/var/lib/jenkins/workspace/overturetool_ncb_development/core/testing/framework/src/main/java/org/overture/core/testing/AbsResultTest.java:132: warning: no description for @throws
     * @throws ParserException
       ^
/var/lib/jenkins/workspace/overturetool_ncb_development/core/testing/framework/src/main/java/org/overture/core/testing/AbsResultTest.java:133: warning: no description for @throws
     * @throws LexException
       ^
/var/lib/jenkins/workspace/overturetool_ncb_development/core/testing/framework/src/main/java/org/overture/core/testing/AbsResultTest.java:134: warning: no description for @throws
     * @throws IOException
       ^
/var/lib/jenkins/workspace/overturetool_ncb_development/core/testing/framework/src/main/java/org/overture/core/testing/AbsResultTest.java:153: error: tag not allowed here: <li>
     * <li>Test Input Source path</li>
       ^
/var/lib/jenkins/workspace/overturetool_ncb_development/core/testing/framework/src/main/java/org/overture/core/testing/AbsResultTest.java:154: error: tag not allowed here: <li>
     * <li>Result File path</li>
       ^
/var/lib/jenkins/workspace/overturetool_ncb_development/core/testing/framework/src/main/java/org/overture/core/testing/AbsResultTest.java:155: error: tag not allowed here: <li>
     * <li>Test Override property</li>
       ^
/var/lib/jenkins/workspace/overturetool_ncb_development/core/testing/framework/src/main/java/org/overture/core/testing/ParamFineGrainTest.java:75: warning: no description for @throws
	 * @throws IOException
	   ^
/var/lib/jenkins/workspace/overturetool_ncb_development/core/testing/framework/src/main/java/org/overture/core/testing/ParamFineGrainTest.java:76: warning: no description for @throws
	 * @throws LexException
	   ^
/var/lib/jenkins/workspace/overturetool_ncb_development/core/testing/framework/src/main/java/org/overture/core/testing/ParamFineGrainTest.java:77: warning: no description for @throws
	 * @throws ParserException
	   ^
/var/lib/jenkins/workspace/overturetool_ncb_development/core/testing/framework/src/main/java/org/overture/core/testing/ParamExternalsTest.java:53: warning: no description for @param
	 * @param nameParameter
	   ^
/var/lib/jenkins/workspace/overturetool_ncb_development/core/testing/framework/src/main/java/org/overture/core/testing/ParamExternalsTest.java:54: warning: no description for @param
	 * @param testParameter
	   ^
/var/lib/jenkins/workspace/overturetool_ncb_development/core/testing/framework/src/main/java/org/overture/core/testing/ParamExternalsTest.java:55: warning: no description for @param
	 * @param resultParameter
	   ^
/var/lib/jenkins/workspace/overturetool_ncb_development/core/testing/framework/src/main/java/org/overture/core/testing/ParamNoResultFileTest.java:79: warning: no description for @throws
	 * @throws IOException
	   ^
/var/lib/jenkins/workspace/overturetool_ncb_development/core/testing/framework/src/main/java/org/overture/core/testing/ParamNoResultFileTest.java:80: warning: no description for @throws
	 * @throws LexException
	   ^
/var/lib/jenkins/workspace/overturetool_ncb_development/core/testing/framework/src/main/java/org/overture/core/testing/ParamNoResultFileTest.java:81: warning: no description for @throws
	 * @throws ParserException
	   ^
/var/lib/jenkins/workspace/overturetool_ncb_development/core/testing/framework/src/main/java/org/overture/core/testing/ParamNoResultFileTest.java:44: warning: no description for @param
 * @param <R>
   ^
/var/lib/jenkins/workspace/overturetool_ncb_development/core/testing/framework/src/main/java/org/overture/core/testing/ParamStandardTest.java:89: warning: no description for @throws
	 * @throws IOException
	   ^
/var/lib/jenkins/workspace/overturetool_ncb_development/core/testing/framework/src/main/java/org/overture/core/testing/ParamStandardTest.java:90: warning: no description for @throws
	 * @throws LexException
	   ^
/var/lib/jenkins/workspace/overturetool_ncb_development/core/testing/framework/src/main/java/org/overture/core/testing/ParamStandardTest.java:91: warning: no description for @throws
	 * @throws ParserException
	   ^
/var/lib/jenkins/workspace/overturetool_ncb_development/core/testing/framework/src/main/java/org/overture/core/testing/ParamStandardTest.java:49: warning: no description for @param
 * @param <R> 
   ^
/var/lib/jenkins/workspace/overturetool_ncb_development/core/testing/framework/src/main/java/org/overture/core/testing/ParseTcFacade.java:80: warning: no description for @throws
	 * @throws LexException
	   ^
/var/lib/jenkins/workspace/overturetool_ncb_development/core/testing/framework/src/main/java/org/overture/core/testing/ParseTcFacade.java:81: warning: no description for @throws
	 * @throws ParserException
	   ^
/var/lib/jenkins/workspace/overturetool_ncb_development/core/testing/framework/src/main/java/org/overture/core/testing/ParseTcFacade.java:128: warning: no @throws for org.overture.parser.syntax.ParserException
	public static PExp parseExpressionString(String expression)
	                   ^
/var/lib/jenkins/workspace/overturetool_ncb_development/core/testing/framework/src/main/java/org/overture/core/testing/ParseTcFacade.java:128: warning: no @throws for org.overture.parser.lex.LexException
	public static PExp parseExpressionString(String expression)
	                   ^
/var/lib/jenkins/workspace/overturetool_ncb_development/core/testing/framework/src/main/java/org/overture/core/testing/ParseTcFacade.java:143: warning: no @throws for org.overture.parser.syntax.ParserException
	public static PExp parseTcExpressionString(String expression)
	                   ^
/var/lib/jenkins/workspace/overturetool_ncb_development/core/testing/framework/src/main/java/org/overture/core/testing/ParseTcFacade.java:143: warning: no @throws for org.overture.parser.lex.LexException
	public static PExp parseTcExpressionString(String expression)
	                   ^
/var/lib/jenkins/workspace/overturetool_ncb_development/core/testing/framework/src/main/java/org/overture/core/testing/ParseTcFacade.java:158: warning: no @throws for org.overture.parser.syntax.ParserException
	public static PExp parseTcExpressionString(String expression,
	                   ^
/var/lib/jenkins/workspace/overturetool_ncb_development/core/testing/framework/src/main/java/org/overture/core/testing/ParseTcFacade.java:158: warning: no @throws for org.overture.parser.lex.LexException
	public static PExp parseTcExpressionString(String expression,
	                   ^
/var/lib/jenkins/workspace/overturetool_ncb_development/core/testing/framework/src/main/java/org/overture/core/testing/ParseTcFacade.java:180: warning: no @throws for org.overture.parser.syntax.ParserException
	public static List<INode> typedAstFromString(String model, Dialect dialect)
	                          ^
/var/lib/jenkins/workspace/overturetool_ncb_development/core/testing/framework/src/main/java/org/overture/core/testing/ParseTcFacade.java:180: warning: no @throws for org.overture.parser.lex.LexException
	public static List<INode> typedAstFromString(String model, Dialect dialect)
	                          ^
/var/lib/jenkins/workspace/overturetool_ncb_development/core/testing/framework/src/main/java/org/overture/core/testing/ParseTcFacade.java:214: warning: no description for @throws
	 * @throws LexException
	   ^
/var/lib/jenkins/workspace/overturetool_ncb_development/core/testing/framework/src/main/java/org/overture/core/testing/ParseTcFacade.java:215: warning: no description for @throws
	 * @throws ParserException
	   ^
/var/lib/jenkins/workspace/overturetool_ncb_development/core/testing/framework/src/main/java/org/overture/core/testing/ParseTcFacade.java:231: warning: no description for @throws
	 * @throws IOException
	   ^
/var/lib/jenkins/workspace/overturetool_ncb_development/core/testing/framework/src/main/java/org/overture/core/testing/ParseTcFacade.java:232: warning: no description for @throws
	 * @throws ParserException
	   ^
/var/lib/jenkins/workspace/overturetool_ncb_development/core/testing/framework/src/main/java/org/overture/core/testing/ParseTcFacade.java:233: warning: no description for @throws
	 * @throws LexException
	   ^
/var/lib/jenkins/workspace/overturetool_ncb_development/core/testing/framework/src/main/java/org/overture/core/testing/PathsProvider.java:109: warning: no description for @return
	 * @return
	   ^

Command line was: /usr/lib/jvm/java-8-oracle/jre/../bin/javadoc @options @packages

Refer to the generated Javadoc files in '/var/lib/jenkins/workspace/overturetool_ncb_development/core/testing/framework/target/apidocs' dir.

org.apache.maven.reporting.MavenReportException: 
Exit code: 1 - Picked up JAVA_TOOL_OPTIONS: -Dmaven.ext.class.path="/var/lib/jenkins/workspace/overturetool_ncb_development@tmp/withMaven948c4b2e/pipeline-maven-spy.jar" -Dorg.jenkinsci.plugins.pipeline.maven.reportsFolder="/var/lib/jenkins/workspace/overturetool_ncb_development@tmp/withMaven948c4b2e" 
/var/lib/jenkins/workspace/overturetool_ncb_development/core/testing/framework/src/main/java/org/overture/core/testing/AbsResultTest.java:65: warning: no description for @throws
     * @throws IOException
       ^
/var/lib/jenkins/workspace/overturetool_ncb_development/core/testing/framework/src/main/java/org/overture/core/testing/AbsResultTest.java:66: warning: no description for @throws
     * @throws FileNotFoundException
       ^
/var/lib/jenkins/workspace/overturetool_ncb_development/core/testing/framework/src/main/java/org/overture/core/testing/AbsResultTest.java:102: error: bad use of '>'
     * <code>testing.update.[maven-module].[test-class].[testcase/input-file]>. <br>
                                                                             ^
/var/lib/jenkins/workspace/overturetool_ncb_development/core/testing/framework/src/main/java/org/overture/core/testing/AbsResultTest.java:102: error: element not closed: code
     * <code>testing.update.[maven-module].[test-class].[testcase/input-file]>. <br>
       ^
/var/lib/jenkins/workspace/overturetool_ncb_development/core/testing/framework/src/main/java/org/overture/core/testing/AbsResultTest.java:114: error: self-closing element not allowed
     * <p/>>
       ^
/var/lib/jenkins/workspace/overturetool_ncb_development/core/testing/framework/src/main/java/org/overture/core/testing/AbsResultTest.java:114: error: bad use of '>'
     * <p/>>
           ^
/var/lib/jenkins/workspace/overturetool_ncb_development/core/testing/framework/src/main/java/org/overture/core/testing/AbsResultTest.java:118: warning: no @return
    protected String getTestResultUpdateMessage() {
                     ^
/var/lib/jenkins/workspace/overturetool_ncb_development/core/testing/framework/src/main/java/org/overture/core/testing/AbsResultTest.java:132: warning: no description for @throws
     * @throws ParserException
       ^
/var/lib/jenkins/workspace/overturetool_ncb_development/core/testing/framework/src/main/java/org/overture/core/testing/AbsResultTest.java:133: warning: no description for @throws
     * @throws LexException
       ^
/var/lib/jenkins/workspace/overturetool_ncb_development/core/testing/framework/src/main/java/org/overture/core/testing/AbsResultTest.java:134: warning: no description for @throws
     * @throws IOException
       ^
/var/lib/jenkins/workspace/overturetool_ncb_development/core/testing/framework/src/main/java/org/overture/core/testing/AbsResultTest.java:153: error: tag not allowed here: <li>
     * <li>Test Input Source path</li>
       ^
/var/lib/jenkins/workspace/overturetool_ncb_development/core/testing/framework/src/main/java/org/overture/core/testing/AbsResultTest.java:154: error: tag not allowed here: <li>
     * <li>Result File path</li>
       ^
/var/lib/jenkins/workspace/overturetool_ncb_development/core/testing/framework/src/main/java/org/overture/core/testing/AbsResultTest.java:155: error: tag not allowed here: <li>
     * <li>Test Override property</li>
       ^
/var/lib/jenkins/workspace/overturetool_ncb_development/core/testing/framework/src/main/java/org/overture/core/testing/ParamFineGrainTest.java:75: warning: no description for @throws
	 * @throws IOException
	   ^
/var/lib/jenkins/workspace/overturetool_ncb_development/core/testing/framework/src/main/java/org/overture/core/testing/ParamFineGrainTest.java:76: warning: no description for @throws
	 * @throws LexException
	   ^
/var/lib/jenkins/workspace/overturetool_ncb_development/core/testing/framework/src/main/java/org/overture/core/testing/ParamFineGrainTest.java:77: warning: no description for @throws
	 * @throws ParserException
	   ^
/var/lib/jenkins/workspace/overturetool_ncb_development/core/testing/framework/src/main/java/org/overture/core/testing/ParamExternalsTest.java:53: warning: no description for @param
	 * @param nameParameter
	   ^
/var/lib/jenkins/workspace/overturetool_ncb_development/core/testing/framework/src/main/java/org/overture/core/testing/ParamExternalsTest.java:54: warning: no description for @param
	 * @param testParameter
	   ^
/var/lib/jenkins/workspace/overturetool_ncb_development/core/testing/framework/src/main/java/org/overture/core/testing/ParamExternalsTest.java:55: warning: no description for @param
	 * @param resultParameter
	   ^
/var/lib/jenkins/workspace/overturetool_ncb_development/core/testing/framework/src/main/java/org/overture/core/testing/ParamNoResultFileTest.java:79: warning: no description for @throws
	 * @throws IOException
	   ^
/var/lib/jenkins/workspace/overturetool_ncb_development/core/testing/framework/src/main/java/org/overture/core/testing/ParamNoResultFileTest.java:80: warning: no description for @throws
	 * @throws LexException
	   ^
/var/lib/jenkins/workspace/overturetool_ncb_development/core/testing/framework/src/main/java/org/overture/core/testing/ParamNoResultFileTest.java:81: warning: no description for @throws
	 * @throws ParserException
	   ^
/var/lib/jenkins/workspace/overturetool_ncb_development/core/testing/framework/src/main/java/org/overture/core/testing/ParamNoResultFileTest.java:44: warning: no description for @param
 * @param <R>
   ^
/var/lib/jenkins/workspace/overturetool_ncb_development/core/testing/framework/src/main/java/org/overture/core/testing/ParamStandardTest.java:89: warning: no description for @throws
	 * @throws IOException
	   ^
/var/lib/jenkins/workspace/overturetool_ncb_development/core/testing/framework/src/main/java/org/overture/core/testing/ParamStandardTest.java:90: warning: no description for @throws
	 * @throws LexException
	   ^
/var/lib/jenkins/workspace/overturetool_ncb_development/core/testing/framework/src/main/java/org/overture/core/testing/ParamStandardTest.java:91: warning: no description for @throws
	 * @throws ParserException
	   ^
/var/lib/jenkins/workspace/overturetool_ncb_development/core/testing/framework/src/main/java/org/overture/core/testing/ParamStandardTest.java:49: warning: no description for @param
 * @param <R> 
   ^
/var/lib/jenkins/workspace/overturetool_ncb_development/core/testing/framework/src/main/java/org/overture/core/testing/ParseTcFacade.java:80: warning: no description for @throws
	 * @throws LexException
	   ^
/var/lib/jenkins/workspace/overturetool_ncb_development/core/testing/framework/src/main/java/org/overture/core/testing/ParseTcFacade.java:81: warning: no description for @throws
	 * @throws ParserException
	   ^
/var/lib/jenkins/workspace/overturetool_ncb_development/core/testing/framework/src/main/java/org/overture/core/testing/ParseTcFacade.java:128: warning: no @throws for org.overture.parser.syntax.ParserException
	public static PExp parseExpressionString(String expression)
	                   ^
/var/lib/jenkins/workspace/overturetool_ncb_development/core/testing/framework/src/main/java/org/overture/core/testing/ParseTcFacade.java:128: warning: no @throws for org.overture.parser.lex.LexException
	public static PExp parseExpressionString(String expression)
	                   ^
/var/lib/jenkins/workspace/overturetool_ncb_development/core/testing/framework/src/main/java/org/overture/core/testing/ParseTcFacade.java:143: warning: no @throws for org.overture.parser.syntax.ParserException
	public static PExp parseTcExpressionString(String expression)
	                   ^
/var/lib/jenkins/workspace/overturetool_ncb_development/core/testing/framework/src/main/java/org/overture/core/testing/ParseTcFacade.java:143: warning: no @throws for org.overture.parser.lex.LexException
	public static PExp parseTcExpressionString(String expression)
	                   ^
/var/lib/jenkins/workspace/overturetool_ncb_development/core/testing/framework/src/main/java/org/overture/core/testing/ParseTcFacade.java:158: warning: no @throws for org.overture.parser.syntax.ParserException
	public static PExp parseTcExpressionString(String expression,
	                   ^
/var/lib/jenkins/workspace/overturetool_ncb_development/core/testing/framework/src/main/java/org/overture/core/testing/ParseTcFacade.java:158: warning: no @throws for org.overture.parser.lex.LexException
	public static PExp parseTcExpressionString(String expression,
	                   ^
/var/lib/jenkins/workspace/overturetool_ncb_development/core/testing/framework/src/main/java/org/overture/core/testing/ParseTcFacade.java:180: warning: no @throws for org.overture.parser.syntax.ParserException
	public static List<INode> typedAstFromString(String model, Dialect dialect)
	                          ^
/var/lib/jenkins/workspace/overturetool_ncb_development/core/testing/framework/src/main/java/org/overture/core/testing/ParseTcFacade.java:180: warning: no @throws for org.overture.parser.lex.LexException
	public static List<INode> typedAstFromString(String model, Dialect dialect)
	                          ^
/var/lib/jenkins/workspace/overturetool_ncb_development/core/testing/framework/src/main/java/org/overture/core/testing/ParseTcFacade.java:214: warning: no description for @throws
	 * @throws LexException
	   ^
/var/lib/jenkins/workspace/overturetool_ncb_development/core/testing/framework/src/main/java/org/overture/core/testing/ParseTcFacade.java:215: warning: no description for @throws
	 * @throws ParserException
	   ^
/var/lib/jenkins/workspace/overturetool_ncb_development/core/testing/framework/src/main/java/org/overture/core/testing/ParseTcFacade.java:231: warning: no description for @throws
	 * @throws IOException
	   ^
/var/lib/jenkins/workspace/overturetool_ncb_development/core/testing/framework/src/main/java/org/overture/core/testing/ParseTcFacade.java:232: warning: no description for @throws
	 * @throws ParserException
	   ^
/var/lib/jenkins/workspace/overturetool_ncb_development/core/testing/framework/src/main/java/org/overture/core/testing/ParseTcFacade.java:233: warning: no description for @throws
	 * @throws LexException
	   ^
/var/lib/jenkins/workspace/overturetool_ncb_development/core/testing/framework/src/main/java/org/overture/core/testing/PathsProvider.java:109: warning: no description for @return
	 * @return
	   ^

Command line was: /usr/lib/jvm/java-8-oracle/jre/../bin/javadoc @options @packages

Refer to the generated Javadoc files in '/var/lib/jenkins/workspace/overturetool_ncb_development/core/testing/framework/target/apidocs' dir.

    at org.apache.maven.plugin.javadoc.AbstractJavadocMojo.executeJavadocCommandLine (AbstractJavadocMojo.java:5163)
    at org.apache.maven.plugin.javadoc.AbstractJavadocMojo.executeReport (AbstractJavadocMojo.java:2075)
    at org.apache.maven.plugin.javadoc.JavadocJar.execute (JavadocJar.java:188)
    at org.apache.maven.plugin.DefaultBuildPluginManager.executeMojo (DefaultBuildPluginManager.java:137)
    at org.apache.maven.lifecycle.internal.MojoExecutor.execute (MojoExecutor.java:210)
    at org.apache.maven.lifecycle.internal.MojoExecutor.execute (MojoExecutor.java:156)
    at org.apache.maven.lifecycle.internal.MojoExecutor.execute (MojoExecutor.java:148)
    at org.apache.maven.lifecycle.internal.LifecycleModuleBuilder.buildProject (LifecycleModuleBuilder.java:117)
    at org.apache.maven.lifecycle.internal.LifecycleModuleBuilder.buildProject (LifecycleModuleBuilder.java:81)
    at org.apache.maven.lifecycle.internal.builder.singlethreaded.SingleThreadedBuilder.build (SingleThreadedBuilder.java:56)
    at org.apache.maven.lifecycle.internal.LifecycleStarter.execute (LifecycleStarter.java:128)
    at org.apache.maven.DefaultMaven.doExecute (DefaultMaven.java:305)
    at org.apache.maven.DefaultMaven.doExecute (DefaultMaven.java:192)
    at org.apache.maven.DefaultMaven.execute (DefaultMaven.java:105)
    at org.apache.maven.cli.MavenCli.execute (MavenCli.java:956)
    at org.apache.maven.cli.MavenCli.doMain (MavenCli.java:288)
    at org.apache.maven.cli.MavenCli.main (MavenCli.java:192)
    at sun.reflect.NativeMethodAccessorImpl.invoke0 (Native Method)
    at sun.reflect.NativeMethodAccessorImpl.invoke (NativeMethodAccessorImpl.java:62)
    at sun.reflect.DelegatingMethodAccessorImpl.invoke (DelegatingMethodAccessorImpl.java:43)
    at java.lang.reflect.Method.invoke (Method.java:498)
    at org.codehaus.plexus.classworlds.launcher.Launcher.launchEnhanced (Launcher.java:289)
    at org.codehaus.plexus.classworlds.launcher.Launcher.launch (Launcher.java:229)
    at org.codehaus.plexus.classworlds.launcher.Launcher.mainWithExitCode (Launcher.java:415)
    at org.codehaus.plexus.classworlds.launcher.Launcher.main (Launcher.java:356)
[INFO] Building jar: /var/lib/jenkins/workspace/overturetool_ncb_development/core/testing/framework/target/framework-3.0.1-SNAPSHOT-javadoc.jar
[INFO] 
[INFO] --- maven-jarsigner-plugin:1.2:sign (sign) @ framework ---
[INFO] Disabled
[INFO] 
[INFO] --- maven-install-plugin:2.5.2:install (default-install) @ framework ---
[INFO] Installing /var/lib/jenkins/workspace/overturetool_ncb_development/core/testing/framework/target/framework-3.0.1-SNAPSHOT.jar to /var/lib/jenkins/workspace/overturetool_ncb_development/.repository/org/overturetool/core/testing/framework/3.0.1-SNAPSHOT/framework-3.0.1-SNAPSHOT.jar
[INFO] Installing /var/lib/jenkins/workspace/overturetool_ncb_development/core/testing/framework/pom.xml to /var/lib/jenkins/workspace/overturetool_ncb_development/.repository/org/overturetool/core/testing/framework/3.0.1-SNAPSHOT/framework-3.0.1-SNAPSHOT.pom
[INFO] Installing /var/lib/jenkins/workspace/overturetool_ncb_development/core/testing/framework/target/framework-3.0.1-SNAPSHOT-javadoc.jar to /var/lib/jenkins/workspace/overturetool_ncb_development/.repository/org/overturetool/core/testing/framework/3.0.1-SNAPSHOT/framework-3.0.1-SNAPSHOT-javadoc.jar
[INFO] 
[INFO] ---------------< org.overturetool.core.testing:samples >----------------
[INFO] Building Overture Sample Tests 3.0.1-SNAPSHOT                    [10/84]
[INFO] --------------------------------[ jar ]---------------------------------
[INFO] 
[INFO] --- maven-enforcer-plugin:1.0:enforce (enforce-maven) @ samples ---
[INFO] 
[INFO] --- jacoco-maven-plugin:0.7.6.201602180812:prepare-agent (jacoco-initialize) @ samples ---
[INFO] argLine set to -javaagent:/var/lib/jenkins/workspace/overturetool_ncb_development/.repository/org/jacoco/org.jacoco.agent/0.7.6.201602180812/org.jacoco.agent-0.7.6.201602180812-runtime.jar=destfile=/var/lib/jenkins/workspace/overturetool_ncb_development/core/testing/samples/target/coverage-reports/jacoco-unit.exec,excludes=**/org/overture/ast/analysis/**/*.*:**/org/overture/ast/expressions/**/*.*:**/org/overture/ast/modules/**/*.*:**/org/overture/ast/node/**/*.*:**/org/overture/ast/patterns/**/*.*:**/org/overture/ast/statements/**/*.*:**/org/overture/ast/types/**/*.*:**/org/overture/codegen/ir/**/*:**/org/overture/ide/**/*
[INFO] 
[INFO] --- maven-resources-plugin:2.7:resources (default-resources) @ samples ---
[INFO] Using 'UTF-8' encoding to copy filtered resources.
[INFO] Copying 1 resource
[INFO] 
[INFO] --- maven-compiler-plugin:3.5.1:compile (default-compile) @ samples ---
[INFO] No sources to compile
[INFO] 
[INFO] --- maven-resources-plugin:2.7:testResources (default-testResources) @ samples ---
[INFO] Using 'UTF-8' encoding to copy filtered resources.
[INFO] Copying 3215 resources
[INFO] 
[INFO] --- maven-compiler-plugin:3.5.1:testCompile (default-testCompile) @ samples ---
[INFO] Nothing to compile - all classes are up to date
[INFO] 
[INFO] --- maven-surefire-plugin:2.19.1:test (default-test) @ samples ---

-------------------------------------------------------
 T E S T S
-------------------------------------------------------
Picked up JAVA_TOOL_OPTIONS: -Dmaven.ext.class.path="/var/lib/jenkins/workspace/overturetool_ncb_development@tmp/withMaven948c4b2e/pipeline-maven-spy.jar" -Dorg.jenkinsci.plugins.pipeline.maven.reportsFolder="/var/lib/jenkins/workspace/overturetool_ncb_development@tmp/withMaven948c4b2e" 
Running org.overture.core.testing.samples.SampleStandardTest
Tests run: 2, Failures: 0, Errors: 0, Skipped: 0, Time elapsed: 0.854 sec - in org.overture.core.testing.samples.SampleStandardTest
Running org.overture.core.testing.samples.SampleExternalsTest
Tests run: 3211, Failures: 0, Errors: 0, Skipped: 0, Time elapsed: 13.891 sec - in org.overture.core.testing.samples.SampleExternalsTest

Results :

Tests run: 3213, Failures: 0, Errors: 0, Skipped: 0

[INFO] 
[INFO] --- maven-jar-plugin:2.6:jar (default-jar) @ samples ---
[INFO] 
[INFO] --- jacoco-maven-plugin:0.7.6.201602180812:report (jacoco-site) @ samples ---
[INFO] Analyzed bundle 'Overture Sample Tests' with 0 classes
[INFO] 
[INFO] --- maven-javadoc-plugin:2.10.3:jar (attach-javadocs) @ samples ---
[INFO] 
[INFO] --- maven-jarsigner-plugin:1.2:sign (sign) @ samples ---
[INFO] Disabled
[INFO] 
[INFO] --- maven-install-plugin:2.5.2:install (default-install) @ samples ---
[INFO] Skipping artifact installation
[INFO] 
[INFO] ----------------< org.overturetool.core:prettyprinting >----------------
[INFO] Building VDM Pretty Printing 3.0.1-SNAPSHOT                      [11/84]
[INFO] --------------------------------[ pom ]---------------------------------
[INFO] 
[INFO] --- maven-enforcer-plugin:1.0:enforce (enforce-maven) @ prettyprinting ---
[INFO] 
[INFO] --- jacoco-maven-plugin:0.7.6.201602180812:prepare-agent (jacoco-initialize) @ prettyprinting ---
[INFO] argLine set to -javaagent:/var/lib/jenkins/workspace/overturetool_ncb_development/.repository/org/jacoco/org.jacoco.agent/0.7.6.201602180812/org.jacoco.agent-0.7.6.201602180812-runtime.jar=destfile=/var/lib/jenkins/workspace/overturetool_ncb_development/core/prettyprinting/target/coverage-reports/jacoco-unit.exec,excludes=**/org/overture/ast/analysis/**/*.*:**/org/overture/ast/expressions/**/*.*:**/org/overture/ast/modules/**/*.*:**/org/overture/ast/node/**/*.*:**/org/overture/ast/patterns/**/*.*:**/org/overture/ast/statements/**/*.*:**/org/overture/ast/types/**/*.*:**/org/overture/codegen/ir/**/*:**/org/overture/ide/**/*
[INFO] 
[INFO] --- jacoco-maven-plugin:0.7.6.201602180812:report (jacoco-site) @ prettyprinting ---
[INFO] Skipping JaCoCo execution due to missing execution data file:/var/lib/jenkins/workspace/overturetool_ncb_development/core/prettyprinting/target/coverage-reports/jacoco-unit.exec
[INFO] 
[INFO] --- maven-javadoc-plugin:2.10.3:jar (attach-javadocs) @ prettyprinting ---
[INFO] Not executing Javadoc as the project is not a Java classpath-capable package
[INFO] 
[INFO] --- maven-jarsigner-plugin:1.2:sign (sign) @ prettyprinting ---
[INFO] Disabled
[INFO] 
[INFO] --- maven-install-plugin:2.5.2:install (default-install) @ prettyprinting ---
[INFO] Installing /var/lib/jenkins/workspace/overturetool_ncb_development/core/prettyprinting/pom.xml to /var/lib/jenkins/workspace/overturetool_ncb_development/.repository/org/overturetool/core/prettyprinting/3.0.1-SNAPSHOT/prettyprinting-3.0.1-SNAPSHOT.pom
[INFO] 
[INFO] ---------< org.overturetool.core.prettyprinting:prettyprinter >---------
[INFO] Building The VDM Pretty Printer 3.0.1-SNAPSHOT                   [12/84]
[INFO] --------------------------------[ jar ]---------------------------------
[INFO] 
[INFO] --- maven-enforcer-plugin:1.0:enforce (enforce-maven) @ prettyprinter ---
[INFO] 
[INFO] --- jacoco-maven-plugin:0.7.6.201602180812:prepare-agent (jacoco-initialize) @ prettyprinter ---
[INFO] argLine set to -javaagent:/var/lib/jenkins/workspace/overturetool_ncb_development/.repository/org/jacoco/org.jacoco.agent/0.7.6.201602180812/org.jacoco.agent-0.7.6.201602180812-runtime.jar=destfile=/var/lib/jenkins/workspace/overturetool_ncb_development/core/prettyprinting/prettyprinter/target/coverage-reports/jacoco-unit.exec,excludes=**/org/overture/ast/analysis/**/*.*:**/org/overture/ast/expressions/**/*.*:**/org/overture/ast/modules/**/*.*:**/org/overture/ast/node/**/*.*:**/org/overture/ast/patterns/**/*.*:**/org/overture/ast/statements/**/*.*:**/org/overture/ast/types/**/*.*:**/org/overture/codegen/ir/**/*:**/org/overture/ide/**/*
[INFO] 
[INFO] --- maven-resources-plugin:2.7:resources (default-resources) @ prettyprinter ---
[INFO] Using 'UTF-8' encoding to copy filtered resources.
[INFO] skip non existing resourceDirectory /var/lib/jenkins/workspace/overturetool_ncb_development/core/prettyprinting/prettyprinter/src/main/resources
[INFO] 
[INFO] --- maven-compiler-plugin:3.5.1:compile (default-compile) @ prettyprinter ---
[INFO] Nothing to compile - all classes are up to date
[INFO] 
[INFO] --- maven-resources-plugin:2.7:testResources (default-testResources) @ prettyprinter ---
[INFO] Using 'UTF-8' encoding to copy filtered resources.
[INFO] skip non existing resourceDirectory /var/lib/jenkins/workspace/overturetool_ncb_development/core/prettyprinting/prettyprinter/src/test/resources
[INFO] 
[INFO] --- maven-compiler-plugin:3.5.1:testCompile (default-testCompile) @ prettyprinter ---
[INFO] No sources to compile
[INFO] 
[INFO] --- maven-surefire-plugin:2.19.1:test (default-test) @ prettyprinter ---
[INFO] No tests to run.
[INFO] 
[INFO] --- maven-jar-plugin:2.6:jar (default-jar) @ prettyprinter ---
[INFO] 
[INFO] --- jacoco-maven-plugin:0.7.6.201602180812:report (jacoco-site) @ prettyprinter ---
[INFO] Skipping JaCoCo execution due to missing execution data file:/var/lib/jenkins/workspace/overturetool_ncb_development/core/prettyprinting/prettyprinter/target/coverage-reports/jacoco-unit.exec
[INFO] 
[INFO] --- maven-javadoc-plugin:2.10.3:jar (attach-javadocs) @ prettyprinter ---
[WARNING] Javadoc Warnings
[WARNING] Picked up JAVA_TOOL_OPTIONS: -Dmaven.ext.class.path="/var/lib/jenkins/workspace/overturetool_ncb_development@tmp/withMaven948c4b2e/pipeline-maven-spy.jar" -Dorg.jenkinsci.plugins.pipeline.maven.reportsFolder="/var/lib/jenkins/workspace/overturetool_ncb_development@tmp/withMaven948c4b2e"
[INFO] Building jar: /var/lib/jenkins/workspace/overturetool_ncb_development/core/prettyprinting/prettyprinter/target/prettyprinter-3.0.1-SNAPSHOT-javadoc.jar
[INFO] 
[INFO] --- maven-jarsigner-plugin:1.2:sign (sign) @ prettyprinter ---
[INFO] Disabled
[INFO] 
[INFO] --- maven-install-plugin:2.5.2:install (default-install) @ prettyprinter ---
[INFO] Installing /var/lib/jenkins/workspace/overturetool_ncb_development/core/prettyprinting/prettyprinter/target/prettyprinter-3.0.1-SNAPSHOT.jar to /var/lib/jenkins/workspace/overturetool_ncb_development/.repository/org/overturetool/core/prettyprinting/prettyprinter/3.0.1-SNAPSHOT/prettyprinter-3.0.1-SNAPSHOT.jar
[INFO] Installing /var/lib/jenkins/workspace/overturetool_ncb_development/core/prettyprinting/prettyprinter/pom.xml to /var/lib/jenkins/workspace/overturetool_ncb_development/.repository/org/overturetool/core/prettyprinting/prettyprinter/3.0.1-SNAPSHOT/prettyprinter-3.0.1-SNAPSHOT.pom
[INFO] Installing /var/lib/jenkins/workspace/overturetool_ncb_development/core/prettyprinting/prettyprinter/target/prettyprinter-3.0.1-SNAPSHOT-javadoc.jar to /var/lib/jenkins/workspace/overturetool_ncb_development/.repository/org/overturetool/core/prettyprinting/prettyprinter/3.0.1-SNAPSHOT/prettyprinter-3.0.1-SNAPSHOT-javadoc.jar
[INFO] 
[INFO] ---------------------< org.overturetool.core:pog >----------------------
[INFO] Building The Proof Obligation Generator 3.0.1-SNAPSHOT           [13/84]
[INFO] --------------------------------[ jar ]---------------------------------
[INFO] 
[INFO] --- maven-enforcer-plugin:1.0:enforce (enforce-maven) @ pog ---
[INFO] 
[INFO] --- jacoco-maven-plugin:0.7.6.201602180812:prepare-agent (jacoco-initialize) @ pog ---
[INFO] argLine set to -javaagent:/var/lib/jenkins/workspace/overturetool_ncb_development/.repository/org/jacoco/org.jacoco.agent/0.7.6.201602180812/org.jacoco.agent-0.7.6.201602180812-runtime.jar=destfile=/var/lib/jenkins/workspace/overturetool_ncb_development/core/pog/target/coverage-reports/jacoco-unit.exec,excludes=**/org/overture/ast/analysis/**/*.*:**/org/overture/ast/expressions/**/*.*:**/org/overture/ast/modules/**/*.*:**/org/overture/ast/node/**/*.*:**/org/overture/ast/patterns/**/*.*:**/org/overture/ast/statements/**/*.*:**/org/overture/ast/types/**/*.*:**/org/overture/codegen/ir/**/*:**/org/overture/ide/**/*
[INFO] 
[INFO] --- astcreator-plugin:1.6.10:generate (generate-ast) @ pog ---
[INFO] Preparing for tree generation...
[INFO] Configuring extension
[INFO] 	Extension base dependency is: "org.overturetool.core:ast"
[INFO] 	Searching for base dependency artifact
[INFO] 	Extension base artifact found - exstracting base tree definition files
[INFO] 	Setting base definition files to:
[INFO] 		base: /var/lib/jenkins/workspace/overturetool_ncb_development/core/pog/target/overtureII.astv2
[INFO] 		base tostring: /var/lib/jenkins/workspace/overturetool_ncb_development/core/pog/target/overtureII.astv2.tostring
[INFO] 	Extension base artifact configured.
[INFO] Checking if generation required.
[INFO] Extended AST unchanged
[INFO] Nothing to generate, source already up-to-date
[INFO] 
[INFO] --- build-helper-maven-plugin:1.10:add-source (add-source) @ pog ---
[INFO] Source directory: /var/lib/jenkins/workspace/overturetool_ncb_development/core/pog/target/generated-sources/astCreator added.
[INFO] 
[INFO] --- maven-resources-plugin:2.7:resources (default-resources) @ pog ---
[INFO] Using 'UTF-8' encoding to copy filtered resources.
[INFO] Copying 2 resources
[INFO] 
[INFO] --- maven-compiler-plugin:3.5.1:compile (default-compile) @ pog ---
[INFO] Nothing to compile - all classes are up to date
[INFO] 
[INFO] --- maven-resources-plugin:2.7:testResources (default-testResources) @ pog ---
[INFO] Using 'UTF-8' encoding to copy filtered resources.
[INFO] Copying 329 resources
[INFO] 
[INFO] --- maven-compiler-plugin:3.5.1:testCompile (default-testCompile) @ pog ---
[INFO] Nothing to compile - all classes are up to date
[INFO] 
[INFO] --- maven-surefire-plugin:2.19.1:test (default-test) @ pog ---

-------------------------------------------------------
 T E S T S
-------------------------------------------------------
Picked up JAVA_TOOL_OPTIONS: -Dmaven.ext.class.path="/var/lib/jenkins/workspace/overturetool_ncb_development@tmp/withMaven948c4b2e/pipeline-maven-spy.jar" -Dorg.jenkinsci.plugins.pipeline.maven.reportsFolder="/var/lib/jenkins/workspace/overturetool_ncb_development@tmp/withMaven948c4b2e" 
Running org.overture.pog.tests.VariableSubTest
Tests run: 7, Failures: 0, Errors: 0, Skipped: 0, Time elapsed: 0.3 sec - in org.overture.pog.tests.VariableSubTest
Running org.overture.pog.tests.newtests.PogBasicTest
Tests run: 39, Failures: 0, Errors: 0, Skipped: 0, Time elapsed: 0.975 sec - in org.overture.pog.tests.newtests.PogBasicTest
Running org.overture.pog.tests.newtests.PogBugRegressionTest
Tests run: 15, Failures: 0, Errors: 0, Skipped: 0, Time elapsed: 0.154 sec - in org.overture.pog.tests.newtests.PogBugRegressionTest
Running org.overture.pog.tests.newtests.PogTypeIntegrityTest
Tests run: 42, Failures: 0, Errors: 0, Skipped: 42, Time elapsed: 0.086 sec - in org.overture.pog.tests.newtests.PogTypeIntegrityTest
Running org.overture.pog.tests.newtests.VarDefIntegrityTest
Tests run: 42, Failures: 0, Errors: 0, Skipped: 42, Time elapsed: 0.024 sec - in org.overture.pog.tests.newtests.VarDefIntegrityTest
Running org.overture.pog.tests.newtests.PogIntegrationTest
Tests run: 50, Failures: 0, Errors: 0, Skipped: 0, Time elapsed: 2.507 sec - in org.overture.pog.tests.newtests.PogIntegrationTest

Results :

Tests run: 195, Failures: 0, Errors: 0, Skipped: 84

[INFO] 
[INFO] --- maven-jar-plugin:2.6:jar (default-jar) @ pog ---
[INFO] 
[INFO] --- jacoco-maven-plugin:0.7.6.201602180812:report (jacoco-site) @ pog ---
[INFO] Analyzed bundle 'The Proof Obligation Generator' with 91 classes
[INFO] 
[INFO] --- maven-javadoc-plugin:2.10.3:jar (attach-javadocs) @ pog ---
[INFO] 
100 warnings
[WARNING] Javadoc Warnings
[WARNING] Picked up JAVA_TOOL_OPTIONS: -Dmaven.ext.class.path="/var/lib/jenkins/workspace/overturetool_ncb_development@tmp/withMaven948c4b2e/pipeline-maven-spy.jar" -Dorg.jenkinsci.plugins.pipeline.maven.reportsFolder="/var/lib/jenkins/workspace/overturetool_ncb_development@tmp/withMaven948c4b2e"
[WARNING] /var/lib/jenkins/workspace/overturetool_ncb_development/core/pog/src/main/java/org/overture/pog/utility/PatternAlwaysMatchesVisitor.java:46: warning: no description for @param
[WARNING] * @param node
[WARNING] ^
[WARNING] /var/lib/jenkins/workspace/overturetool_ncb_development/core/pog/src/main/java/org/overture/pog/utility/PatternAlwaysMatchesVisitor.java:47: warning: no description for @return
[WARNING] * @return
[WARNING] ^
[WARNING] /var/lib/jenkins/workspace/overturetool_ncb_development/core/pog/src/main/java/org/overture/pog/utility/PatternAlwaysMatchesVisitor.java:48: warning: no description for @throws
[WARNING] * @throws AnalysisException
[WARNING] ^
[WARNING] /var/lib/jenkins/workspace/overturetool_ncb_development/core/pog/src/main/java/org/overture/pog/utility/PatternAlwaysMatchesVisitor.java:68: warning: no description for @param
[WARNING] * @param node
[WARNING] ^
[WARNING] /var/lib/jenkins/workspace/overturetool_ncb_development/core/pog/src/main/java/org/overture/pog/utility/PatternAlwaysMatchesVisitor.java:69: warning: no description for @return
[WARNING] * @return
[WARNING] ^
[WARNING] /var/lib/jenkins/workspace/overturetool_ncb_development/core/pog/src/main/java/org/overture/pog/utility/PatternAlwaysMatchesVisitor.java:70: warning: no description for @throws
[WARNING] * @throws AnalysisException
[WARNING] ^
[WARNING] /var/lib/jenkins/workspace/overturetool_ncb_development/core/pog/src/main/java/org/overture/pog/obligation/ProofObligation.java:237: warning: no @param for node
[WARNING] protected AForAllExp makeRelContext(ATypeDefinition node, AVariableExp... exps){
[WARNING] ^
[WARNING] /var/lib/jenkins/workspace/overturetool_ncb_development/core/pog/src/main/java/org/overture/pog/obligation/ProofObligation.java:237: warning: no @param for exps
[WARNING] protected AForAllExp makeRelContext(ATypeDefinition node, AVariableExp... exps){
[WARNING] ^
[WARNING] /var/lib/jenkins/workspace/overturetool_ncb_development/core/pog/src/main/java/org/overture/pog/obligation/ProofObligation.java:237: warning: no @return
[WARNING] protected AForAllExp makeRelContext(ATypeDefinition node, AVariableExp... exps){
[WARNING] ^
[WARNING] /var/lib/jenkins/workspace/overturetool_ncb_development/core/pog/src/main/java/org/overture/pog/obligation/ProofObligation.java:260: warning: no @param for patternType
[WARNING] protected PMultipleBind getMultipleTypeBind(PType patternType,
[WARNING] ^
[WARNING] /var/lib/jenkins/workspace/overturetool_ncb_development/core/pog/src/main/java/org/overture/pog/obligation/ProofObligation.java:260: warning: no @param for patternNames
[WARNING] protected PMultipleBind getMultipleTypeBind(PType patternType,
[WARNING] ^
[WARNING] /var/lib/jenkins/workspace/overturetool_ncb_development/core/pog/src/main/java/org/overture/pog/obligation/ProofObligation.java:260: warning: no @return
[WARNING] protected PMultipleBind getMultipleTypeBind(PType patternType,
[WARNING] ^
[WARNING] /var/lib/jenkins/workspace/overturetool_ncb_development/core/pog/src/main/java/org/overture/pog/obligation/ProofObligation.java:283: warning: no @param for setExp
[WARNING] protected PMultipleBind getMultipleSetBind(PExp setExp,
[WARNING] ^
[WARNING] /var/lib/jenkins/workspace/overturetool_ncb_development/core/pog/src/main/java/org/overture/pog/obligation/ProofObligation.java:283: warning: no @param for patternNames
[WARNING] protected PMultipleBind getMultipleSetBind(PExp setExp,
[WARNING] ^
[WARNING] /var/lib/jenkins/workspace/overturetool_ncb_development/core/pog/src/main/java/org/overture/pog/obligation/ProofObligation.java:283: warning: no @return
[WARNING] protected PMultipleBind getMultipleSetBind(PExp setExp,
[WARNING] ^
[WARNING] /var/lib/jenkins/workspace/overturetool_ncb_development/core/pog/src/main/java/org/overture/pog/obligation/ProofObligation.java:305: warning: no @param for patternType
[WARNING] protected List<PMultipleBind> getMultipleTypeBindList(PType patternType,
[WARNING] ^
[WARNING] /var/lib/jenkins/workspace/overturetool_ncb_development/core/pog/src/main/java/org/overture/pog/obligation/ProofObligation.java:305: warning: no @param for patternNames
[WARNING] protected List<PMultipleBind> getMultipleTypeBindList(PType patternType,
[WARNING] ^
[WARNING] /var/lib/jenkins/workspace/overturetool_ncb_development/core/pog/src/main/java/org/overture/pog/obligation/ProofObligation.java:305: warning: no @return
[WARNING] protected List<PMultipleBind> getMultipleTypeBindList(PType patternType,
[WARNING] ^
[WARNING] /var/lib/jenkins/workspace/overturetool_ncb_development/core/pog/src/main/java/org/overture/pog/obligation/ProofObligation.java:316: warning: no @param for setExp
[WARNING] protected List<PMultipleBind> getMultipleSetBindList(PExp setExp,
[WARNING] ^
[WARNING] /var/lib/jenkins/workspace/overturetool_ncb_development/core/pog/src/main/java/org/overture/pog/obligation/ProofObligation.java:316: warning: no @param for patternNames
[WARNING] protected List<PMultipleBind> getMultipleSetBindList(PExp setExp,
[WARNING] ^
[WARNING] /var/lib/jenkins/workspace/overturetool_ncb_development/core/pog/src/main/java/org/overture/pog/obligation/ProofObligation.java:316: warning: no @return
[WARNING] protected List<PMultipleBind> getMultipleSetBindList(PExp setExp,
[WARNING] ^
[WARNING] /var/lib/jenkins/workspace/overturetool_ncb_development/core/pog/src/main/java/org/overture/pog/obligation/ProofObligation.java:327: warning: no @param for name
[WARNING] protected ILexNameToken getUnique(String name)
[WARNING] ^
[WARNING] /var/lib/jenkins/workspace/overturetool_ncb_development/core/pog/src/main/java/org/overture/pog/obligation/ProofObligation.java:327: warning: no @return
[WARNING] protected ILexNameToken getUnique(String name)
[WARNING] ^
[WARNING] /var/lib/jenkins/workspace/overturetool_ncb_development/core/pog/src/main/java/org/overture/pog/obligation/ProofObligation.java:335: warning: no @param for left
[WARNING] protected AEqualsBinaryExp getEqualsExp(PExp left, PExp right)
[WARNING] ^
[WARNING] /var/lib/jenkins/workspace/overturetool_ncb_development/core/pog/src/main/java/org/overture/pog/obligation/ProofObligation.java:335: warning: no @param for right
[WARNING] protected AEqualsBinaryExp getEqualsExp(PExp left, PExp right)
[WARNING] ^
[WARNING] /var/lib/jenkins/workspace/overturetool_ncb_development/core/pog/src/main/java/org/overture/pog/obligation/ProofObligation.java:335: warning: no @return
[WARNING] protected AEqualsBinaryExp getEqualsExp(PExp left, PExp right)
[WARNING] ^
[WARNING] /var/lib/jenkins/workspace/overturetool_ncb_development/core/pog/src/main/java/org/overture/pog/obligation/ProofObligation.java:343: warning: no @param for name
[WARNING] protected AVariableExp getVarExp(ILexNameToken name)
[WARNING] ^
[WARNING] /var/lib/jenkins/workspace/overturetool_ncb_development/core/pog/src/main/java/org/overture/pog/obligation/ProofObligation.java:343: warning: no @return
[WARNING] protected AVariableExp getVarExp(ILexNameToken name)
[WARNING] ^
[WARNING] /var/lib/jenkins/workspace/overturetool_ncb_development/core/pog/src/main/java/org/overture/pog/obligation/ProofObligation.java:354: warning: no @param for name
[WARNING] protected AVariableExp getVarExp(ILexNameToken name, PType type)
[WARNING] ^
[WARNING] /var/lib/jenkins/workspace/overturetool_ncb_development/core/pog/src/main/java/org/overture/pog/obligation/ProofObligation.java:354: warning: no @param for type
[WARNING] protected AVariableExp getVarExp(ILexNameToken name, PType type)
[WARNING] ^
[WARNING] /var/lib/jenkins/workspace/overturetool_ncb_development/core/pog/src/main/java/org/overture/pog/obligation/ProofObligation.java:354: warning: no @return
[WARNING] protected AVariableExp getVarExp(ILexNameToken name, PType type)
[WARNING] ^
[WARNING] /var/lib/jenkins/workspace/overturetool_ncb_development/core/pog/src/main/java/org/overture/pog/obligation/ProofObligation.java:364: warning: no @param for name
[WARNING] protected AVariableExp getVarExp(ILexNameToken name, PDefinition vardef)
[WARNING] ^
[WARNING] /var/lib/jenkins/workspace/overturetool_ncb_development/core/pog/src/main/java/org/overture/pog/obligation/ProofObligation.java:364: warning: no @param for vardef
[WARNING] protected AVariableExp getVarExp(ILexNameToken name, PDefinition vardef)
[WARNING] ^
[WARNING] /var/lib/jenkins/workspace/overturetool_ncb_development/core/pog/src/main/java/org/overture/pog/obligation/ProofObligation.java:364: warning: no @return
[WARNING] protected AVariableExp getVarExp(ILexNameToken name, PDefinition vardef)
[WARNING] ^
[WARNING] /var/lib/jenkins/workspace/overturetool_ncb_development/core/pog/src/main/java/org/overture/pog/obligation/ProofObligation.java:374: warning: no description for @return
[WARNING] * @return
[WARNING] ^
[WARNING] /var/lib/jenkins/workspace/overturetool_ncb_development/core/pog/src/main/java/org/overture/pog/obligation/ProofObligation.java:376: warning: no @param for name
[WARNING] protected AVariableExp getVarExp(ILexNameToken name, PDefinition vardef, PType type){
[WARNING] ^
[WARNING] /var/lib/jenkins/workspace/overturetool_ncb_development/core/pog/src/main/java/org/overture/pog/obligation/ProofObligation.java:376: warning: no @param for vardef
[WARNING] protected AVariableExp getVarExp(ILexNameToken name, PDefinition vardef, PType type){
[WARNING] ^
[WARNING] /var/lib/jenkins/workspace/overturetool_ncb_development/core/pog/src/main/java/org/overture/pog/obligation/ProofObligation.java:376: warning: no @param for type
[WARNING] protected AVariableExp getVarExp(ILexNameToken name, PDefinition vardef, PType type){
[WARNING] ^
[WARNING] /var/lib/jenkins/workspace/overturetool_ncb_development/core/pog/src/main/java/org/overture/pog/obligation/ProofObligation.java:392: warning: no @param for root
[WARNING] protected AApplyExp getApplyExp(PExp root, PExp... arglist)
[WARNING] ^
[WARNING] /var/lib/jenkins/workspace/overturetool_ncb_development/core/pog/src/main/java/org/overture/pog/obligation/ProofObligation.java:392: warning: no @param for arglist
[WARNING] protected AApplyExp getApplyExp(PExp root, PExp... arglist)
[WARNING] ^
[WARNING] /var/lib/jenkins/workspace/overturetool_ncb_development/core/pog/src/main/java/org/overture/pog/obligation/ProofObligation.java:392: warning: no @return
[WARNING] protected AApplyExp getApplyExp(PExp root, PExp... arglist)
[WARNING] ^
[WARNING] /var/lib/jenkins/workspace/overturetool_ncb_development/core/pog/src/main/java/org/overture/pog/obligation/ProofObligation.java:400: warning: no @param for root
[WARNING] protected AApplyExp getApplyExp(PExp root, List<PExp> arglist)
[WARNING] ^
[WARNING] /var/lib/jenkins/workspace/overturetool_ncb_development/core/pog/src/main/java/org/overture/pog/obligation/ProofObligation.java:400: warning: no @param for arglist
[WARNING] protected AApplyExp getApplyExp(PExp root, List<PExp> arglist)
[WARNING] ^
[WARNING] /var/lib/jenkins/workspace/overturetool_ncb_development/core/pog/src/main/java/org/overture/pog/obligation/ProofObligation.java:400: warning: no @return
[WARNING] protected AApplyExp getApplyExp(PExp root, List<PExp> arglist)
[WARNING] ^
[WARNING] /var/lib/jenkins/workspace/overturetool_ncb_development/core/pog/src/main/java/org/overture/pog/obligation/ProofObligation.java:418: warning: no @param for i
[WARNING] protected AIntLiteralExp getIntLiteral(long i)
[WARNING] ^
[WARNING] /var/lib/jenkins/workspace/overturetool_ncb_development/core/pog/src/main/java/org/overture/pog/obligation/ProofObligation.java:418: warning: no @return
[WARNING] protected AIntLiteralExp getIntLiteral(long i)
[WARNING] ^
[WARNING] /var/lib/jenkins/workspace/overturetool_ncb_development/core/pog/src/main/java/org/overture/pog/obligation/ProofObligation.java:430: warning: no @param for root
[WARNING] protected PExp makeAnd(PExp root, PExp e)
[WARNING] ^
[WARNING] /var/lib/jenkins/workspace/overturetool_ncb_development/core/pog/src/main/java/org/overture/pog/obligation/ProofObligation.java:430: warning: no @param for e
[WARNING] protected PExp makeAnd(PExp root, PExp e)
[WARNING] ^
[WARNING] /var/lib/jenkins/workspace/overturetool_ncb_development/core/pog/src/main/java/org/overture/pog/obligation/ProofObligation.java:430: warning: no @return
[WARNING] protected PExp makeAnd(PExp root, PExp e)
[WARNING] ^
[WARNING] /var/lib/jenkins/workspace/overturetool_ncb_development/core/pog/src/main/java/org/overture/pog/obligation/ProofObligation.java:450: warning: no @param for root
[WARNING] protected PExp makeOr(PExp root, PExp e)
[WARNING] ^
[WARNING] /var/lib/jenkins/workspace/overturetool_ncb_development/core/pog/src/main/java/org/overture/pog/obligation/ProofObligation.java:450: warning: no @param for e
[WARNING] protected PExp makeOr(PExp root, PExp e)
[WARNING] ^
[WARNING] /var/lib/jenkins/workspace/overturetool_ncb_development/core/pog/src/main/java/org/overture/pog/obligation/ProofObligation.java:450: warning: no @return
[WARNING] protected PExp makeOr(PExp root, PExp e)
[WARNING] ^
[WARNING] /var/lib/jenkins/workspace/overturetool_ncb_development/core/pog/src/main/java/org/overture/pog/obligation/ProofObligation.java:469: warning: no @param for pattern
[WARNING] protected PExp patternToExp(PPattern pattern) throws AnalysisException
[WARNING] ^
[WARNING] /var/lib/jenkins/workspace/overturetool_ncb_development/core/pog/src/main/java/org/overture/pog/obligation/ProofObligation.java:469: warning: no @return
[WARNING] protected PExp patternToExp(PPattern pattern) throws AnalysisException
[WARNING] ^
[WARNING] /var/lib/jenkins/workspace/overturetool_ncb_development/core/pog/src/main/java/org/overture/pog/obligation/ProofObligation.java:469: warning: no @throws for org.overture.ast.analysis.AnalysisException
[WARNING] protected PExp patternToExp(PPattern pattern) throws AnalysisException
[WARNING] ^
[WARNING] /var/lib/jenkins/workspace/overturetool_ncb_development/core/pog/src/main/java/org/overture/pog/obligation/FiniteSetObligation.java:57: warning: no description for @param
[WARNING] * @param exp
[WARNING] ^
[WARNING] /var/lib/jenkins/workspace/overturetool_ncb_development/core/pog/src/main/java/org/overture/pog/obligation/FiniteSetObligation.java:58: warning: no description for @param
[WARNING] * @param settype
[WARNING] ^
[WARNING] /var/lib/jenkins/workspace/overturetool_ncb_development/core/pog/src/main/java/org/overture/pog/obligation/FiniteSetObligation.java:59: warning: no description for @param
[WARNING] * @param ctxt
[WARNING] ^
[WARNING] /var/lib/jenkins/workspace/overturetool_ncb_development/core/pog/src/main/java/org/overture/pog/obligation/FiniteSetObligation.java:60: warning: no description for @param
[WARNING] * @param af
[WARNING] ^
[WARNING] /var/lib/jenkins/workspace/overturetool_ncb_development/core/pog/src/main/java/org/overture/pog/obligation/FiniteSetObligation.java:61: warning: no description for @throws
[WARNING] * @throws AnalysisException
[WARNING] ^
[WARNING] /var/lib/jenkins/workspace/overturetool_ncb_development/core/pog/src/main/java/org/overture/pog/obligation/MapInverseObligation.java:42: warning: no description for @param
[WARNING] * @param exp
[WARNING] ^
[WARNING] /var/lib/jenkins/workspace/overturetool_ncb_development/core/pog/src/main/java/org/overture/pog/obligation/MapInverseObligation.java:43: warning: no description for @param
[WARNING] * @param ctxt
[WARNING] ^
[WARNING] /var/lib/jenkins/workspace/overturetool_ncb_development/core/pog/src/main/java/org/overture/pog/obligation/MapInverseObligation.java:44: warning: no description for @param
[WARNING] * @param af
[WARNING] ^
[WARNING] /var/lib/jenkins/workspace/overturetool_ncb_development/core/pog/src/main/java/org/overture/pog/obligation/MapInverseObligation.java:45: warning: no description for @throws
[WARNING] * @throws AnalysisException
[WARNING] ^
[WARNING] /var/lib/jenkins/workspace/overturetool_ncb_development/core/pog/src/main/java/org/overture/pog/obligation/TypeCompatibilityObligation.java:107: warning: no description for @param
[WARNING] * @param assistantFactory
[WARNING] ^
[WARNING] /var/lib/jenkins/workspace/overturetool_ncb_development/core/pog/src/main/java/org/overture/pog/obligation/TypeCompatibilityObligation.java:108: warning: no description for @return
[WARNING] * @return
[WARNING] ^
[WARNING] /var/lib/jenkins/workspace/overturetool_ncb_development/core/pog/src/main/java/org/overture/pog/obligation/TypeCompatibilityObligation.java:109: warning: no description for @throws
[WARNING] * @throws AnalysisException
[WARNING] ^
[WARNING] /var/lib/jenkins/workspace/overturetool_ncb_development/core/pog/src/main/java/org/overture/pog/obligation/TypeCompatibilityObligation.java:197: warning: no description for @throws
[WARNING] * @throws AnalysisException
[WARNING] ^
[WARNING] /var/lib/jenkins/workspace/overturetool_ncb_development/core/pog/src/main/java/org/overture/pog/obligation/TypeCompatibilityObligation.java:199: warning: no @param for assistantFactory
[WARNING] protected TypeCompatibilityObligation(INode root, ILexLocation loc,
[WARNING] ^
[WARNING] /var/lib/jenkins/workspace/overturetool_ncb_development/core/pog/src/main/java/org/overture/pog/visitors/AbstractPogParamVisitor.java:37: warning: no @param for annotation
[WARNING] protected IProofObligationList beforeAnnotation(PAnnotation annotation, INode node, IPOContextStack question)
[WARNING] ^
[WARNING] /var/lib/jenkins/workspace/overturetool_ncb_development/core/pog/src/main/java/org/overture/pog/visitors/AbstractPogParamVisitor.java:37: warning: no @param for node
[WARNING] protected IProofObligationList beforeAnnotation(PAnnotation annotation, INode node, IPOContextStack question)
[WARNING] ^
[WARNING] /var/lib/jenkins/workspace/overturetool_ncb_development/core/pog/src/main/java/org/overture/pog/visitors/AbstractPogParamVisitor.java:37: warning: no @param for question
[WARNING] protected IProofObligationList beforeAnnotation(PAnnotation annotation, INode node, IPOContextStack question)
[WARNING] ^
[WARNING] /var/lib/jenkins/workspace/overturetool_ncb_development/core/pog/src/main/java/org/overture/pog/visitors/AbstractPogParamVisitor.java:37: warning: no @return
[WARNING] protected IProofObligationList beforeAnnotation(PAnnotation annotation, INode node, IPOContextStack question)
[WARNING] ^
[WARNING] /var/lib/jenkins/workspace/overturetool_ncb_development/core/pog/src/main/java/org/overture/pog/visitors/AbstractPogParamVisitor.java:37: warning: no @throws for org.overture.ast.analysis.AnalysisException
[WARNING] protected IProofObligationList beforeAnnotation(PAnnotation annotation, INode node, IPOContextStack question)
[WARNING] ^
[WARNING] /var/lib/jenkins/workspace/overturetool_ncb_development/core/pog/src/main/java/org/overture/pog/visitors/AbstractPogParamVisitor.java:117: warning: no @param for annotations
[WARNING] protected IProofObligationList beforeAnnotations(List<PAnnotation> annotations, INode node, IPOContextStack question) throws AnalysisException
[WARNING] ^
[WARNING] /var/lib/jenkins/workspace/overturetool_ncb_development/core/pog/src/main/java/org/overture/pog/visitors/AbstractPogParamVisitor.java:117: warning: no @param for node
[WARNING] protected IProofObligationList beforeAnnotations(List<PAnnotation> annotations, INode node, IPOContextStack question) throws AnalysisException
[WARNING] ^
[WARNING] /var/lib/jenkins/workspace/overturetool_ncb_development/core/pog/src/main/java/org/overture/pog/visitors/AbstractPogParamVisitor.java:117: warning: no @param for question
[WARNING] protected IProofObligationList beforeAnnotations(List<PAnnotation> annotations, INode node, IPOContextStack question) throws AnalysisException
[WARNING] ^
[WARNING] /var/lib/jenkins/workspace/overturetool_ncb_development/core/pog/src/main/java/org/overture/pog/visitors/AbstractPogParamVisitor.java:117: warning: no @return
[WARNING] protected IProofObligationList beforeAnnotations(List<PAnnotation> annotations, INode node, IPOContextStack question) throws AnalysisException
[WARNING] ^
[WARNING] /var/lib/jenkins/workspace/overturetool_ncb_development/core/pog/src/main/java/org/overture/pog/visitors/AbstractPogParamVisitor.java:117: warning: no @throws for org.overture.ast.analysis.AnalysisException
[WARNING] protected IProofObligationList beforeAnnotations(List<PAnnotation> annotations, INode node, IPOContextStack question) throws AnalysisException
[WARNING] ^
[WARNING] /var/lib/jenkins/workspace/overturetool_ncb_development/core/pog/src/main/java/org/overture/pog/visitors/PatternToExpVisitor.java:79: warning: no description for @param
[WARNING] * @param node
[WARNING] ^
[WARNING] /var/lib/jenkins/workspace/overturetool_ncb_development/core/pog/src/main/java/org/overture/pog/visitors/PatternToExpVisitor.java:80: warning: no description for @return
[WARNING] * @return
[WARNING] ^
[WARNING] /var/lib/jenkins/workspace/overturetool_ncb_development/core/pog/src/main/java/org/overture/pog/visitors/PatternToExpVisitor.java:81: warning: no description for @throws
[WARNING] * @throws AnalysisException
[WARNING] ^
[WARNING] /var/lib/jenkins/workspace/overturetool_ncb_development/core/pog/src/main/java/org/overture/pog/visitors/PatternToExpVisitor.java:173: warning: no description for @param
[WARNING] * @param node
[WARNING] ^
[WARNING] /var/lib/jenkins/workspace/overturetool_ncb_development/core/pog/src/main/java/org/overture/pog/visitors/PatternToExpVisitor.java:174: warning: no description for @return
[WARNING] * @return
[WARNING] ^
[WARNING] /var/lib/jenkins/workspace/overturetool_ncb_development/core/pog/src/main/java/org/overture/pog/visitors/PatternToExpVisitor.java:175: warning: no description for @throws
[WARNING] * @throws AnalysisException
[WARNING] ^
[WARNING] /var/lib/jenkins/workspace/overturetool_ncb_development/core/pog/src/main/java/org/overture/pog/visitors/PogParamDefinitionVisitor.java:558: warning: no description for @param
[WARNING] * @param node
[WARNING] ^
[WARNING] /var/lib/jenkins/workspace/overturetool_ncb_development/core/pog/src/main/java/org/overture/pog/visitors/PogParamDefinitionVisitor.java:559: warning: no description for @param
[WARNING] * @param question
[WARNING] ^
[WARNING] /var/lib/jenkins/workspace/overturetool_ncb_development/core/pog/src/main/java/org/overture/pog/visitors/PogParamDefinitionVisitor.java:560: warning: no description for @param
[WARNING] * @param precond
[WARNING] ^
[WARNING] /var/lib/jenkins/workspace/overturetool_ncb_development/core/pog/src/main/java/org/overture/pog/visitors/PogParamDefinitionVisitor.java:561: warning: no description for @throws
[WARNING] * @throws AnalysisException
[WARNING] ^
[WARNING] /var/lib/jenkins/workspace/overturetool_ncb_development/core/pog/src/main/java/org/overture/pog/visitors/PogParamDefinitionVisitor.java:88: warning: no description for @param
[WARNING] * @param parentVisitor
[WARNING] ^
[WARNING] /var/lib/jenkins/workspace/overturetool_ncb_development/core/pog/src/main/java/org/overture/pog/visitors/PogParamDefinitionVisitor.java:71: warning: no description for @param
[WARNING] * @param parentVisitor
[WARNING] ^
[WARNING] /var/lib/jenkins/workspace/overturetool_ncb_development/core/pog/src/main/java/org/overture/pog/visitors/PogParamDefinitionVisitor.java:72: warning: no description for @param
[WARNING] * @param mainVisitor
[WARNING] ^
[WARNING] /var/lib/jenkins/workspace/overturetool_ncb_development/core/pog/src/main/java/org/overture/pog/visitors/PogParamDefinitionVisitor.java:73: warning: no description for @param
[WARNING] * @param assistantFactory
[WARNING] ^
[WARNING] /var/lib/jenkins/workspace/overturetool_ncb_development/core/pog/src/main/java/org/overture/pog/visitors/PogParamExpVisitor.java:56: warning: no description for @param
[WARNING] * @param parentVisitor
[WARNING] ^
[WARNING] /var/lib/jenkins/workspace/overturetool_ncb_development/core/pog/src/main/java/org/overture/pog/visitors/PogParamStmVisitor.java:82: warning: no description for @param
[WARNING] * @param parentVisitor
[WARNING] ^
[WARNING] /var/lib/jenkins/workspace/overturetool_ncb_development/core/pog/src/main/java/org/overture/pog/visitors/PogParamVisitor.java:51: warning: no description for @param
[WARNING] * @param <Q>
[WARNING] ^
[WARNING] /var/lib/jenkins/workspace/overturetool_ncb_development/core/pog/src/main/java/org/overture/pog/visitors/PogParamVisitor.java:52: warning: no description for @param
[WARNING] * @param <A>
[WARNING] ^
[WARNING] /var/lib/jenkins/workspace/overturetool_ncb_development/core/pog/src/main/java/org/overture/pog/visitors/PogParamVisitor.java:74: warning: no description for @param
[WARNING] * @param assistantFactory
[WARNING] ^
[WARNING] /var/lib/jenkins/workspace/overturetool_ncb_development/core/pog/src/main/java/org/overture/pog/contexts/POContext.java:88: warning: no @param for pattern
[WARNING] protected PExp patternToExp(PPattern pattern, IPogAssistantFactory af,
[WARNING] ^
[WARNING] /var/lib/jenkins/workspace/overturetool_ncb_development/core/pog/src/main/java/org/overture/pog/contexts/POContext.java:88: warning: no @param for af
[WARNING] protected PExp patternToExp(PPattern pattern, IPogAssistantFactory af,
[WARNING] ^
[INFO] Building jar: /var/lib/jenkins/workspace/overturetool_ncb_development/core/pog/target/pog-3.0.1-SNAPSHOT-javadoc.jar
[INFO] 
[INFO] --- maven-jarsigner-plugin:1.2:sign (sign) @ pog ---
[INFO] Disabled
[INFO] 
[INFO] --- maven-install-plugin:2.5.2:install (default-install) @ pog ---
[INFO] Installing /var/lib/jenkins/workspace/overturetool_ncb_development/core/pog/target/pog-3.0.1-SNAPSHOT.jar to /var/lib/jenkins/workspace/overturetool_ncb_development/.repository/org/overturetool/core/pog/3.0.1-SNAPSHOT/pog-3.0.1-SNAPSHOT.jar
[INFO] Installing /var/lib/jenkins/workspace/overturetool_ncb_development/core/pog/pom.xml to /var/lib/jenkins/workspace/overturetool_ncb_development/.repository/org/overturetool/core/pog/3.0.1-SNAPSHOT/pog-3.0.1-SNAPSHOT.pom
[INFO] Installing /var/lib/jenkins/workspace/overturetool_ncb_development/core/pog/target/pog-3.0.1-SNAPSHOT-javadoc.jar to /var/lib/jenkins/workspace/overturetool_ncb_development/.repository/org/overturetool/core/pog/3.0.1-SNAPSHOT/pog-3.0.1-SNAPSHOT-javadoc.jar
[INFO] 
[INFO] -----------------< org.overturetool.core:interpreter >------------------
[INFO] Building The VDM Interpreter 3.0.1-SNAPSHOT                      [14/84]
[INFO] --------------------------------[ jar ]---------------------------------
[INFO] 
[INFO] --- maven-enforcer-plugin:1.0:enforce (enforce-maven) @ interpreter ---
[INFO] 
[INFO] --- jacoco-maven-plugin:0.7.6.201602180812:prepare-agent (jacoco-initialize) @ interpreter ---
[INFO] argLine set to -javaagent:/var/lib/jenkins/workspace/overturetool_ncb_development/.repository/org/jacoco/org.jacoco.agent/0.7.6.201602180812/org.jacoco.agent-0.7.6.201602180812-runtime.jar=destfile=/var/lib/jenkins/workspace/overturetool_ncb_development/core/interpreter/target/coverage-reports/jacoco-unit.exec,excludes=**/org/overture/ast/analysis/**/*.*:**/org/overture/ast/expressions/**/*.*:**/org/overture/ast/modules/**/*.*:**/org/overture/ast/node/**/*.*:**/org/overture/ast/patterns/**/*.*:**/org/overture/ast/statements/**/*.*:**/org/overture/ast/types/**/*.*:**/org/overture/codegen/ir/**/*:**/org/overture/ide/**/*
[INFO] 
[INFO] --- maven-resources-plugin:2.7:resources (default-resources) @ interpreter ---
[INFO] Using 'UTF-8' encoding to copy filtered resources.
[INFO] Copying 1 resource
[INFO] 
[INFO] --- maven-compiler-plugin:3.5.1:compile (default-compile) @ interpreter ---
[INFO] Nothing to compile - all classes are up to date
[INFO] 
[INFO] --- maven-resources-plugin:2.7:testResources (default-testResources) @ interpreter ---
[INFO] Using 'UTF-8' encoding to copy filtered resources.
[INFO] Copying 1998 resources
[INFO] 
[INFO] --- maven-compiler-plugin:3.5.1:testCompile (default-testCompile) @ interpreter ---
[INFO] Nothing to compile - all classes are up to date
[INFO] 
[INFO] --- maven-surefire-plugin:2.19.1:test (default-test) @ interpreter ---

-------------------------------------------------------
 T E S T S
-------------------------------------------------------
Picked up JAVA_TOOL_OPTIONS: -Dmaven.ext.class.path="/var/lib/jenkins/workspace/overturetool_ncb_development@tmp/withMaven948c4b2e/pipeline-maven-spy.jar" -Dorg.jenkinsci.plugins.pipeline.maven.reportsFolder="/var/lib/jenkins/workspace/overturetool_ncb_development@tmp/withMaven948c4b2e" 
Running org.overture.interpreter.tests.RepeatTraceNodeTest
Tests run: 2, Failures: 0, Errors: 0, Skipped: 0, Time elapsed: 0.184 sec - in org.overture.interpreter.tests.RepeatTraceNodeTest
Running org.overture.interpreter.tests.RandomListTests
Tests run: 1, Failures: 0, Errors: 0, Skipped: 0, Time elapsed: 0.002 sec - in org.overture.interpreter.tests.RandomListTests
Running org.overture.interpreter.tests.newtests.ClassesPpClassicTest
Tests run: 7, Failures: 0, Errors: 0, Skipped: 0, Time elapsed: 3.743 sec - in org.overture.interpreter.tests.newtests.ClassesPpClassicTest
Running org.overture.interpreter.tests.newtests.ClassesRtTest
Tests run: 1, Failures: 0, Errors: 0, Skipped: 0, Time elapsed: 0.11 sec - in org.overture.interpreter.tests.newtests.ClassesRtTest
Running org.overture.interpreter.tests.newtests.BugRegressionTest
Tests run: 3, Failures: 0, Errors: 0, Skipped: 0, Time elapsed: 0.04 sec - in org.overture.interpreter.tests.newtests.BugRegressionTest
Running org.overture.interpreter.tests.newtests.ExternalInterpreterTest
Tests run: 1, Failures: 0, Errors: 0, Skipped: 1, Time elapsed: 0 sec - in org.overture.interpreter.tests.newtests.ExternalInterpreterTest
Running org.overture.interpreter.tests.newtests.ModulesSlTest
Tests run: 20, Failures: 0, Errors: 0, Skipped: 0, Time elapsed: 2.085 sec - in org.overture.interpreter.tests.newtests.ModulesSlTest
Running org.overture.interpreter.tests.newtests.ClassesRtClassicTest
Sending interrupt signal to process
Aborted by idhugoid

Results :

Tests run: 35, Failures: 0, Errors: 0, Skipped: 1

script returned exit code 143
[Pipeline] }
[withMaven] One or multiple Maven executions have been ignored by the Jenkins Pipeline Maven Plugin because they have been interrupted before completion (1). See Pipeline Maven Plugin FAQ for more details.
[Pipeline] // withMaven
[Pipeline] }
[Pipeline] // stage
[Pipeline] stage
[Pipeline] { (Clean up workspace)
[Pipeline] cleanWs
[WS-CLEANUP] Deleting project workspace...
[WS-CLEANUP] Deferred wipeout is used...
[WS-CLEANUP] done
[Pipeline] }
[Pipeline] // stage
[Pipeline] stage
[Pipeline] { (Reporting)
[Pipeline] emailextrecipients
[Pipeline] emailext
Click here to forcibly terminate running steps
Sending email to: hugodsmacedo@gmail.com
[Pipeline] }
[Pipeline] // stage
[Pipeline] }
[Pipeline] // node
[Pipeline] End of Pipeline

GitHub has been notified of this commit’s build result

Finished: ABORTED