FailedConsole Output

Skipping 237 KB.. Full Log
p://overture.au.dk/artifactory/remote-repos/org/codehaus/plexus/plexus-container-default/1.0-alpha-9/plexus-container-default-1.0-alpha-9.jar
[INFO] Downloaded: http://overture.au.dk/artifactory/remote-repos/org/apache/maven/doxia/doxia-module-fml/1.0-alpha-11/doxia-module-fml-1.0-alpha-11.jar (18 KB at 88.6 KB/sec)
[INFO] Downloading: http://overture.au.dk/artifactory/remote-repos/org/codehaus/plexus/plexus-utils/1.5.5/plexus-utils-1.5.5.jar
[INFO] Downloaded: http://overture.au.dk/artifactory/remote-repos/org/apache/maven/doxia/doxia-module-xdoc/1.0-alpha-11/doxia-module-xdoc-1.0-alpha-11.jar (27 KB at 129.6 KB/sec)
[INFO] Downloaded: http://overture.au.dk/artifactory/remote-repos/org/apache/maven/doxia/doxia-module-apt/1.0-alpha-11/doxia-module-apt-1.0-alpha-11.jar (46 KB at 220.6 KB/sec)
[INFO] Downloaded: http://overture.au.dk/artifactory/remote-repos/commons-lang/commons-lang/2.1/commons-lang-2.1.jar (203 KB at 975.3 KB/sec)
[INFO] Downloaded: http://overture.au.dk/artifactory/remote-repos/org/codehaus/plexus/plexus-container-default/1.0-alpha-9/plexus-container-default-1.0-alpha-9.jar (191 KB at 895.8 KB/sec)
[INFO] Downloaded: http://overture.au.dk/artifactory/remote-repos/org/codehaus/plexus/plexus-utils/1.5.5/plexus-utils-1.5.5.jar (246 KB at 1146.7 KB/sec)
[INFO] Preparing for tree generation...
[INFO] Configuring extension
[INFO] 	Extension base dependency is: "org.overturetool.core.codegen:ir"
[INFO] 	Searching for base dependency artifact
[INFO] 	Extension base artifact found - exstracting base tree definition files
[INFO] 	Setting base definition files to:
[INFO] 		base: /var/lib/jenkins/workspace/ch-pipeline_vpb_development-KCTLYUE5TMW7Z33VLFXIW7KHT6FIH4V5AIJQWV52XR2IIKDPQP2Q/core/vdm2c/target/ir.ast
[INFO] 		base tostring: /var/lib/jenkins/workspace/ch-pipeline_vpb_development-KCTLYUE5TMW7Z33VLFXIW7KHT6FIH4V5AIJQWV52XR2IIKDPQP2Q/core/vdm2c/target/ir.ast.tostring
[INFO] 	Extension base artifact configured.
[INFO] Checking if generation required.
[INFO] Full AST generation needed
[INFO] Generating...
[INFO] Generator starting with input: /var/lib/jenkins/workspace/ch-pipeline_vpb_development-KCTLYUE5TMW7Z33VLFXIW7KHT6FIH4V5AIJQWV52XR2IIKDPQP2Q/core/vdm2c/target/ir.ast
[INFO] Generator starting with extension input: /var/lib/jenkins/workspace/ch-pipeline_vpb_development-KCTLYUE5TMW7Z33VLFXIW7KHT6FIH4V5AIJQWV52XR2IIKDPQP2Q/core/vdm2c/src/main/resources/ccg.ast
Generating base and extension tree, standby ... 
Extension tree only: true
Adding aspect fields: PIRBase.{sourceNode,tag,metaData}
WARNING: Using SubProduction class found without using package name. SImportsIRBase
WARNING: Using SubProduction class found without using package name. SImportIRBase
Adding aspect fields: SImportIRBase.{name,renamed,fromModuleName}
Adding aspect fields: SValueImportBase.{importType}
WARNING: Using SubProduction class found without using package name. SExportsIRBase
WARNING: Using SubProduction class found without using package name. SExportIRBase
Adding aspect fields: SExportIRBase.{decl}
WARNING: Using SubProduction class found without using package name. SPatternIRBase
WARNING: Using SubProduction class found without using package name. SBindIRBase
Adding aspect fields: SBindIRBase.{pattern}
WARNING: Using SubProduction class found without using package name. SMultipleBindIRBase
Adding aspect fields: SMultipleBindIRBase.{patterns}
WARNING: Using SubProduction class found without using package name. SNameIRBase
WARNING: Using SubProduction class found without using package name. SDeclIRBase
Adding aspect fields: SClassDeclBase.{globalMetaData,package,dependencies,access,abstract,static,name,fields,invariant,methods,functions,traces,superNames,thread,innerClasses,interfaces,typeDecls,perSyncs,mutexSyncs}
WARNING: Using SubProduction class found without using package name. SStateDesignatorIRBase
Adding aspect fields: SStateDesignatorIRBase.{type}
WARNING: Using SubProduction class found without using package name. SObjectDesignatorIRBase
WARNING: Using SubProduction class found without using package name. SLocalParamIRBase
WARNING: Using SubProduction class found without using package name. SStmIRBase
Adding aspect fields: SCallStmBase.{type,isStatic,name,args}
WARNING: Using SubProduction class found without using package name. SLetBeStIRBase
WARNING: Using SubProduction class found without using package name. SExpIRBase
Adding aspect fields: SExpIRBase.{type}
WARNING: Using SubProduction class found without using package name. SModifierIRBase
Adding aspect fields: SIsExpBase.{exp}
Adding aspect fields: SVarExpBase.{isLambda,isLocal,name}
Adding aspect fields: SQuantifierExpBase.{bindList,predicate}
Adding aspect fields: SBinaryExpBase.{left,right}
Adding aspect fields: SUnaryExpBase.{exp}
WARNING: Using SubProduction class found without using package name. STypeIRBase
Adding aspect fields: STypeIRBase.{optional,namedInvType}
Adding aspect fields: SSetTypeBase.{empty,setOf}
Adding aspect fields: SSeqTypeBase.{empty,seq1,seqOf}
Adding aspect fields: SMapTypeBase.{empty,injective,from,to}
WARNING: Using SubProduction class found without using package name. STermIRBase
WARNING: Using SubProduction class found without using package name. STraceDeclIRBase
WARNING: Using SubProduction class found without using package name. STraceCoreDeclIRBase
Retry Create interfaces - with 19 not yet created interfaces.
Retry Create interfaces - with 1 not yet created interfaces.
Done creating interfaces
Generating toString add on...
WARNING: Using SubProduction class found without using package name. SExpIRBase
WARNING: Using SubProduction class found without using package name. SStmIRBase
WARNING: Using SubProduction class found without using package name. SDeclIRBase
Done creating interfaces
Generating toString add on...
***********************************************
AST Creator Extensions
***********************************************
Generating enumerations...
Generating analysis visitors...
Analysis...Answer...Question...Question-Answer...Depth-First...
Writing sources to the file system, standby ... 
Destination: /var/lib/jenkins/workspace/ch-pipeline_vpb_development-KCTLYUE5TMW7Z33VLFXIW7KHT6FIH4V5AIJQWV52XR2IIKDPQP2Q/core/vdm2c/target/generated-sources/astCreator
Copying base classes to destination...
Writing source files.:
.................................
File write completed in 1 secs
Created AST with extensions.
[INFO] 
[INFO] --- build-helper-maven-plugin:1.7:add-source (add-source) @ vdm2c ---
[INFO] Source directory: /var/lib/jenkins/workspace/ch-pipeline_vpb_development-KCTLYUE5TMW7Z33VLFXIW7KHT6FIH4V5AIJQWV52XR2IIKDPQP2Q/core/vdm2c/target/generated-sources/astCreator added.
[INFO] 
[INFO] --- maven-resources-plugin:2.6:resources (default-resources) @ vdm2c ---
[INFO] Using 'UTF-8' encoding to copy filtered resources.
[INFO] Copying 90 resources
[INFO] 
[INFO] --- maven-compiler-plugin:3.0:compile (default-compile) @ vdm2c ---
[INFO] Changes detected - recompiling the module!
[INFO] Compiling 119 source files to /var/lib/jenkins/workspace/ch-pipeline_vpb_development-KCTLYUE5TMW7Z33VLFXIW7KHT6FIH4V5AIJQWV52XR2IIKDPQP2Q/core/vdm2c/target/classes
[INFO] ------------------------------------------------------------------------
[INFO] Reactor Summary:
[INFO] 
[INFO] Overture VDM 2 C Translator Root ................... SUCCESS [  4.190 s]
[INFO] C native root vdm2c ................................ SUCCESS [  0.006 s]
[INFO] The C Code Generator VDM library sources ........... SUCCESS [  1.475 s]
[INFO] Core Tools for vdm2c ............................... SUCCESS [  0.136 s]
[INFO] The C Code Generator ............................... SUCCESS [  8.050 s]
[INFO] ------------------------------------------------------------------------
[INFO] BUILD SUCCESS
[INFO] ------------------------------------------------------------------------
[INFO] Total time: 14.230 s
[INFO] Finished at: 2017-10-03T16:36:52+02:00
[INFO] Final Memory: 37M/732M
[INFO] ------------------------------------------------------------------------
[jenkins-maven-event-spy] INFO generated /var/lib/jenkins/workspace/ch-pipeline_vpb_development-KCTLYUE5TMW7Z33VLFXIW7KHT6FIH4V5AIJQWV52XR2IIKDPQP2Q@tmp/withMaven037587d8/maven-spy-20171003-163638-3.log
[Pipeline] }
[withMaven] artifactsPublisher - Archive artifact pom.xml under org/overturetool/vdm2c/root/0.1.15-SNAPSHOT/root-0.1.15-SNAPSHOT.pom
[withMaven] artifactsPublisher - Archive artifact c/pom.xml under org/overturetool/vdm2c/c/0.1.15-SNAPSHOT/c-0.1.15-SNAPSHOT.pom
[withMaven] artifactsPublisher - Archive artifact c/vdmclib/pom.xml under org/overturetool/vdm2c/c/vdmclib/0.1.15-SNAPSHOT/vdmclib-0.1.15-SNAPSHOT.pom
[withMaven] artifactsPublisher - Archive artifact core/pom.xml under org/overturetool/vdm2c/core/0.1.15-SNAPSHOT/core-0.1.15-SNAPSHOT.pom
[withMaven] artifactsPublisher - Archive artifact core/vdm2c/pom.xml under org/overturetool/vdm2c/core/vdm2c/0.1.15-SNAPSHOT/vdm2c-0.1.15-SNAPSHOT.pom
[withMaven] openTasksPublisher - Scan Tasks for Maven artifact org.overturetool.vdm2c.core:vdm2c:0.1.15-SNAPSHOT in source directory core/vdm2c/src/main/java
[TASKS] Scanning folder '/var/lib/jenkins/workspace/ch-pipeline_vpb_development-KCTLYUE5TMW7Z33VLFXIW7KHT6FIH4V5AIJQWV52XR2IIKDPQP2Q' for files matching the pattern 'core/vdm2c/src/main/java/**/*' - excludes: null
[TASKS] Found 86 files to scan for tasks
[TASKS] Found 21 open tasks.
Skipping warnings blame since pipelines do not have an SCM link.%n
[TASKS] Computing warning deltas based on reference build #41
[Pipeline] // withMaven
[Pipeline] }
[Pipeline] // stage
[Pipeline] stage
[Pipeline] { (Install IDE)
[Pipeline] withMaven
[withMaven] Options: []
[withMaven] Available options: 
[withMaven] use JDK installation provided by the build agent
$ /bin/sh -c "which mvn"
[withMaven] use Maven installation provided by the build agent with executable /usr/bin/mvn
[withMaven] use Maven settings provided on the build agent '/var/lib/jenkins/internal-resources/settings.xml' 
[withMaven] use Maven global settings provided by the Jenkins global configuration on the build agent '/var/lib/jenkins/internal-resources/settings.xml' 
[Pipeline] {
[Pipeline] sh
[ch-pipeline_vpb_development-KCTLYUE5TMW7Z33VLFXIW7KHT6FIH4V5AIJQWV52XR2IIKDPQP2Q] Running shell script
+ mvn install -PWith-IDE -Pall-platforms -P!linux64 -DexternalTestsPath=/var/lib/jenkins/internal-resources/externaltests/ -P!ui-tests -Pforce-download-externals -Pcodesigning
----- withMaven Wrapper script -----
Picked up JAVA_TOOL_OPTIONS: -Dmaven.ext.class.path="/var/lib/jenkins/workspace/ch-pipeline_vpb_development-KCTLYUE5TMW7Z33VLFXIW7KHT6FIH4V5AIJQWV52XR2IIKDPQP2Q@tmp/withMaven4697a710/pipeline-maven-spy.jar" -Dorg.jenkinsci.plugins.pipeline.maven.reportsFolder="/var/lib/jenkins/workspace/ch-pipeline_vpb_development-KCTLYUE5TMW7Z33VLFXIW7KHT6FIH4V5AIJQWV52XR2IIKDPQP2Q@tmp/withMaven4697a710" 
Apache Maven 3.3.9
Maven home: /usr/share/maven
Java version: 1.8.0_121, vendor: Oracle Corporation
Java home: /usr/lib/jvm/java-8-oracle/jre
Default locale: en_GB, platform encoding: UTF-8
OS name: "linux", version: "4.4.0-78-generic", arch: "amd64", family: "unix"
[jenkins-maven-event-spy] INFO generate /var/lib/jenkins/workspace/ch-pipeline_vpb_development-KCTLYUE5TMW7Z33VLFXIW7KHT6FIH4V5AIJQWV52XR2IIKDPQP2Q@tmp/withMaven4697a710/maven-spy-20171003-163654-228.log ...
[INFO] Scanning for projects...
[INFO] Downloading: http://overture.au.dk/artifactory/remote-repos/org/eclipse/tycho/tycho-bundles-external/0.24.0/tycho-bundles-external-0.24.0.zip
[INFO] Downloaded: http://overture.au.dk/artifactory/remote-repos/org/eclipse/tycho/tycho-bundles-external/0.24.0/tycho-bundles-external-0.24.0.zip (7062 KB at 28022.9 KB/sec)
[INFO] Downloading: http://overture.au.dk/artifactory/remote-repos/org/eclipse/tycho/org.eclipse.tycho.p2.resolver.impl/0.24.0/org.eclipse.tycho.p2.resolver.impl-0.24.0.jar
[INFO] Downloaded: http://overture.au.dk/artifactory/remote-repos/org/eclipse/tycho/org.eclipse.tycho.p2.resolver.impl/0.24.0/org.eclipse.tycho.p2.resolver.impl-0.24.0.jar (209 KB at 8343.3 KB/sec)
[INFO] Downloading: http://overture.au.dk/artifactory/remote-repos/org/eclipse/tycho/org.eclipse.tycho.p2.maven.repository/0.24.0/org.eclipse.tycho.p2.maven.repository-0.24.0.jar
[INFO] Downloaded: http://overture.au.dk/artifactory/remote-repos/org/eclipse/tycho/org.eclipse.tycho.p2.maven.repository/0.24.0/org.eclipse.tycho.p2.maven.repository-0.24.0.jar (144 KB at 4358.8 KB/sec)
[INFO] Downloading: http://overture.au.dk/artifactory/remote-repos/org/eclipse/tycho/org.eclipse.tycho.p2.tools.impl/0.24.0/org.eclipse.tycho.p2.tools.impl-0.24.0.jar
[INFO] Downloaded: http://overture.au.dk/artifactory/remote-repos/org/eclipse/tycho/org.eclipse.tycho.p2.tools.impl/0.24.0/org.eclipse.tycho.p2.tools.impl-0.24.0.jar (46 KB at 3017.4 KB/sec)
[INFO] Downloading: http://overture.au.dk/artifactory/remote-repos/org/codehaus/mojo/versions-maven-plugin/2.1/versions-maven-plugin-2.1.pom
[INFO] Downloaded: http://overture.au.dk/artifactory/remote-repos/org/codehaus/mojo/versions-maven-plugin/2.1/versions-maven-plugin-2.1.pom (15 KB at 679.3 KB/sec)
[INFO] Downloading: http://overture.au.dk/artifactory/remote-repos/org/codehaus/mojo/mojo-parent/32/mojo-parent-32.pom
[INFO] Downloaded: http://overture.au.dk/artifactory/remote-repos/org/codehaus/mojo/mojo-parent/32/mojo-parent-32.pom (26 KB at 2351.8 KB/sec)
[INFO] Downloading: http://overture.au.dk/artifactory/remote-repos/org/codehaus/codehaus-parent/4/codehaus-parent-4.pom
[INFO] Downloaded: http://overture.au.dk/artifactory/remote-repos/org/codehaus/codehaus-parent/4/codehaus-parent-4.pom (5 KB at 454.6 KB/sec)
[INFO] Downloading: http://overture.au.dk/artifactory/remote-repos/org/codehaus/mojo/versions-maven-plugin/2.1/versions-maven-plugin-2.1.jar
[INFO] Downloaded: http://overture.au.dk/artifactory/remote-repos/org/codehaus/mojo/versions-maven-plugin/2.1/versions-maven-plugin-2.1.jar (237 KB at 10267.4 KB/sec)
[INFO] Downloading: http://overture.au.dk/artifactory/remote-repos/org/apache/maven/plugins/maven-jarsigner-plugin/1.2/maven-jarsigner-plugin-1.2.pom
[INFO] Downloaded: http://overture.au.dk/artifactory/remote-repos/org/apache/maven/plugins/maven-jarsigner-plugin/1.2/maven-jarsigner-plugin-1.2.pom (6 KB at 263.9 KB/sec)
[INFO] Downloading: http://overture.au.dk/artifactory/remote-repos/org/apache/maven/plugins/maven-plugins/14/maven-plugins-14.pom
[INFO] Downloaded: http://overture.au.dk/artifactory/remote-repos/org/apache/maven/plugins/maven-plugins/14/maven-plugins-14.pom (13 KB at 644.4 KB/sec)
[INFO] Downloading: http://overture.au.dk/artifactory/remote-repos/org/apache/maven/maven-parent/13/maven-parent-13.pom
[INFO] Downloaded: http://overture.au.dk/artifactory/remote-repos/org/apache/maven/maven-parent/13/maven-parent-13.pom (23 KB at 1842.0 KB/sec)
[INFO] Downloading: http://overture.au.dk/artifactory/remote-repos/org/apache/maven/plugins/maven-jarsigner-plugin/1.2/maven-jarsigner-plugin-1.2.jar
[INFO] Downloaded: http://overture.au.dk/artifactory/remote-repos/org/apache/maven/plugins/maven-jarsigner-plugin/1.2/maven-jarsigner-plugin-1.2.jar (28 KB at 1310.4 KB/sec)
[INFO] Downloading: http://overture.au.dk/artifactory/remote-repos/org/eclipse/tycho/target-platform-configuration/0.24.0/target-platform-configuration-0.24.0.pom
[INFO] Downloaded: http://overture.au.dk/artifactory/remote-repos/org/eclipse/tycho/target-platform-configuration/0.24.0/target-platform-configuration-0.24.0.pom (2 KB at 84.2 KB/sec)
[INFO] Downloading: http://overture.au.dk/artifactory/remote-repos/org/eclipse/tycho/target-platform-configuration/0.24.0/target-platform-configuration-0.24.0.jar
[INFO] Downloaded: http://overture.au.dk/artifactory/remote-repos/org/eclipse/tycho/target-platform-configuration/0.24.0/target-platform-configuration-0.24.0.jar (8 KB at 461.5 KB/sec)
[INFO] Downloading: http://overture.au.dk/artifactory/remote-repos/org/apache/maven/plugins/maven-dependency-plugin/2.6/maven-dependency-plugin-2.6.pom
[INFO] Downloaded: http://overture.au.dk/artifactory/remote-repos/org/apache/maven/plugins/maven-dependency-plugin/2.6/maven-dependency-plugin-2.6.pom (11 KB at 726.2 KB/sec)
[INFO] Downloading: http://overture.au.dk/artifactory/remote-repos/org/apache/maven/plugins/maven-dependency-plugin/2.6/maven-dependency-plugin-2.6.jar
[INFO] Downloaded: http://overture.au.dk/artifactory/remote-repos/org/apache/maven/plugins/maven-dependency-plugin/2.6/maven-dependency-plugin-2.6.jar (142 KB at 8822.4 KB/sec)
[INFO] Downloading: http://overture.au.dk/artifactory/remote-repos/org/eclipse/tycho/tycho-packaging-plugin/0.24.0/tycho-packaging-plugin-0.24.0.pom
[INFO] Downloaded: http://overture.au.dk/artifactory/remote-repos/org/eclipse/tycho/tycho-packaging-plugin/0.24.0/tycho-packaging-plugin-0.24.0.pom (3 KB at 147.3 KB/sec)
[INFO] Downloading: http://overture.au.dk/artifactory/remote-repos/org/eclipse/tycho/tycho-packaging-plugin/0.24.0/tycho-packaging-plugin-0.24.0.jar
[INFO] Downloaded: http://overture.au.dk/artifactory/remote-repos/org/eclipse/tycho/tycho-packaging-plugin/0.24.0/tycho-packaging-plugin-0.24.0.jar (124 KB at 9520.0 KB/sec)
[INFO] Downloading: http://overture.au.dk/artifactory/remote-repos/org/eclipse/tycho/tycho-p2-plugin/0.24.0/tycho-p2-plugin-0.24.0.pom
[INFO] Downloaded: http://overture.au.dk/artifactory/remote-repos/org/eclipse/tycho/tycho-p2-plugin/0.24.0/tycho-p2-plugin-0.24.0.pom (3 KB at 147.3 KB/sec)
[INFO] Downloading: http://overture.au.dk/artifactory/remote-repos/org/eclipse/tycho/tycho-p2-plugin/0.24.0/tycho-p2-plugin-0.24.0.jar
[INFO] Downloaded: http://overture.au.dk/artifactory/remote-repos/org/eclipse/tycho/tycho-p2-plugin/0.24.0/tycho-p2-plugin-0.24.0.jar (27 KB at 1794.3 KB/sec)
[INFO] Downloading: http://overture.au.dk/artifactory/remote-repos/org/eclipse/tycho/sisu-equinox-launching/0.24.0/sisu-equinox-launching-0.24.0.pom
[INFO] Downloaded: http://overture.au.dk/artifactory/remote-repos/org/eclipse/tycho/sisu-equinox-launching/0.24.0/sisu-equinox-launching-0.24.0.pom (3 KB at 190.6 KB/sec)
[INFO] Downloading: http://overture.au.dk/artifactory/remote-repos/org/apache/commons/commons-exec/1.2/commons-exec-1.2.pom
[INFO] Downloaded: http://overture.au.dk/artifactory/remote-repos/org/apache/commons/commons-exec/1.2/commons-exec-1.2.pom (11 KB at 969.8 KB/sec)
[INFO] Downloading: http://overture.au.dk/artifactory/remote-repos/org/eclipse/tycho/tycho-artifactcomparator/0.24.0/tycho-artifactcomparator-0.24.0.pom
[INFO] Downloaded: http://overture.au.dk/artifactory/remote-repos/org/eclipse/tycho/tycho-artifactcomparator/0.24.0/tycho-artifactcomparator-0.24.0.pom (2 KB at 90.2 KB/sec)
[INFO] Downloading: http://overture.au.dk/artifactory/remote-repos/org/ow2/asm/asm-debug-all/5.0.3/asm-debug-all-5.0.3.pom
[INFO] Downloaded: http://overture.au.dk/artifactory/remote-repos/org/ow2/asm/asm-debug-all/5.0.3/asm-debug-all-5.0.3.pom (2 KB at 96.8 KB/sec)
[INFO] Downloading: http://overture.au.dk/artifactory/remote-repos/org/ow2/asm/asm-parent/5.0.3/asm-parent-5.0.3.pom
[INFO] Downloaded: http://overture.au.dk/artifactory/remote-repos/org/ow2/asm/asm-parent/5.0.3/asm-parent-5.0.3.pom (6 KB at 447.2 KB/sec)
[INFO] Downloading: http://overture.au.dk/artifactory/remote-repos/org/eclipse/tycho/sisu-equinox-launching/0.24.0/sisu-equinox-launching-0.24.0.jar
[INFO] Downloading: http://overture.au.dk/artifactory/remote-repos/org/apache/commons/commons-exec/1.2/commons-exec-1.2.jar
[INFO] Downloading: http://overture.au.dk/artifactory/remote-repos/org/eclipse/tycho/tycho-artifactcomparator/0.24.0/tycho-artifactcomparator-0.24.0.jar
[INFO] Downloading: http://overture.au.dk/artifactory/remote-repos/org/ow2/asm/asm-debug-all/5.0.3/asm-debug-all-5.0.3.jar
[INFO] Downloaded: http://overture.au.dk/artifactory/remote-repos/org/eclipse/tycho/tycho-artifactcomparator/0.24.0/tycho-artifactcomparator-0.24.0.jar (20 KB at 956.8 KB/sec)
[INFO] Downloaded: http://overture.au.dk/artifactory/remote-repos/org/apache/commons/commons-exec/1.2/commons-exec-1.2.jar (53 KB at 2026.3 KB/sec)
[INFO] Downloaded: http://overture.au.dk/artifactory/remote-repos/org/eclipse/tycho/sisu-equinox-launching/0.24.0/sisu-equinox-launching-0.24.0.jar (28 KB at 854.3 KB/sec)
[INFO] Downloaded: http://overture.au.dk/artifactory/remote-repos/org/ow2/asm/asm-debug-all/5.0.3/asm-debug-all-5.0.3.jar (370 KB at 10565.3 KB/sec)
[INFO] Downloading: http://overture.au.dk/artifactory/remote-repos/org/eclipse/tycho/tycho-compiler-plugin/0.24.0/tycho-compiler-plugin-0.24.0.pom
[INFO] Downloaded: http://overture.au.dk/artifactory/remote-repos/org/eclipse/tycho/tycho-compiler-plugin/0.24.0/tycho-compiler-plugin-0.24.0.pom (3 KB at 193.4 KB/sec)
[INFO] Downloading: http://overture.au.dk/artifactory/remote-repos/org/eclipse/tycho/tycho-compiler-plugin/0.24.0/tycho-compiler-plugin-0.24.0.jar
[INFO] Downloaded: http://overture.au.dk/artifactory/remote-repos/org/eclipse/tycho/tycho-compiler-plugin/0.24.0/tycho-compiler-plugin-0.24.0.jar (33 KB at 2716.1 KB/sec)
[INFO] Downloading: http://overture.au.dk/artifactory/remote-repos/org/apache/maven/plugins/maven-install-plugin/2.4/maven-install-plugin-2.4.pom
[INFO] Downloaded: http://overture.au.dk/artifactory/remote-repos/org/apache/maven/plugins/maven-install-plugin/2.4/maven-install-plugin-2.4.pom (7 KB at 445.1 KB/sec)
[INFO] Downloading: http://overture.au.dk/artifactory/remote-repos/org/apache/maven/plugins/maven-install-plugin/2.4/maven-install-plugin-2.4.jar
[INFO] Downloaded: http://overture.au.dk/artifactory/remote-repos/org/apache/maven/plugins/maven-install-plugin/2.4/maven-install-plugin-2.4.jar (27 KB at 1645.0 KB/sec)
[INFO] Downloading: http://overture.au.dk/artifactory/remote-repos/org/apache/maven/plugins/maven-deploy-plugin/2.8.1/maven-deploy-plugin-2.8.1.pom
[INFO] Downloaded: http://overture.au.dk/artifactory/remote-repos/org/apache/maven/plugins/maven-deploy-plugin/2.8.1/maven-deploy-plugin-2.8.1.pom (8 KB at 597.0 KB/sec)
[INFO] Downloading: http://overture.au.dk/artifactory/remote-repos/org/apache/maven/plugins/maven-plugins/24/maven-plugins-24.pom
[INFO] Downloaded: http://overture.au.dk/artifactory/remote-repos/org/apache/maven/plugins/maven-plugins/24/maven-plugins-24.pom (11 KB at 480.0 KB/sec)
[INFO] Downloading: http://overture.au.dk/artifactory/remote-repos/org/apache/maven/plugins/maven-deploy-plugin/2.8.1/maven-deploy-plugin-2.8.1.jar
[INFO] Downloaded: http://overture.au.dk/artifactory/remote-repos/org/apache/maven/plugins/maven-deploy-plugin/2.8.1/maven-deploy-plugin-2.8.1.jar (34 KB at 2757.8 KB/sec)
[INFO] Downloading: http://overture.au.dk/artifactory/remote-repos/org/apache/maven/plugins/maven-site-plugin/3.3/maven-site-plugin-3.3.pom
[INFO] Downloaded: http://overture.au.dk/artifactory/remote-repos/org/apache/maven/plugins/maven-site-plugin/3.3/maven-site-plugin-3.3.pom (21 KB at 1451.8 KB/sec)
[INFO] Downloading: http://overture.au.dk/artifactory/remote-repos/org/apache/maven/plugins/maven-site-plugin/3.3/maven-site-plugin-3.3.jar
[INFO] Downloaded: http://overture.au.dk/artifactory/remote-repos/org/apache/maven/plugins/maven-site-plugin/3.3/maven-site-plugin-3.3.jar (122 KB at 6072.1 KB/sec)
[INFO] Downloading: http://overture.au.dk/artifactory/remote-repos/org/eclipse/tycho/tycho-p2-repository-plugin/0.24.0/tycho-p2-repository-plugin-0.24.0.pom
[INFO] Downloaded: http://overture.au.dk/artifactory/remote-repos/org/eclipse/tycho/tycho-p2-repository-plugin/0.24.0/tycho-p2-repository-plugin-0.24.0.pom (2 KB at 58.5 KB/sec)
[INFO] Downloading: http://overture.au.dk/artifactory/remote-repos/org/eclipse/tycho/tycho-p2-repository-plugin/0.24.0/tycho-p2-repository-plugin-0.24.0.jar
[INFO] Downloaded: http://overture.au.dk/artifactory/remote-repos/org/eclipse/tycho/tycho-p2-repository-plugin/0.24.0/tycho-p2-repository-plugin-0.24.0.jar (14 KB at 938.1 KB/sec)
[INFO] Downloading: http://overture.au.dk/artifactory/remote-repos/org/eclipse/tycho/tycho-p2-publisher-plugin/0.24.0/tycho-p2-publisher-plugin-0.24.0.pom
[INFO] Downloaded: http://overture.au.dk/artifactory/remote-repos/org/eclipse/tycho/tycho-p2-publisher-plugin/0.24.0/tycho-p2-publisher-plugin-0.24.0.pom (3 KB at 102.5 KB/sec)
[INFO] Downloading: http://overture.au.dk/artifactory/remote-repos/org/eclipse/tycho/tycho-p2-publisher-plugin/0.24.0/tycho-p2-publisher-plugin-0.24.0.jar
[INFO] Downloaded: http://overture.au.dk/artifactory/remote-repos/org/eclipse/tycho/tycho-p2-publisher-plugin/0.24.0/tycho-p2-publisher-plugin-0.24.0.jar (20 KB at 1939.6 KB/sec)
[INFO] Downloading: http://overture.au.dk/artifactory/remote-repos/org/apache/commons/commons-lang3/3.1/commons-lang3-3.1.pom
[INFO] Downloaded: http://overture.au.dk/artifactory/remote-repos/org/apache/commons/commons-lang3/3.1/commons-lang3-3.1.pom (17 KB at 1359.9 KB/sec)
[INFO] Downloading: http://overture.au.dk/artifactory/remote-repos/org/apache/commons/commons-parent/22/commons-parent-22.pom
[INFO] Downloaded: http://overture.au.dk/artifactory/remote-repos/org/apache/commons/commons-parent/22/commons-parent-22.pom (41 KB at 3721.4 KB/sec)
[INFO] Downloading: http://overture.au.dk/artifactory/remote-repos/org/apache/maven/maven-archiver/2.5/maven-archiver-2.5.pom
[INFO] Downloaded: http://overture.au.dk/artifactory/remote-repos/org/apache/maven/maven-archiver/2.5/maven-archiver-2.5.pom (5 KB at 369.3 KB/sec)
[INFO] Downloading: http://overture.au.dk/artifactory/remote-repos/org/codehaus/plexus/plexus-interpolation/1.15/plexus-interpolation-1.15.pom
[INFO] Downloaded: http://overture.au.dk/artifactory/remote-repos/org/codehaus/plexus/plexus-interpolation/1.15/plexus-interpolation-1.15.pom (1018 B at 82.8 KB/sec)
[INFO] Downloading: http://overture.au.dk/artifactory/remote-repos/org/codehaus/plexus/plexus/3.0.1/plexus-3.0.1.pom
[INFO] Downloaded: http://overture.au.dk/artifactory/remote-repos/org/codehaus/plexus/plexus/3.0.1/plexus-3.0.1.pom (19 KB at 1817.8 KB/sec)
[INFO] Downloading: http://overture.au.dk/artifactory/remote-repos/org/apache/commons/commons-lang3/3.1/commons-lang3-3.1.jar
[INFO] Downloading: http://overture.au.dk/artifactory/remote-repos/org/apache/maven/maven-archiver/2.5/maven-archiver-2.5.jar
[INFO] Downloaded: http://overture.au.dk/artifactory/remote-repos/org/apache/maven/maven-archiver/2.5/maven-archiver-2.5.jar (22 KB at 1521.6 KB/sec)
[INFO] Downloaded: http://overture.au.dk/artifactory/remote-repos/org/apache/commons/commons-lang3/3.1/commons-lang3-3.1.jar (309 KB at 17133.5 KB/sec)
[INFO] Computing target platform for MavenProject: org.overturetool.vdm2c.ide:org.overturetool.vdm2c.ide.cgen:0.1.15-SNAPSHOT @ /var/lib/jenkins/workspace/ch-pipeline_vpb_development-KCTLYUE5TMW7Z33VLFXIW7KHT6FIH4V5AIJQWV52XR2IIKDPQP2Q/ide/cgen/pom.xml
[INFO] Fetching p2.index from http://download.eclipse.org/releases/neon/ (0B at 0B/s)
[INFO] Adding repository http://download.eclipse.org/releases/neon
[INFO] Fetching compositeContent.jar from http://download.eclipse.org/releases/neon/ (0B of 518B at 0B/s)
[INFO] Fetching p2.index from http://download.eclipse.org/technology/epp/packages/neon/ (0B at 0B/s)
[INFO] Fetching content.xml.xz from http://download.eclipse.org/technology/epp/packages/neon/ (0B at 0B/s)
[INFO] Fetching p2.index from http://download.eclipse.org/releases/neon/201705151400/ (0B at 0B/s)
[INFO] Fetching content.xml.xz from http://download.eclipse.org/releases/neon/201705151400/ (0B of 884.78kB at 0B/s)
[INFO] Fetching p2.index from http://download.eclipse.org/releases/neon/201703141400/ (0B at 0B/s)
[INFO] Fetching content.xml.xz from http://download.eclipse.org/releases/neon/201703141400/ (0B of 886.38kB at 0B/s)
[INFO] Fetching p2.index from http://download.eclipse.org/releases/neon/201703231000/ (0B at 0B/s)
[INFO] Fetching content.xml.xz from http://download.eclipse.org/releases/neon/201703231000/ (0B of 886.4kB at 0B/s)
[INFO] Fetching p2.index from http://download.eclipse.org/releases/neon/201606221000/ (0B at 0B/s)
[INFO] Fetching content.xml.xz from http://download.eclipse.org/releases/neon/201606221000/ (0B of 861.1kB at 0B/s)
[INFO] Fetching p2.index from http://download.eclipse.org/releases/neon/201609281000/ (0B at 0B/s)
[INFO] Fetching content.xml.xz from http://download.eclipse.org/releases/neon/201609281000/ (0B of 871.38kB at 0B/s)
[INFO] Fetching p2.index from http://download.eclipse.org/releases/neon/201610111000/ (0B at 0B/s)
[INFO] Fetching content.xml.xz from http://download.eclipse.org/releases/neon/201610111000/ (0B of 870.9kB at 0B/s)
[INFO] Fetching p2.index from http://download.eclipse.org/releases/neon/201612211000/ (0B at 0B/s)
[INFO] Fetching content.xml.xz from http://download.eclipse.org/releases/neon/201612211000/ (0B of 876.7kB at 0B/s)
[INFO] Adding repository http://dl.bintray.com/overturetool/overturetool-development
[INFO] Fetching content.jar from http://dl.bintray.com/overturetool/overturetool-development/ (0B of 128.88kB at 0B/s)
[INFO] Resolving dependencies of MavenProject: org.overturetool.vdm2c.ide:org.overturetool.vdm2c.ide.cgen:0.1.15-SNAPSHOT @ /var/lib/jenkins/workspace/ch-pipeline_vpb_development-KCTLYUE5TMW7Z33VLFXIW7KHT6FIH4V5AIJQWV52XR2IIKDPQP2Q/ide/cgen/pom.xml
[INFO] Fetching 201705151400&countryCode=gb&timeZone=1&format=xml from http://www.eclipse.org/downloads/download.php?format=xml&file=/releases/neon/ (0B at 0B/s)
[INFO] Fetching org.eclipse.osgi_3.11.3.v20170209-1843.jar.pack.gz from http://download.eclipse.org/releases/neon/201705151400/plugins/ (0B of 431.77kB at 0B/s)
[INFO] Fetching org.eclipse.osgi_3.11.3.v20170209-1843.jar.pack.gz from http://download.eclipse.org/releases/neon/201705151400/plugins/ (105.24kB of 431.77kB at 102.57kB/s)
[INFO] Fetching org.eclipse.osgi_3.11.3.v20170209-1843.jar.pack.gz from http://download.eclipse.org/releases/neon/201705151400/plugins/ (236.16kB of 431.77kB at 108.06kB/s)
[INFO] Fetching org.eclipse.osgi_3.11.3.v20170209-1843.jar.pack.gz from http://download.eclipse.org/releases/neon/201705151400/plugins/ (363.08kB of 431.77kB at 112.56kB/s)
[INFO] Fetching javax.xml_1.3.4.v201005080400.jar from http://www.mirrorservice.org/sites/download.eclipse.org/eclipseMirror/releases/neon/201705151400/plugins/ (0B of 246.29kB at 0B/s)
[INFO] Fetching org.apache.batik.css_1.7.0.v201011041433.jar from http://www.mirrorservice.org/sites/download.eclipse.org/eclipseMirror/releases/neon/201705151400/plugins/ (0B of 347.67kB at 0B/s)
[INFO] Fetching org.apache.batik.util_1.7.0.v201011041433.jar from http://mirror.ibcp.fr/pub/eclipse//releases/neon/201705151400/plugins/ (0B of 154.43kB at 0B/s)
[INFO] Fetching org.w3c.dom.events_3.0.0.draft20060413_v201105210656.jar from http://mirror.ibcp.fr/pub/eclipse//releases/neon/201705151400/plugins/ (0B of 17.78kB at 0B/s)
[INFO] Fetching org.w3c.css.sac_1.3.1.v200903091627.jar from http://mirror.ibcp.fr/pub/eclipse//releases/neon/201705151400/plugins/ (0B of 37.68kB at 0B/s)
[INFO] Fetching org.w3c.dom.svg_1.1.0.v201011041433.jar from http://www.mirrorservice.org/sites/download.eclipse.org/eclipseMirror/releases/neon/201705151400/plugins/ (0B of 95.1kB at 0B/s)
[INFO] Fetching org.apache.batik.util.gui_1.7.0.v200903091627.jar from http://download.eclipse.org/releases/neon/201705151400/plugins/ (0B of 207.37kB at 0B/s)
[INFO] Fetching org.apache.batik.util.gui_1.7.0.v200903091627.jar from http://download.eclipse.org/releases/neon/201705151400/plugins/ (126.61kB of 207.37kB at 123.94kB/s)
[INFO] Fetching org.eclipse.osgi.services_3.5.100.v20160504-1419.jar.pack.gz from http://mirror.ibcp.fr/pub/eclipse//releases/neon/201705151400/plugins/ (0B of 40.14kB at 0B/s)
[INFO] Fetching org.eclipse.ui_3.108.1.v20160929-1045.jar.pack.gz from http://mirrors.uniri.hr/eclipse//releases/neon/201705151400/plugins/ (0B of 268.51kB at 0B/s)
[INFO] Fetching org.eclipse.core.resources_3.11.1.v20161107-2032.jar from http://www.mirrorservice.org/sites/download.eclipse.org/eclipseMirror/releases/neon/201705151400/plugins/ (0B of 862.01kB at 0B/s)
[INFO] Fetching org.eclipse.jface.text_3.11.2.v20170220-1911.jar.pack.gz from http://download.eclipse.org/releases/neon/201705151400/plugins/ (0B of 314.18kB at 0B/s)
[INFO] Fetching org.eclipse.jface.text_3.11.2.v20170220-1911.jar.pack.gz from http://download.eclipse.org/releases/neon/201705151400/plugins/ (110.58kB of 314.18kB at 106.58kB/s)
[INFO] Fetching org.eclipse.jface.text_3.11.2.v20170220-1911.jar.pack.gz from http://download.eclipse.org/releases/neon/201705151400/plugins/ (217.46kB of 314.18kB at 96.71kB/s)
[INFO] Fetching org.eclipse.jface.text_3.11.2.v20170220-1911.jar.pack.gz from http://download.eclipse.org/releases/neon/201705151400/plugins/ (304.3kB of 314.18kB at 97.42kB/s)
[INFO] Fetching org.eclipse.ui.ide_3.12.3.v20170119-0935.jar.pack.gz from http://mirror.kumi.systems/eclipse/releases/neon/201705151400/plugins/ (0B of 793.87kB at 0B/s)
[INFO] Fetching org.eclipse.ui.views_3.8.102.v20170111-0801.jar.pack.gz from http://www.mirrorservice.org/sites/download.eclipse.org/eclipseMirror/releases/neon/201705151400/plugins/ (0B of 48.08kB at 0B/s)
[INFO] Fetching org.eclipse.ui.workbench.texteditor_3.10.1.v20160818-1626.jar.pack.gz from http://www.mirrorservice.org/sites/download.eclipse.org/eclipseMirror/releases/neon/201705151400/plugins/ (0B of 228.35kB at 0B/s)
[INFO] Fetching org.eclipse.core.runtime_3.12.0.v20160606-1342.jar.pack.gz from http://mirror.ibcp.fr/pub/eclipse//releases/neon/201705151400/plugins/ (0B of 35.25kB at 0B/s)
[INFO] Fetching org.eclipse.core.expressions_3.5.100.v20160418-1621.jar.pack.gz from http://mirror.ibcp.fr/pub/eclipse//releases/neon/201705151400/plugins/ (0B of 32.83kB at 0B/s)
[INFO] Fetching org.eclipse.ui.editors_3.10.1.v20161106-1856.jar.pack.gz from http://mirror.ibcp.fr/pub/eclipse//releases/neon/201705151400/plugins/ (0B of 178.45kB at 0B/s)
[INFO] Fetching org.eclipse.ui.forms_3.7.1.v20161220-1635.jar.pack.gz from http://mirrors.uniri.hr/eclipse//releases/neon/201705151400/plugins/ (0B of 125.61kB at 0B/s)
[INFO] Fetching org.eclipse.compare.core_3.6.0.v20160418-1534.jar.pack.gz from http://mirror.ibcp.fr/pub/eclipse//releases/neon/201705151400/plugins/ (0B of 32.24kB at 0B/s)
[INFO] Fetching com.ibm.icu_56.1.0.v201601250100.jar.pack.gz from http://mirror.kumi.systems/eclipse/releases/neon/201705151400/plugins/ (0B of 8.22MB at 0B/s)
[INFO] Fetching org.eclipse.compare_3.7.1.v20170103-1805.jar.pack.gz from http://mirror.ibcp.fr/pub/eclipse//releases/neon/201705151400/plugins/ (0B of 251.65kB at 0B/s)
[INFO] Fetching org.eclipse.equinox.common_3.8.0.v20160509-1230.jar.pack.gz from http://mirrors.uniri.hr/eclipse//releases/neon/201705151400/plugins/ (0B of 51.37kB at 0B/s)
[INFO] Fetching org.eclipse.core.commands_3.8.1.v20161221-1651.jar.pack.gz from http://mirror.ibcp.fr/pub/eclipse//releases/neon/201705151400/plugins/ (0B of 43.13kB at 0B/s)
[INFO] Fetching org.eclipse.core.contenttype_3.5.100.v20160418-1621.jar.pack.gz from http://mirror.ibcp.fr/pub/eclipse//releases/neon/201705151400/plugins/ (0B of 39.58kB at 0B/s)
[INFO] Fetching org.eclipse.equinox.preferences_3.6.1.v20160815-1406.jar.pack.gz from http://mirrors.uniri.hr/eclipse//releases/neon/201705151400/plugins/ (0B of 53.94kB at 0B/s)
[INFO] Fetching org.eclipse.equinox.registry_3.6.100.v20160223-2218.jar.pack.gz from http://www.mirrorservice.org/sites/download.eclipse.org/eclipseMirror/releases/neon/201705151400/plugins/ (0B of 71.51kB at 0B/s)
[INFO] Fetching org.eclipse.core.databinding_1.6.0.v20160412-0910.jar.pack.gz from http://mirror.ibcp.fr/pub/eclipse//releases/neon/201705151400/plugins/ (0B of 57.81kB at 0B/s)
[INFO] Fetching org.eclipse.core.databinding.observable_1.6.0.v20160511-1747.jar.pack.gz from http://www.mirrorservice.org/sites/download.eclipse.org/eclipseMirror/releases/neon/201705151400/plugins/ (0B of 90.47kB at 0B/s)
[INFO] Fetching org.eclipse.core.databinding.property_1.6.0.v20160427-0852.jar.pack.gz from http://download.eclipse.org/releases/neon/201705151400/plugins/ (0B of 49.78kB at 0B/s)
[INFO] Fetching org.eclipse.core.filebuffers_3.6.0.v20160503-1849.jar.pack.gz from http://mirror.ibcp.fr/pub/eclipse//releases/neon/201705151400/plugins/ (0B of 42.91kB at 0B/s)
[INFO] Fetching org.eclipse.text_3.6.0.v20160503-1849.jar.pack.gz from http://www.mirrorservice.org/sites/download.eclipse.org/eclipseMirror/releases/neon/201705151400/plugins/ (0B of 91.22kB at 0B/s)
[INFO] Fetching org.eclipse.core.filesystem_1.6.1.v20161113-2349.jar.pack.gz from http://mirror.ibcp.fr/pub/eclipse//releases/neon/201705151400/plugins/ (0B of 27.54kB at 0B/s)
[INFO] Fetching org.eclipse.core.jobs_3.8.0.v20160509-0411.jar.pack.gz from http://mirror.kumi.systems/eclipse/releases/neon/201705151400/plugins/ (0B of 46.37kB at 0B/s)
[INFO] Fetching org.eclipse.equinox.app_1.3.400.v20150715-1528.jar.pack.gz from http://mirror.kumi.systems/eclipse/releases/neon/201705151400/plugins/ (0B of 40.76kB at 0B/s)
[INFO] Fetching org.eclipse.core.variables_3.3.0.v20160419-1720.jar.pack.gz from http://www.mirrorservice.org/sites/download.eclipse.org/eclipseMirror/releases/neon/201705151400/plugins/ (0B of 17.99kB at 0B/s)
[INFO] Fetching org.eclipse.debug.core_3.10.100.v20160419-1720.jar.pack.gz from http://www.mirrorservice.org/sites/download.eclipse.org/eclipseMirror/releases/neon/201705151400/plugins/ (0B of 115.16kB at 0B/s)
[INFO] Fetching org.eclipse.ui.console_3.6.201.v20161107-0337.jar.pack.gz from http://www.mirrorservice.org/sites/download.eclipse.org/eclipseMirror/releases/neon/201705151400/plugins/ (0B of 84.38kB at 0B/s)
[INFO] Fetching org.eclipse.help_3.7.0.v20160602-1307.jar.pack.gz from http://mirror.ibcp.fr/pub/eclipse//releases/neon/201705151400/plugins/ (0B of 122.2kB at 0B/s)
[INFO] Fetching org.eclipse.debug.ui_3.11.202.v20161114-0338.jar.pack.gz from http://mirror.ibcp.fr/pub/eclipse//releases/neon/201705151400/plugins/ (0B of 1MB at 0B/s)
[INFO] Fetching org.eclipse.e4.core.commands_0.11.100.v20160506-0804.jar.pack.gz from http://mirror.onet.pl/pub/mirrors/eclipse//releases/neon/201705151400/plugins/ (0B of 13.72kB at 0B/s)
[INFO] Fetching org.eclipse.e4.core.di_1.6.1.v20160712-0927.jar.pack.gz from http://mirror.ibcp.fr/pub/eclipse//releases/neon/201705151400/plugins/ (0B of 26.23kB at 0B/s)
[INFO] Fetching javax.inject_1.0.0.v20091030.jar from http://www.mirrorservice.org/sites/download.eclipse.org/eclipseMirror/releases/neon/201705151400/plugins/ (0B of 16.6kB at 0B/s)
[INFO] Fetching org.eclipse.e4.core.contexts_1.5.1.v20170203-1100.jar.pack.gz from http://mirror.ibcp.fr/pub/eclipse//releases/neon/201705151400/plugins/ (0B of 22.44kB at 0B/s)
[INFO] Fetching org.eclipse.e4.core.services_2.0.100.v20160509-1032.jar.pack.gz from http://mirror.kumi.systems/eclipse/releases/neon/201705151400/plugins/ (0B of 23.39kB at 0B/s)
[INFO] Fetching org.eclipse.e4.core.di.annotations_1.5.0.v20151127-1241.jar.pack.gz from http://www.mirrorservice.org/sites/download.eclipse.org/eclipseMirror/releases/neon/201705151400/plugins/ (0B of 7.59kB at 0B/s)
[INFO] Fetching org.eclipse.e4.core.di.extensions_0.14.0.v20160211-1614.jar.pack.gz from http://mirror.onet.pl/pub/mirrors/eclipse//releases/neon/201705151400/plugins/ (0B of 13.88kB at 0B/s)
[INFO] Fetching org.eclipse.e4.emf.xpath_0.1.200.v20160506-0804.jar.pack.gz from http://www.mirrorservice.org/sites/download.eclipse.org/eclipseMirror/releases/neon/201705151400/plugins/ (0B of 21.67kB at 0B/s)
[INFO] Fetching org.apache.commons.jxpath_1.3.0.v200911051830.jar.pack.gz from http://www.mirrorservice.org/sites/download.eclipse.org/eclipseMirror/releases/neon/201705151400/plugins/ (0B of 98kB at 0B/s)
[INFO] Fetching org.eclipse.emf.ecore_2.12.0.v20160420-0247.jar.pack.gz from http://www.mirrorservice.org/sites/download.eclipse.org/eclipseMirror/releases/neon/201705151400/plugins/ (0B of 366.46kB at 0B/s)
[INFO] Fetching org.eclipse.e4.ui.bindings_0.11.100.v20160509-1025.jar.pack.gz from http://www.mirrorservice.org/sites/download.eclipse.org/eclipseMirror/releases/neon/201705151400/plugins/ (0B of 24.02kB at 0B/s)
[INFO] Fetching org.eclipse.swt_3.105.3.v20170228-0512.jar.pack.gz from http://mirror.ibcp.fr/pub/eclipse//releases/neon/201705151400/plugins/ (0B of 18.2kB at 0B/s)
[INFO] Fetching org.eclipse.jface_3.12.2.v20170113-2113.jar.pack.gz from http://mirrors.uniri.hr/eclipse//releases/neon/201705151400/plugins/ (0B of 344.64kB at 0B/s)
[INFO] Fetching org.eclipse.e4.ui.css.core_0.12.1.v20161114-0210.jar.pack.gz from http://mirror.ibcp.fr/pub/eclipse//releases/neon/201705151400/plugins/ (0B of 65.01kB at 0B/s)
[INFO] Fetching org.eclipse.e4.ui.css.swt_0.12.100.v20160517-1505.jar.pack.gz from http://www.mirrorservice.org/sites/download.eclipse.org/eclipseMirror/releases/neon/201705151400/plugins/ (0B of 80.01kB at 0B/s)
[INFO] Fetching org.eclipse.e4.ui.css.swt.theme_0.10.100.v20160523-0836.jar.pack.gz from http://mirror.ibcp.fr/pub/eclipse//releases/neon/201705151400/plugins/ (0B of 16.11kB at 0B/s)
[INFO] Fetching org.eclipse.e4.ui.di_1.1.100.v20160506-0759.jar.pack.gz from http://www.mirrorservice.org/sites/download.eclipse.org/eclipseMirror/releases/neon/201705151400/plugins/ (0B of 9.57kB at 0B/s)
[INFO] Fetching org.eclipse.e4.ui.model.workbench_1.2.0.v20160229-1459.jar.pack.gz from http://mirror.onet.pl/pub/mirrors/eclipse//releases/neon/201705151400/plugins/ (0B of 106.56kB at 0B/s)
[INFO] Fetching org.eclipse.e4.ui.services_1.2.100.v20160506-0759.jar.pack.gz from http://mirror.ibcp.fr/pub/eclipse//releases/neon/201705151400/plugins/ (0B of 14.13kB at 0B/s)
[INFO] Fetching org.eclipse.e4.ui.widgets_1.1.100.v20160506-0759.jar.pack.gz from http://mirror.kumi.systems/eclipse/releases/neon/201705151400/plugins/ (0B of 9.84kB at 0B/s)
[INFO] Fetching org.eclipse.e4.ui.workbench_1.4.0.v20160517-1624.jar.pack.gz from http://www.mirrorservice.org/sites/download.eclipse.org/eclipseMirror/releases/neon/201705151400/plugins/ (0B of 81.91kB at 0B/s)
[INFO] Fetching org.eclipse.emf.ecore.change_2.11.0.v20160420-0247.jar.pack.gz from http://www.mirrorservice.org/sites/download.eclipse.org/eclipseMirror/releases/neon/201705151400/plugins/ (0B of 36.05kB at 0B/s)
[INFO] Fetching org.eclipse.emf.ecore.xmi_2.12.0.v20160420-0247.jar.pack.gz from http://ftp-stud.fht-esslingen.de/pub/Mirrors/eclipse/releases/neon/201705151400/plugins/ (0B of 80.33kB at 0B/s)
[INFO] Fetching org.eclipse.e4.ui.workbench.renderers.swt_0.14.1.v20170117-1415.jar.pack.gz from http://www.mirrorservice.org/sites/download.eclipse.org/eclipseMirror/releases/neon/201705151400/plugins/ (0B of 98.24kB at 0B/s)
[INFO] Fetching org.eclipse.e4.ui.workbench.swt_0.14.1.v20160829-0832.jar.pack.gz from http://mirror.ibcp.fr/pub/eclipse//releases/neon/201705151400/plugins/ (0B of 72.42kB at 0B/s)
[INFO] Fetching org.eclipse.e4.ui.workbench.addons.swt_1.2.101.v20170206-1129.jar.pack.gz from http://www.mirrorservice.org/sites/download.eclipse.org/eclipseMirror/releases/neon/201705151400/plugins/ (0B of 54.05kB at 0B/s)
[INFO] Fetching org.eclipse.equinox.ds_1.4.400.v20160226-2036.jar.pack.gz from http://mirror.ibcp.fr/pub/eclipse//releases/neon/201705151400/plugins/ (0B of 89.5kB at 0B/s)
[INFO] Fetching org.eclipse.jface.databinding_1.8.1.v20161026-1531.jar.pack.gz from http://www.mirrorservice.org/sites/download.eclipse.org/eclipseMirror/releases/neon/201705151400/plugins/ (0B of 70.71kB at 0B/s)
[INFO] Fetching org.eclipse.e4.ui.workbench3_0.13.100.v20160506-0759.jar.pack.gz from http://mirror.onet.pl/pub/mirrors/eclipse//releases/neon/201705151400/plugins/ (0B of 7.92kB at 0B/s)
[INFO] Fetching org.eclipse.emf.common_2.12.0.v20160420-0247.jar.pack.gz from http://mirror.ibcp.fr/pub/eclipse//releases/neon/201705151400/plugins/ (0B of 104.54kB at 0B/s)
[INFO] Fetching org.eclipse.equinox.bidi_1.0.0.v20160307-1318.jar.pack.gz from http://mirror.ibcp.fr/pub/eclipse//releases/neon/201705151400/plugins/ (0B of 23.14kB at 0B/s)
[INFO] Fetching org.eclipse.equinox.util_1.0.500.v20130404-1337.jar.pack.gz from http://www.mirrorservice.org/sites/download.eclipse.org/eclipseMirror/releases/neon/201705151400/plugins/ (0B of 30.41kB at 0B/s)
[INFO] Fetching org.eclipse.equinox.p2.core_2.4.100.v20160419-0834.jar.pack.gz from http://mirror.switch.ch/eclipse/releases/neon/201705151400/plugins/ (0B of 29.98kB at 0B/s)
[INFO] Fetching org.eclipse.equinox.p2.engine_2.4.100.v20160419-0834.jar.pack.gz from http://mirror.ibcp.fr/pub/eclipse//releases/neon/201705151400/plugins/ (0B of 71.28kB at 0B/s)
[INFO] Fetching org.eclipse.equinox.p2.metadata_2.3.100.v20160427-2220.jar.pack.gz from http://mirror.ibcp.fr/pub/eclipse//releases/neon/201705151400/plugins/ (0B of 101.77kB at 0B/s)
[INFO] Fetching org.eclipse.equinox.p2.metadata.repository_1.2.300.v20160419-0834.jar.pack.gz from http://mirror.kumi.systems/eclipse/releases/neon/201705151400/plugins/ (0B of 47.43kB at 0B/s)
[INFO] Fetching org.eclipse.equinox.p2.repository_2.3.200.v20160421-0324.jar.pack.gz from http://mirror.ibcp.fr/pub/eclipse//releases/neon/201705151400/plugins/ (0B of 52.26kB at 0B/s)
[INFO] Fetching org.tukaani.xz_1.3.0.v201308270617.jar.pack.gz from http://www.mirrorservice.org/sites/download.eclipse.org/eclipseMirror/releases/neon/201705151400/plugins/ (0B of 36.04kB at 0B/s)
[INFO] Fetching org.eclipse.equinox.security_1.2.200.v20150715-1528.jar.pack.gz from http://mirrors.uniri.hr/eclipse//releases/neon/201705151400/plugins/ (0B of 42.22kB at 0B/s)
[INFO] Fetching org.eclipse.ltk.core.refactoring_3.7.0.v20160419-0705.jar.pack.gz from http://mirror.ibcp.fr/pub/eclipse//releases/neon/201705151400/plugins/ (0B of 105.61kB at 0B/s)
[INFO] Fetching org.eclipse.ltk.ui.refactoring_3.8.0.v20160518-1817.jar.pack.gz from http://mirror.onet.pl/pub/mirrors/eclipse//releases/neon/201705151400/plugins/ (0B of 176.66kB at 0B/s)
[INFO] Fetching org.eclipse.ui.navigator_3.6.101.v20161006-1120.jar.pack.gz from http://mirror.ibcp.fr/pub/eclipse//releases/neon/201705151400/plugins/ (0B of 131.55kB at 0B/s)
[INFO] Fetching org.eclipse.team.core_3.8.0.v20160418-1534.jar.pack.gz from http://mirror.ibcp.fr/pub/eclipse//releases/neon/201705151400/plugins/ (0B of 127.51kB at 0B/s)
[INFO] Fetching org.eclipse.team.ui_3.8.0.v20160518-1906.jar.pack.gz from http://www.mirrorservice.org/sites/download.eclipse.org/eclipseMirror/releases/neon/201705151400/plugins/ (0B of 431.71kB at 0B/s)
[INFO] Fetching org.eclipse.swt.win32.win32.x86_3.105.3.v20170228-0512.jar.pack.gz from http://mirror.ibcp.fr/pub/eclipse//releases/neon/201705151400/plugins/ (0B of 1.18MB at 0B/s)
[INFO] Fetching org.eclipse.ui.workbench_3.108.3.v20170216-1539.jar.pack.gz from http://mirror.ibcp.fr/pub/eclipse//releases/neon/201705151400/plugins/ (0B of 1.03MB at 0B/s)
[INFO] Fetching org.eclipse.ui.views.properties.tabbed_3.7.0.v20160310-0903.jar.pack.gz from http://www.mirrorservice.org/sites/download.eclipse.org/eclipseMirror/releases/neon/201705151400/plugins/ (0B of 39.29kB at 0B/s)
[INFO] Fetching org.eclipse.ui.navigator.resources_3.5.101.v20161006-0640.jar.pack.gz from http://www.mirrorservice.org/sites/download.eclipse.org/eclipseMirror/releases/neon/201705151400/plugins/ (0B of 62.91kB at 0B/s)
[INFO] Fetching org.overture.ide.builders.vdmj_2.5.3.201709121241.jar from http://dl.bintray.com/overturetool/overturetool-development/plugins/ (0B of 406.51kB at 0B/s)
[INFO] Fetching org.overture.ide.core_2.5.3.201709121241.jar from http://dl.bintray.com/overturetool/overturetool-development/plugins/ (0B of 1.44MB at 0B/s)
[INFO] Fetching org.overture.ide.debug_2.5.3.201709121241.jar from http://dl.bintray.com/overturetool/overturetool-development/plugins/ (0B of 1.44MB at 0B/s)
[INFO] Fetching org.overture.ide.ui_2.5.3.201709121241.jar from http://dl.bintray.com/overturetool/overturetool-development/plugins/ (0B of 689.86kB at 0B/s)
[INFO] Fetching 201703141400&countryCode=gb&timeZone=1&format=xml from http://www.eclipse.org/downloads/download.php?format=xml&file=/releases/neon/ (0B at 0B/s)
[INFO] Fetching org.slf4j.api_1.7.10.v20160921-1923.jar from http://mirror.internode.on.net/pub/eclipse/releases/neon/201703141400/plugins/ (0B of 42.56kB at 0B/s)
[INFO] Fetching org.slf4j.api_1.7.10.v20160921-1923.jar from http://mirror.internode.on.net/pub/eclipse/releases/neon/201703141400/plugins/ (31.8kB of 42.56kB at 27.8kB/s)
[INFO] Fetching org.w3c.dom.smil_1.0.1.v200903091627.jar.pack.gz from http://mirror.switch.ch/eclipse/releases/neon/201705151400/plugins/ (0B of 14.95kB at 0B/s)
[INFO] Fetching org.eclipse.swt.win32.win32.x86_64_3.105.3.v20170228-0512.jar.pack.gz from http://www.mirrorservice.org/sites/download.eclipse.org/eclipseMirror/releases/neon/201705151400/plugins/ (0B of 1.17MB at 0B/s)
[INFO] Fetching org.eclipse.swt.gtk.linux.x86_3.105.3.v20170228-0512.jar.pack.gz from http://www.mirrorservice.org/sites/download.eclipse.org/eclipseMirror/releases/neon/201705151400/plugins/ (0B of 1.14MB at 0B/s)
[INFO] Fetching org.eclipse.swt.gtk.linux.x86_64_3.105.3.v20170228-0512.jar.pack.gz from http://ftp-stud.fht-esslingen.de/pub/Mirrors/eclipse/releases/neon/201705151400/plugins/ (0B of 1.28MB at 0B/s)
[INFO] Fetching org.eclipse.swt.cocoa.macosx.x86_64_3.105.3.v20170228-0512.jar.pack.gz from http://www.mirrorservice.org/sites/download.eclipse.org/eclipseMirror/releases/neon/201705151400/plugins/ (0B of 961.03kB at 0B/s)
[INFO] Resolving class path of MavenProject: org.overturetool.vdm2c.ide:org.overturetool.vdm2c.ide.cgen:0.1.15-SNAPSHOT @ /var/lib/jenkins/workspace/ch-pipeline_vpb_development-KCTLYUE5TMW7Z33VLFXIW7KHT6FIH4V5AIJQWV52XR2IIKDPQP2Q/ide/cgen/pom.xml
[INFO] Computing target platform for MavenProject: org.overturetool.vdm2c.ide.features:org.overturetool.vdm2c.ide.features.cgen:0.1.15-SNAPSHOT @ /var/lib/jenkins/workspace/ch-pipeline_vpb_development-KCTLYUE5TMW7Z33VLFXIW7KHT6FIH4V5AIJQWV52XR2IIKDPQP2Q/ide/features/cgen/pom.xml
[INFO] Resolving dependencies of MavenProject: org.overturetool.vdm2c.ide.features:org.overturetool.vdm2c.ide.features.cgen:0.1.15-SNAPSHOT @ /var/lib/jenkins/workspace/ch-pipeline_vpb_development-KCTLYUE5TMW7Z33VLFXIW7KHT6FIH4V5AIJQWV52XR2IIKDPQP2Q/ide/features/cgen/pom.xml
[INFO] Resolving class path of MavenProject: org.overturetool.vdm2c.ide.features:org.overturetool.vdm2c.ide.features.cgen:0.1.15-SNAPSHOT @ /var/lib/jenkins/workspace/ch-pipeline_vpb_development-KCTLYUE5TMW7Z33VLFXIW7KHT6FIH4V5AIJQWV52XR2IIKDPQP2Q/ide/features/cgen/pom.xml
[INFO] Computing target platform for MavenProject: org.overturetool.vdm2c.ide:org.overturetool.vdm2c.ide.repository:0.1.15-SNAPSHOT @ /var/lib/jenkins/workspace/ch-pipeline_vpb_development-KCTLYUE5TMW7Z33VLFXIW7KHT6FIH4V5AIJQWV52XR2IIKDPQP2Q/ide/repository/pom.xml
[INFO] Resolving dependencies of MavenProject: org.overturetool.vdm2c.ide:org.overturetool.vdm2c.ide.repository:0.1.15-SNAPSHOT @ /var/lib/jenkins/workspace/ch-pipeline_vpb_development-KCTLYUE5TMW7Z33VLFXIW7KHT6FIH4V5AIJQWV52XR2IIKDPQP2Q/ide/repository/pom.xml
[INFO] Resolving class path of MavenProject: org.overturetool.vdm2c.ide:org.overturetool.vdm2c.ide.repository:0.1.15-SNAPSHOT @ /var/lib/jenkins/workspace/ch-pipeline_vpb_development-KCTLYUE5TMW7Z33VLFXIW7KHT6FIH4V5AIJQWV52XR2IIKDPQP2Q/ide/repository/pom.xml
[INFO] ------------------------------------------------------------------------
[INFO] Reactor Build Order:
[INFO] 
[INFO] Overture VDM 2 C Translator Root
[INFO] C native root vdm2c
[INFO] The C Code Generator VDM library sources
[INFO] Core Tools for vdm2c
[INFO] The C Code Generator
[INFO] Overture FMI IDE Top-level
[INFO] The C Code Generator Plugin
[INFO] Overture IDE Eclipse VDM2C features
[INFO] Overture IDE Eclipse C Code Generator feature
[INFO] Overture IDE Eclipse repository
[INFO]                                                                         
[INFO] ------------------------------------------------------------------------
[INFO] Building Overture VDM 2 C Translator Root 0.1.15-SNAPSHOT
[INFO] ------------------------------------------------------------------------
[INFO] 
[INFO] --- maven-enforcer-plugin:1.0:enforce (enforce-maven) @ root ---
[INFO] 
[INFO] --- jacoco-maven-plugin:0.7.6.201602180812:prepare-agent (jacoco-initialize) @ root ---
[INFO] argLine set to -javaagent:/var/lib/jenkins/workspace/ch-pipeline_vpb_development-KCTLYUE5TMW7Z33VLFXIW7KHT6FIH4V5AIJQWV52XR2IIKDPQP2Q/.repository/org/jacoco/org.jacoco.agent/0.7.6.201602180812/org.jacoco.agent-0.7.6.201602180812-runtime.jar=destfile=/var/lib/jenkins/workspace/ch-pipeline_vpb_development-KCTLYUE5TMW7Z33VLFXIW7KHT6FIH4V5AIJQWV52XR2IIKDPQP2Q/target/coverage-reports/jacoco-unit.exec,excludes=org/overture/cgc/extast/analysis/**/*.*:org/overture/codegen/vdm2c/extast/expressions/**/*:org/overture/codegen/vdm2c/extast/declarations/**/*:org/overture/codegen/vdm2c/extast/statements/**/*:org/overture/cgc/extast/node/**/*:org/overture/codegen/vdm2c/ast/preview/**/*
[INFO] 
[INFO] --- jacoco-maven-plugin:0.7.6.201602180812:report (jacoco-site) @ root ---
[INFO] Skipping JaCoCo execution due to missing execution data file:/var/lib/jenkins/workspace/ch-pipeline_vpb_development-KCTLYUE5TMW7Z33VLFXIW7KHT6FIH4V5AIJQWV52XR2IIKDPQP2Q/target/coverage-reports/jacoco-unit.exec
[INFO] 
[INFO] --- maven-jarsigner-plugin:1.2:sign (sign) @ root ---
[INFO] Downloading: http://overture.au.dk/artifactory/remote-repos/org/codehaus/plexus/plexus-utils/1.5.15/plexus-utils-1.5.15.jar
[INFO] Downloaded: http://overture.au.dk/artifactory/remote-repos/org/codehaus/plexus/plexus-utils/1.5.15/plexus-utils-1.5.15.jar (223 KB at 6551.9 KB/sec)
[INFO] 0 archive(s) processed
[INFO] 
[INFO] --- maven-install-plugin:2.4:install (default-install) @ root ---
[INFO] Downloading: http://overture.au.dk/artifactory/remote-repos/org/codehaus/plexus/plexus-utils/3.0.5/plexus-utils-3.0.5.pom
[INFO] Downloaded: http://overture.au.dk/artifactory/remote-repos/org/codehaus/plexus/plexus-utils/3.0.5/plexus-utils-3.0.5.pom (3 KB at 204.4 KB/sec)
[INFO] Downloading: http://overture.au.dk/artifactory/remote-repos/org/codehaus/plexus/plexus-utils/3.0.5/plexus-utils-3.0.5.jar
[INFO] Downloaded: http://overture.au.dk/artifactory/remote-repos/org/codehaus/plexus/plexus-utils/3.0.5/plexus-utils-3.0.5.jar (226 KB at 15003.1 KB/sec)
[INFO] Installing /var/lib/jenkins/workspace/ch-pipeline_vpb_development-KCTLYUE5TMW7Z33VLFXIW7KHT6FIH4V5AIJQWV52XR2IIKDPQP2Q/pom.xml to /var/lib/jenkins/workspace/ch-pipeline_vpb_development-KCTLYUE5TMW7Z33VLFXIW7KHT6FIH4V5AIJQWV52XR2IIKDPQP2Q/.repository/org/overturetool/vdm2c/root/0.1.15-SNAPSHOT/root-0.1.15-SNAPSHOT.pom
[INFO]                                                                         
[INFO] ------------------------------------------------------------------------
[INFO] Building C native root vdm2c 0.1.15-SNAPSHOT
[INFO] ------------------------------------------------------------------------
[INFO] 
[INFO] --- maven-enforcer-plugin:1.0:enforce (enforce-maven) @ c ---
[INFO] 
[INFO] --- jacoco-maven-plugin:0.7.6.201602180812:prepare-agent (jacoco-initialize) @ c ---
[INFO] argLine set to -javaagent:/var/lib/jenkins/workspace/ch-pipeline_vpb_development-KCTLYUE5TMW7Z33VLFXIW7KHT6FIH4V5AIJQWV52XR2IIKDPQP2Q/.repository/org/jacoco/org.jacoco.agent/0.7.6.201602180812/org.jacoco.agent-0.7.6.201602180812-runtime.jar=destfile=/var/lib/jenkins/workspace/ch-pipeline_vpb_development-KCTLYUE5TMW7Z33VLFXIW7KHT6FIH4V5AIJQWV52XR2IIKDPQP2Q/c/target/coverage-reports/jacoco-unit.exec,excludes=org/overture/cgc/extast/analysis/**/*.*:org/overture/codegen/vdm2c/extast/expressions/**/*:org/overture/codegen/vdm2c/extast/declarations/**/*:org/overture/codegen/vdm2c/extast/statements/**/*:org/overture/cgc/extast/node/**/*:org/overture/codegen/vdm2c/ast/preview/**/*
[INFO] 
[INFO] --- maven-antrun-plugin:1.7:run (copy-dependencies) @ c ---
[INFO] Executing tasks

main:
     [exec] -- The C compiler identification is GNU 5.4.0
     [exec] -- The CXX compiler identification is GNU 5.4.0
     [exec] -- Check for working C compiler: /usr/bin/cc
     [exec] -- Check for working C compiler: /usr/bin/cc -- works
     [exec] -- Detecting C compiler ABI info
     [exec] -- Detecting C compiler ABI info - done
     [exec] -- Detecting C compile features
     [exec] -- Detecting C compile features - done
     [exec] -- Check for working CXX compiler: /usr/bin/c++
     [exec] -- Check for working CXX compiler: /usr/bin/c++ -- works
     [exec] -- Detecting CXX compiler ABI info
     [exec] -- Detecting CXX compiler ABI info - done
     [exec] -- Detecting CXX compile features
     [exec] -- Detecting CXX compile features - done
     [exec] -- Found PythonInterp: /usr/bin/python (found version "2.7.12") 
     [exec] -- Looking for pthread.h
     [exec] -- Looking for pthread.h - found
     [exec] -- Looking for pthread_create
     [exec] -- Looking for pthread_create - not found
     [exec] -- Looking for pthread_create in pthreads
     [exec] -- Looking for pthread_create in pthreads - not found
     [exec] -- Looking for pthread_create in pthread
     [exec] -- Looking for pthread_create in pthread - found
     [exec] -- Found Threads: TRUE  
     [exec] -- Configuring done
     [exec] -- Generating done
     [exec] -- Build files have been written to: /var/lib/jenkins/workspace/ch-pipeline_vpb_development-KCTLYUE5TMW7Z33VLFXIW7KHT6FIH4V5AIJQWV52XR2IIKDPQP2Q/c
[INFO] Executed tasks
[INFO] 
[INFO] --- jacoco-maven-plugin:0.7.6.201602180812:report (jacoco-site) @ c ---
[INFO] Skipping JaCoCo execution due to missing execution data file:/var/lib/jenkins/workspace/ch-pipeline_vpb_development-KCTLYUE5TMW7Z33VLFXIW7KHT6FIH4V5AIJQWV52XR2IIKDPQP2Q/c/target/coverage-reports/jacoco-unit.exec
[INFO] 
[INFO] --- maven-jarsigner-plugin:1.2:sign (sign) @ c ---
[INFO] 0 archive(s) processed
[INFO] 
[INFO] --- maven-install-plugin:2.4:install (default-install) @ c ---
[INFO] Installing /var/lib/jenkins/workspace/ch-pipeline_vpb_development-KCTLYUE5TMW7Z33VLFXIW7KHT6FIH4V5AIJQWV52XR2IIKDPQP2Q/c/pom.xml to /var/lib/jenkins/workspace/ch-pipeline_vpb_development-KCTLYUE5TMW7Z33VLFXIW7KHT6FIH4V5AIJQWV52XR2IIKDPQP2Q/.repository/org/overturetool/vdm2c/c/0.1.15-SNAPSHOT/c-0.1.15-SNAPSHOT.pom
[INFO]                                                                         
[INFO] ------------------------------------------------------------------------
[INFO] Building The C Code Generator VDM library sources 0.1.15-SNAPSHOT
[INFO] ------------------------------------------------------------------------
[INFO] Downloading: http://overture.au.dk/artifactory/remote-repos/org/apache/maven/plugins/maven-surefire-plugin/2.19/maven-surefire-plugin-2.19.pom
[INFO] Downloaded: http://overture.au.dk/artifactory/remote-repos/org/apache/maven/plugins/maven-surefire-plugin/2.19/maven-surefire-plugin-2.19.pom (6 KB at 388.0 KB/sec)
[INFO] Downloading: http://overture.au.dk/artifactory/remote-repos/org/apache/maven/surefire/surefire/2.19/surefire-2.19.pom
[INFO] Downloaded: http://overture.au.dk/artifactory/remote-repos/org/apache/maven/surefire/surefire/2.19/surefire-2.19.pom (18 KB at 1629.2 KB/sec)
[INFO] Downloading: http://overture.au.dk/artifactory/remote-repos/org/apache/maven/maven-parent/26/maven-parent-26.pom
[INFO] Downloaded: http://overture.au.dk/artifactory/remote-repos/org/apache/maven/maven-parent/26/maven-parent-26.pom (40 KB at 2653.1 KB/sec)
[INFO] Downloading: http://overture.au.dk/artifactory/remote-repos/org/apache/maven/plugins/maven-surefire-plugin/2.19/maven-surefire-plugin-2.19.jar
[INFO] Downloaded: http://overture.au.dk/artifactory/remote-repos/org/apache/maven/plugins/maven-surefire-plugin/2.19/maven-surefire-plugin-2.19.jar (38 KB at 2197.4 KB/sec)
[INFO] Downloading: http://overture.au.dk/artifactory/remote-repos/org/apache/maven/plugins/maven-jar-plugin/2.4/maven-jar-plugin-2.4.pom
[INFO] Downloaded: http://overture.au.dk/artifactory/remote-repos/org/apache/maven/plugins/maven-jar-plugin/2.4/maven-jar-plugin-2.4.pom (6 KB at 517.9 KB/sec)
[INFO] Downloading: http://overture.au.dk/artifactory/remote-repos/org/apache/maven/plugins/maven-jar-plugin/2.4/maven-jar-plugin-2.4.jar
[INFO] Downloaded: http://overture.au.dk/artifactory/remote-repos/org/apache/maven/plugins/maven-jar-plugin/2.4/maven-jar-plugin-2.4.jar (34 KB at 2076.5 KB/sec)
[INFO] 
[INFO] --- maven-enforcer-plugin:1.0:enforce (enforce-maven) @ vdmclib ---
[INFO] 
[INFO] --- jacoco-maven-plugin:0.7.6.201602180812:prepare-agent (jacoco-initialize) @ vdmclib ---
[INFO] argLine set to -javaagent:/var/lib/jenkins/workspace/ch-pipeline_vpb_development-KCTLYUE5TMW7Z33VLFXIW7KHT6FIH4V5AIJQWV52XR2IIKDPQP2Q/.repository/org/jacoco/org.jacoco.agent/0.7.6.201602180812/org.jacoco.agent-0.7.6.201602180812-runtime.jar=destfile=/var/lib/jenkins/workspace/ch-pipeline_vpb_development-KCTLYUE5TMW7Z33VLFXIW7KHT6FIH4V5AIJQWV52XR2IIKDPQP2Q/c/vdmclib/target/coverage-reports/jacoco-unit.exec,excludes=org/overture/cgc/extast/analysis/**/*.*:org/overture/codegen/vdm2c/extast/expressions/**/*:org/overture/codegen/vdm2c/extast/declarations/**/*:org/overture/codegen/vdm2c/extast/statements/**/*:org/overture/cgc/extast/node/**/*:org/overture/codegen/vdm2c/ast/preview/**/*
[INFO] 
[INFO] --- maven-resources-plugin:2.6:resources (default-resources) @ vdmclib ---
[INFO] Using 'UTF-8' encoding to copy filtered resources.
[INFO] Copying 74 resources to /var/lib/jenkins/workspace/ch-pipeline_vpb_development-KCTLYUE5TMW7Z33VLFXIW7KHT6FIH4V5AIJQWV52XR2IIKDPQP2Q/c/vdmclib/target/classes/src
[INFO] 
[INFO] --- maven-compiler-plugin:3.0:compile (default-compile) @ vdmclib ---
[INFO] No sources to compile
[INFO] 
[INFO] --- maven-resources-plugin:2.6:testResources (default-testResources) @ vdmclib ---
[INFO] Using 'UTF-8' encoding to copy filtered resources.
[INFO] Copying 1 resource
[INFO] 
[INFO] --- maven-compiler-plugin:3.0:testCompile (default-testCompile) @ vdmclib ---
[INFO] No sources to compile
[INFO] 
[INFO] --- maven-surefire-plugin:2.19:test (default-test) @ vdmclib ---
[INFO] Downloading: http://overture.au.dk/artifactory/remote-repos/org/apache/maven/surefire/maven-surefire-common/2.19/maven-surefire-common-2.19.pom
[INFO] Downloaded: http://overture.au.dk/artifactory/remote-repos/org/apache/maven/surefire/maven-surefire-common/2.19/maven-surefire-common-2.19.pom (8 KB at 511.1 KB/sec)
[INFO] Downloading: http://overture.au.dk/artifactory/remote-repos/org/apache/maven/plugin-tools/maven-plugin-annotations/3.3/maven-plugin-annotations-3.3.pom
[INFO] Downloaded: http://overture.au.dk/artifactory/remote-repos/org/apache/maven/plugin-tools/maven-plugin-annotations/3.3/maven-plugin-annotations-3.3.pom (2 KB at 159.1 KB/sec)
[INFO] Downloading: http://overture.au.dk/artifactory/remote-repos/org/apache/maven/plugin-tools/maven-plugin-tools/3.3/maven-plugin-tools-3.3.pom
[INFO] Downloaded: http://overture.au.dk/artifactory/remote-repos/org/apache/maven/plugin-tools/maven-plugin-tools/3.3/maven-plugin-tools-3.3.pom (13 KB at 1235.2 KB/sec)
[INFO] Downloading: http://overture.au.dk/artifactory/remote-repos/org/apache/maven/maven-parent/24/maven-parent-24.pom
[INFO] Downloaded: http://overture.au.dk/artifactory/remote-repos/org/apache/maven/maven-parent/24/maven-parent-24.pom (37 KB at 3077.1 KB/sec)
[INFO] Downloading: http://overture.au.dk/artifactory/remote-repos/org/apache/apache/14/apache-14.pom
[INFO] Downloaded: http://overture.au.dk/artifactory/remote-repos/org/apache/apache/14/apache-14.pom (15 KB at 1604.1 KB/sec)
[INFO] Downloading: http://overture.au.dk/artifactory/remote-repos/org/apache/maven/surefire/surefire-api/2.19/surefire-api-2.19.pom
[INFO] Downloaded: http://overture.au.dk/artifactory/remote-repos/org/apache/maven/surefire/surefire-api/2.19/surefire-api-2.19.pom (4 KB at 342.6 KB/sec)
[INFO] Downloading: http://overture.au.dk/artifactory/remote-repos/org/apache/maven/surefire/surefire-booter/2.19/surefire-booter-2.19.pom
[INFO] Downloaded: http://overture.au.dk/artifactory/remote-repos/org/apache/maven/surefire/surefire-booter/2.19/surefire-booter-2.19.pom (4 KB at 239.0 KB/sec)
[INFO] Downloading: http://overture.au.dk/artifactory/remote-repos/junit/junit/4.12/junit-4.12.pom
[INFO] Downloaded: http://overture.au.dk/artifactory/remote-repos/junit/junit/4.12/junit-4.12.pom (24 KB at 2102.1 KB/sec)
[INFO] Downloading: http://overture.au.dk/artifactory/remote-repos/org/apache/maven/maven-toolchain/2.2.1/maven-toolchain-2.2.1.pom
[INFO] Downloaded: http://overture.au.dk/artifactory/remote-repos/org/apache/maven/maven-toolchain/2.2.1/maven-toolchain-2.2.1.pom (4 KB at 362.8 KB/sec)
[INFO] Downloading: http://overture.au.dk/artifactory/remote-repos/org/apache/maven/surefire/maven-surefire-common/2.19/maven-surefire-common-2.19.jar
[INFO] Downloading: http://overture.au.dk/artifactory/remote-repos/org/apache/maven/surefire/surefire-booter/2.19/surefire-booter-2.19.jar
[INFO] Downloading: http://overture.au.dk/artifactory/remote-repos/org/apache/maven/maven-plugin-descriptor/2.2.1/maven-plugin-descriptor-2.2.1.jar
[INFO] Downloading: http://overture.au.dk/artifactory/remote-repos/junit/junit/4.12/junit-4.12.jar
[INFO] Downloading: http://overture.au.dk/artifactory/remote-repos/org/apache/maven/maven-core/2.2.1/maven-core-2.2.1.jar
[INFO] Downloaded: http://overture.au.dk/artifactory/remote-repos/org/apache/maven/maven-plugin-descriptor/2.2.1/maven-plugin-descriptor-2.2.1.jar (39 KB at 2557.6 KB/sec)
[INFO] Downloading: http://overture.au.dk/artifactory/remote-repos/org/apache/maven/maven-plugin-parameter-documenter/2.2.1/maven-plugin-parameter-documenter-2.2.1.jar
[INFO] Downloaded: http://overture.au.dk/artifactory/remote-repos/org/apache/maven/surefire/surefire-booter/2.19/surefire-booter-2.19.jar (44 KB at 1675.0 KB/sec)
[INFO] Downloading: http://overture.au.dk/artifactory/remote-repos/org/slf4j/slf4j-jdk14/1.5.6/slf4j-jdk14-1.5.6.jar
[INFO] Downloaded: http://overture.au.dk/artifactory/remote-repos/org/apache/maven/maven-plugin-parameter-documenter/2.2.1/maven-plugin-parameter-documenter-2.2.1.jar (22 KB at 903.0 KB/sec)
[INFO] Downloading: http://overture.au.dk/artifactory/remote-repos/org/slf4j/slf4j-api/1.5.6/slf4j-api-1.5.6.jar
[INFO] Downloaded: http://overture.au.dk/artifactory/remote-repos/junit/junit/4.12/junit-4.12.jar (308 KB at 11828.9 KB/sec)
[INFO] Downloading: http://overture.au.dk/artifactory/remote-repos/org/slf4j/jcl-over-slf4j/1.5.6/jcl-over-slf4j-1.5.6.jar
[INFO] Downloaded: http://overture.au.dk/artifactory/remote-repos/org/apache/maven/maven-core/2.2.1/maven-core-2.2.1.jar (174 KB at 6948.7 KB/sec)
[INFO] Downloading: http://overture.au.dk/artifactory/remote-repos/org/apache/maven/reporting/maven-reporting-api/3.0/maven-reporting-api-3.0.jar
[INFO] Downloaded: http://overture.au.dk/artifactory/remote-repos/org/apache/maven/surefire/maven-surefire-common/2.19/maven-surefire-common-2.19.jar (286 KB at 9216.8 KB/sec)
[INFO] Downloading: http://overture.au.dk/artifactory/remote-repos/org/apache/maven/maven-error-diagnostics/2.2.1/maven-error-diagnostics-2.2.1.jar
[INFO] Downloaded: http://overture.au.dk/artifactory/remote-repos/org/slf4j/slf4j-api/1.5.6/slf4j-api-1.5.6.jar (22 KB at 681.7 KB/sec)
[INFO] Downloading: http://overture.au.dk/artifactory/remote-repos/org/apache/maven/maven-monitor/2.2.1/maven-monitor-2.2.1.jar
[INFO] Downloaded: http://overture.au.dk/artifactory/remote-repos/org/slf4j/jcl-over-slf4j/1.5.6/jcl-over-slf4j-1.5.6.jar (17 KB at 480.3 KB/sec)
[INFO] Downloading: http://overture.au.dk/artifactory/remote-repos/org/sonatype/plexus/plexus-cipher/1.4/plexus-cipher-1.4.jar
[INFO] Downloaded: http://overture.au.dk/artifactory/remote-repos/org/apache/maven/reporting/maven-reporting-api/3.0/maven-reporting-api-3.0.jar (11 KB at 281.1 KB/sec)
[INFO] Downloading: http://overture.au.dk/artifactory/remote-repos/org/apache/maven/surefire/surefire-api/2.19/surefire-api-2.19.jar
[INFO] Downloaded: http://overture.au.dk/artifactory/remote-repos/org/apache/maven/maven-monitor/2.2.1/maven-monitor-2.2.1.jar (11 KB at 243.1 KB/sec)
[INFO] Downloading: http://overture.au.dk/artifactory/remote-repos/org/apache/maven/maven-toolchain/2.2.1/maven-toolchain-2.2.1.jar
[INFO] Downloaded: http://overture.au.dk/artifactory/remote-repos/org/apache/maven/maven-error-diagnostics/2.2.1/maven-error-diagnostics-2.2.1.jar (13 KB at 295.7 KB/sec)
[INFO] Downloading: http://overture.au.dk/artifactory/remote-repos/org/apache/maven/plugin-tools/maven-plugin-annotations/3.3/maven-plugin-annotations-3.3.jar
[INFO] Downloaded: http://overture.au.dk/artifactory/remote-repos/org/sonatype/plexus/plexus-cipher/1.4/plexus-cipher-1.4.jar (14 KB at 299.5 KB/sec)
[INFO] Downloaded: http://overture.au.dk/artifactory/remote-repos/org/slf4j/slf4j-jdk14/1.5.6/slf4j-jdk14-1.5.6.jar (9 KB at 191.3 KB/sec)
[INFO] Downloaded: http://overture.au.dk/artifactory/remote-repos/org/apache/maven/maven-toolchain/2.2.1/maven-toolchain-2.2.1.jar (37 KB at 720.4 KB/sec)
[INFO] Downloaded: http://overture.au.dk/artifactory/remote-repos/org/apache/maven/surefire/surefire-api/2.19/surefire-api-2.19.jar (191 KB at 3525.8 KB/sec)
[INFO] Downloaded: http://overture.au.dk/artifactory/remote-repos/org/apache/maven/plugin-tools/maven-plugin-annotations/3.3/maven-plugin-annotations-3.3.jar (14 KB at 244.8 KB/sec)
[INFO] 
[INFO] --- maven-antrun-plugin:1.7:run (copy-dependencies) @ vdmclib ---
[INFO] Executing tasks

main:
     [exec] cd /var/lib/jenkins/workspace/ch-pipeline_vpb_development-KCTLYUE5TMW7Z33VLFXIW7KHT6FIH4V5AIJQWV52XR2IIKDPQP2Q/c && /usr/bin/cmake -H/var/lib/jenkins/workspace/ch-pipeline_vpb_development-KCTLYUE5TMW7Z33VLFXIW7KHT6FIH4V5AIJQWV52XR2IIKDPQP2Q/c -B/var/lib/jenkins/workspace/ch-pipeline_vpb_development-KCTLYUE5TMW7Z33VLFXIW7KHT6FIH4V5AIJQWV52XR2IIKDPQP2Q/c --check-build-system CMakeFiles/Makefile.cmake 0
     [exec] cd /var/lib/jenkins/workspace/ch-pipeline_vpb_development-KCTLYUE5TMW7Z33VLFXIW7KHT6FIH4V5AIJQWV52XR2IIKDPQP2Q/c && /usr/bin/cmake -E cmake_progress_start /var/lib/jenkins/workspace/ch-pipeline_vpb_development-KCTLYUE5TMW7Z33VLFXIW7KHT6FIH4V5AIJQWV52XR2IIKDPQP2Q/c/CMakeFiles /var/lib/jenkins/workspace/ch-pipeline_vpb_development-KCTLYUE5TMW7Z33VLFXIW7KHT6FIH4V5AIJQWV52XR2IIKDPQP2Q/c/vdmclib/CMakeFiles/progress.marks
     [exec] cd /var/lib/jenkins/workspace/ch-pipeline_vpb_development-KCTLYUE5TMW7Z33VLFXIW7KHT6FIH4V5AIJQWV52XR2IIKDPQP2Q/c && make -f CMakeFiles/Makefile2 vdmclib/all
     [exec] make[1]: Entering directory '/var/lib/jenkins/workspace/ch-pipeline_vpb_development-KCTLYUE5TMW7Z33VLFXIW7KHT6FIH4V5AIJQWV52XR2IIKDPQP2Q/c'
     [exec] make -f third_party/googletest/googletest/CMakeFiles/gtest.dir/build.make third_party/googletest/googletest/CMakeFiles/gtest.dir/depend
     [exec] make[2]: Entering directory '/var/lib/jenkins/workspace/ch-pipeline_vpb_development-KCTLYUE5TMW7Z33VLFXIW7KHT6FIH4V5AIJQWV52XR2IIKDPQP2Q/c'
     [exec] cd /var/lib/jenkins/workspace/ch-pipeline_vpb_development-KCTLYUE5TMW7Z33VLFXIW7KHT6FIH4V5AIJQWV52XR2IIKDPQP2Q/c && /usr/bin/cmake -E cmake_depends "Unix Makefiles" /var/lib/jenkins/workspace/ch-pipeline_vpb_development-KCTLYUE5TMW7Z33VLFXIW7KHT6FIH4V5AIJQWV52XR2IIKDPQP2Q/c /var/lib/jenkins/workspace/ch-pipeline_vpb_development-KCTLYUE5TMW7Z33VLFXIW7KHT6FIH4V5AIJQWV52XR2IIKDPQP2Q/c/third_party/googletest/googletest /var/lib/jenkins/workspace/ch-pipeline_vpb_development-KCTLYUE5TMW7Z33VLFXIW7KHT6FIH4V5AIJQWV52XR2IIKDPQP2Q/c /var/lib/jenkins/workspace/ch-pipeline_vpb_development-KCTLYUE5TMW7Z33VLFXIW7KHT6FIH4V5AIJQWV52XR2IIKDPQP2Q/c/third_party/googletest/googletest /var/lib/jenkins/workspace/ch-pipeline_vpb_development-KCTLYUE5TMW7Z33VLFXIW7KHT6FIH4V5AIJQWV52XR2IIKDPQP2Q/c/third_party/googletest/googletest/CMakeFiles/gtest.dir/DependInfo.cmake --color=
     [exec] Scanning dependencies of target gtest
     [exec] make[2]: Leaving directory '/var/lib/jenkins/workspace/ch-pipeline_vpb_development-KCTLYUE5TMW7Z33VLFXIW7KHT6FIH4V5AIJQWV52XR2IIKDPQP2Q/c'
     [exec] make -f third_party/googletest/googletest/CMakeFiles/gtest.dir/build.make third_party/googletest/googletest/CMakeFiles/gtest.dir/build
     [exec] make[2]: Entering directory '/var/lib/jenkins/workspace/ch-pipeline_vpb_development-KCTLYUE5TMW7Z33VLFXIW7KHT6FIH4V5AIJQWV52XR2IIKDPQP2Q/c'
     [exec] [  1%] Building CXX object third_party/googletest/googletest/CMakeFiles/gtest.dir/src/gtest-all.cc.o
     [exec] cd /var/lib/jenkins/workspace/ch-pipeline_vpb_development-KCTLYUE5TMW7Z33VLFXIW7KHT6FIH4V5AIJQWV52XR2IIKDPQP2Q/c/third_party/googletest/googletest && /usr/bin/c++    -I/var/lib/jenkins/workspace/ch-pipeline_vpb_development-KCTLYUE5TMW7Z33VLFXIW7KHT6FIH4V5AIJQWV52XR2IIKDPQP2Q/c/vdmclib/src/test/resources -I/var/lib/jenkins/workspace/ch-pipeline_vpb_development-KCTLYUE5TMW7Z33VLFXIW7KHT6FIH4V5AIJQWV52XR2IIKDPQP2Q/c/third_party/googletest/googletest/include -I/var/lib/jenkins/workspace/ch-pipeline_vpb_development-KCTLYUE5TMW7Z33VLFXIW7KHT6FIH4V5AIJQWV52XR2IIKDPQP2Q/c/third_party/googletest/googletest  -Wall -Wshadow -DGTEST_HAS_PTHREAD=1 -fexceptions -Wextra -Wno-unused-parameter -Wno-missing-field-initializers -o CMakeFiles/gtest.dir/src/gtest-all.cc.o -c /var/lib/jenkins/workspace/ch-pipeline_vpb_development-KCTLYUE5TMW7Z33VLFXIW7KHT6FIH4V5AIJQWV52XR2IIKDPQP2Q/c/third_party/googletest/googletest/src/gtest-all.cc
     [exec] [  3%] Linking CXX static library libgtest.a
     [exec] cd /var/lib/jenkins/workspace/ch-pipeline_vpb_development-KCTLYUE5TMW7Z33VLFXIW7KHT6FIH4V5AIJQWV52XR2IIKDPQP2Q/c/third_party/googletest/googletest && /usr/bin/cmake -P CMakeFiles/gtest.dir/cmake_clean_target.cmake
     [exec] cd /var/lib/jenkins/workspace/ch-pipeline_vpb_development-KCTLYUE5TMW7Z33VLFXIW7KHT6FIH4V5AIJQWV52XR2IIKDPQP2Q/c/third_party/googletest/googletest && /usr/bin/cmake -E cmake_link_script CMakeFiles/gtest.dir/link.txt --verbose=1
     [exec] /usr/bin/ar qc libgtest.a  CMakeFiles/gtest.dir/src/gtest-all.cc.o
     [exec] /usr/bin/ranlib libgtest.a
     [exec] make[2]: Leaving directory '/var/lib/jenkins/workspace/ch-pipeline_vpb_development-KCTLYUE5TMW7Z33VLFXIW7KHT6FIH4V5AIJQWV52XR2IIKDPQP2Q/c'
     [exec] [  3%] Built target gtest
     [exec] make -f third_party/googletest/googletest/CMakeFiles/gtest_main.dir/build.make third_party/googletest/googletest/CMakeFiles/gtest_main.dir/depend
     [exec] make[2]: Entering directory '/var/lib/jenkins/workspace/ch-pipeline_vpb_development-KCTLYUE5TMW7Z33VLFXIW7KHT6FIH4V5AIJQWV52XR2IIKDPQP2Q/c'
     [exec] cd /var/lib/jenkins/workspace/ch-pipeline_vpb_development-KCTLYUE5TMW7Z33VLFXIW7KHT6FIH4V5AIJQWV52XR2IIKDPQP2Q/c && /usr/bin/cmake -E cmake_depends "Unix Makefiles" /var/lib/jenkins/workspace/ch-pipeline_vpb_development-KCTLYUE5TMW7Z33VLFXIW7KHT6FIH4V5AIJQWV52XR2IIKDPQP2Q/c /var/lib/jenkins/workspace/ch-pipeline_vpb_development-KCTLYUE5TMW7Z33VLFXIW7KHT6FIH4V5AIJQWV52XR2IIKDPQP2Q/c/third_party/googletest/googletest /var/lib/jenkins/workspace/ch-pipeline_vpb_development-KCTLYUE5TMW7Z33VLFXIW7KHT6FIH4V5AIJQWV52XR2IIKDPQP2Q/c /var/lib/jenkins/workspace/ch-pipeline_vpb_development-KCTLYUE5TMW7Z33VLFXIW7KHT6FIH4V5AIJQWV52XR2IIKDPQP2Q/c/third_party/googletest/googletest /var/lib/jenkins/workspace/ch-pipeline_vpb_development-KCTLYUE5TMW7Z33VLFXIW7KHT6FIH4V5AIJQWV52XR2IIKDPQP2Q/c/third_party/googletest/googletest/CMakeFiles/gtest_main.dir/DependInfo.cmake --color=
     [exec] Scanning dependencies of target gtest_main
     [exec] make[2]: Leaving directory '/var/lib/jenkins/workspace/ch-pipeline_vpb_development-KCTLYUE5TMW7Z33VLFXIW7KHT6FIH4V5AIJQWV52XR2IIKDPQP2Q/c'
     [exec] make -f third_party/googletest/googletest/CMakeFiles/gtest_main.dir/build.make third_party/googletest/googletest/CMakeFiles/gtest_main.dir/build
     [exec] make[2]: Entering directory '/var/lib/jenkins/workspace/ch-pipeline_vpb_development-KCTLYUE5TMW7Z33VLFXIW7KHT6FIH4V5AIJQWV52XR2IIKDPQP2Q/c'
     [exec] [  5%] Building CXX object third_party/googletest/googletest/CMakeFiles/gtest_main.dir/src/gtest_main.cc.o
     [exec] cd /var/lib/jenkins/workspace/ch-pipeline_vpb_development-KCTLYUE5TMW7Z33VLFXIW7KHT6FIH4V5AIJQWV52XR2IIKDPQP2Q/c/third_party/googletest/googletest && /usr/bin/c++    -I/var/lib/jenkins/workspace/ch-pipeline_vpb_development-KCTLYUE5TMW7Z33VLFXIW7KHT6FIH4V5AIJQWV52XR2IIKDPQP2Q/c/vdmclib/src/test/resources -I/var/lib/jenkins/workspace/ch-pipeline_vpb_development-KCTLYUE5TMW7Z33VLFXIW7KHT6FIH4V5AIJQWV52XR2IIKDPQP2Q/c/third_party/googletest/googletest/include -I/var/lib/jenkins/workspace/ch-pipeline_vpb_development-KCTLYUE5TMW7Z33VLFXIW7KHT6FIH4V5AIJQWV52XR2IIKDPQP2Q/c/third_party/googletest/googletest  -Wall -Wshadow -DGTEST_HAS_PTHREAD=1 -fexceptions -Wextra -Wno-unused-parameter -Wno-missing-field-initializers -o CMakeFiles/gtest_main.dir/src/gtest_main.cc.o -c /var/lib/jenkins/workspace/ch-pipeline_vpb_development-KCTLYUE5TMW7Z33VLFXIW7KHT6FIH4V5AIJQWV52XR2IIKDPQP2Q/c/third_party/googletest/googletest/src/gtest_main.cc
     [exec] [  7%] Linking CXX static library libgtest_main.a
     [exec] cd /var/lib/jenkins/workspace/ch-pipeline_vpb_development-KCTLYUE5TMW7Z33VLFXIW7KHT6FIH4V5AIJQWV52XR2IIKDPQP2Q/c/third_party/googletest/googletest && /usr/bin/cmake -P CMakeFiles/gtest_main.dir/cmake_clean_target.cmake
     [exec] cd /var/lib/jenkins/workspace/ch-pipeline_vpb_development-KCTLYUE5TMW7Z33VLFXIW7KHT6FIH4V5AIJQWV52XR2IIKDPQP2Q/c/third_party/googletest/googletest && /usr/bin/cmake -E cmake_link_script CMakeFiles/gtest_main.dir/link.txt --verbose=1
     [exec] /usr/bin/ar qc libgtest_main.a  CMakeFiles/gtest_main.dir/src/gtest_main.cc.o
     [exec] /usr/bin/ranlib libgtest_main.a
     [exec] make[2]: Leaving directory '/var/lib/jenkins/workspace/ch-pipeline_vpb_development-KCTLYUE5TMW7Z33VLFXIW7KHT6FIH4V5AIJQWV52XR2IIKDPQP2Q/c'
     [exec] [  7%] Built target gtest_main
     [exec] make -f vdmclib/CMakeFiles/vdmclib.dir/build.make vdmclib/CMakeFiles/vdmclib.dir/depend
     [exec] make[2]: Entering directory '/var/lib/jenkins/workspace/ch-pipeline_vpb_development-KCTLYUE5TMW7Z33VLFXIW7KHT6FIH4V5AIJQWV52XR2IIKDPQP2Q/c'
     [exec] cd /var/lib/jenkins/workspace/ch-pipeline_vpb_development-KCTLYUE5TMW7Z33VLFXIW7KHT6FIH4V5AIJQWV52XR2IIKDPQP2Q/c && /usr/bin/cmake -E cmake_depends "Unix Makefiles" /var/lib/jenkins/workspace/ch-pipeline_vpb_development-KCTLYUE5TMW7Z33VLFXIW7KHT6FIH4V5AIJQWV52XR2IIKDPQP2Q/c /var/lib/jenkins/workspace/ch-pipeline_vpb_development-KCTLYUE5TMW7Z33VLFXIW7KHT6FIH4V5AIJQWV52XR2IIKDPQP2Q/c/vdmclib /var/lib/jenkins/workspace/ch-pipeline_vpb_development-KCTLYUE5TMW7Z33VLFXIW7KHT6FIH4V5AIJQWV52XR2IIKDPQP2Q/c /var/lib/jenkins/workspace/ch-pipeline_vpb_development-KCTLYUE5TMW7Z33VLFXIW7KHT6FIH4V5AIJQWV52XR2IIKDPQP2Q/c/vdmclib /var/lib/jenkins/workspace/ch-pipeline_vpb_development-KCTLYUE5TMW7Z33VLFXIW7KHT6FIH4V5AIJQWV52XR2IIKDPQP2Q/c/vdmclib/CMakeFiles/vdmclib.dir/DependInfo.cmake --color=
     [exec] Scanning dependencies of target vdmclib
     [exec] make[2]: Leaving directory '/var/lib/jenkins/workspace/ch-pipeline_vpb_development-KCTLYUE5TMW7Z33VLFXIW7KHT6FIH4V5AIJQWV52XR2IIKDPQP2Q/c'
     [exec] make -f vdmclib/CMakeFiles/vdmclib.dir/build.make vdmclib/CMakeFiles/vdmclib.dir/build
     [exec] make[2]: Entering directory '/var/lib/jenkins/workspace/ch-pipeline_vpb_development-KCTLYUE5TMW7Z33VLFXIW7KHT6FIH4V5AIJQWV52XR2IIKDPQP2Q/c'
     [exec] [  9%] Building C object vdmclib/CMakeFiles/vdmclib.dir/src/main/MATHLib.c.o
     [exec] cd /var/lib/jenkins/workspace/ch-pipeline_vpb_development-KCTLYUE5TMW7Z33VLFXIW7KHT6FIH4V5AIJQWV52XR2IIKDPQP2Q/c/vdmclib && /usr/bin/cc   -I/var/lib/jenkins/workspace/ch-pipeline_vpb_development-KCTLYUE5TMW7Z33VLFXIW7KHT6FIH4V5AIJQWV52XR2IIKDPQP2Q/c/vdmclib -I/var/lib/jenkins/workspace/ch-pipeline_vpb_development-KCTLYUE5TMW7Z33VLFXIW7KHT6FIH4V5AIJQWV52XR2IIKDPQP2Q/c/vdmclib/src/test/resources -I/var/lib/jenkins/workspace/ch-pipeline_vpb_development-KCTLYUE5TMW7Z33VLFXIW7KHT6FIH4V5AIJQWV52XR2IIKDPQP2Q/c/vdmclib/src/main -I/var/lib/jenkins/workspace/ch-pipeline_vpb_development-KCTLYUE5TMW7Z33VLFXIW7KHT6FIH4V5AIJQWV52XR2IIKDPQP2Q/c/vdmclib/src/main/classes -I/var/lib/jenkins/workspace/ch-pipeline_vpb_development-KCTLYUE5TMW7Z33VLFXIW7KHT6FIH4V5AIJQWV52XR2IIKDPQP2Q/c/third_party/googletest/googletest/include  -Wall -fmessage-length=0 -std=c89   -o CMakeFiles/vdmclib.dir/src/main/MATHLib.c.o   -c /var/lib/jenkins/workspace/ch-pipeline_vpb_development-KCTLYUE5TMW7Z33VLFXIW7KHT6FIH4V5AIJQWV52XR2IIKDPQP2Q/c/vdmclib/src/main/MATHLib.c
     [exec] [ 11%] Building C object vdmclib/CMakeFiles/vdmclib.dir/src/main/PrettyPrint.c.o
     [exec] [ 13%] Building C object vdmclib/CMakeFiles/vdmclib.dir/src/main/IOLib.c.o
     [exec] cd /var/lib/jenkins/workspace/ch-pipeline_vpb_development-KCTLYUE5TMW7Z33VLFXIW7KHT6FIH4V5AIJQWV52XR2IIKDPQP2Q/c/vdmclib && /usr/bin/cc   -I/var/lib/jenkins/workspace/ch-pipeline_vpb_development-KCTLYUE5TMW7Z33VLFXIW7KHT6FIH4V5AIJQWV52XR2IIKDPQP2Q/c/vdmclib -I/var/lib/jenkins/workspace/ch-pipeline_vpb_development-KCTLYUE5TMW7Z33VLFXIW7KHT6FIH4V5AIJQWV52XR2IIKDPQP2Q/c/vdmclib/src/test/resources -I/var/lib/jenkins/workspace/ch-pipeline_vpb_development-KCTLYUE5TMW7Z33VLFXIW7KHT6FIH4V5AIJQWV52XR2IIKDPQP2Q/c/vdmclib/src/main -I/var/lib/jenkins/workspace/ch-pipeline_vpb_development-KCTLYUE5TMW7Z33VLFXIW7KHT6FIH4V5AIJQWV52XR2IIKDPQP2Q/c/vdmclib/src/main/classes -I/var/lib/jenkins/workspace/ch-pipeline_vpb_development-KCTLYUE5TMW7Z33VLFXIW7KHT6FIH4V5AIJQWV52XR2IIKDPQP2Q/c/third_party/googletest/googletest/include  -Wall -fmessage-length=0 -std=c89   -o CMakeFiles/vdmclib.dir/src/main/PrettyPrint.c.o   -c /var/lib/jenkins/workspace/ch-pipeline_vpb_development-KCTLYUE5TMW7Z33VLFXIW7KHT6FIH4V5AIJQWV52XR2IIKDPQP2Q/c/vdmclib/src/main/PrettyPrint.c
     [exec] cd /var/lib/jenkins/workspace/ch-pipeline_vpb_development-KCTLYUE5TMW7Z33VLFXIW7KHT6FIH4V5AIJQWV52XR2IIKDPQP2Q/c/vdmclib && /usr/bin/cc   -I/var/lib/jenkins/workspace/ch-pipeline_vpb_development-KCTLYUE5TMW7Z33VLFXIW7KHT6FIH4V5AIJQWV52XR2IIKDPQP2Q/c/vdmclib -I/var/lib/jenkins/workspace/ch-pipeline_vpb_development-KCTLYUE5TMW7Z33VLFXIW7KHT6FIH4V5AIJQWV52XR2IIKDPQP2Q/c/vdmclib/src/test/resources -I/var/lib/jenkins/workspace/ch-pipeline_vpb_development-KCTLYUE5TMW7Z33VLFXIW7KHT6FIH4V5AIJQWV52XR2IIKDPQP2Q/c/vdmclib/src/main -I/var/lib/jenkins/workspace/ch-pipeline_vpb_development-KCTLYUE5TMW7Z33VLFXIW7KHT6FIH4V5AIJQWV52XR2IIKDPQP2Q/c/vdmclib/src/main/classes -I/var/lib/jenkins/workspace/ch-pipeline_vpb_development-KCTLYUE5TMW7Z33VLFXIW7KHT6FIH4V5AIJQWV52XR2IIKDPQP2Q/c/third_party/googletest/googletest/include  -Wall -fmessage-length=0 -std=c89   -o CMakeFiles/vdmclib.dir/src/main/IOLib.c.o   -c /var/lib/jenkins/workspace/ch-pipeline_vpb_development-KCTLYUE5TMW7Z33VLFXIW7KHT6FIH4V5AIJQWV52XR2IIKDPQP2Q/c/vdmclib/src/main/IOLib.c
     [exec] [ 15%] Building C object vdmclib/CMakeFiles/vdmclib.dir/src/main/CSVLib.c.o
     [exec] cd /var/lib/jenkins/workspace/ch-pipeline_vpb_development-KCTLYUE5TMW7Z33VLFXIW7KHT6FIH4V5AIJQWV52XR2IIKDPQP2Q/c/vdmclib && /usr/bin/cc   -I/var/lib/jenkins/workspace/ch-pipeline_vpb_development-KCTLYUE5TMW7Z33VLFXIW7KHT6FIH4V5AIJQWV52XR2IIKDPQP2Q/c/vdmclib -I/var/lib/jenkins/workspace/ch-pipeline_vpb_development-KCTLYUE5TMW7Z33VLFXIW7KHT6FIH4V5AIJQWV52XR2IIKDPQP2Q/c/vdmclib/src/test/resources -I/var/lib/jenkins/workspace/ch-pipeline_vpb_development-KCTLYUE5TMW7Z33VLFXIW7KHT6FIH4V5AIJQWV52XR2IIKDPQP2Q/c/vdmclib/src/main -I/var/lib/jenkins/workspace/ch-pipeline_vpb_development-KCTLYUE5TMW7Z33VLFXIW7KHT6FIH4V5AIJQWV52XR2IIKDPQP2Q/c/vdmclib/src/main/classes -I/var/lib/jenkins/workspace/ch-pipeline_vpb_development-KCTLYUE5TMW7Z33VLFXIW7KHT6FIH4V5AIJQWV52XR2IIKDPQP2Q/c/third_party/googletest/googletest/include  -Wall -fmessage-length=0 -std=c89   -o CMakeFiles/vdmclib.dir/src/main/CSVLib.c.o   -c /var/lib/jenkins/workspace/ch-pipeline_vpb_development-KCTLYUE5TMW7Z33VLFXIW7KHT6FIH4V5AIJQWV52XR2IIKDPQP2Q/c/vdmclib/src/main/CSVLib.c
     [exec] [ 17%] Building C object vdmclib/CMakeFiles/vdmclib.dir/src/main/PatternBindMatch.c.o
     [exec] cd /var/lib/jenkins/workspace/ch-pipeline_vpb_development-KCTLYUE5TMW7Z33VLFXIW7KHT6FIH4V5AIJQWV52XR2IIKDPQP2Q/c/vdmclib && /usr/bin/cc   -I/var/lib/jenkins/workspace/ch-pipeline_vpb_development-KCTLYUE5TMW7Z33VLFXIW7KHT6FIH4V5AIJQWV52XR2IIKDPQP2Q/c/vdmclib -I/var/lib/jenkins/workspace/ch-pipeline_vpb_development-KCTLYUE5TMW7Z33VLFXIW7KHT6FIH4V5AIJQWV52XR2IIKDPQP2Q/c/vdmclib/src/test/resources -I/var/lib/jenkins/workspace/ch-pipeline_vpb_development-KCTLYUE5TMW7Z33VLFXIW7KHT6FIH4V5AIJQWV52XR2IIKDPQP2Q/c/vdmclib/src/main -I/var/lib/jenkins/workspace/ch-pipeline_vpb_development-KCTLYUE5TMW7Z33VLFXIW7KHT6FIH4V5AIJQWV52XR2IIKDPQP2Q/c/vdmclib/src/main/classes -I/var/lib/jenkins/workspace/ch-pipeline_vpb_development-KCTLYUE5TMW7Z33VLFXIW7KHT6FIH4V5AIJQWV52XR2IIKDPQP2Q/c/third_party/googletest/googletest/include  -Wall -fmessage-length=0 -std=c89   -o CMakeFiles/vdmclib.dir/src/main/PatternBindMatch.c.o   -c /var/lib/jenkins/workspace/ch-pipeline_vpb_development-KCTLYUE5TMW7Z33VLFXIW7KHT6FIH4V5AIJQWV52XR2IIKDPQP2Q/c/vdmclib/src/main/PatternBindMatch.c
     [exec] [ 19%] Building C object vdmclib/CMakeFiles/vdmclib.dir/src/main/TypedValue.c.o
     [exec] cd /var/lib/jenkins/workspace/ch-pipeline_vpb_development-KCTLYUE5TMW7Z33VLFXIW7KHT6FIH4V5AIJQWV52XR2IIKDPQP2Q/c/vdmclib && /usr/bin/cc   -I/var/lib/jenkins/workspace/ch-pipeline_vpb_development-KCTLYUE5TMW7Z33VLFXIW7KHT6FIH4V5AIJQWV52XR2IIKDPQP2Q/c/vdmclib -I/var/lib/jenkins/workspace/ch-pipeline_vpb_development-KCTLYUE5TMW7Z33VLFXIW7KHT6FIH4V5AIJQWV52XR2IIKDPQP2Q/c/vdmclib/src/test/resources -I/var/lib/jenkins/workspace/ch-pipeline_vpb_development-KCTLYUE5TMW7Z33VLFXIW7KHT6FIH4V5AIJQWV52XR2IIKDPQP2Q/c/vdmclib/src/main -I/var/lib/jenkins/workspace/ch-pipeline_vpb_development-KCTLYUE5TMW7Z33VLFXIW7KHT6FIH4V5AIJQWV52XR2IIKDPQP2Q/c/vdmclib/src/main/classes -I/var/lib/jenkins/workspace/ch-pipeline_vpb_development-KCTLYUE5TMW7Z33VLFXIW7KHT6FIH4V5AIJQWV52XR2IIKDPQP2Q/c/third_party/googletest/googletest/include  -Wall -fmessage-length=0 -std=c89   -o CMakeFiles/vdmclib.dir/src/main/TypedValue.c.o   -c /var/lib/jenkins/workspace/ch-pipeline_vpb_development-KCTLYUE5TMW7Z33VLFXIW7KHT6FIH4V5AIJQWV52XR2IIKDPQP2Q/c/vdmclib/src/main/TypedValue.c
     [exec] [ 21%] Building C object vdmclib/CMakeFiles/vdmclib.dir/src/main/VdmClass.c.o
     [exec] cd /var/lib/jenkins/workspace/ch-pipeline_vpb_development-KCTLYUE5TMW7Z33VLFXIW7KHT6FIH4V5AIJQWV52XR2IIKDPQP2Q/c/vdmclib && /usr/bin/cc   -I/var/lib/jenkins/workspace/ch-pipeline_vpb_development-KCTLYUE5TMW7Z33VLFXIW7KHT6FIH4V5AIJQWV52XR2IIKDPQP2Q/c/vdmclib -I/var/lib/jenkins/workspace/ch-pipeline_vpb_development-KCTLYUE5TMW7Z33VLFXIW7KHT6FIH4V5AIJQWV52XR2IIKDPQP2Q/c/vdmclib/src/test/resources -I/var/lib/jenkins/workspace/ch-pipeline_vpb_development-KCTLYUE5TMW7Z33VLFXIW7KHT6FIH4V5AIJQWV52XR2IIKDPQP2Q/c/vdmclib/src/main -I/var/lib/jenkins/workspace/ch-pipeline_vpb_development-KCTLYUE5TMW7Z33VLFXIW7KHT6FIH4V5AIJQWV52XR2IIKDPQP2Q/c/vdmclib/src/main/classes -I/var/lib/jenkins/workspace/ch-pipeline_vpb_development-KCTLYUE5TMW7Z33VLFXIW7KHT6FIH4V5AIJQWV52XR2IIKDPQP2Q/c/third_party/googletest/googletest/include  -Wall -fmessage-length=0 -std=c89   -o CMakeFiles/vdmclib.dir/src/main/VdmClass.c.o   -c /var/lib/jenkins/workspace/ch-pipeline_vpb_development-KCTLYUE5TMW7Z33VLFXIW7KHT6FIH4V5AIJQWV52XR2IIKDPQP2Q/c/vdmclib/src/main/VdmClass.c
     [exec] [ 23%] Building C object vdmclib/CMakeFiles/vdmclib.dir/src/main/VdmGC.c.o
     [exec] cd /var/lib/jenkins/workspace/ch-pipeline_vpb_development-KCTLYUE5TMW7Z33VLFXIW7KHT6FIH4V5AIJQWV52XR2IIKDPQP2Q/c/vdmclib && /usr/bin/cc   -I/var/lib/jenkins/workspace/ch-pipeline_vpb_development-KCTLYUE5TMW7Z33VLFXIW7KHT6FIH4V5AIJQWV52XR2IIKDPQP2Q/c/vdmclib -I/var/lib/jenkins/workspace/ch-pipeline_vpb_development-KCTLYUE5TMW7Z33VLFXIW7KHT6FIH4V5AIJQWV52XR2IIKDPQP2Q/c/vdmclib/src/test/resources -I/var/lib/jenkins/workspace/ch-pipeline_vpb_development-KCTLYUE5TMW7Z33VLFXIW7KHT6FIH4V5AIJQWV52XR2IIKDPQP2Q/c/vdmclib/src/main -I/var/lib/jenkins/workspace/ch-pipeline_vpb_development-KCTLYUE5TMW7Z33VLFXIW7KHT6FIH4V5AIJQWV52XR2IIKDPQP2Q/c/vdmclib/src/main/classes -I/var/lib/jenkins/workspace/ch-pipeline_vpb_development-KCTLYUE5TMW7Z33VLFXIW7KHT6FIH4V5AIJQWV52XR2IIKDPQP2Q/c/third_party/googletest/googletest/include  -Wall -fmessage-length=0 -std=c89   -o CMakeFiles/vdmclib.dir/src/main/VdmGC.c.o   -c /var/lib/jenkins/workspace/ch-pipeline_vpb_development-KCTLYUE5TMW7Z33VLFXIW7KHT6FIH4V5AIJQWV52XR2IIKDPQP2Q/c/vdmclib/src/main/VdmGC.c
     [exec] [ 25%] Building C object vdmclib/CMakeFiles/vdmclib.dir/src/main/VdmBasicTypes.c.o
     [exec] cd /var/lib/jenkins/workspace/ch-pipeline_vpb_development-KCTLYUE5TMW7Z33VLFXIW7KHT6FIH4V5AIJQWV52XR2IIKDPQP2Q/c/vdmclib && /usr/bin/cc   -I/var/lib/jenkins/workspace/ch-pipeline_vpb_development-KCTLYUE5TMW7Z33VLFXIW7KHT6FIH4V5AIJQWV52XR2IIKDPQP2Q/c/vdmclib -I/var/lib/jenkins/workspace/ch-pipeline_vpb_development-KCTLYUE5TMW7Z33VLFXIW7KHT6FIH4V5AIJQWV52XR2IIKDPQP2Q/c/vdmclib/src/test/resources -I/var/lib/jenkins/workspace/ch-pipeline_vpb_development-KCTLYUE5TMW7Z33VLFXIW7KHT6FIH4V5AIJQWV52XR2IIKDPQP2Q/c/vdmclib/src/main -I/var/lib/jenkins/workspace/ch-pipeline_vpb_development-KCTLYUE5TMW7Z33VLFXIW7KHT6FIH4V5AIJQWV52XR2IIKDPQP2Q/c/vdmclib/src/main/classes -I/var/lib/jenkins/workspace/ch-pipeline_vpb_development-KCTLYUE5TMW7Z33VLFXIW7KHT6FIH4V5AIJQWV52XR2IIKDPQP2Q/c/third_party/googletest/googletest/include  -Wall -fmessage-length=0 -std=c89   -o CMakeFiles/vdmclib.dir/src/main/VdmBasicTypes.c.o   -c /var/lib/jenkins/workspace/ch-pipeline_vpb_development-KCTLYUE5TMW7Z33VLFXIW7KHT6FIH4V5AIJQWV52XR2IIKDPQP2Q/c/vdmclib/src/main/VdmBasicTypes.c
     [exec] [ 27%] Building C object vdmclib/CMakeFiles/vdmclib.dir/src/main/VdmMap.c.o
     [exec] cd /var/lib/jenkins/workspace/ch-pipeline_vpb_development-KCTLYUE5TMW7Z33VLFXIW7KHT6FIH4V5AIJQWV52XR2IIKDPQP2Q/c/vdmclib && /usr/bin/cc   -I/var/lib/jenkins/workspace/ch-pipeline_vpb_development-KCTLYUE5TMW7Z33VLFXIW7KHT6FIH4V5AIJQWV52XR2IIKDPQP2Q/c/vdmclib -I/var/lib/jenkins/workspace/ch-pipeline_vpb_development-KCTLYUE5TMW7Z33VLFXIW7KHT6FIH4V5AIJQWV52XR2IIKDPQP2Q/c/vdmclib/src/test/resources -I/var/lib/jenkins/workspace/ch-pipeline_vpb_development-KCTLYUE5TMW7Z33VLFXIW7KHT6FIH4V5AIJQWV52XR2IIKDPQP2Q/c/vdmclib/src/main -I/var/lib/jenkins/workspace/ch-pipeline_vpb_development-KCTLYUE5TMW7Z33VLFXIW7KHT6FIH4V5AIJQWV52XR2IIKDPQP2Q/c/vdmclib/src/main/classes -I/var/lib/jenkins/workspace/ch-pipeline_vpb_development-KCTLYUE5TMW7Z33VLFXIW7KHT6FIH4V5AIJQWV52XR2IIKDPQP2Q/c/third_party/googletest/googletest/include  -Wall -fmessage-length=0 -std=c89   -o CMakeFiles/vdmclib.dir/src/main/VdmMap.c.o   -c /var/lib/jenkins/workspace/ch-pipeline_vpb_development-KCTLYUE5TMW7Z33VLFXIW7KHT6FIH4V5AIJQWV52XR2IIKDPQP2Q/c/vdmclib/src/main/VdmMap.c
     [exec] [ 29%] Building C object vdmclib/CMakeFiles/vdmclib.dir/src/main/VdmProduct.c.o
     [exec] cd /var/lib/jenkins/workspace/ch-pipeline_vpb_development-KCTLYUE5TMW7Z33VLFXIW7KHT6FIH4V5AIJQWV52XR2IIKDPQP2Q/c/vdmclib && /usr/bin/cc   -I/var/lib/jenkins/workspace/ch-pipeline_vpb_development-KCTLYUE5TMW7Z33VLFXIW7KHT6FIH4V5AIJQWV52XR2IIKDPQP2Q/c/vdmclib -I/var/lib/jenkins/workspace/ch-pipeline_vpb_development-KCTLYUE5TMW7Z33VLFXIW7KHT6FIH4V5AIJQWV52XR2IIKDPQP2Q/c/vdmclib/src/test/resources -I/var/lib/jenkins/workspace/ch-pipeline_vpb_development-KCTLYUE5TMW7Z33VLFXIW7KHT6FIH4V5AIJQWV52XR2IIKDPQP2Q/c/vdmclib/src/main -I/var/lib/jenkins/workspace/ch-pipeline_vpb_development-KCTLYUE5TMW7Z33VLFXIW7KHT6FIH4V5AIJQWV52XR2IIKDPQP2Q/c/vdmclib/src/main/classes -I/var/lib/jenkins/workspace/ch-pipeline_vpb_development-KCTLYUE5TMW7Z33VLFXIW7KHT6FIH4V5AIJQWV52XR2IIKDPQP2Q/c/third_party/googletest/googletest/include  -Wall -fmessage-length=0 -std=c89   -o CMakeFiles/vdmclib.dir/src/main/VdmProduct.c.o   -c /var/lib/jenkins/workspace/ch-pipeline_vpb_development-KCTLYUE5TMW7Z33VLFXIW7KHT6FIH4V5AIJQWV52XR2IIKDPQP2Q/c/vdmclib/src/main/VdmProduct.c
     [exec] [ 31%] Building C object vdmclib/CMakeFiles/vdmclib.dir/src/main/VdmSeq.c.o
     [exec] cd /var/lib/jenkins/workspace/ch-pipeline_vpb_development-KCTLYUE5TMW7Z33VLFXIW7KHT6FIH4V5AIJQWV52XR2IIKDPQP2Q/c/vdmclib && /usr/bin/cc   -I/var/lib/jenkins/workspace/ch-pipeline_vpb_development-KCTLYUE5TMW7Z33VLFXIW7KHT6FIH4V5AIJQWV52XR2IIKDPQP2Q/c/vdmclib -I/var/lib/jenkins/workspace/ch-pipeline_vpb_development-KCTLYUE5TMW7Z33VLFXIW7KHT6FIH4V5AIJQWV52XR2IIKDPQP2Q/c/vdmclib/src/test/resources -I/var/lib/jenkins/workspace/ch-pipeline_vpb_development-KCTLYUE5TMW7Z33VLFXIW7KHT6FIH4V5AIJQWV52XR2IIKDPQP2Q/c/vdmclib/src/main -I/var/lib/jenkins/workspace/ch-pipeline_vpb_development-KCTLYUE5TMW7Z33VLFXIW7KHT6FIH4V5AIJQWV52XR2IIKDPQP2Q/c/vdmclib/src/main/classes -I/var/lib/jenkins/workspace/ch-pipeline_vpb_development-KCTLYUE5TMW7Z33VLFXIW7KHT6FIH4V5AIJQWV52XR2IIKDPQP2Q/c/third_party/googletest/googletest/include  -Wall -fmessage-length=0 -std=c89   -o CMakeFiles/vdmclib.dir/src/main/VdmSeq.c.o   -c /var/lib/jenkins/workspace/ch-pipeline_vpb_development-KCTLYUE5TMW7Z33VLFXIW7KHT6FIH4V5AIJQWV52XR2IIKDPQP2Q/c/vdmclib/src/main/VdmSeq.c
     [exec] [ 35%] Building C object vdmclib/CMakeFiles/vdmclib.dir/src/main/VdmSet.c.o
     [exec] [ 33%] Building C object vdmclib/CMakeFiles/vdmclib.dir/src/main/VdmUnpackString.c.o
     [exec] cd /var/lib/jenkins/workspace/ch-pipeline_vpb_development-KCTLYUE5TMW7Z33VLFXIW7KHT6FIH4V5AIJQWV52XR2IIKDPQP2Q/c/vdmclib && /usr/bin/cc   -I/var/lib/jenkins/workspace/ch-pipeline_vpb_development-KCTLYUE5TMW7Z33VLFXIW7KHT6FIH4V5AIJQWV52XR2IIKDPQP2Q/c/vdmclib -I/var/lib/jenkins/workspace/ch-pipeline_vpb_development-KCTLYUE5TMW7Z33VLFXIW7KHT6FIH4V5AIJQWV52XR2IIKDPQP2Q/c/vdmclib/src/test/resources -I/var/lib/jenkins/workspace/ch-pipeline_vpb_development-KCTLYUE5TMW7Z33VLFXIW7KHT6FIH4V5AIJQWV52XR2IIKDPQP2Q/c/vdmclib/src/main -I/var/lib/jenkins/workspace/ch-pipeline_vpb_development-KCTLYUE5TMW7Z33VLFXIW7KHT6FIH4V5AIJQWV52XR2IIKDPQP2Q/c/vdmclib/src/main/classes -I/var/lib/jenkins/workspace/ch-pipeline_vpb_development-KCTLYUE5TMW7Z33VLFXIW7KHT6FIH4V5AIJQWV52XR2IIKDPQP2Q/c/third_party/googletest/googletest/include  -Wall -fmessage-length=0 -std=c89   -o CMakeFiles/vdmclib.dir/src/main/VdmUnpackString.c.o   -c /var/lib/jenkins/workspace/ch-pipeline_vpb_development-KCTLYUE5TMW7Z33VLFXIW7KHT6FIH4V5AIJQWV52XR2IIKDPQP2Q/c/vdmclib/src/main/VdmUnpackString.c
     [exec] cd /var/lib/jenkins/workspace/ch-pipeline_vpb_development-KCTLYUE5TMW7Z33VLFXIW7KHT6FIH4V5AIJQWV52XR2IIKDPQP2Q/c/vdmclib && /usr/bin/cc   -I/var/lib/jenkins/workspace/ch-pipeline_vpb_development-KCTLYUE5TMW7Z33VLFXIW7KHT6FIH4V5AIJQWV52XR2IIKDPQP2Q/c/vdmclib -I/var/lib/jenkins/workspace/ch-pipeline_vpb_development-KCTLYUE5TMW7Z33VLFXIW7KHT6FIH4V5AIJQWV52XR2IIKDPQP2Q/c/vdmclib/src/test/resources -I/var/lib/jenkins/workspace/ch-pipeline_vpb_development-KCTLYUE5TMW7Z33VLFXIW7KHT6FIH4V5AIJQWV52XR2IIKDPQP2Q/c/vdmclib/src/main -I/var/lib/jenkins/workspace/ch-pipeline_vpb_development-KCTLYUE5TMW7Z33VLFXIW7KHT6FIH4V5AIJQWV52XR2IIKDPQP2Q/c/vdmclib/src/main/classes -I/var/lib/jenkins/workspace/ch-pipeline_vpb_development-KCTLYUE5TMW7Z33VLFXIW7KHT6FIH4V5AIJQWV52XR2IIKDPQP2Q/c/third_party/googletest/googletest/include  -Wall -fmessage-length=0 -std=c89   -o CMakeFiles/vdmclib.dir/src/main/VdmSet.c.o   -c /var/lib/jenkins/workspace/ch-pipeline_vpb_development-KCTLYUE5TMW7Z33VLFXIW7KHT6FIH4V5AIJQWV52XR2IIKDPQP2Q/c/vdmclib/src/main/VdmSet.c
     [exec] [ 37%] Building C object vdmclib/CMakeFiles/vdmclib.dir/src/test/classes/A.c.o
     [exec] cd /var/lib/jenkins/workspace/ch-pipeline_vpb_development-KCTLYUE5TMW7Z33VLFXIW7KHT6FIH4V5AIJQWV52XR2IIKDPQP2Q/c/vdmclib && /usr/bin/cc   -I/var/lib/jenkins/workspace/ch-pipeline_vpb_development-KCTLYUE5TMW7Z33VLFXIW7KHT6FIH4V5AIJQWV52XR2IIKDPQP2Q/c/vdmclib -I/var/lib/jenkins/workspace/ch-pipeline_vpb_development-KCTLYUE5TMW7Z33VLFXIW7KHT6FIH4V5AIJQWV52XR2IIKDPQP2Q/c/vdmclib/src/test/resources -I/var/lib/jenkins/workspace/ch-pipeline_vpb_development-KCTLYUE5TMW7Z33VLFXIW7KHT6FIH4V5AIJQWV52XR2IIKDPQP2Q/c/vdmclib/src/main -I/var/lib/jenkins/workspace/ch-pipeline_vpb_development-KCTLYUE5TMW7Z33VLFXIW7KHT6FIH4V5AIJQWV52XR2IIKDPQP2Q/c/vdmclib/src/main/classes -I/var/lib/jenkins/workspace/ch-pipeline_vpb_development-KCTLYUE5TMW7Z33VLFXIW7KHT6FIH4V5AIJQWV52XR2IIKDPQP2Q/c/third_party/googletest/googletest/include  -Wall -fmessage-length=0 -std=c89   -o CMakeFiles/vdmclib.dir/src/test/classes/A.c.o   -c /var/lib/jenkins/workspace/ch-pipeline_vpb_development-KCTLYUE5TMW7Z33VLFXIW7KHT6FIH4V5AIJQWV52XR2IIKDPQP2Q/c/vdmclib/src/test/classes/A.c
     [exec] [ 39%] Building C object vdmclib/CMakeFiles/vdmclib.dir/src/test/classes/B.c.o
     [exec] cd /var/lib/jenkins/workspace/ch-pipeline_vpb_development-KCTLYUE5TMW7Z33VLFXIW7KHT6FIH4V5AIJQWV52XR2IIKDPQP2Q/c/vdmclib && /usr/bin/cc   -I/var/lib/jenkins/workspace/ch-pipeline_vpb_development-KCTLYUE5TMW7Z33VLFXIW7KHT6FIH4V5AIJQWV52XR2IIKDPQP2Q/c/vdmclib -I/var/lib/jenkins/workspace/ch-pipeline_vpb_development-KCTLYUE5TMW7Z33VLFXIW7KHT6FIH4V5AIJQWV52XR2IIKDPQP2Q/c/vdmclib/src/test/resources -I/var/lib/jenkins/workspace/ch-pipeline_vpb_development-KCTLYUE5TMW7Z33VLFXIW7KHT6FIH4V5AIJQWV52XR2IIKDPQP2Q/c/vdmclib/src/main -I/var/lib/jenkins/workspace/ch-pipeline_vpb_development-KCTLYUE5TMW7Z33VLFXIW7KHT6FIH4V5AIJQWV52XR2IIKDPQP2Q/c/vdmclib/src/main/classes -I/var/lib/jenkins/workspace/ch-pipeline_vpb_development-KCTLYUE5TMW7Z33VLFXIW7KHT6FIH4V5AIJQWV52XR2IIKDPQP2Q/c/third_party/googletest/googletest/include  -Wall -fmessage-length=0 -std=c89   -o CMakeFiles/vdmclib.dir/src/test/classes/B.c.o   -c /var/lib/jenkins/workspace/ch-pipeline_vpb_development-KCTLYUE5TMW7Z33VLFXIW7KHT6FIH4V5AIJQWV52XR2IIKDPQP2Q/c/vdmclib/src/test/classes/B.c
     [exec] [ 41%] Building C object vdmclib/CMakeFiles/vdmclib.dir/src/test/classes/C.c.o
     [exec] cd /var/lib/jenkins/workspace/ch-pipeline_vpb_development-KCTLYUE5TMW7Z33VLFXIW7KHT6FIH4V5AIJQWV52XR2IIKDPQP2Q/c/vdmclib && /usr/bin/cc   -I/var/lib/jenkins/workspace/ch-pipeline_vpb_development-KCTLYUE5TMW7Z33VLFXIW7KHT6FIH4V5AIJQWV52XR2IIKDPQP2Q/c/vdmclib -I/var/lib/jenkins/workspace/ch-pipeline_vpb_development-KCTLYUE5TMW7Z33VLFXIW7KHT6FIH4V5AIJQWV52XR2IIKDPQP2Q/c/vdmclib/src/test/resources -I/var/lib/jenkins/workspace/ch-pipeline_vpb_development-KCTLYUE5TMW7Z33VLFXIW7KHT6FIH4V5AIJQWV52XR2IIKDPQP2Q/c/vdmclib/src/main -I/var/lib/jenkins/workspace/ch-pipeline_vpb_development-KCTLYUE5TMW7Z33VLFXIW7KHT6FIH4V5AIJQWV52XR2IIKDPQP2Q/c/vdmclib/src/main/classes -I/var/lib/jenkins/workspace/ch-pipeline_vpb_development-KCTLYUE5TMW7Z33VLFXIW7KHT6FIH4V5AIJQWV52XR2IIKDPQP2Q/c/third_party/googletest/googletest/include  -Wall -fmessage-length=0 -std=c89   -o CMakeFiles/vdmclib.dir/src/test/classes/C.c.o   -c /var/lib/jenkins/workspace/ch-pipeline_vpb_development-KCTLYUE5TMW7Z33VLFXIW7KHT6FIH4V5AIJQWV52XR2IIKDPQP2Q/c/vdmclib/src/test/classes/C.c
     [exec] [ 43%] Building C object vdmclib/CMakeFiles/vdmclib.dir/src/test/records/MyRec.c.o
     [exec] cd /var/lib/jenkins/workspace/ch-pipeline_vpb_development-KCTLYUE5TMW7Z33VLFXIW7KHT6FIH4V5AIJQWV52XR2IIKDPQP2Q/c/vdmclib && /usr/bin/cc   -I/var/lib/jenkins/workspace/ch-pipeline_vpb_development-KCTLYUE5TMW7Z33VLFXIW7KHT6FIH4V5AIJQWV52XR2IIKDPQP2Q/c/vdmclib -I/var/lib/jenkins/workspace/ch-pipeline_vpb_development-KCTLYUE5TMW7Z33VLFXIW7KHT6FIH4V5AIJQWV52XR2IIKDPQP2Q/c/vdmclib/src/test/resources -I/var/lib/jenkins/workspace/ch-pipeline_vpb_development-KCTLYUE5TMW7Z33VLFXIW7KHT6FIH4V5AIJQWV52XR2IIKDPQP2Q/c/vdmclib/src/main -I/var/lib/jenkins/workspace/ch-pipeline_vpb_development-KCTLYUE5TMW7Z33VLFXIW7KHT6FIH4V5AIJQWV52XR2IIKDPQP2Q/c/vdmclib/src/main/classes -I/var/lib/jenkins/workspace/ch-pipeline_vpb_development-KCTLYUE5TMW7Z33VLFXIW7KHT6FIH4V5AIJQWV52XR2IIKDPQP2Q/c/third_party/googletest/googletest/include  -Wall -fmessage-length=0 -std=c89   -o CMakeFiles/vdmclib.dir/src/test/records/MyRec.c.o   -c /var/lib/jenkins/workspace/ch-pipeline_vpb_development-KCTLYUE5TMW7Z33VLFXIW7KHT6FIH4V5AIJQWV52XR2IIKDPQP2Q/c/vdmclib/src/test/records/MyRec.c
     [exec] [ 45%] Building C object vdmclib/CMakeFiles/vdmclib.dir/src/test/records/MyRec2.c.o
     [exec] cd /var/lib/jenkins/workspace/ch-pipeline_vpb_development-KCTLYUE5TMW7Z33VLFXIW7KHT6FIH4V5AIJQWV52XR2IIKDPQP2Q/c/vdmclib && /usr/bin/cc   -I/var/lib/jenkins/workspace/ch-pipeline_vpb_development-KCTLYUE5TMW7Z33VLFXIW7KHT6FIH4V5AIJQWV52XR2IIKDPQP2Q/c/vdmclib -I/var/lib/jenkins/workspace/ch-pipeline_vpb_development-KCTLYUE5TMW7Z33VLFXIW7KHT6FIH4V5AIJQWV52XR2IIKDPQP2Q/c/vdmclib/src/test/resources -I/var/lib/jenkins/workspace/ch-pipeline_vpb_development-KCTLYUE5TMW7Z33VLFXIW7KHT6FIH4V5AIJQWV52XR2IIKDPQP2Q/c/vdmclib/src/main -I/var/lib/jenkins/workspace/ch-pipeline_vpb_development-KCTLYUE5TMW7Z33VLFXIW7KHT6FIH4V5AIJQWV52XR2IIKDPQP2Q/c/vdmclib/src/main/classes -I/var/lib/jenkins/workspace/ch-pipeline_vpb_development-KCTLYUE5TMW7Z33VLFXIW7KHT6FIH4V5AIJQWV52XR2IIKDPQP2Q/c/third_party/googletest/googletest/include  -Wall -fmessage-length=0 -std=c89   -o CMakeFiles/vdmclib.dir/src/test/records/MyRec2.c.o   -c /var/lib/jenkins/workspace/ch-pipeline_vpb_development-KCTLYUE5TMW7Z33VLFXIW7KHT6FIH4V5AIJQWV52XR2IIKDPQP2Q/c/vdmclib/src/test/records/MyRec2.c
     [exec] [ 47%] Building C object vdmclib/CMakeFiles/vdmclib.dir/src/test/records/R1.c.o
     [exec] cd /var/lib/jenkins/workspace/ch-pipeline_vpb_development-KCTLYUE5TMW7Z33VLFXIW7KHT6FIH4V5AIJQWV52XR2IIKDPQP2Q/c/vdmclib && /usr/bin/cc   -I/var/lib/jenkins/workspace/ch-pipeline_vpb_development-KCTLYUE5TMW7Z33VLFXIW7KHT6FIH4V5AIJQWV52XR2IIKDPQP2Q/c/vdmclib -I/var/lib/jenkins/workspace/ch-pipeline_vpb_development-KCTLYUE5TMW7Z33VLFXIW7KHT6FIH4V5AIJQWV52XR2IIKDPQP2Q/c/vdmclib/src/test/resources -I/var/lib/jenkins/workspace/ch-pipeline_vpb_development-KCTLYUE5TMW7Z33VLFXIW7KHT6FIH4V5AIJQWV52XR2IIKDPQP2Q/c/vdmclib/src/main -I/var/lib/jenkins/workspace/ch-pipeline_vpb_development-KCTLYUE5TMW7Z33VLFXIW7KHT6FIH4V5AIJQWV52XR2IIKDPQP2Q/c/vdmclib/src/main/classes -I/var/lib/jenkins/workspace/ch-pipeline_vpb_development-KCTLYUE5TMW7Z33VLFXIW7KHT6FIH4V5AIJQWV52XR2IIKDPQP2Q/c/third_party/googletest/googletest/include  -Wall -fmessage-length=0 -std=c89   -o CMakeFiles/vdmclib.dir/src/test/records/R1.c.o   -c /var/lib/jenkins/workspace/ch-pipeline_vpb_development-KCTLYUE5TMW7Z33VLFXIW7KHT6FIH4V5AIJQWV52XR2IIKDPQP2Q/c/vdmclib/src/test/records/R1.c
     [exec] [ 49%] Building C object vdmclib/CMakeFiles/vdmclib.dir/src/test/records/RecordTest.c.o
     [exec] cd /var/lib/jenkins/workspace/ch-pipeline_vpb_development-KCTLYUE5TMW7Z33VLFXIW7KHT6FIH4V5AIJQWV52XR2IIKDPQP2Q/c/vdmclib && /usr/bin/cc   -I/var/lib/jenkins/workspace/ch-pipeline_vpb_development-KCTLYUE5TMW7Z33VLFXIW7KHT6FIH4V5AIJQWV52XR2IIKDPQP2Q/c/vdmclib -I/var/lib/jenkins/workspace/ch-pipeline_vpb_development-KCTLYUE5TMW7Z33VLFXIW7KHT6FIH4V5AIJQWV52XR2IIKDPQP2Q/c/vdmclib/src/test/resources -I/var/lib/jenkins/workspace/ch-pipeline_vpb_development-KCTLYUE5TMW7Z33VLFXIW7KHT6FIH4V5AIJQWV52XR2IIKDPQP2Q/c/vdmclib/src/main -I/var/lib/jenkins/workspace/ch-pipeline_vpb_development-KCTLYUE5TMW7Z33VLFXIW7KHT6FIH4V5AIJQWV52XR2IIKDPQP2Q/c/vdmclib/src/main/classes -I/var/lib/jenkins/workspace/ch-pipeline_vpb_development-KCTLYUE5TMW7Z33VLFXIW7KHT6FIH4V5AIJQWV52XR2IIKDPQP2Q/c/third_party/googletest/googletest/include  -Wall -fmessage-length=0 -std=c89   -o CMakeFiles/vdmclib.dir/src/test/records/RecordTest.c.o   -c /var/lib/jenkins/workspace/ch-pipeline_vpb_development-KCTLYUE5TMW7Z33VLFXIW7KHT6FIH4V5AIJQWV52XR2IIKDPQP2Q/c/vdmclib/src/test/records/RecordTest.c
     [exec] [ 50%] Building C object vdmclib/CMakeFiles/vdmclib.dir/src/test/typeoftest.c.o
     [exec] cd /var/lib/jenkins/workspace/ch-pipeline_vpb_development-KCTLYUE5TMW7Z33VLFXIW7KHT6FIH4V5AIJQWV52XR2IIKDPQP2Q/c/vdmclib && /usr/bin/cc   -I/var/lib/jenkins/workspace/ch-pipeline_vpb_development-KCTLYUE5TMW7Z33VLFXIW7KHT6FIH4V5AIJQWV52XR2IIKDPQP2Q/c/vdmclib -I/var/lib/jenkins/workspace/ch-pipeline_vpb_development-KCTLYUE5TMW7Z33VLFXIW7KHT6FIH4V5AIJQWV52XR2IIKDPQP2Q/c/vdmclib/src/test/resources -I/var/lib/jenkins/workspace/ch-pipeline_vpb_development-KCTLYUE5TMW7Z33VLFXIW7KHT6FIH4V5AIJQWV52XR2IIKDPQP2Q/c/vdmclib/src/main -I/var/lib/jenkins/workspace/ch-pipeline_vpb_development-KCTLYUE5TMW7Z33VLFXIW7KHT6FIH4V5AIJQWV52XR2IIKDPQP2Q/c/vdmclib/src/main/classes -I/var/lib/jenkins/workspace/ch-pipeline_vpb_development-KCTLYUE5TMW7Z33VLFXIW7KHT6FIH4V5AIJQWV52XR2IIKDPQP2Q/c/third_party/googletest/googletest/include  -Wall -fmessage-length=0 -std=c89   -o CMakeFiles/vdmclib.dir/src/test/typeoftest.c.o   -c /var/lib/jenkins/workspace/ch-pipeline_vpb_development-KCTLYUE5TMW7Z33VLFXIW7KHT6FIH4V5AIJQWV52XR2IIKDPQP2Q/c/vdmclib/src/test/typeoftest.c
     [exec] [ 52%] Building CXX object vdmclib/CMakeFiles/vdmclib.dir/src/test/ClassBTest.cpp.o
     [exec] [ 54%] Building CXX object vdmclib/CMakeFiles/vdmclib.dir/src/test/ClassATest.cpp.o
     [exec] cd /var/lib/jenkins/workspace/ch-pipeline_vpb_development-KCTLYUE5TMW7Z33VLFXIW7KHT6FIH4V5AIJQWV52XR2IIKDPQP2Q/c/vdmclib && /usr/bin/c++    -I/var/lib/jenkins/workspace/ch-pipeline_vpb_development-KCTLYUE5TMW7Z33VLFXIW7KHT6FIH4V5AIJQWV52XR2IIKDPQP2Q/c/vdmclib -I/var/lib/jenkins/workspace/ch-pipeline_vpb_development-KCTLYUE5TMW7Z33VLFXIW7KHT6FIH4V5AIJQWV52XR2IIKDPQP2Q/c/vdmclib/src/test/resources -I/var/lib/jenkins/workspace/ch-pipeline_vpb_development-KCTLYUE5TMW7Z33VLFXIW7KHT6FIH4V5AIJQWV52XR2IIKDPQP2Q/c/vdmclib/src/main -I/var/lib/jenkins/workspace/ch-pipeline_vpb_development-KCTLYUE5TMW7Z33VLFXIW7KHT6FIH4V5AIJQWV52XR2IIKDPQP2Q/c/vdmclib/src/main/classes -I/var/lib/jenkins/workspace/ch-pipeline_vpb_development-KCTLYUE5TMW7Z33VLFXIW7KHT6FIH4V5AIJQWV52XR2IIKDPQP2Q/c/third_party/googletest/googletest/include  -fmessage-length=0   -o CMakeFiles/vdmclib.dir/src/test/ClassBTest.cpp.o -c /var/lib/jenkins/workspace/ch-pipeline_vpb_development-KCTLYUE5TMW7Z33VLFXIW7KHT6FIH4V5AIJQWV52XR2IIKDPQP2Q/c/vdmclib/src/test/ClassBTest.cpp
     [exec] cd /var/lib/jenkins/workspace/ch-pipeline_vpb_development-KCTLYUE5TMW7Z33VLFXIW7KHT6FIH4V5AIJQWV52XR2IIKDPQP2Q/c/vdmclib && /usr/bin/c++    -I/var/lib/jenkins/workspace/ch-pipeline_vpb_development-KCTLYUE5TMW7Z33VLFXIW7KHT6FIH4V5AIJQWV52XR2IIKDPQP2Q/c/vdmclib -I/var/lib/jenkins/workspace/ch-pipeline_vpb_development-KCTLYUE5TMW7Z33VLFXIW7KHT6FIH4V5AIJQWV52XR2IIKDPQP2Q/c/vdmclib/src/test/resources -I/var/lib/jenkins/workspace/ch-pipeline_vpb_development-KCTLYUE5TMW7Z33VLFXIW7KHT6FIH4V5AIJQWV52XR2IIKDPQP2Q/c/vdmclib/src/main -I/var/lib/jenkins/workspace/ch-pipeline_vpb_development-KCTLYUE5TMW7Z33VLFXIW7KHT6FIH4V5AIJQWV52XR2IIKDPQP2Q/c/vdmclib/src/main/classes -I/var/lib/jenkins/workspace/ch-pipeline_vpb_development-KCTLYUE5TMW7Z33VLFXIW7KHT6FIH4V5AIJQWV52XR2IIKDPQP2Q/c/third_party/googletest/googletest/include  -fmessage-length=0   -o CMakeFiles/vdmclib.dir/src/test/ClassATest.cpp.o -c /var/lib/jenkins/workspace/ch-pipeline_vpb_development-KCTLYUE5TMW7Z33VLFXIW7KHT6FIH4V5AIJQWV52XR2IIKDPQP2Q/c/vdmclib/src/test/ClassATest.cpp
     [exec] [ 56%] Building CXX object vdmclib/CMakeFiles/vdmclib.dir/src/test/ClassCSV_Tests.cpp.o
     [exec] cd /var/lib/jenkins/workspace/ch-pipeline_vpb_development-KCTLYUE5TMW7Z33VLFXIW7KHT6FIH4V5AIJQWV52XR2IIKDPQP2Q/c/vdmclib && /usr/bin/c++    -I/var/lib/jenkins/workspace/ch-pipeline_vpb_development-KCTLYUE5TMW7Z33VLFXIW7KHT6FIH4V5AIJQWV52XR2IIKDPQP2Q/c/vdmclib -I/var/lib/jenkins/workspace/ch-pipeline_vpb_development-KCTLYUE5TMW7Z33VLFXIW7KHT6FIH4V5AIJQWV52XR2IIKDPQP2Q/c/vdmclib/src/test/resources -I/var/lib/jenkins/workspace/ch-pipeline_vpb_development-KCTLYUE5TMW7Z33VLFXIW7KHT6FIH4V5AIJQWV52XR2IIKDPQP2Q/c/vdmclib/src/main -I/var/lib/jenkins/workspace/ch-pipeline_vpb_development-KCTLYUE5TMW7Z33VLFXIW7KHT6FIH4V5AIJQWV52XR2IIKDPQP2Q/c/vdmclib/src/main/classes -I/var/lib/jenkins/workspace/ch-pipeline_vpb_development-KCTLYUE5TMW7Z33VLFXIW7KHT6FIH4V5AIJQWV52XR2IIKDPQP2Q/c/third_party/googletest/googletest/include  -fmessage-length=0   -o CMakeFiles/vdmclib.dir/src/test/ClassCSV_Tests.cpp.o -c /var/lib/jenkins/workspace/ch-pipeline_vpb_development-KCTLYUE5TMW7Z33VLFXIW7KHT6FIH4V5AIJQWV52XR2IIKDPQP2Q/c/vdmclib/src/test/ClassCSV_Tests.cpp
     [exec] [ 58%] Building CXX object vdmclib/CMakeFiles/vdmclib.dir/src/test/ClassCTest.cpp.o
     [exec] cd /var/lib/jenkins/workspace/ch-pipeline_vpb_development-KCTLYUE5TMW7Z33VLFXIW7KHT6FIH4V5AIJQWV52XR2IIKDPQP2Q/c/vdmclib && /usr/bin/c++    -I/var/lib/jenkins/workspace/ch-pipeline_vpb_development-KCTLYUE5TMW7Z33VLFXIW7KHT6FIH4V5AIJQWV52XR2IIKDPQP2Q/c/vdmclib -I/var/lib/jenkins/workspace/ch-pipeline_vpb_development-KCTLYUE5TMW7Z33VLFXIW7KHT6FIH4V5AIJQWV52XR2IIKDPQP2Q/c/vdmclib/src/test/resources -I/var/lib/jenkins/workspace/ch-pipeline_vpb_development-KCTLYUE5TMW7Z33VLFXIW7KHT6FIH4V5AIJQWV52XR2IIKDPQP2Q/c/vdmclib/src/main -I/var/lib/jenkins/workspace/ch-pipeline_vpb_development-KCTLYUE5TMW7Z33VLFXIW7KHT6FIH4V5AIJQWV52XR2IIKDPQP2Q/c/vdmclib/src/main/classes -I/var/lib/jenkins/workspace/ch-pipeline_vpb_development-KCTLYUE5TMW7Z33VLFXIW7KHT6FIH4V5AIJQWV52XR2IIKDPQP2Q/c/third_party/googletest/googletest/include  -fmessage-length=0   -o CMakeFiles/vdmclib.dir/src/test/ClassCTest.cpp.o -c /var/lib/jenkins/workspace/ch-pipeline_vpb_development-KCTLYUE5TMW7Z33VLFXIW7KHT6FIH4V5AIJQWV52XR2IIKDPQP2Q/c/vdmclib/src/test/ClassCTest.cpp
     [exec] [ 60%] Building CXX object vdmclib/CMakeFiles/vdmclib.dir/src/test/ClassIO_Tests.cpp.o
     [exec] cd /var/lib/jenkins/workspace/ch-pipeline_vpb_development-KCTLYUE5TMW7Z33VLFXIW7KHT6FIH4V5AIJQWV52XR2IIKDPQP2Q/c/vdmclib && /usr/bin/c++    -I/var/lib/jenkins/workspace/ch-pipeline_vpb_development-KCTLYUE5TMW7Z33VLFXIW7KHT6FIH4V5AIJQWV52XR2IIKDPQP2Q/c/vdmclib -I/var/lib/jenkins/workspace/ch-pipeline_vpb_development-KCTLYUE5TMW7Z33VLFXIW7KHT6FIH4V5AIJQWV52XR2IIKDPQP2Q/c/vdmclib/src/test/resources -I/var/lib/jenkins/workspace/ch-pipeline_vpb_development-KCTLYUE5TMW7Z33VLFXIW7KHT6FIH4V5AIJQWV52XR2IIKDPQP2Q/c/vdmclib/src/main -I/var/lib/jenkins/workspace/ch-pipeline_vpb_development-KCTLYUE5TMW7Z33VLFXIW7KHT6FIH4V5AIJQWV52XR2IIKDPQP2Q/c/vdmclib/src/main/classes -I/var/lib/jenkins/workspace/ch-pipeline_vpb_development-KCTLYUE5TMW7Z33VLFXIW7KHT6FIH4V5AIJQWV52XR2IIKDPQP2Q/c/third_party/googletest/googletest/include  -fmessage-length=0   -o CMakeFiles/vdmclib.dir/src/test/ClassIO_Tests.cpp.o -c /var/lib/jenkins/workspace/ch-pipeline_vpb_development-KCTLYUE5TMW7Z33VLFXIW7KHT6FIH4V5AIJQWV52XR2IIKDPQP2Q/c/vdmclib/src/test/ClassIO_Tests.cpp
     [exec] [ 62%] Building CXX object vdmclib/CMakeFiles/vdmclib.dir/src/test/ClassPrivateCallABC_Tests.cpp.o
     [exec] cd /var/lib/jenkins/workspace/ch-pipeline_vpb_development-KCTLYUE5TMW7Z33VLFXIW7KHT6FIH4V5AIJQWV52XR2IIKDPQP2Q/c/vdmclib && /usr/bin/c++    -I/var/lib/jenkins/workspace/ch-pipeline_vpb_development-KCTLYUE5TMW7Z33VLFXIW7KHT6FIH4V5AIJQWV52XR2IIKDPQP2Q/c/vdmclib -I/var/lib/jenkins/workspace/ch-pipeline_vpb_development-KCTLYUE5TMW7Z33VLFXIW7KHT6FIH4V5AIJQWV52XR2IIKDPQP2Q/c/vdmclib/src/test/resources -I/var/lib/jenkins/workspace/ch-pipeline_vpb_development-KCTLYUE5TMW7Z33VLFXIW7KHT6FIH4V5AIJQWV52XR2IIKDPQP2Q/c/vdmclib/src/main -I/var/lib/jenkins/workspace/ch-pipeline_vpb_development-KCTLYUE5TMW7Z33VLFXIW7KHT6FIH4V5AIJQWV52XR2IIKDPQP2Q/c/vdmclib/src/main/classes -I/var/lib/jenkins/workspace/ch-pipeline_vpb_development-KCTLYUE5TMW7Z33VLFXIW7KHT6FIH4V5AIJQWV52XR2IIKDPQP2Q/c/third_party/googletest/googletest/include  -fmessage-length=0   -o CMakeFiles/vdmclib.dir/src/test/ClassPrivateCallABC_Tests.cpp.o -c /var/lib/jenkins/workspace/ch-pipeline_vpb_development-KCTLYUE5TMW7Z33VLFXIW7KHT6FIH4V5AIJQWV52XR2IIKDPQP2Q/c/vdmclib/src/test/ClassPrivateCallABC_Tests.cpp
     [exec] [ 64%] Building CXX object vdmclib/CMakeFiles/vdmclib.dir/src/test/ClassPrivateFieldABC_Tests.cpp.o
     [exec] cd /var/lib/jenkins/workspace/ch-pipeline_vpb_development-KCTLYUE5TMW7Z33VLFXIW7KHT6FIH4V5AIJQWV52XR2IIKDPQP2Q/c/vdmclib && /usr/bin/c++    -I/var/lib/jenkins/workspace/ch-pipeline_vpb_development-KCTLYUE5TMW7Z33VLFXIW7KHT6FIH4V5AIJQWV52XR2IIKDPQP2Q/c/vdmclib -I/var/lib/jenkins/workspace/ch-pipeline_vpb_development-KCTLYUE5TMW7Z33VLFXIW7KHT6FIH4V5AIJQWV52XR2IIKDPQP2Q/c/vdmclib/src/test/resources -I/var/lib/jenkins/workspace/ch-pipeline_vpb_development-KCTLYUE5TMW7Z33VLFXIW7KHT6FIH4V5AIJQWV52XR2IIKDPQP2Q/c/vdmclib/src/main -I/var/lib/jenkins/workspace/ch-pipeline_vpb_development-KCTLYUE5TMW7Z33VLFXIW7KHT6FIH4V5AIJQWV52XR2IIKDPQP2Q/c/vdmclib/src/main/classes -I/var/lib/jenkins/workspace/ch-pipeline_vpb_development-KCTLYUE5TMW7Z33VLFXIW7KHT6FIH4V5AIJQWV52XR2IIKDPQP2Q/c/third_party/googletest/googletest/include  -fmessage-length=0   -o CMakeFiles/vdmclib.dir/src/test/ClassPrivateFieldABC_Tests.cpp.o -c /var/lib/jenkins/workspace/ch-pipeline_vpb_development-KCTLYUE5TMW7Z33VLFXIW7KHT6FIH4V5AIJQWV52XR2IIKDPQP2Q/c/vdmclib/src/test/ClassPrivateFieldABC_Tests.cpp
     [exec] [ 66%] Building CXX object vdmclib/CMakeFiles/vdmclib.dir/src/test/ClassPublicCallABC_Tests.cpp.o
     [exec] cd /var/lib/jenkins/workspace/ch-pipeline_vpb_development-KCTLYUE5TMW7Z33VLFXIW7KHT6FIH4V5AIJQWV52XR2IIKDPQP2Q/c/vdmclib && /usr/bin/c++    -I/var/lib/jenkins/workspace/ch-pipeline_vpb_development-KCTLYUE5TMW7Z33VLFXIW7KHT6FIH4V5AIJQWV52XR2IIKDPQP2Q/c/vdmclib -I/var/lib/jenkins/workspace/ch-pipeline_vpb_development-KCTLYUE5TMW7Z33VLFXIW7KHT6FIH4V5AIJQWV52XR2IIKDPQP2Q/c/vdmclib/src/test/resources -I/var/lib/jenkins/workspace/ch-pipeline_vpb_development-KCTLYUE5TMW7Z33VLFXIW7KHT6FIH4V5AIJQWV52XR2IIKDPQP2Q/c/vdmclib/src/main -I/var/lib/jenkins/workspace/ch-pipeline_vpb_development-KCTLYUE5TMW7Z33VLFXIW7KHT6FIH4V5AIJQWV52XR2IIKDPQP2Q/c/vdmclib/src/main/classes -I/var/lib/jenkins/workspace/ch-pipeline_vpb_development-KCTLYUE5TMW7Z33VLFXIW7KHT6FIH4V5AIJQWV52XR2IIKDPQP2Q/c/third_party/googletest/googletest/include  -fmessage-length=0   -o CMakeFiles/vdmclib.dir/src/test/ClassPublicCallABC_Tests.cpp.o -c /var/lib/jenkins/workspace/ch-pipeline_vpb_development-KCTLYUE5TMW7Z33VLFXIW7KHT6FIH4V5AIJQWV52XR2IIKDPQP2Q/c/vdmclib/src/test/ClassPublicCallABC_Tests.cpp
     [exec] [ 68%] Building CXX object vdmclib/CMakeFiles/vdmclib.dir/src/test/ClassPublicFieldABC_Tests.cpp.o
     [exec] cd /var/lib/jenkins/workspace/ch-pipeline_vpb_development-KCTLYUE5TMW7Z33VLFXIW7KHT6FIH4V5AIJQWV52XR2IIKDPQP2Q/c/vdmclib && /usr/bin/c++    -I/var/lib/jenkins/workspace/ch-pipeline_vpb_development-KCTLYUE5TMW7Z33VLFXIW7KHT6FIH4V5AIJQWV52XR2IIKDPQP2Q/c/vdmclib -I/var/lib/jenkins/workspace/ch-pipeline_vpb_development-KCTLYUE5TMW7Z33VLFXIW7KHT6FIH4V5AIJQWV52XR2IIKDPQP2Q/c/vdmclib/src/test/resources -I/var/lib/jenkins/workspace/ch-pipeline_vpb_development-KCTLYUE5TMW7Z33VLFXIW7KHT6FIH4V5AIJQWV52XR2IIKDPQP2Q/c/vdmclib/src/main -I/var/lib/jenkins/workspace/ch-pipeline_vpb_development-KCTLYUE5TMW7Z33VLFXIW7KHT6FIH4V5AIJQWV52XR2IIKDPQP2Q/c/vdmclib/src/main/classes -I/var/lib/jenkins/workspace/ch-pipeline_vpb_development-KCTLYUE5TMW7Z33VLFXIW7KHT6FIH4V5AIJQWV52XR2IIKDPQP2Q/c/third_party/googletest/googletest/include  -fmessage-length=0   -o CMakeFiles/vdmclib.dir/src/test/ClassPublicFieldABC_Tests.cpp.o -c /var/lib/jenkins/workspace/ch-pipeline_vpb_development-KCTLYUE5TMW7Z33VLFXIW7KHT6FIH4V5AIJQWV52XR2IIKDPQP2Q/c/vdmclib/src/test/ClassPublicFieldABC_Tests.cpp
     [exec] [ 70%] Building CXX object vdmclib/CMakeFiles/vdmclib.dir/src/test/ExpressionForLoop.cpp.o
     [exec] [ 72%] Building CXX object vdmclib/CMakeFiles/vdmclib.dir/src/test/ExpressionsBoolean_Tests.cpp.o
     [exec] cd /var/lib/jenkins/workspace/ch-pipeline_vpb_development-KCTLYUE5TMW7Z33VLFXIW7KHT6FIH4V5AIJQWV52XR2IIKDPQP2Q/c/vdmclib && /usr/bin/c++    -I/var/lib/jenkins/workspace/ch-pipeline_vpb_development-KCTLYUE5TMW7Z33VLFXIW7KHT6FIH4V5AIJQWV52XR2IIKDPQP2Q/c/vdmclib -I/var/lib/jenkins/workspace/ch-pipeline_vpb_development-KCTLYUE5TMW7Z33VLFXIW7KHT6FIH4V5AIJQWV52XR2IIKDPQP2Q/c/vdmclib/src/test/resources -I/var/lib/jenkins/workspace/ch-pipeline_vpb_development-KCTLYUE5TMW7Z33VLFXIW7KHT6FIH4V5AIJQWV52XR2IIKDPQP2Q/c/vdmclib/src/main -I/var/lib/jenkins/workspace/ch-pipeline_vpb_development-KCTLYUE5TMW7Z33VLFXIW7KHT6FIH4V5AIJQWV52XR2IIKDPQP2Q/c/vdmclib/src/main/classes -I/var/lib/jenkins/workspace/ch-pipeline_vpb_development-KCTLYUE5TMW7Z33VLFXIW7KHT6FIH4V5AIJQWV52XR2IIKDPQP2Q/c/third_party/googletest/googletest/include  -fmessage-length=0   -o CMakeFiles/vdmclib.dir/src/test/ExpressionForLoop.cpp.o -c /var/lib/jenkins/workspace/ch-pipeline_vpb_development-KCTLYUE5TMW7Z33VLFXIW7KHT6FIH4V5AIJQWV52XR2IIKDPQP2Q/c/vdmclib/src/test/ExpressionForLoop.cpp
     [exec] cd /var/lib/jenkins/workspace/ch-pipeline_vpb_development-KCTLYUE5TMW7Z33VLFXIW7KHT6FIH4V5AIJQWV52XR2IIKDPQP2Q/c/vdmclib && /usr/bin/c++    -I/var/lib/jenkins/workspace/ch-pipeline_vpb_development-KCTLYUE5TMW7Z33VLFXIW7KHT6FIH4V5AIJQWV52XR2IIKDPQP2Q/c/vdmclib -I/var/lib/jenkins/workspace/ch-pipeline_vpb_development-KCTLYUE5TMW7Z33VLFXIW7KHT6FIH4V5AIJQWV52XR2IIKDPQP2Q/c/vdmclib/src/test/resources -I/var/lib/jenkins/workspace/ch-pipeline_vpb_development-KCTLYUE5TMW7Z33VLFXIW7KHT6FIH4V5AIJQWV52XR2IIKDPQP2Q/c/vdmclib/src/main -I/var/lib/jenkins/workspace/ch-pipeline_vpb_development-KCTLYUE5TMW7Z33VLFXIW7KHT6FIH4V5AIJQWV52XR2IIKDPQP2Q/c/vdmclib/src/main/classes -I/var/lib/jenkins/workspace/ch-pipeline_vpb_development-KCTLYUE5TMW7Z33VLFXIW7KHT6FIH4V5AIJQWV52XR2IIKDPQP2Q/c/third_party/googletest/googletest/include  -fmessage-length=0   -o CMakeFiles/vdmclib.dir/src/test/ExpressionsBoolean_Tests.cpp.o -c /var/lib/jenkins/workspace/ch-pipeline_vpb_development-KCTLYUE5TMW7Z33VLFXIW7KHT6FIH4V5AIJQWV52XR2IIKDPQP2Q/c/vdmclib/src/test/ExpressionsBoolean_Tests.cpp
     [exec] [ 74%] Building CXX object vdmclib/CMakeFiles/vdmclib.dir/src/test/ExpressionsMap_Tests.cpp.o
     [exec] cd /var/lib/jenkins/workspace/ch-pipeline_vpb_development-KCTLYUE5TMW7Z33VLFXIW7KHT6FIH4V5AIJQWV52XR2IIKDPQP2Q/c/vdmclib && /usr/bin/c++    -I/var/lib/jenkins/workspace/ch-pipeline_vpb_development-KCTLYUE5TMW7Z33VLFXIW7KHT6FIH4V5AIJQWV52XR2IIKDPQP2Q/c/vdmclib -I/var/lib/jenkins/workspace/ch-pipeline_vpb_development-KCTLYUE5TMW7Z33VLFXIW7KHT6FIH4V5AIJQWV52XR2IIKDPQP2Q/c/vdmclib/src/test/resources -I/var/lib/jenkins/workspace/ch-pipeline_vpb_development-KCTLYUE5TMW7Z33VLFXIW7KHT6FIH4V5AIJQWV52XR2IIKDPQP2Q/c/vdmclib/src/main -I/var/lib/jenkins/workspace/ch-pipeline_vpb_development-KCTLYUE5TMW7Z33VLFXIW7KHT6FIH4V5AIJQWV52XR2IIKDPQP2Q/c/vdmclib/src/main/classes -I/var/lib/jenkins/workspace/ch-pipeline_vpb_development-KCTLYUE5TMW7Z33VLFXIW7KHT6FIH4V5AIJQWV52XR2IIKDPQP2Q/c/third_party/googletest/googletest/include  -fmessage-length=0   -o CMakeFiles/vdmclib.dir/src/test/ExpressionsMap_Tests.cpp.o -c /var/lib/jenkins/workspace/ch-pipeline_vpb_development-KCTLYUE5TMW7Z33VLFXIW7KHT6FIH4V5AIJQWV52XR2IIKDPQP2Q/c/vdmclib/src/test/ExpressionsMap_Tests.cpp
     [exec] [ 76%] Building CXX object vdmclib/CMakeFiles/vdmclib.dir/src/test/ExpressionsNumeric_Tests.cpp.o
     [exec] cd /var/lib/jenkins/workspace/ch-pipeline_vpb_development-KCTLYUE5TMW7Z33VLFXIW7KHT6FIH4V5AIJQWV52XR2IIKDPQP2Q/c/vdmclib && /usr/bin/c++    -I/var/lib/jenkins/workspace/ch-pipeline_vpb_development-KCTLYUE5TMW7Z33VLFXIW7KHT6FIH4V5AIJQWV52XR2IIKDPQP2Q/c/vdmclib -I/var/lib/jenkins/workspace/ch-pipeline_vpb_development-KCTLYUE5TMW7Z33VLFXIW7KHT6FIH4V5AIJQWV52XR2IIKDPQP2Q/c/vdmclib/src/test/resources -I/var/lib/jenkins/workspace/ch-pipeline_vpb_development-KCTLYUE5TMW7Z33VLFXIW7KHT6FIH4V5AIJQWV52XR2IIKDPQP2Q/c/vdmclib/src/main -I/var/lib/jenkins/workspace/ch-pipeline_vpb_development-KCTLYUE5TMW7Z33VLFXIW7KHT6FIH4V5AIJQWV52XR2IIKDPQP2Q/c/vdmclib/src/main/classes -I/var/lib/jenkins/workspace/ch-pipeline_vpb_development-KCTLYUE5TMW7Z33VLFXIW7KHT6FIH4V5AIJQWV52XR2IIKDPQP2Q/c/third_party/googletest/googletest/include  -fmessage-length=0   -o CMakeFiles/vdmclib.dir/src/test/ExpressionsNumeric_Tests.cpp.o -c /var/lib/jenkins/workspace/ch-pipeline_vpb_development-KCTLYUE5TMW7Z33VLFXIW7KHT6FIH4V5AIJQWV52XR2IIKDPQP2Q/c/vdmclib/src/test/ExpressionsNumeric_Tests.cpp
     [exec] [ 78%] Building CXX object vdmclib/CMakeFiles/vdmclib.dir/src/test/ExpressionsProduct_Tests.cpp.o
     [exec] cd /var/lib/jenkins/workspace/ch-pipeline_vpb_development-KCTLYUE5TMW7Z33VLFXIW7KHT6FIH4V5AIJQWV52XR2IIKDPQP2Q/c/vdmclib && /usr/bin/c++    -I/var/lib/jenkins/workspace/ch-pipeline_vpb_development-KCTLYUE5TMW7Z33VLFXIW7KHT6FIH4V5AIJQWV52XR2IIKDPQP2Q/c/vdmclib -I/var/lib/jenkins/workspace/ch-pipeline_vpb_development-KCTLYUE5TMW7Z33VLFXIW7KHT6FIH4V5AIJQWV52XR2IIKDPQP2Q/c/vdmclib/src/test/resources -I/var/lib/jenkins/workspace/ch-pipeline_vpb_development-KCTLYUE5TMW7Z33VLFXIW7KHT6FIH4V5AIJQWV52XR2IIKDPQP2Q/c/vdmclib/src/main -I/var/lib/jenkins/workspace/ch-pipeline_vpb_development-KCTLYUE5TMW7Z33VLFXIW7KHT6FIH4V5AIJQWV52XR2IIKDPQP2Q/c/vdmclib/src/main/classes -I/var/lib/jenkins/workspace/ch-pipeline_vpb_development-KCTLYUE5TMW7Z33VLFXIW7KHT6FIH4V5AIJQWV52XR2IIKDPQP2Q/c/third_party/googletest/googletest/include  -fmessage-length=0   -o CMakeFiles/vdmclib.dir/src/test/ExpressionsProduct_Tests.cpp.o -c /var/lib/jenkins/workspace/ch-pipeline_vpb_development-KCTLYUE5TMW7Z33VLFXIW7KHT6FIH4V5AIJQWV52XR2IIKDPQP2Q/c/vdmclib/src/test/ExpressionsProduct_Tests.cpp
     [exec] [ 80%] Building CXX object vdmclib/CMakeFiles/vdmclib.dir/src/test/ExpressionsSeq_Tests.cpp.o
     [exec] cd /var/lib/jenkins/workspace/ch-pipeline_vpb_development-KCTLYUE5TMW7Z33VLFXIW7KHT6FIH4V5AIJQWV52XR2IIKDPQP2Q/c/vdmclib && /usr/bin/c++    -I/var/lib/jenkins/workspace/ch-pipeline_vpb_development-KCTLYUE5TMW7Z33VLFXIW7KHT6FIH4V5AIJQWV52XR2IIKDPQP2Q/c/vdmclib -I/var/lib/jenkins/workspace/ch-pipeline_vpb_development-KCTLYUE5TMW7Z33VLFXIW7KHT6FIH4V5AIJQWV52XR2IIKDPQP2Q/c/vdmclib/src/test/resources -I/var/lib/jenkins/workspace/ch-pipeline_vpb_development-KCTLYUE5TMW7Z33VLFXIW7KHT6FIH4V5AIJQWV52XR2IIKDPQP2Q/c/vdmclib/src/main -I/var/lib/jenkins/workspace/ch-pipeline_vpb_development-KCTLYUE5TMW7Z33VLFXIW7KHT6FIH4V5AIJQWV52XR2IIKDPQP2Q/c/vdmclib/src/main/classes -I/var/lib/jenkins/workspace/ch-pipeline_vpb_development-KCTLYUE5TMW7Z33VLFXIW7KHT6FIH4V5AIJQWV52XR2IIKDPQP2Q/c/third_party/googletest/googletest/include  -fmessage-length=0   -o CMakeFiles/vdmclib.dir/src/test/ExpressionsSeq_Tests.cpp.o -c /var/lib/jenkins/workspace/ch-pipeline_vpb_development-KCTLYUE5TMW7Z33VLFXIW7KHT6FIH4V5AIJQWV52XR2IIKDPQP2Q/c/vdmclib/src/test/ExpressionsSeq_Tests.cpp
     [exec] [ 82%] Building CXX object vdmclib/CMakeFiles/vdmclib.dir/src/test/ExpressionsSetRandom_Tests.cpp.o
     [exec] cd /var/lib/jenkins/workspace/ch-pipeline_vpb_development-KCTLYUE5TMW7Z33VLFXIW7KHT6FIH4V5AIJQWV52XR2IIKDPQP2Q/c/vdmclib && /usr/bin/c++    -I/var/lib/jenkins/workspace/ch-pipeline_vpb_development-KCTLYUE5TMW7Z33VLFXIW7KHT6FIH4V5AIJQWV52XR2IIKDPQP2Q/c/vdmclib -I/var/lib/jenkins/workspace/ch-pipeline_vpb_development-KCTLYUE5TMW7Z33VLFXIW7KHT6FIH4V5AIJQWV52XR2IIKDPQP2Q/c/vdmclib/src/test/resources -I/var/lib/jenkins/workspace/ch-pipeline_vpb_development-KCTLYUE5TMW7Z33VLFXIW7KHT6FIH4V5AIJQWV52XR2IIKDPQP2Q/c/vdmclib/src/main -I/var/lib/jenkins/workspace/ch-pipeline_vpb_development-KCTLYUE5TMW7Z33VLFXIW7KHT6FIH4V5AIJQWV52XR2IIKDPQP2Q/c/vdmclib/src/main/classes -I/var/lib/jenkins/workspace/ch-pipeline_vpb_development-KCTLYUE5TMW7Z33VLFXIW7KHT6FIH4V5AIJQWV52XR2IIKDPQP2Q/c/third_party/googletest/googletest/include  -fmessage-length=0   -o CMakeFiles/vdmclib.dir/src/test/ExpressionsSetRandom_Tests.cpp.o -c /var/lib/jenkins/workspace/ch-pipeline_vpb_development-KCTLYUE5TMW7Z33VLFXIW7KHT6FIH4V5AIJQWV52XR2IIKDPQP2Q/c/vdmclib/src/test/ExpressionsSetRandom_Tests.cpp
     [exec] [ 84%] Building CXX object vdmclib/CMakeFiles/vdmclib.dir/src/test/ExpressionsSet_Tests.cpp.o
     [exec] cd /var/lib/jenkins/workspace/ch-pipeline_vpb_development-KCTLYUE5TMW7Z33VLFXIW7KHT6FIH4V5AIJQWV52XR2IIKDPQP2Q/c/vdmclib && /usr/bin/c++    -I/var/lib/jenkins/workspace/ch-pipeline_vpb_development-KCTLYUE5TMW7Z33VLFXIW7KHT6FIH4V5AIJQWV52XR2IIKDPQP2Q/c/vdmclib -I/var/lib/jenkins/workspace/ch-pipeline_vpb_development-KCTLYUE5TMW7Z33VLFXIW7KHT6FIH4V5AIJQWV52XR2IIKDPQP2Q/c/vdmclib/src/test/resources -I/var/lib/jenkins/workspace/ch-pipeline_vpb_development-KCTLYUE5TMW7Z33VLFXIW7KHT6FIH4V5AIJQWV52XR2IIKDPQP2Q/c/vdmclib/src/main -I/var/lib/jenkins/workspace/ch-pipeline_vpb_development-KCTLYUE5TMW7Z33VLFXIW7KHT6FIH4V5AIJQWV52XR2IIKDPQP2Q/c/vdmclib/src/main/classes -I/var/lib/jenkins/workspace/ch-pipeline_vpb_development-KCTLYUE5TMW7Z33VLFXIW7KHT6FIH4V5AIJQWV52XR2IIKDPQP2Q/c/third_party/googletest/googletest/include  -fmessage-length=0   -o CMakeFiles/vdmclib.dir/src/test/ExpressionsSet_Tests.cpp.o -c /var/lib/jenkins/workspace/ch-pipeline_vpb_development-KCTLYUE5TMW7Z33VLFXIW7KHT6FIH4V5AIJQWV52XR2IIKDPQP2Q/c/vdmclib/src/test/ExpressionsSet_Tests.cpp
     [exec] [ 86%] Building CXX object vdmclib/CMakeFiles/vdmclib.dir/src/test/GC_Tests.cpp.o
     [exec] cd /var/lib/jenkins/workspace/ch-pipeline_vpb_development-KCTLYUE5TMW7Z33VLFXIW7KHT6FIH4V5AIJQWV52XR2IIKDPQP2Q/c/vdmclib && /usr/bin/c++    -I/var/lib/jenkins/workspace/ch-pipeline_vpb_development-KCTLYUE5TMW7Z33VLFXIW7KHT6FIH4V5AIJQWV52XR2IIKDPQP2Q/c/vdmclib -I/var/lib/jenkins/workspace/ch-pipeline_vpb_development-KCTLYUE5TMW7Z33VLFXIW7KHT6FIH4V5AIJQWV52XR2IIKDPQP2Q/c/vdmclib/src/test/resources -I/var/lib/jenkins/workspace/ch-pipeline_vpb_development-KCTLYUE5TMW7Z33VLFXIW7KHT6FIH4V5AIJQWV52XR2IIKDPQP2Q/c/vdmclib/src/main -I/var/lib/jenkins/workspace/ch-pipeline_vpb_development-KCTLYUE5TMW7Z33VLFXIW7KHT6FIH4V5AIJQWV52XR2IIKDPQP2Q/c/vdmclib/src/main/classes -I/var/lib/jenkins/workspace/ch-pipeline_vpb_development-KCTLYUE5TMW7Z33VLFXIW7KHT6FIH4V5AIJQWV52XR2IIKDPQP2Q/c/third_party/googletest/googletest/include  -fmessage-length=0   -o CMakeFiles/vdmclib.dir/src/test/GC_Tests.cpp.o -c /var/lib/jenkins/workspace/ch-pipeline_vpb_development-KCTLYUE5TMW7Z33VLFXIW7KHT6FIH4V5AIJQWV52XR2IIKDPQP2Q/c/vdmclib/src/test/GC_Tests.cpp
     [exec] [ 88%] Building CXX object vdmclib/CMakeFiles/vdmclib.dir/src/test/Expressions_Tests.cpp.o
     [exec] cd /var/lib/jenkins/workspace/ch-pipeline_vpb_development-KCTLYUE5TMW7Z33VLFXIW7KHT6FIH4V5AIJQWV52XR2IIKDPQP2Q/c/vdmclib && /usr/bin/c++    -I/var/lib/jenkins/workspace/ch-pipeline_vpb_development-KCTLYUE5TMW7Z33VLFXIW7KHT6FIH4V5AIJQWV52XR2IIKDPQP2Q/c/vdmclib -I/var/lib/jenkins/workspace/ch-pipeline_vpb_development-KCTLYUE5TMW7Z33VLFXIW7KHT6FIH4V5AIJQWV52XR2IIKDPQP2Q/c/vdmclib/src/test/resources -I/var/lib/jenkins/workspace/ch-pipeline_vpb_development-KCTLYUE5TMW7Z33VLFXIW7KHT6FIH4V5AIJQWV52XR2IIKDPQP2Q/c/vdmclib/src/main -I/var/lib/jenkins/workspace/ch-pipeline_vpb_development-KCTLYUE5TMW7Z33VLFXIW7KHT6FIH4V5AIJQWV52XR2IIKDPQP2Q/c/vdmclib/src/main/classes -I/var/lib/jenkins/workspace/ch-pipeline_vpb_development-KCTLYUE5TMW7Z33VLFXIW7KHT6FIH4V5AIJQWV52XR2IIKDPQP2Q/c/third_party/googletest/googletest/include  -fmessage-length=0   -o CMakeFiles/vdmclib.dir/src/test/Expressions_Tests.cpp.o -c /var/lib/jenkins/workspace/ch-pipeline_vpb_development-KCTLYUE5TMW7Z33VLFXIW7KHT6FIH4V5AIJQWV52XR2IIKDPQP2Q/c/vdmclib/src/test/Expressions_Tests.cpp
     [exec] [ 90%] Building CXX object vdmclib/CMakeFiles/vdmclib.dir/src/test/PrettyPrint_Tests.cpp.o
     [exec] cd /var/lib/jenkins/workspace/ch-pipeline_vpb_development-KCTLYUE5TMW7Z33VLFXIW7KHT6FIH4V5AIJQWV52XR2IIKDPQP2Q/c/vdmclib && /usr/bin/c++    -I/var/lib/jenkins/workspace/ch-pipeline_vpb_development-KCTLYUE5TMW7Z33VLFXIW7KHT6FIH4V5AIJQWV52XR2IIKDPQP2Q/c/vdmclib -I/var/lib/jenkins/workspace/ch-pipeline_vpb_development-KCTLYUE5TMW7Z33VLFXIW7KHT6FIH4V5AIJQWV52XR2IIKDPQP2Q/c/vdmclib/src/test/resources -I/var/lib/jenkins/workspace/ch-pipeline_vpb_development-KCTLYUE5TMW7Z33VLFXIW7KHT6FIH4V5AIJQWV52XR2IIKDPQP2Q/c/vdmclib/src/main -I/var/lib/jenkins/workspace/ch-pipeline_vpb_development-KCTLYUE5TMW7Z33VLFXIW7KHT6FIH4V5AIJQWV52XR2IIKDPQP2Q/c/vdmclib/src/main/classes -I/var/lib/jenkins/workspace/ch-pipeline_vpb_development-KCTLYUE5TMW7Z33VLFXIW7KHT6FIH4V5AIJQWV52XR2IIKDPQP2Q/c/third_party/googletest/googletest/include  -fmessage-length=0   -o CMakeFiles/vdmclib.dir/src/test/PrettyPrint_Tests.cpp.o -c /var/lib/jenkins/workspace/ch-pipeline_vpb_development-KCTLYUE5TMW7Z33VLFXIW7KHT6FIH4V5AIJQWV52XR2IIKDPQP2Q/c/vdmclib/src/test/PrettyPrint_Tests.cpp
     [exec] [ 92%] Building CXX object vdmclib/CMakeFiles/vdmclib.dir/src/test/Statements_Record_Tests.cpp.o
     [exec] cd /var/lib/jenkins/workspace/ch-pipeline_vpb_development-KCTLYUE5TMW7Z33VLFXIW7KHT6FIH4V5AIJQWV52XR2IIKDPQP2Q/c/vdmclib && /usr/bin/c++    -I/var/lib/jenkins/workspace/ch-pipeline_vpb_development-KCTLYUE5TMW7Z33VLFXIW7KHT6FIH4V5AIJQWV52XR2IIKDPQP2Q/c/vdmclib -I/var/lib/jenkins/workspace/ch-pipeline_vpb_development-KCTLYUE5TMW7Z33VLFXIW7KHT6FIH4V5AIJQWV52XR2IIKDPQP2Q/c/vdmclib/src/test/resources -I/var/lib/jenkins/workspace/ch-pipeline_vpb_development-KCTLYUE5TMW7Z33VLFXIW7KHT6FIH4V5AIJQWV52XR2IIKDPQP2Q/c/vdmclib/src/main -I/var/lib/jenkins/workspace/ch-pipeline_vpb_development-KCTLYUE5TMW7Z33VLFXIW7KHT6FIH4V5AIJQWV52XR2IIKDPQP2Q/c/vdmclib/src/main/classes -I/var/lib/jenkins/workspace/ch-pipeline_vpb_development-KCTLYUE5TMW7Z33VLFXIW7KHT6FIH4V5AIJQWV52XR2IIKDPQP2Q/c/third_party/googletest/googletest/include  -fmessage-length=0   -o CMakeFiles/vdmclib.dir/src/test/Statements_Record_Tests.cpp.o -c /var/lib/jenkins/workspace/ch-pipeline_vpb_development-KCTLYUE5TMW7Z33VLFXIW7KHT6FIH4V5AIJQWV52XR2IIKDPQP2Q/c/vdmclib/src/test/Statements_Record_Tests.cpp
     [exec] [ 94%] Building CXX object vdmclib/CMakeFiles/vdmclib.dir/src/test/StructOffsetTest_Tests.cpp.o
     [exec] cd /var/lib/jenkins/workspace/ch-pipeline_vpb_development-KCTLYUE5TMW7Z33VLFXIW7KHT6FIH4V5AIJQWV52XR2IIKDPQP2Q/c/vdmclib && /usr/bin/c++    -I/var/lib/jenkins/workspace/ch-pipeline_vpb_development-KCTLYUE5TMW7Z33VLFXIW7KHT6FIH4V5AIJQWV52XR2IIKDPQP2Q/c/vdmclib -I/var/lib/jenkins/workspace/ch-pipeline_vpb_development-KCTLYUE5TMW7Z33VLFXIW7KHT6FIH4V5AIJQWV52XR2IIKDPQP2Q/c/vdmclib/src/test/resources -I/var/lib/jenkins/workspace/ch-pipeline_vpb_development-KCTLYUE5TMW7Z33VLFXIW7KHT6FIH4V5AIJQWV52XR2IIKDPQP2Q/c/vdmclib/src/main -I/var/lib/jenkins/workspace/ch-pipeline_vpb_development-KCTLYUE5TMW7Z33VLFXIW7KHT6FIH4V5AIJQWV52XR2IIKDPQP2Q/c/vdmclib/src/main/classes -I/var/lib/jenkins/workspace/ch-pipeline_vpb_development-KCTLYUE5TMW7Z33VLFXIW7KHT6FIH4V5AIJQWV52XR2IIKDPQP2Q/c/third_party/googletest/googletest/include  -fmessage-length=0   -o CMakeFiles/vdmclib.dir/src/test/StructOffsetTest_Tests.cpp.o -c /var/lib/jenkins/workspace/ch-pipeline_vpb_development-KCTLYUE5TMW7Z33VLFXIW7KHT6FIH4V5AIJQWV52XR2IIKDPQP2Q/c/vdmclib/src/test/StructOffsetTest_Tests.cpp
     [exec] [ 96%] Building CXX object vdmclib/CMakeFiles/vdmclib.dir/src/test/TokenType_Tests.cpp.o
     [exec] cd /var/lib/jenkins/workspace/ch-pipeline_vpb_development-KCTLYUE5TMW7Z33VLFXIW7KHT6FIH4V5AIJQWV52XR2IIKDPQP2Q/c/vdmclib && /usr/bin/c++    -I/var/lib/jenkins/workspace/ch-pipeline_vpb_development-KCTLYUE5TMW7Z33VLFXIW7KHT6FIH4V5AIJQWV52XR2IIKDPQP2Q/c/vdmclib -I/var/lib/jenkins/workspace/ch-pipeline_vpb_development-KCTLYUE5TMW7Z33VLFXIW7KHT6FIH4V5AIJQWV52XR2IIKDPQP2Q/c/vdmclib/src/test/resources -I/var/lib/jenkins/workspace/ch-pipeline_vpb_development-KCTLYUE5TMW7Z33VLFXIW7KHT6FIH4V5AIJQWV52XR2IIKDPQP2Q/c/vdmclib/src/main -I/var/lib/jenkins/workspace/ch-pipeline_vpb_development-KCTLYUE5TMW7Z33VLFXIW7KHT6FIH4V5AIJQWV52XR2IIKDPQP2Q/c/vdmclib/src/main/classes -I/var/lib/jenkins/workspace/ch-pipeline_vpb_development-KCTLYUE5TMW7Z33VLFXIW7KHT6FIH4V5AIJQWV52XR2IIKDPQP2Q/c/third_party/googletest/googletest/include  -fmessage-length=0   -o CMakeFiles/vdmclib.dir/src/test/TokenType_Tests.cpp.o -c /var/lib/jenkins/workspace/ch-pipeline_vpb_development-KCTLYUE5TMW7Z33VLFXIW7KHT6FIH4V5AIJQWV52XR2IIKDPQP2Q/c/vdmclib/src/test/TokenType_Tests.cpp
     [exec] [ 98%] Building CXX object vdmclib/CMakeFiles/vdmclib.dir/src/test/TypeofTest_Tests.cpp.o
     [exec] cd /var/lib/jenkins/workspace/ch-pipeline_vpb_development-KCTLYUE5TMW7Z33VLFXIW7KHT6FIH4V5AIJQWV52XR2IIKDPQP2Q/c/vdmclib && /usr/bin/c++    -I/var/lib/jenkins/workspace/ch-pipeline_vpb_development-KCTLYUE5TMW7Z33VLFXIW7KHT6FIH4V5AIJQWV52XR2IIKDPQP2Q/c/vdmclib -I/var/lib/jenkins/workspace/ch-pipeline_vpb_development-KCTLYUE5TMW7Z33VLFXIW7KHT6FIH4V5AIJQWV52XR2IIKDPQP2Q/c/vdmclib/src/test/resources -I/var/lib/jenkins/workspace/ch-pipeline_vpb_development-KCTLYUE5TMW7Z33VLFXIW7KHT6FIH4V5AIJQWV52XR2IIKDPQP2Q/c/vdmclib/src/main -I/var/lib/jenkins/workspace/ch-pipeline_vpb_development-KCTLYUE5TMW7Z33VLFXIW7KHT6FIH4V5AIJQWV52XR2IIKDPQP2Q/c/vdmclib/src/main/classes -I/var/lib/jenkins/workspace/ch-pipeline_vpb_development-KCTLYUE5TMW7Z33VLFXIW7KHT6FIH4V5AIJQWV52XR2IIKDPQP2Q/c/third_party/googletest/googletest/include  -fmessage-length=0   -o CMakeFiles/vdmclib.dir/src/test/TypeofTest_Tests.cpp.o -c /var/lib/jenkins/workspace/ch-pipeline_vpb_development-KCTLYUE5TMW7Z33VLFXIW7KHT6FIH4V5AIJQWV52XR2IIKDPQP2Q/c/vdmclib/src/test/TypeofTest_Tests.cpp
     [exec] [100%] Linking CXX executable target/vdmclib
     [exec] cd /var/lib/jenkins/workspace/ch-pipeline_vpb_development-KCTLYUE5TMW7Z33VLFXIW7KHT6FIH4V5AIJQWV52XR2IIKDPQP2Q/c/vdmclib && /usr/bin/cmake -E cmake_link_script CMakeFiles/vdmclib.dir/link.txt --verbose=1
     [exec] /usr/bin/c++    -fmessage-length=0   CMakeFiles/vdmclib.dir/src/main/CSVLib.c.o CMakeFiles/vdmclib.dir/src/main/IOLib.c.o CMakeFiles/vdmclib.dir/src/main/MATHLib.c.o CMakeFiles/vdmclib.dir/src/main/PatternBindMatch.c.o CMakeFiles/vdmclib.dir/src/main/PrettyPrint.c.o CMakeFiles/vdmclib.dir/src/main/TypedValue.c.o CMakeFiles/vdmclib.dir/src/main/VdmBasicTypes.c.o CMakeFiles/vdmclib.dir/src/main/VdmClass.c.o CMakeFiles/vdmclib.dir/src/main/VdmGC.c.o CMakeFiles/vdmclib.dir/src/main/VdmMap.c.o CMakeFiles/vdmclib.dir/src/main/VdmProduct.c.o CMakeFiles/vdmclib.dir/src/main/VdmSeq.c.o CMakeFiles/vdmclib.dir/src/main/VdmSet.c.o CMakeFiles/vdmclib.dir/src/main/VdmUnpackString.c.o CMakeFiles/vdmclib.dir/src/test/classes/A.c.o CMakeFiles/vdmclib.dir/src/test/classes/B.c.o CMakeFiles/vdmclib.dir/src/test/classes/C.c.o CMakeFiles/vdmclib.dir/src/test/records/MyRec.c.o CMakeFiles/vdmclib.dir/src/test/records/MyRec2.c.o CMakeFiles/vdmclib.dir/src/test/records/R1.c.o CMakeFiles/vdmclib.dir/src/test/records/RecordTest.c.o CMakeFiles/vdmclib.dir/src/test/typeoftest.c.o CMakeFiles/vdmclib.dir/src/test/ClassATest.cpp.o CMakeFiles/vdmclib.dir/src/test/ClassBTest.cpp.o CMakeFiles/vdmclib.dir/src/test/ClassCSV_Tests.cpp.o CMakeFiles/vdmclib.dir/src/test/ClassCTest.cpp.o CMakeFiles/vdmclib.dir/src/test/ClassIO_Tests.cpp.o CMakeFiles/vdmclib.dir/src/test/ClassPrivateCallABC_Tests.cpp.o CMakeFiles/vdmclib.dir/src/test/ClassPrivateFieldABC_Tests.cpp.o CMakeFiles/vdmclib.dir/src/test/ClassPublicCallABC_Tests.cpp.o CMakeFiles/vdmclib.dir/src/test/ClassPublicFieldABC_Tests.cpp.o CMakeFiles/vdmclib.dir/src/test/ExpressionForLoop.cpp.o CMakeFiles/vdmclib.dir/src/test/ExpressionsBoolean_Tests.cpp.o CMakeFiles/vdmclib.dir/src/test/ExpressionsMap_Tests.cpp.o CMakeFiles/vdmclib.dir/src/test/ExpressionsNumeric_Tests.cpp.o CMakeFiles/vdmclib.dir/src/test/ExpressionsProduct_Tests.cpp.o CMakeFiles/vdmclib.dir/src/test/ExpressionsSeq_Tests.cpp.o CMakeFiles/vdmclib.dir/src/test/ExpressionsSetRandom_Tests.cpp.o CMakeFiles/vdmclib.dir/src/test/ExpressionsSet_Tests.cpp.o CMakeFiles/vdmclib.dir/src/test/Expressions_Tests.cpp.o CMakeFiles/vdmclib.dir/src/test/GC_Tests.cpp.o CMakeFiles/vdmclib.dir/src/test/PrettyPrint_Tests.cpp.o CMakeFiles/vdmclib.dir/src/test/Statements_Record_Tests.cpp.o CMakeFiles/vdmclib.dir/src/test/StructOffsetTest_Tests.cpp.o CMakeFiles/vdmclib.dir/src/test/TokenType_Tests.cpp.o CMakeFiles/vdmclib.dir/src/test/TypeofTest_Tests.cpp.o  -o target/vdmclib -rdynamic ../third_party/googletest/googletest/libgtest_main.a ../third_party/googletest/googletest/libgtest.a -lpthread 
     [exec] make[2]: Leaving directory '/var/lib/jenkins/workspace/ch-pipeline_vpb_development-KCTLYUE5TMW7Z33VLFXIW7KHT6FIH4V5AIJQWV52XR2IIKDPQP2Q/c'
     [exec] [100%] Built target vdmclib
     [exec] make[1]: Leaving directory '/var/lib/jenkins/workspace/ch-pipeline_vpb_development-KCTLYUE5TMW7Z33VLFXIW7KHT6FIH4V5AIJQWV52XR2IIKDPQP2Q/c'
     [exec] /usr/bin/cmake -E cmake_progress_start /var/lib/jenkins/workspace/ch-pipeline_vpb_development-KCTLYUE5TMW7Z33VLFXIW7KHT6FIH4V5AIJQWV52XR2IIKDPQP2Q/c/CMakeFiles 0
     [exec] Running tests...
     [exec] /usr/bin/ctest --force-new-ctest-process 
     [exec] Test project /var/lib/jenkins/workspace/ch-pipeline_vpb_development-KCTLYUE5TMW7Z33VLFXIW7KHT6FIH4V5AIJQWV52XR2IIKDPQP2Q/c/vdmclib
     [exec]     Start 1: vdmclib-tests
     [exec] Errors while running CTest
     [exec] make: *** [test] Error 8
     [exec] 1/1 Test #1: vdmclib-tests ....................***Failed    0.20 sec
     [exec] 
     [exec] 0% tests passed, 1 tests failed out of 1
     [exec] 
     [exec] Total Test time (real) =   0.21 sec
     [exec] 
     [exec] The following tests FAILED:
     [exec] 	  1 - vdmclib-tests (Failed)
     [exec] Makefile:130: recipe for target 'test' failed
[INFO] ------------------------------------------------------------------------
[INFO] Reactor Summary:
[INFO] 
[INFO] Overture VDM 2 C Translator Root ................... SUCCESS [  0.718 s]
[INFO] C native root vdm2c ................................ SUCCESS [  3.050 s]
[INFO] The C Code Generator VDM library sources ........... FAILURE [  8.496 s]
[INFO] Core Tools for vdm2c ............................... SKIPPED
[INFO] The C Code Generator ............................... SKIPPED
[INFO] Overture FMI IDE Top-level ......................... SKIPPED
[INFO] The C Code Generator Plugin ........................ SKIPPED
[INFO] Overture IDE Eclipse VDM2C features ................ SKIPPED
[INFO] Overture IDE Eclipse C Code Generator feature ...... SKIPPED
[INFO] Overture IDE Eclipse repository .................... SKIPPED
[INFO] ------------------------------------------------------------------------
[INFO] BUILD FAILURE
[INFO] ------------------------------------------------------------------------
[INFO] Total time: 02:24 min
[INFO] Finished at: 2017-10-03T16:39:18+02:00
[INFO] Final Memory: 157M/812M
[INFO] ------------------------------------------------------------------------
[WARNING] The requested profile "force-download-externals" could not be activated because it does not exist.
[jenkins-maven-event-spy] INFO generated /var/lib/jenkins/workspace/ch-pipeline_vpb_development-KCTLYUE5TMW7Z33VLFXIW7KHT6FIH4V5AIJQWV52XR2IIKDPQP2Q@tmp/withMaven4697a710/maven-spy-20171003-163654-228.log
[ERROR] Failed to execute goal org.apache.maven.plugins:maven-antrun-plugin:1.7:run (copy-dependencies) on project vdmclib: An Ant BuildException has occured: exec returned: 2
[ERROR] around Ant part ...<exec failonerror="true" executable="make">... @ 7:46 in /var/lib/jenkins/workspace/ch-pipeline_vpb_development-KCTLYUE5TMW7Z33VLFXIW7KHT6FIH4V5AIJQWV52XR2IIKDPQP2Q/c/vdmclib/target/antrun/build-main.xml
[ERROR] -> [Help 1]
[ERROR] 
[ERROR] To see the full stack trace of the errors, re-run Maven with the -e switch.
[ERROR] Re-run Maven using the -X switch to enable full debug logging.
[ERROR] 
[ERROR] For more information about the errors and possible solutions, please read the following articles:
[ERROR] [Help 1] http://cwiki.apache.org/confluence/display/MAVEN/MojoExecutionException
[ERROR] 
[ERROR] After correcting the problems, you can resume the build with the command
[ERROR]   mvn <goals> -rf :vdmclib
[Pipeline] }
[withMaven] artifactsPublisher - Archive artifact pom.xml under org/overturetool/vdm2c/root/0.1.15-SNAPSHOT/root-0.1.15-SNAPSHOT.pom
[withMaven] artifactsPublisher - Archive artifact c/pom.xml under org/overturetool/vdm2c/c/0.1.15-SNAPSHOT/c-0.1.15-SNAPSHOT.pom
[withMaven] junitPublisher - Archive test results for Maven artifact org.overturetool.vdm2c.c:vdmclib:0.1.15-SNAPSHOT generated by maven-surefire-plugin:test (default-test): c/vdmclib/target/surefire-reports/*.xml
[withMaven] junitPublisher - Jenkins JUnit Attachments Plugin not found, can't publish test attachments.Recording test results
None of the test reports contained any result
[TASKS] Scanning folder '/var/lib/jenkins/workspace/ch-pipeline_vpb_development-KCTLYUE5TMW7Z33VLFXIW7KHT6FIH4V5AIJQWV52XR2IIKDPQP2Q' for files matching the pattern '**/*.java' - excludes: null
[TASKS] Found 148 files to scan for tasks
[TASKS] Found 23 open tasks.
Skipping warnings blame since pipelines do not have an SCM link.%n
[TASKS] Computing warning deltas based on reference build #41
[Pipeline] // withMaven
[Pipeline] }
[Pipeline] // stage
[Pipeline] stage
[Pipeline] { (Clean up workspace)
[Pipeline] cleanWs
[WS-CLEANUP] Deleting project workspace...[WS-CLEANUP] done
[Pipeline] }
[Pipeline] // stage
[Pipeline] stage
[Pipeline] { (Reporting)
[Pipeline] emailextrecipients
Not sending mail to user victor.bandur@eng.au.dk with no permission to view vdm2c-multibranch-pipeline » vpb/development #42[Pipeline] emailext
An attempt to send an e-mail to empty list of recipients, ignored.
[Pipeline] }
[Pipeline] // stage
[Pipeline] }
[Pipeline] // node
[Pipeline] End of Pipeline

GitHub has been notified of this commit’s build result

ERROR: script returned exit code 1
Finished: FAILURE