FailedConsole Output

Skipping 275 KB.. Full Log
lugins/ (91.88kB of 314.18kB at 20.83kB/s)
[INFO] Fetching org.eclipse.jface.text_3.11.2.v20170220-1911.jar.pack.gz from http://download.eclipse.org/releases/neon/201705151400/plugins/ (125.27kB of 314.18kB at 23.3kB/s)
[INFO] Fetching org.eclipse.jface.text_3.11.2.v20170220-1911.jar.pack.gz from http://download.eclipse.org/releases/neon/201705151400/plugins/ (162.69kB of 314.18kB at 28kB/s)
[INFO] Fetching org.eclipse.jface.text_3.11.2.v20170220-1911.jar.pack.gz from http://download.eclipse.org/releases/neon/201705151400/plugins/ (224.14kB of 314.18kB at 32.33kB/s)
[INFO] Fetching org.eclipse.jface.text_3.11.2.v20170220-1911.jar.pack.gz from http://download.eclipse.org/releases/neon/201705151400/plugins/ (288.26kB of 314.18kB at 39.01kB/s)
[INFO] Fetching org.eclipse.ui.ide_3.12.3.v20170119-0935.jar.pack.gz from http://ftp-stud.fht-esslingen.de/pub/Mirrors/eclipse/releases/neon/201705151400/plugins/ (0B of 793.87kB at 0B/s)
[INFO] Fetching org.eclipse.ui.views_3.8.102.v20170111-0801.jar.pack.gz from http://ftp-stud.fht-esslingen.de/pub/Mirrors/eclipse/releases/neon/201705151400/plugins/ (0B of 48.08kB at 0B/s)
[INFO] Fetching org.eclipse.ui.workbench.texteditor_3.10.1.v20160818-1626.jar.pack.gz from http://ftp-stud.fht-esslingen.de/pub/Mirrors/eclipse/releases/neon/201705151400/plugins/ (0B of 228.35kB at 0B/s)
[INFO] Fetching org.eclipse.core.runtime_3.12.0.v20160606-1342.jar.pack.gz from http://mirror.dkm.cz/eclipse/releases/neon/201705151400/plugins/ (0B of 35.25kB at 0B/s)
[INFO] Fetching org.eclipse.core.expressions_3.5.100.v20160418-1621.jar.pack.gz from http://ftp-stud.fht-esslingen.de/pub/Mirrors/eclipse/releases/neon/201705151400/plugins/ (0B of 32.83kB at 0B/s)
[INFO] Fetching org.eclipse.ui.editors_3.10.1.v20161106-1856.jar.pack.gz from http://ftp-stud.fht-esslingen.de/pub/Mirrors/eclipse/releases/neon/201705151400/plugins/ (0B of 178.45kB at 0B/s)
[INFO] Fetching org.eclipse.ui.forms_3.7.1.v20161220-1635.jar.pack.gz from http://mirror.dkm.cz/eclipse/releases/neon/201705151400/plugins/ (0B of 125.61kB at 0B/s)
[INFO] Fetching org.eclipse.compare.core_3.6.0.v20160418-1534.jar.pack.gz from http://ftp-stud.fht-esslingen.de/pub/Mirrors/eclipse/releases/neon/201705151400/plugins/ (0B of 32.24kB at 0B/s)
[INFO] Fetching com.ibm.icu_56.1.0.v201601250100.jar.pack.gz from http://ftp-stud.fht-esslingen.de/pub/Mirrors/eclipse/releases/neon/201705151400/plugins/ (0B of 8.22MB at 0B/s)
[INFO] Fetching org.eclipse.compare_3.7.1.v20170103-1805.jar.pack.gz from http://mirror.dkm.cz/eclipse/releases/neon/201705151400/plugins/ (0B of 251.65kB at 0B/s)
[INFO] Fetching org.eclipse.equinox.common_3.8.0.v20160509-1230.jar.pack.gz from http://mirror.dkm.cz/eclipse/releases/neon/201705151400/plugins/ (0B of 51.37kB at 0B/s)
[INFO] Fetching org.eclipse.core.commands_3.8.1.v20161221-1651.jar.pack.gz from http://ftp-stud.fht-esslingen.de/pub/Mirrors/eclipse/releases/neon/201705151400/plugins/ (0B of 43.13kB at 0B/s)
[INFO] Fetching org.eclipse.core.contenttype_3.5.100.v20160418-1621.jar.pack.gz from http://mirror.onet.pl/pub/mirrors/eclipse//releases/neon/201705151400/plugins/ (0B of 39.58kB at 0B/s)
[INFO] Fetching org.eclipse.equinox.preferences_3.6.1.v20160815-1406.jar.pack.gz from http://ftp-stud.fht-esslingen.de/pub/Mirrors/eclipse/releases/neon/201705151400/plugins/ (0B of 53.94kB at 0B/s)
[INFO] Fetching org.eclipse.equinox.registry_3.6.100.v20160223-2218.jar.pack.gz from http://ftp-stud.fht-esslingen.de/pub/Mirrors/eclipse/releases/neon/201705151400/plugins/ (0B of 71.51kB at 0B/s)
[INFO] Fetching org.eclipse.core.databinding_1.6.0.v20160412-0910.jar.pack.gz from http://mirror.dkm.cz/eclipse/releases/neon/201705151400/plugins/ (0B of 57.81kB at 0B/s)
[INFO] Fetching org.eclipse.core.databinding.observable_1.6.0.v20160511-1747.jar.pack.gz from http://download.eclipse.org/releases/neon/201705151400/plugins/ (0B of 90.47kB at 0B/s)
[INFO] Fetching org.eclipse.core.databinding.property_1.6.0.v20160427-0852.jar.pack.gz from http://ftp-stud.fht-esslingen.de/pub/Mirrors/eclipse/releases/neon/201705151400/plugins/ (0B of 49.78kB at 0B/s)
[INFO] Fetching org.eclipse.core.filebuffers_3.6.0.v20160503-1849.jar.pack.gz from http://ftp-stud.fht-esslingen.de/pub/Mirrors/eclipse/releases/neon/201705151400/plugins/ (0B of 42.91kB at 0B/s)
[INFO] Fetching org.eclipse.text_3.6.0.v20160503-1849.jar.pack.gz from http://download.eclipse.org/releases/neon/201705151400/plugins/ (0B of 91.22kB at 0B/s)
[INFO] Fetching org.eclipse.text_3.6.0.v20160503-1849.jar.pack.gz from http://download.eclipse.org/releases/neon/201705151400/plugins/ (42.45kB of 91.22kB at 39.78kB/s)
[INFO] Fetching org.eclipse.text_3.6.0.v20160503-1849.jar.pack.gz from http://download.eclipse.org/releases/neon/201705151400/plugins/ (65.16kB of 91.22kB at 27.24kB/s)
[INFO] Fetching org.eclipse.core.filesystem_1.6.1.v20161113-2349.jar.pack.gz from http://ftp-stud.fht-esslingen.de/pub/Mirrors/eclipse/releases/neon/201705151400/plugins/ (0B of 27.54kB at 0B/s)
[INFO] Fetching org.eclipse.core.jobs_3.8.0.v20160509-0411.jar.pack.gz from http://ftp-stud.fht-esslingen.de/pub/Mirrors/eclipse/releases/neon/201705151400/plugins/ (0B of 46.37kB at 0B/s)
[INFO] Fetching org.eclipse.equinox.app_1.3.400.v20150715-1528.jar.pack.gz from http://mirror.dkm.cz/eclipse/releases/neon/201705151400/plugins/ (0B of 40.76kB at 0B/s)
[INFO] Fetching org.eclipse.core.variables_3.3.0.v20160419-1720.jar.pack.gz from http://mirror.dkm.cz/eclipse/releases/neon/201705151400/plugins/ (0B of 17.99kB at 0B/s)
[INFO] Fetching org.eclipse.debug.core_3.10.100.v20160419-1720.jar.pack.gz from http://mirror.dkm.cz/eclipse/releases/neon/201705151400/plugins/ (0B of 115.16kB at 0B/s)
[INFO] Fetching org.eclipse.ui.console_3.6.201.v20161107-0337.jar.pack.gz from http://ftp-stud.fht-esslingen.de/pub/Mirrors/eclipse/releases/neon/201705151400/plugins/ (0B of 84.38kB at 0B/s)
[INFO] Fetching org.eclipse.help_3.7.0.v20160602-1307.jar.pack.gz from http://ftp-stud.fht-esslingen.de/pub/Mirrors/eclipse/releases/neon/201705151400/plugins/ (0B of 122.2kB at 0B/s)
[INFO] Fetching org.eclipse.debug.ui_3.11.202.v20161114-0338.jar.pack.gz from http://ftp-stud.fht-esslingen.de/pub/Mirrors/eclipse/releases/neon/201705151400/plugins/ (0B of 1MB at 0B/s)
[INFO] Fetching org.eclipse.e4.core.commands_0.11.100.v20160506-0804.jar.pack.gz from http://download.eclipse.org/releases/neon/201705151400/plugins/ (0B of 13.72kB at 0B/s)
[INFO] Fetching org.eclipse.e4.core.di_1.6.1.v20160712-0927.jar.pack.gz from http://ftp-stud.fht-esslingen.de/pub/Mirrors/eclipse/releases/neon/201705151400/plugins/ (0B of 26.23kB at 0B/s)
[INFO] Fetching javax.inject_1.0.0.v20091030.jar from http://ftp-stud.fht-esslingen.de/pub/Mirrors/eclipse/releases/neon/201705151400/plugins/ (0B of 16.6kB at 0B/s)
[INFO] Fetching org.eclipse.e4.core.contexts_1.5.1.v20170203-1100.jar.pack.gz from http://ftp-stud.fht-esslingen.de/pub/Mirrors/eclipse/releases/neon/201705151400/plugins/ (0B of 22.44kB at 0B/s)
[INFO] Fetching org.eclipse.e4.core.services_2.0.100.v20160509-1032.jar.pack.gz from http://mirror.dkm.cz/eclipse/releases/neon/201705151400/plugins/ (0B of 23.39kB at 0B/s)
[INFO] Fetching org.eclipse.e4.core.di.annotations_1.5.0.v20151127-1241.jar.pack.gz from http://mirror.dkm.cz/eclipse/releases/neon/201705151400/plugins/ (0B of 7.59kB at 0B/s)
[INFO] Fetching org.eclipse.e4.core.di.extensions_0.14.0.v20160211-1614.jar.pack.gz from http://download.eclipse.org/releases/neon/201705151400/plugins/ (0B of 13.88kB at 0B/s)
[INFO] Fetching org.eclipse.e4.emf.xpath_0.1.200.v20160506-0804.jar.pack.gz from http://mirror.dkm.cz/eclipse/releases/neon/201705151400/plugins/ (0B of 21.67kB at 0B/s)
[INFO] Fetching org.apache.commons.jxpath_1.3.0.v200911051830.jar.pack.gz from http://mirror.onet.pl/pub/mirrors/eclipse//releases/neon/201705151400/plugins/ (0B of 98kB at 0B/s)
[INFO] Fetching org.eclipse.emf.ecore_2.12.0.v20160420-0247.jar.pack.gz from http://ftp-stud.fht-esslingen.de/pub/Mirrors/eclipse/releases/neon/201705151400/plugins/ (0B of 366.46kB at 0B/s)
[INFO] Fetching org.eclipse.e4.ui.bindings_0.11.100.v20160509-1025.jar.pack.gz from http://mirror.onet.pl/pub/mirrors/eclipse//releases/neon/201705151400/plugins/ (0B of 24.02kB at 0B/s)
[INFO] Fetching org.eclipse.swt_3.105.3.v20170228-0512.jar.pack.gz from http://mirror.onet.pl/pub/mirrors/eclipse//releases/neon/201705151400/plugins/ (0B of 18.2kB at 0B/s)
[INFO] Fetching org.eclipse.jface_3.12.2.v20170113-2113.jar.pack.gz from http://ftp-stud.fht-esslingen.de/pub/Mirrors/eclipse/releases/neon/201705151400/plugins/ (0B of 344.64kB at 0B/s)
[INFO] Fetching org.eclipse.e4.ui.css.core_0.12.1.v20161114-0210.jar.pack.gz from http://ftp-stud.fht-esslingen.de/pub/Mirrors/eclipse/releases/neon/201705151400/plugins/ (0B of 65.01kB at 0B/s)
[INFO] Fetching org.eclipse.e4.ui.css.swt_0.12.100.v20160517-1505.jar.pack.gz from http://ftp-stud.fht-esslingen.de/pub/Mirrors/eclipse/releases/neon/201705151400/plugins/ (0B of 80.01kB at 0B/s)
[INFO] Fetching org.eclipse.e4.ui.css.swt.theme_0.10.100.v20160523-0836.jar.pack.gz from http://ftp-stud.fht-esslingen.de/pub/Mirrors/eclipse/releases/neon/201705151400/plugins/ (0B of 16.11kB at 0B/s)
[INFO] Fetching org.eclipse.e4.ui.di_1.1.100.v20160506-0759.jar.pack.gz from http://mirror.dkm.cz/eclipse/releases/neon/201705151400/plugins/ (0B of 9.57kB at 0B/s)
[INFO] Fetching org.eclipse.e4.ui.model.workbench_1.2.0.v20160229-1459.jar.pack.gz from http://mirror.dkm.cz/eclipse/releases/neon/201705151400/plugins/ (0B of 106.56kB at 0B/s)
[INFO] Fetching org.eclipse.e4.ui.services_1.2.100.v20160506-0759.jar.pack.gz from http://mirror.tspu.ru/eclipse/releases/neon/201705151400/plugins/ (0B of 14.13kB at 0B/s)
[INFO] Fetching org.eclipse.e4.ui.widgets_1.1.100.v20160506-0759.jar.pack.gz from http://mirror.onet.pl/pub/mirrors/eclipse//releases/neon/201705151400/plugins/ (0B of 9.84kB at 0B/s)
[INFO] Fetching org.eclipse.e4.ui.workbench_1.4.0.v20160517-1624.jar.pack.gz from http://mirror.dkm.cz/eclipse/releases/neon/201705151400/plugins/ (0B of 81.91kB at 0B/s)
[INFO] Fetching org.eclipse.emf.ecore.change_2.11.0.v20160420-0247.jar.pack.gz from http://mirror.dkm.cz/eclipse/releases/neon/201705151400/plugins/ (0B of 36.05kB at 0B/s)
[INFO] Fetching org.eclipse.emf.ecore.xmi_2.12.0.v20160420-0247.jar.pack.gz from http://mirror.dkm.cz/eclipse/releases/neon/201705151400/plugins/ (0B of 80.33kB at 0B/s)
[INFO] Fetching org.eclipse.e4.ui.workbench.renderers.swt_0.14.1.v20170117-1415.jar.pack.gz from http://ftp-stud.fht-esslingen.de/pub/Mirrors/eclipse/releases/neon/201705151400/plugins/ (0B of 98.24kB at 0B/s)
[INFO] Fetching org.eclipse.e4.ui.workbench.swt_0.14.1.v20160829-0832.jar.pack.gz from http://mirror.dkm.cz/eclipse/releases/neon/201705151400/plugins/ (0B of 72.42kB at 0B/s)
[INFO] Fetching org.eclipse.e4.ui.workbench.addons.swt_1.2.101.v20170206-1129.jar.pack.gz from http://ftp-stud.fht-esslingen.de/pub/Mirrors/eclipse/releases/neon/201705151400/plugins/ (0B of 54.05kB at 0B/s)
[INFO] Fetching org.eclipse.equinox.ds_1.4.400.v20160226-2036.jar.pack.gz from http://mirror.dkm.cz/eclipse/releases/neon/201705151400/plugins/ (0B of 89.5kB at 0B/s)
[INFO] Fetching org.eclipse.jface.databinding_1.8.1.v20161026-1531.jar.pack.gz from http://ftp-stud.fht-esslingen.de/pub/Mirrors/eclipse/releases/neon/201705151400/plugins/ (0B of 70.71kB at 0B/s)
[INFO] Fetching org.eclipse.e4.ui.workbench3_0.13.100.v20160506-0759.jar.pack.gz from http://mirror.dkm.cz/eclipse/releases/neon/201705151400/plugins/ (0B of 7.92kB at 0B/s)
[INFO] Fetching org.eclipse.emf.common_2.12.0.v20160420-0247.jar.pack.gz from http://mirror.tspu.ru/eclipse/releases/neon/201705151400/plugins/ (0B of 104.54kB at 0B/s)
[INFO] Fetching org.eclipse.equinox.bidi_1.0.0.v20160307-1318.jar.pack.gz from http://mirror.onet.pl/pub/mirrors/eclipse//releases/neon/201705151400/plugins/ (0B of 23.14kB at 0B/s)
[INFO] Fetching org.eclipse.equinox.util_1.0.500.v20130404-1337.jar.pack.gz from http://ftp-stud.fht-esslingen.de/pub/Mirrors/eclipse/releases/neon/201705151400/plugins/ (0B of 30.41kB at 0B/s)
[INFO] Fetching org.eclipse.equinox.p2.core_2.4.100.v20160419-0834.jar.pack.gz from http://ftp-stud.fht-esslingen.de/pub/Mirrors/eclipse/releases/neon/201705151400/plugins/ (0B of 29.98kB at 0B/s)
[INFO] Fetching org.eclipse.equinox.p2.engine_2.4.100.v20160419-0834.jar.pack.gz from http://ftp-stud.fht-esslingen.de/pub/Mirrors/eclipse/releases/neon/201705151400/plugins/ (0B of 71.28kB at 0B/s)
[INFO] Fetching org.eclipse.equinox.p2.metadata_2.3.100.v20160427-2220.jar.pack.gz from http://mirror.dkm.cz/eclipse/releases/neon/201705151400/plugins/ (0B of 101.77kB at 0B/s)
[INFO] Fetching org.eclipse.equinox.p2.metadata.repository_1.2.300.v20160419-0834.jar.pack.gz from http://mirror.tspu.ru/eclipse/releases/neon/201705151400/plugins/ (0B of 47.43kB at 0B/s)
[INFO] Fetching org.eclipse.equinox.p2.repository_2.3.200.v20160421-0324.jar.pack.gz from http://mirror.dkm.cz/eclipse/releases/neon/201705151400/plugins/ (0B of 52.26kB at 0B/s)
[INFO] Fetching org.tukaani.xz_1.3.0.v201308270617.jar.pack.gz from http://ftp-stud.fht-esslingen.de/pub/Mirrors/eclipse/releases/neon/201705151400/plugins/ (0B of 36.04kB at 0B/s)
[INFO] Fetching org.eclipse.equinox.security_1.2.200.v20150715-1528.jar.pack.gz from http://ftp-stud.fht-esslingen.de/pub/Mirrors/eclipse/releases/neon/201705151400/plugins/ (0B of 42.22kB at 0B/s)
[INFO] Fetching org.eclipse.ltk.core.refactoring_3.7.0.v20160419-0705.jar.pack.gz from http://ftp-stud.fht-esslingen.de/pub/Mirrors/eclipse/releases/neon/201705151400/plugins/ (0B of 105.61kB at 0B/s)
[INFO] Fetching org.eclipse.ltk.ui.refactoring_3.8.0.v20160518-1817.jar.pack.gz from http://mirror.dkm.cz/eclipse/releases/neon/201705151400/plugins/ (0B of 176.66kB at 0B/s)
[INFO] Fetching org.eclipse.ui.navigator_3.6.101.v20161006-1120.jar.pack.gz from http://mirror.dkm.cz/eclipse/releases/neon/201705151400/plugins/ (0B of 131.55kB at 0B/s)
[INFO] Fetching org.eclipse.team.core_3.8.0.v20160418-1534.jar.pack.gz from http://mirror.dkm.cz/eclipse/releases/neon/201705151400/plugins/ (0B of 127.51kB at 0B/s)
[INFO] Fetching org.eclipse.team.ui_3.8.0.v20160518-1906.jar.pack.gz from http://mirror.onet.pl/pub/mirrors/eclipse//releases/neon/201705151400/plugins/ (0B of 431.71kB at 0B/s)
[INFO] Fetching org.eclipse.swt.win32.win32.x86_3.105.3.v20170228-0512.jar.pack.gz from http://ftp-stud.fht-esslingen.de/pub/Mirrors/eclipse/releases/neon/201705151400/plugins/ (0B of 1.18MB at 0B/s)
[INFO] Fetching org.eclipse.ui.workbench_3.108.3.v20170216-1539.jar.pack.gz from http://ftp-stud.fht-esslingen.de/pub/Mirrors/eclipse/releases/neon/201705151400/plugins/ (0B of 1.03MB at 0B/s)
[INFO] Fetching org.eclipse.ui.views.properties.tabbed_3.7.0.v20160310-0903.jar.pack.gz from http://ftp-stud.fht-esslingen.de/pub/Mirrors/eclipse/releases/neon/201705151400/plugins/ (0B of 39.29kB at 0B/s)
[INFO] Fetching org.eclipse.ui.navigator.resources_3.5.101.v20161006-0640.jar.pack.gz from http://ftp-stud.fht-esslingen.de/pub/Mirrors/eclipse/releases/neon/201705151400/plugins/ (0B of 62.91kB at 0B/s)
[INFO] Fetching org.overture.ide.builders.vdmj_2.5.3.201709121241.jar from http://dl.bintray.com/overturetool/overturetool-development/plugins/ (0B of 406.51kB at 0B/s)
[INFO] Fetching org.overture.ide.core_2.5.3.201709121241.jar from http://dl.bintray.com/overturetool/overturetool-development/plugins/ (0B of 1.44MB at 0B/s)
[INFO] Fetching org.overture.ide.debug_2.5.3.201709121241.jar from http://dl.bintray.com/overturetool/overturetool-development/plugins/ (0B of 1.44MB at 0B/s)
[INFO] Fetching org.overture.ide.ui_2.5.3.201709121241.jar from http://dl.bintray.com/overturetool/overturetool-development/plugins/ (0B of 689.86kB at 0B/s)
[INFO] Fetching 201703141400&countryCode=gb&timeZone=1&format=xml from http://www.eclipse.org/downloads/download.php?format=xml&file=/releases/neon/ (0B at 0B/s)
[INFO] Fetching org.slf4j.api_1.7.10.v20160921-1923.jar from http://download.eclipse.org/releases/neon/201703141400/plugins/ (0B of 42.56kB at 0B/s)
[INFO] Fetching org.w3c.dom.smil_1.0.1.v200903091627.jar.pack.gz from http://ftp-stud.fht-esslingen.de/pub/Mirrors/eclipse/releases/neon/201705151400/plugins/ (0B of 14.95kB at 0B/s)
[INFO] Fetching org.eclipse.swt.win32.win32.x86_64_3.105.3.v20170228-0512.jar.pack.gz from http://ftp-stud.fht-esslingen.de/pub/Mirrors/eclipse/releases/neon/201705151400/plugins/ (0B of 1.17MB at 0B/s)
[INFO] Fetching org.eclipse.swt.gtk.linux.x86_3.105.3.v20170228-0512.jar.pack.gz from http://mirror.dkm.cz/eclipse/releases/neon/201705151400/plugins/ (0B of 1.14MB at 0B/s)
[INFO] Fetching org.eclipse.swt.gtk.linux.x86_64_3.105.3.v20170228-0512.jar.pack.gz from http://mirror.tspu.ru/eclipse/releases/neon/201705151400/plugins/ (0B of 1.28MB at 0B/s)
[INFO] Fetching org.eclipse.swt.cocoa.macosx.x86_64_3.105.3.v20170228-0512.jar.pack.gz from http://ftp-stud.fht-esslingen.de/pub/Mirrors/eclipse/releases/neon/201705151400/plugins/ (0B of 961.03kB at 0B/s)
[INFO] Resolving class path of MavenProject: org.overturetool.vdm2c.ide:org.overturetool.vdm2c.ide.cgen:0.1.15-SNAPSHOT @ /var/lib/jenkins/workspace/ch-pipeline_vpb_development-KCTLYUE5TMW7Z33VLFXIW7KHT6FIH4V5AIJQWV52XR2IIKDPQP2Q/ide/cgen/pom.xml
[INFO] Computing target platform for MavenProject: org.overturetool.vdm2c.ide.features:org.overturetool.vdm2c.ide.features.cgen:0.1.15-SNAPSHOT @ /var/lib/jenkins/workspace/ch-pipeline_vpb_development-KCTLYUE5TMW7Z33VLFXIW7KHT6FIH4V5AIJQWV52XR2IIKDPQP2Q/ide/features/cgen/pom.xml
[INFO] Resolving dependencies of MavenProject: org.overturetool.vdm2c.ide.features:org.overturetool.vdm2c.ide.features.cgen:0.1.15-SNAPSHOT @ /var/lib/jenkins/workspace/ch-pipeline_vpb_development-KCTLYUE5TMW7Z33VLFXIW7KHT6FIH4V5AIJQWV52XR2IIKDPQP2Q/ide/features/cgen/pom.xml
[INFO] Resolving class path of MavenProject: org.overturetool.vdm2c.ide.features:org.overturetool.vdm2c.ide.features.cgen:0.1.15-SNAPSHOT @ /var/lib/jenkins/workspace/ch-pipeline_vpb_development-KCTLYUE5TMW7Z33VLFXIW7KHT6FIH4V5AIJQWV52XR2IIKDPQP2Q/ide/features/cgen/pom.xml
[INFO] Computing target platform for MavenProject: org.overturetool.vdm2c.ide:org.overturetool.vdm2c.ide.repository:0.1.15-SNAPSHOT @ /var/lib/jenkins/workspace/ch-pipeline_vpb_development-KCTLYUE5TMW7Z33VLFXIW7KHT6FIH4V5AIJQWV52XR2IIKDPQP2Q/ide/repository/pom.xml
[INFO] Resolving dependencies of MavenProject: org.overturetool.vdm2c.ide:org.overturetool.vdm2c.ide.repository:0.1.15-SNAPSHOT @ /var/lib/jenkins/workspace/ch-pipeline_vpb_development-KCTLYUE5TMW7Z33VLFXIW7KHT6FIH4V5AIJQWV52XR2IIKDPQP2Q/ide/repository/pom.xml
[INFO] Resolving class path of MavenProject: org.overturetool.vdm2c.ide:org.overturetool.vdm2c.ide.repository:0.1.15-SNAPSHOT @ /var/lib/jenkins/workspace/ch-pipeline_vpb_development-KCTLYUE5TMW7Z33VLFXIW7KHT6FIH4V5AIJQWV52XR2IIKDPQP2Q/ide/repository/pom.xml
[INFO] ------------------------------------------------------------------------
[INFO] Reactor Build Order:
[INFO] 
[INFO] Overture VDM 2 C Translator Root
[INFO] C native root vdm2c
[INFO] The C Code Generator VDM library sources
[INFO] Core Tools for vdm2c
[INFO] The C Code Generator
[INFO] Overture FMI IDE Top-level
[INFO] The C Code Generator Plugin
[INFO] Overture IDE Eclipse VDM2C features
[INFO] Overture IDE Eclipse C Code Generator feature
[INFO] Overture IDE Eclipse repository
[INFO]                                                                         
[INFO] ------------------------------------------------------------------------
[INFO] Building Overture VDM 2 C Translator Root 0.1.15-SNAPSHOT
[INFO] ------------------------------------------------------------------------
[INFO] 
[INFO] --- maven-enforcer-plugin:1.0:enforce (enforce-maven) @ root ---
[INFO] 
[INFO] --- jacoco-maven-plugin:0.7.6.201602180812:prepare-agent (jacoco-initialize) @ root ---
[INFO] argLine set to -javaagent:/var/lib/jenkins/workspace/ch-pipeline_vpb_development-KCTLYUE5TMW7Z33VLFXIW7KHT6FIH4V5AIJQWV52XR2IIKDPQP2Q/.repository/org/jacoco/org.jacoco.agent/0.7.6.201602180812/org.jacoco.agent-0.7.6.201602180812-runtime.jar=destfile=/var/lib/jenkins/workspace/ch-pipeline_vpb_development-KCTLYUE5TMW7Z33VLFXIW7KHT6FIH4V5AIJQWV52XR2IIKDPQP2Q/target/coverage-reports/jacoco-unit.exec,excludes=org/overture/cgc/extast/analysis/**/*.*:org/overture/codegen/vdm2c/extast/expressions/**/*:org/overture/codegen/vdm2c/extast/declarations/**/*:org/overture/codegen/vdm2c/extast/statements/**/*:org/overture/cgc/extast/node/**/*:org/overture/codegen/vdm2c/ast/preview/**/*
[INFO] 
[INFO] --- jacoco-maven-plugin:0.7.6.201602180812:report (jacoco-site) @ root ---
[INFO] Skipping JaCoCo execution due to missing execution data file:/var/lib/jenkins/workspace/ch-pipeline_vpb_development-KCTLYUE5TMW7Z33VLFXIW7KHT6FIH4V5AIJQWV52XR2IIKDPQP2Q/target/coverage-reports/jacoco-unit.exec
[INFO] 
[INFO] --- maven-jarsigner-plugin:1.2:sign (sign) @ root ---
[INFO] Downloading: http://overture.au.dk/artifactory/remote-repos/org/codehaus/plexus/plexus-utils/1.5.15/plexus-utils-1.5.15.jar
[INFO] Downloaded: http://overture.au.dk/artifactory/remote-repos/org/codehaus/plexus/plexus-utils/1.5.15/plexus-utils-1.5.15.jar (223 KB at 7955.8 KB/sec)
[INFO] 0 archive(s) processed
[INFO] 
[INFO] --- maven-install-plugin:2.4:install (default-install) @ root ---
[INFO] Downloading: http://overture.au.dk/artifactory/remote-repos/org/codehaus/plexus/plexus-utils/3.0.5/plexus-utils-3.0.5.pom
[INFO] Downloaded: http://overture.au.dk/artifactory/remote-repos/org/codehaus/plexus/plexus-utils/3.0.5/plexus-utils-3.0.5.pom (3 KB at 144.3 KB/sec)
[INFO] Downloading: http://overture.au.dk/artifactory/remote-repos/org/codehaus/plexus/plexus-utils/3.0.5/plexus-utils-3.0.5.jar
[INFO] Downloaded: http://overture.au.dk/artifactory/remote-repos/org/codehaus/plexus/plexus-utils/3.0.5/plexus-utils-3.0.5.jar (226 KB at 14065.4 KB/sec)
[INFO] Installing /var/lib/jenkins/workspace/ch-pipeline_vpb_development-KCTLYUE5TMW7Z33VLFXIW7KHT6FIH4V5AIJQWV52XR2IIKDPQP2Q/pom.xml to /var/lib/jenkins/workspace/ch-pipeline_vpb_development-KCTLYUE5TMW7Z33VLFXIW7KHT6FIH4V5AIJQWV52XR2IIKDPQP2Q/.repository/org/overturetool/vdm2c/root/0.1.15-SNAPSHOT/root-0.1.15-SNAPSHOT.pom
[INFO]                                                                         
[INFO] ------------------------------------------------------------------------
[INFO] Building C native root vdm2c 0.1.15-SNAPSHOT
[INFO] ------------------------------------------------------------------------
[INFO] 
[INFO] --- maven-enforcer-plugin:1.0:enforce (enforce-maven) @ c ---
[INFO] 
[INFO] --- jacoco-maven-plugin:0.7.6.201602180812:prepare-agent (jacoco-initialize) @ c ---
[INFO] argLine set to -javaagent:/var/lib/jenkins/workspace/ch-pipeline_vpb_development-KCTLYUE5TMW7Z33VLFXIW7KHT6FIH4V5AIJQWV52XR2IIKDPQP2Q/.repository/org/jacoco/org.jacoco.agent/0.7.6.201602180812/org.jacoco.agent-0.7.6.201602180812-runtime.jar=destfile=/var/lib/jenkins/workspace/ch-pipeline_vpb_development-KCTLYUE5TMW7Z33VLFXIW7KHT6FIH4V5AIJQWV52XR2IIKDPQP2Q/c/target/coverage-reports/jacoco-unit.exec,excludes=org/overture/cgc/extast/analysis/**/*.*:org/overture/codegen/vdm2c/extast/expressions/**/*:org/overture/codegen/vdm2c/extast/declarations/**/*:org/overture/codegen/vdm2c/extast/statements/**/*:org/overture/cgc/extast/node/**/*:org/overture/codegen/vdm2c/ast/preview/**/*
[INFO] 
[INFO] --- maven-antrun-plugin:1.7:run (copy-dependencies) @ c ---
[INFO] Executing tasks

main:
     [exec] -- The C compiler identification is GNU 5.4.0
     [exec] -- The CXX compiler identification is GNU 5.4.0
     [exec] -- Check for working C compiler: /usr/bin/cc
     [exec] -- Check for working C compiler: /usr/bin/cc -- works
     [exec] -- Detecting C compiler ABI info
     [exec] -- Detecting C compiler ABI info - done
     [exec] -- Detecting C compile features
     [exec] -- Detecting C compile features - done
     [exec] -- Check for working CXX compiler: /usr/bin/c++
     [exec] -- Check for working CXX compiler: /usr/bin/c++ -- works
     [exec] -- Detecting CXX compiler ABI info
     [exec] -- Detecting CXX compiler ABI info - done
     [exec] -- Detecting CXX compile features
     [exec] -- Detecting CXX compile features - done
     [exec] -- Found PythonInterp: /usr/bin/python (found version "2.7.12") 
     [exec] -- Looking for pthread.h
     [exec] -- Looking for pthread.h - found
     [exec] -- Looking for pthread_create
     [exec] -- Looking for pthread_create - not found
     [exec] -- Looking for pthread_create in pthreads
     [exec] -- Looking for pthread_create in pthreads - not found
     [exec] -- Looking for pthread_create in pthread
     [exec] -- Looking for pthread_create in pthread - found
     [exec] -- Found Threads: TRUE  
     [exec] -- Configuring done
     [exec] -- Generating done
     [exec] -- Build files have been written to: /var/lib/jenkins/workspace/ch-pipeline_vpb_development-KCTLYUE5TMW7Z33VLFXIW7KHT6FIH4V5AIJQWV52XR2IIKDPQP2Q/c
[INFO] Executed tasks
[INFO] 
[INFO] --- jacoco-maven-plugin:0.7.6.201602180812:report (jacoco-site) @ c ---
[INFO] Skipping JaCoCo execution due to missing execution data file:/var/lib/jenkins/workspace/ch-pipeline_vpb_development-KCTLYUE5TMW7Z33VLFXIW7KHT6FIH4V5AIJQWV52XR2IIKDPQP2Q/c/target/coverage-reports/jacoco-unit.exec
[INFO] 
[INFO] --- maven-jarsigner-plugin:1.2:sign (sign) @ c ---
[INFO] 0 archive(s) processed
[INFO] 
[INFO] --- maven-install-plugin:2.4:install (default-install) @ c ---
[INFO] Installing /var/lib/jenkins/workspace/ch-pipeline_vpb_development-KCTLYUE5TMW7Z33VLFXIW7KHT6FIH4V5AIJQWV52XR2IIKDPQP2Q/c/pom.xml to /var/lib/jenkins/workspace/ch-pipeline_vpb_development-KCTLYUE5TMW7Z33VLFXIW7KHT6FIH4V5AIJQWV52XR2IIKDPQP2Q/.repository/org/overturetool/vdm2c/c/0.1.15-SNAPSHOT/c-0.1.15-SNAPSHOT.pom
[INFO]                                                                         
[INFO] ------------------------------------------------------------------------
[INFO] Building The C Code Generator VDM library sources 0.1.15-SNAPSHOT
[INFO] ------------------------------------------------------------------------
[INFO] Downloading: http://overture.au.dk/artifactory/remote-repos/org/apache/maven/plugins/maven-surefire-plugin/2.19/maven-surefire-plugin-2.19.pom
[INFO] Downloaded: http://overture.au.dk/artifactory/remote-repos/org/apache/maven/plugins/maven-surefire-plugin/2.19/maven-surefire-plugin-2.19.pom (6 KB at 339.5 KB/sec)
[INFO] Downloading: http://overture.au.dk/artifactory/remote-repos/org/apache/maven/surefire/surefire/2.19/surefire-2.19.pom
[INFO] Downloaded: http://overture.au.dk/artifactory/remote-repos/org/apache/maven/surefire/surefire/2.19/surefire-2.19.pom (18 KB at 1629.2 KB/sec)
[INFO] Downloading: http://overture.au.dk/artifactory/remote-repos/org/apache/maven/maven-parent/26/maven-parent-26.pom
[INFO] Downloaded: http://overture.au.dk/artifactory/remote-repos/org/apache/maven/maven-parent/26/maven-parent-26.pom (40 KB at 2842.6 KB/sec)
[INFO] Downloading: http://overture.au.dk/artifactory/remote-repos/org/apache/maven/plugins/maven-surefire-plugin/2.19/maven-surefire-plugin-2.19.jar
[INFO] Downloaded: http://overture.au.dk/artifactory/remote-repos/org/apache/maven/plugins/maven-surefire-plugin/2.19/maven-surefire-plugin-2.19.jar (38 KB at 3396.0 KB/sec)
[INFO] Downloading: http://overture.au.dk/artifactory/remote-repos/org/apache/maven/plugins/maven-jar-plugin/2.4/maven-jar-plugin-2.4.pom
[INFO] Downloaded: http://overture.au.dk/artifactory/remote-repos/org/apache/maven/plugins/maven-jar-plugin/2.4/maven-jar-plugin-2.4.pom (6 KB at 569.7 KB/sec)
[INFO] Downloading: http://overture.au.dk/artifactory/remote-repos/org/apache/maven/plugins/maven-jar-plugin/2.4/maven-jar-plugin-2.4.jar
[INFO] Downloaded: http://overture.au.dk/artifactory/remote-repos/org/apache/maven/plugins/maven-jar-plugin/2.4/maven-jar-plugin-2.4.jar (34 KB at 1661.2 KB/sec)
[INFO] 
[INFO] --- maven-enforcer-plugin:1.0:enforce (enforce-maven) @ vdmclib ---
[INFO] 
[INFO] --- jacoco-maven-plugin:0.7.6.201602180812:prepare-agent (jacoco-initialize) @ vdmclib ---
[INFO] argLine set to -javaagent:/var/lib/jenkins/workspace/ch-pipeline_vpb_development-KCTLYUE5TMW7Z33VLFXIW7KHT6FIH4V5AIJQWV52XR2IIKDPQP2Q/.repository/org/jacoco/org.jacoco.agent/0.7.6.201602180812/org.jacoco.agent-0.7.6.201602180812-runtime.jar=destfile=/var/lib/jenkins/workspace/ch-pipeline_vpb_development-KCTLYUE5TMW7Z33VLFXIW7KHT6FIH4V5AIJQWV52XR2IIKDPQP2Q/c/vdmclib/target/coverage-reports/jacoco-unit.exec,excludes=org/overture/cgc/extast/analysis/**/*.*:org/overture/codegen/vdm2c/extast/expressions/**/*:org/overture/codegen/vdm2c/extast/declarations/**/*:org/overture/codegen/vdm2c/extast/statements/**/*:org/overture/cgc/extast/node/**/*:org/overture/codegen/vdm2c/ast/preview/**/*
[INFO] 
[INFO] --- maven-resources-plugin:2.6:resources (default-resources) @ vdmclib ---
[INFO] Using 'UTF-8' encoding to copy filtered resources.
[INFO] Copying 75 resources to /var/lib/jenkins/workspace/ch-pipeline_vpb_development-KCTLYUE5TMW7Z33VLFXIW7KHT6FIH4V5AIJQWV52XR2IIKDPQP2Q/c/vdmclib/target/classes/src
[INFO] 
[INFO] --- maven-compiler-plugin:3.0:compile (default-compile) @ vdmclib ---
[INFO] No sources to compile
[INFO] 
[INFO] --- maven-resources-plugin:2.6:testResources (default-testResources) @ vdmclib ---
[INFO] Using 'UTF-8' encoding to copy filtered resources.
[INFO] Copying 2 resources
[INFO] 
[INFO] --- maven-compiler-plugin:3.0:testCompile (default-testCompile) @ vdmclib ---
[INFO] No sources to compile
[INFO] 
[INFO] --- maven-surefire-plugin:2.19:test (default-test) @ vdmclib ---
[INFO] Downloading: http://overture.au.dk/artifactory/remote-repos/org/apache/maven/surefire/maven-surefire-common/2.19/maven-surefire-common-2.19.pom
[INFO] Downloaded: http://overture.au.dk/artifactory/remote-repos/org/apache/maven/surefire/maven-surefire-common/2.19/maven-surefire-common-2.19.pom (8 KB at 511.1 KB/sec)
[INFO] Downloading: http://overture.au.dk/artifactory/remote-repos/org/apache/maven/plugin-tools/maven-plugin-annotations/3.3/maven-plugin-annotations-3.3.pom
[INFO] Downloaded: http://overture.au.dk/artifactory/remote-repos/org/apache/maven/plugin-tools/maven-plugin-annotations/3.3/maven-plugin-annotations-3.3.pom (2 KB at 132.6 KB/sec)
[INFO] Downloading: http://overture.au.dk/artifactory/remote-repos/org/apache/maven/plugin-tools/maven-plugin-tools/3.3/maven-plugin-tools-3.3.pom
[INFO] Downloaded: http://overture.au.dk/artifactory/remote-repos/org/apache/maven/plugin-tools/maven-plugin-tools/3.3/maven-plugin-tools-3.3.pom (13 KB at 823.4 KB/sec)
[INFO] Downloading: http://overture.au.dk/artifactory/remote-repos/org/apache/maven/maven-parent/24/maven-parent-24.pom
[INFO] Downloaded: http://overture.au.dk/artifactory/remote-repos/org/apache/maven/maven-parent/24/maven-parent-24.pom (37 KB at 3077.1 KB/sec)
[INFO] Downloading: http://overture.au.dk/artifactory/remote-repos/org/apache/apache/14/apache-14.pom
[INFO] Downloaded: http://overture.au.dk/artifactory/remote-repos/org/apache/apache/14/apache-14.pom (15 KB at 1604.1 KB/sec)
[INFO] Downloading: http://overture.au.dk/artifactory/remote-repos/org/apache/maven/surefire/surefire-api/2.19/surefire-api-2.19.pom
[INFO] Downloaded: http://overture.au.dk/artifactory/remote-repos/org/apache/maven/surefire/surefire-api/2.19/surefire-api-2.19.pom (4 KB at 148.9 KB/sec)
[INFO] Downloading: http://overture.au.dk/artifactory/remote-repos/org/apache/maven/surefire/surefire-booter/2.19/surefire-booter-2.19.pom
[INFO] Downloaded: http://overture.au.dk/artifactory/remote-repos/org/apache/maven/surefire/surefire-booter/2.19/surefire-booter-2.19.pom (4 KB at 310.6 KB/sec)
[INFO] Downloading: http://overture.au.dk/artifactory/remote-repos/junit/junit/4.12/junit-4.12.pom
[INFO] Downloaded: http://overture.au.dk/artifactory/remote-repos/junit/junit/4.12/junit-4.12.pom (24 KB at 2569.2 KB/sec)
[INFO] Downloading: http://overture.au.dk/artifactory/remote-repos/org/apache/maven/maven-toolchain/2.2.1/maven-toolchain-2.2.1.pom
[INFO] Downloaded: http://overture.au.dk/artifactory/remote-repos/org/apache/maven/maven-toolchain/2.2.1/maven-toolchain-2.2.1.pom (4 KB at 362.8 KB/sec)
[INFO] Downloading: http://overture.au.dk/artifactory/remote-repos/org/apache/maven/surefire/maven-surefire-common/2.19/maven-surefire-common-2.19.jar
[INFO] Downloading: http://overture.au.dk/artifactory/remote-repos/org/apache/maven/surefire/surefire-booter/2.19/surefire-booter-2.19.jar
[INFO] Downloading: http://overture.au.dk/artifactory/remote-repos/org/apache/maven/maven-plugin-descriptor/2.2.1/maven-plugin-descriptor-2.2.1.jar
[INFO] Downloading: http://overture.au.dk/artifactory/remote-repos/junit/junit/4.12/junit-4.12.jar
[INFO] Downloading: http://overture.au.dk/artifactory/remote-repos/org/apache/maven/maven-core/2.2.1/maven-core-2.2.1.jar
[INFO] Downloaded: http://overture.au.dk/artifactory/remote-repos/org/apache/maven/surefire/surefire-booter/2.19/surefire-booter-2.19.jar (44 KB at 2903.3 KB/sec)
[INFO] Downloading: http://overture.au.dk/artifactory/remote-repos/org/apache/maven/maven-plugin-parameter-documenter/2.2.1/maven-plugin-parameter-documenter-2.2.1.jar
[INFO] Downloaded: http://overture.au.dk/artifactory/remote-repos/org/apache/maven/maven-plugin-descriptor/2.2.1/maven-plugin-descriptor-2.2.1.jar (39 KB at 2397.8 KB/sec)
[INFO] Downloading: http://overture.au.dk/artifactory/remote-repos/org/slf4j/slf4j-jdk14/1.5.6/slf4j-jdk14-1.5.6.jar
[INFO] Downloaded: http://overture.au.dk/artifactory/remote-repos/org/apache/maven/surefire/maven-surefire-common/2.19/maven-surefire-common-2.19.jar (286 KB at 12987.3 KB/sec)
[INFO] Downloading: http://overture.au.dk/artifactory/remote-repos/org/slf4j/slf4j-api/1.5.6/slf4j-api-1.5.6.jar
[INFO] Downloaded: http://overture.au.dk/artifactory/remote-repos/org/slf4j/slf4j-jdk14/1.5.6/slf4j-jdk14-1.5.6.jar (9 KB at 331.1 KB/sec)
[INFO] Downloading: http://overture.au.dk/artifactory/remote-repos/org/slf4j/jcl-over-slf4j/1.5.6/jcl-over-slf4j-1.5.6.jar
[INFO] Downloaded: http://overture.au.dk/artifactory/remote-repos/org/apache/maven/maven-plugin-parameter-documenter/2.2.1/maven-plugin-parameter-documenter-2.2.1.jar (22 KB at 833.5 KB/sec)
[INFO] Downloading: http://overture.au.dk/artifactory/remote-repos/org/apache/maven/reporting/maven-reporting-api/3.0/maven-reporting-api-3.0.jar
[INFO] Downloaded: http://overture.au.dk/artifactory/remote-repos/junit/junit/4.12/junit-4.12.jar (308 KB at 9319.7 KB/sec)
[INFO] Downloading: http://overture.au.dk/artifactory/remote-repos/org/apache/maven/maven-error-diagnostics/2.2.1/maven-error-diagnostics-2.2.1.jar
[INFO] Downloaded: http://overture.au.dk/artifactory/remote-repos/org/apache/maven/maven-core/2.2.1/maven-core-2.2.1.jar (174 KB at 4963.4 KB/sec)
[INFO] Downloading: http://overture.au.dk/artifactory/remote-repos/org/apache/maven/maven-monitor/2.2.1/maven-monitor-2.2.1.jar
[INFO] Downloaded: http://overture.au.dk/artifactory/remote-repos/org/slf4j/slf4j-api/1.5.6/slf4j-api-1.5.6.jar (22 KB at 641.6 KB/sec)
[INFO] Downloading: http://overture.au.dk/artifactory/remote-repos/org/sonatype/plexus/plexus-cipher/1.4/plexus-cipher-1.4.jar
[INFO] Downloaded: http://overture.au.dk/artifactory/remote-repos/org/slf4j/jcl-over-slf4j/1.5.6/jcl-over-slf4j-1.5.6.jar (17 KB at 429.7 KB/sec)
[INFO] Downloading: http://overture.au.dk/artifactory/remote-repos/org/apache/maven/surefire/surefire-api/2.19/surefire-api-2.19.jar
[INFO] Downloaded: http://overture.au.dk/artifactory/remote-repos/org/apache/maven/maven-error-diagnostics/2.2.1/maven-error-diagnostics-2.2.1.jar (13 KB at 326.1 KB/sec)
[INFO] Downloading: http://overture.au.dk/artifactory/remote-repos/org/apache/maven/maven-toolchain/2.2.1/maven-toolchain-2.2.1.jar
[INFO] Downloaded: http://overture.au.dk/artifactory/remote-repos/org/apache/maven/reporting/maven-reporting-api/3.0/maven-reporting-api-3.0.jar (11 KB at 232.3 KB/sec)
[INFO] Downloading: http://overture.au.dk/artifactory/remote-repos/org/apache/maven/plugin-tools/maven-plugin-annotations/3.3/maven-plugin-annotations-3.3.jar
[INFO] Downloaded: http://overture.au.dk/artifactory/remote-repos/org/apache/maven/maven-monitor/2.2.1/maven-monitor-2.2.1.jar (11 KB at 222.0 KB/sec)
[INFO] Downloaded: http://overture.au.dk/artifactory/remote-repos/org/apache/maven/maven-toolchain/2.2.1/maven-toolchain-2.2.1.jar (37 KB at 706.6 KB/sec)
[INFO] Downloaded: http://overture.au.dk/artifactory/remote-repos/org/sonatype/plexus/plexus-cipher/1.4/plexus-cipher-1.4.jar (14 KB at 235.3 KB/sec)
[INFO] Downloaded: http://overture.au.dk/artifactory/remote-repos/org/apache/maven/plugin-tools/maven-plugin-annotations/3.3/maven-plugin-annotations-3.3.jar (14 KB at 228.5 KB/sec)
[INFO] Downloaded: http://overture.au.dk/artifactory/remote-repos/org/apache/maven/surefire/surefire-api/2.19/surefire-api-2.19.jar (191 KB at 2929.1 KB/sec)
[INFO] 
[INFO] --- maven-antrun-plugin:1.7:run (copy-dependencies) @ vdmclib ---
[INFO] Executing tasks

main:
     [exec] cd /var/lib/jenkins/workspace/ch-pipeline_vpb_development-KCTLYUE5TMW7Z33VLFXIW7KHT6FIH4V5AIJQWV52XR2IIKDPQP2Q/c && /usr/bin/cmake -H/var/lib/jenkins/workspace/ch-pipeline_vpb_development-KCTLYUE5TMW7Z33VLFXIW7KHT6FIH4V5AIJQWV52XR2IIKDPQP2Q/c -B/var/lib/jenkins/workspace/ch-pipeline_vpb_development-KCTLYUE5TMW7Z33VLFXIW7KHT6FIH4V5AIJQWV52XR2IIKDPQP2Q/c --check-build-system CMakeFiles/Makefile.cmake 0
     [exec] cd /var/lib/jenkins/workspace/ch-pipeline_vpb_development-KCTLYUE5TMW7Z33VLFXIW7KHT6FIH4V5AIJQWV52XR2IIKDPQP2Q/c && /usr/bin/cmake -E cmake_progress_start /var/lib/jenkins/workspace/ch-pipeline_vpb_development-KCTLYUE5TMW7Z33VLFXIW7KHT6FIH4V5AIJQWV52XR2IIKDPQP2Q/c/CMakeFiles /var/lib/jenkins/workspace/ch-pipeline_vpb_development-KCTLYUE5TMW7Z33VLFXIW7KHT6FIH4V5AIJQWV52XR2IIKDPQP2Q/c/vdmclib/CMakeFiles/progress.marks
     [exec] cd /var/lib/jenkins/workspace/ch-pipeline_vpb_development-KCTLYUE5TMW7Z33VLFXIW7KHT6FIH4V5AIJQWV52XR2IIKDPQP2Q/c && make -f CMakeFiles/Makefile2 vdmclib/all
     [exec] make[1]: Entering directory '/var/lib/jenkins/workspace/ch-pipeline_vpb_development-KCTLYUE5TMW7Z33VLFXIW7KHT6FIH4V5AIJQWV52XR2IIKDPQP2Q/c'
     [exec] make -f third_party/googletest/googletest/CMakeFiles/gtest.dir/build.make third_party/googletest/googletest/CMakeFiles/gtest.dir/depend
     [exec] make[2]: Entering directory '/var/lib/jenkins/workspace/ch-pipeline_vpb_development-KCTLYUE5TMW7Z33VLFXIW7KHT6FIH4V5AIJQWV52XR2IIKDPQP2Q/c'
     [exec] cd /var/lib/jenkins/workspace/ch-pipeline_vpb_development-KCTLYUE5TMW7Z33VLFXIW7KHT6FIH4V5AIJQWV52XR2IIKDPQP2Q/c && /usr/bin/cmake -E cmake_depends "Unix Makefiles" /var/lib/jenkins/workspace/ch-pipeline_vpb_development-KCTLYUE5TMW7Z33VLFXIW7KHT6FIH4V5AIJQWV52XR2IIKDPQP2Q/c /var/lib/jenkins/workspace/ch-pipeline_vpb_development-KCTLYUE5TMW7Z33VLFXIW7KHT6FIH4V5AIJQWV52XR2IIKDPQP2Q/c/third_party/googletest/googletest /var/lib/jenkins/workspace/ch-pipeline_vpb_development-KCTLYUE5TMW7Z33VLFXIW7KHT6FIH4V5AIJQWV52XR2IIKDPQP2Q/c /var/lib/jenkins/workspace/ch-pipeline_vpb_development-KCTLYUE5TMW7Z33VLFXIW7KHT6FIH4V5AIJQWV52XR2IIKDPQP2Q/c/third_party/googletest/googletest /var/lib/jenkins/workspace/ch-pipeline_vpb_development-KCTLYUE5TMW7Z33VLFXIW7KHT6FIH4V5AIJQWV52XR2IIKDPQP2Q/c/third_party/googletest/googletest/CMakeFiles/gtest.dir/DependInfo.cmake --color=
     [exec] Scanning dependencies of target gtest
     [exec] make[2]: Leaving directory '/var/lib/jenkins/workspace/ch-pipeline_vpb_development-KCTLYUE5TMW7Z33VLFXIW7KHT6FIH4V5AIJQWV52XR2IIKDPQP2Q/c'
     [exec] make -f third_party/googletest/googletest/CMakeFiles/gtest.dir/build.make third_party/googletest/googletest/CMakeFiles/gtest.dir/build
     [exec] make[2]: Entering directory '/var/lib/jenkins/workspace/ch-pipeline_vpb_development-KCTLYUE5TMW7Z33VLFXIW7KHT6FIH4V5AIJQWV52XR2IIKDPQP2Q/c'
     [exec] [  1%] Building CXX object third_party/googletest/googletest/CMakeFiles/gtest.dir/src/gtest-all.cc.o
     [exec] cd /var/lib/jenkins/workspace/ch-pipeline_vpb_development-KCTLYUE5TMW7Z33VLFXIW7KHT6FIH4V5AIJQWV52XR2IIKDPQP2Q/c/third_party/googletest/googletest && /usr/bin/c++    -I/var/lib/jenkins/workspace/ch-pipeline_vpb_development-KCTLYUE5TMW7Z33VLFXIW7KHT6FIH4V5AIJQWV52XR2IIKDPQP2Q/c/vdmclib/src/test/resources -I/var/lib/jenkins/workspace/ch-pipeline_vpb_development-KCTLYUE5TMW7Z33VLFXIW7KHT6FIH4V5AIJQWV52XR2IIKDPQP2Q/c/third_party/googletest/googletest/include -I/var/lib/jenkins/workspace/ch-pipeline_vpb_development-KCTLYUE5TMW7Z33VLFXIW7KHT6FIH4V5AIJQWV52XR2IIKDPQP2Q/c/third_party/googletest/googletest  -Wall -Wshadow -DGTEST_HAS_PTHREAD=1 -fexceptions -Wextra -Wno-unused-parameter -Wno-missing-field-initializers -o CMakeFiles/gtest.dir/src/gtest-all.cc.o -c /var/lib/jenkins/workspace/ch-pipeline_vpb_development-KCTLYUE5TMW7Z33VLFXIW7KHT6FIH4V5AIJQWV52XR2IIKDPQP2Q/c/third_party/googletest/googletest/src/gtest-all.cc
     [exec] [  3%] Linking CXX static library libgtest.a
     [exec] cd /var/lib/jenkins/workspace/ch-pipeline_vpb_development-KCTLYUE5TMW7Z33VLFXIW7KHT6FIH4V5AIJQWV52XR2IIKDPQP2Q/c/third_party/googletest/googletest && /usr/bin/cmake -P CMakeFiles/gtest.dir/cmake_clean_target.cmake
     [exec] cd /var/lib/jenkins/workspace/ch-pipeline_vpb_development-KCTLYUE5TMW7Z33VLFXIW7KHT6FIH4V5AIJQWV52XR2IIKDPQP2Q/c/third_party/googletest/googletest && /usr/bin/cmake -E cmake_link_script CMakeFiles/gtest.dir/link.txt --verbose=1
     [exec] /usr/bin/ar qc libgtest.a  CMakeFiles/gtest.dir/src/gtest-all.cc.o
     [exec] /usr/bin/ranlib libgtest.a
     [exec] make[2]: Leaving directory '/var/lib/jenkins/workspace/ch-pipeline_vpb_development-KCTLYUE5TMW7Z33VLFXIW7KHT6FIH4V5AIJQWV52XR2IIKDPQP2Q/c'
     [exec] [  3%] Built target gtest
     [exec] make -f third_party/googletest/googletest/CMakeFiles/gtest_main.dir/build.make third_party/googletest/googletest/CMakeFiles/gtest_main.dir/depend
     [exec] make[2]: Entering directory '/var/lib/jenkins/workspace/ch-pipeline_vpb_development-KCTLYUE5TMW7Z33VLFXIW7KHT6FIH4V5AIJQWV52XR2IIKDPQP2Q/c'
     [exec] cd /var/lib/jenkins/workspace/ch-pipeline_vpb_development-KCTLYUE5TMW7Z33VLFXIW7KHT6FIH4V5AIJQWV52XR2IIKDPQP2Q/c && /usr/bin/cmake -E cmake_depends "Unix Makefiles" /var/lib/jenkins/workspace/ch-pipeline_vpb_development-KCTLYUE5TMW7Z33VLFXIW7KHT6FIH4V5AIJQWV52XR2IIKDPQP2Q/c /var/lib/jenkins/workspace/ch-pipeline_vpb_development-KCTLYUE5TMW7Z33VLFXIW7KHT6FIH4V5AIJQWV52XR2IIKDPQP2Q/c/third_party/googletest/googletest /var/lib/jenkins/workspace/ch-pipeline_vpb_development-KCTLYUE5TMW7Z33VLFXIW7KHT6FIH4V5AIJQWV52XR2IIKDPQP2Q/c /var/lib/jenkins/workspace/ch-pipeline_vpb_development-KCTLYUE5TMW7Z33VLFXIW7KHT6FIH4V5AIJQWV52XR2IIKDPQP2Q/c/third_party/googletest/googletest /var/lib/jenkins/workspace/ch-pipeline_vpb_development-KCTLYUE5TMW7Z33VLFXIW7KHT6FIH4V5AIJQWV52XR2IIKDPQP2Q/c/third_party/googletest/googletest/CMakeFiles/gtest_main.dir/DependInfo.cmake --color=
     [exec] Scanning dependencies of target gtest_main
     [exec] make[2]: Leaving directory '/var/lib/jenkins/workspace/ch-pipeline_vpb_development-KCTLYUE5TMW7Z33VLFXIW7KHT6FIH4V5AIJQWV52XR2IIKDPQP2Q/c'
     [exec] make -f third_party/googletest/googletest/CMakeFiles/gtest_main.dir/build.make third_party/googletest/googletest/CMakeFiles/gtest_main.dir/build
     [exec] make[2]: Entering directory '/var/lib/jenkins/workspace/ch-pipeline_vpb_development-KCTLYUE5TMW7Z33VLFXIW7KHT6FIH4V5AIJQWV52XR2IIKDPQP2Q/c'
     [exec] [  5%] Building CXX object third_party/googletest/googletest/CMakeFiles/gtest_main.dir/src/gtest_main.cc.o
     [exec] cd /var/lib/jenkins/workspace/ch-pipeline_vpb_development-KCTLYUE5TMW7Z33VLFXIW7KHT6FIH4V5AIJQWV52XR2IIKDPQP2Q/c/third_party/googletest/googletest && /usr/bin/c++    -I/var/lib/jenkins/workspace/ch-pipeline_vpb_development-KCTLYUE5TMW7Z33VLFXIW7KHT6FIH4V5AIJQWV52XR2IIKDPQP2Q/c/vdmclib/src/test/resources -I/var/lib/jenkins/workspace/ch-pipeline_vpb_development-KCTLYUE5TMW7Z33VLFXIW7KHT6FIH4V5AIJQWV52XR2IIKDPQP2Q/c/third_party/googletest/googletest/include -I/var/lib/jenkins/workspace/ch-pipeline_vpb_development-KCTLYUE5TMW7Z33VLFXIW7KHT6FIH4V5AIJQWV52XR2IIKDPQP2Q/c/third_party/googletest/googletest  -Wall -Wshadow -DGTEST_HAS_PTHREAD=1 -fexceptions -Wextra -Wno-unused-parameter -Wno-missing-field-initializers -o CMakeFiles/gtest_main.dir/src/gtest_main.cc.o -c /var/lib/jenkins/workspace/ch-pipeline_vpb_development-KCTLYUE5TMW7Z33VLFXIW7KHT6FIH4V5AIJQWV52XR2IIKDPQP2Q/c/third_party/googletest/googletest/src/gtest_main.cc
     [exec] [  7%] Linking CXX static library libgtest_main.a
     [exec] cd /var/lib/jenkins/workspace/ch-pipeline_vpb_development-KCTLYUE5TMW7Z33VLFXIW7KHT6FIH4V5AIJQWV52XR2IIKDPQP2Q/c/third_party/googletest/googletest && /usr/bin/cmake -P CMakeFiles/gtest_main.dir/cmake_clean_target.cmake
     [exec] cd /var/lib/jenkins/workspace/ch-pipeline_vpb_development-KCTLYUE5TMW7Z33VLFXIW7KHT6FIH4V5AIJQWV52XR2IIKDPQP2Q/c/third_party/googletest/googletest && /usr/bin/cmake -E cmake_link_script CMakeFiles/gtest_main.dir/link.txt --verbose=1
     [exec] /usr/bin/ar qc libgtest_main.a  CMakeFiles/gtest_main.dir/src/gtest_main.cc.o
     [exec] /usr/bin/ranlib libgtest_main.a
     [exec] make[2]: Leaving directory '/var/lib/jenkins/workspace/ch-pipeline_vpb_development-KCTLYUE5TMW7Z33VLFXIW7KHT6FIH4V5AIJQWV52XR2IIKDPQP2Q/c'
     [exec] [  7%] Built target gtest_main
     [exec] make -f vdmclib/CMakeFiles/vdmclib.dir/build.make vdmclib/CMakeFiles/vdmclib.dir/depend
     [exec] make[2]: Entering directory '/var/lib/jenkins/workspace/ch-pipeline_vpb_development-KCTLYUE5TMW7Z33VLFXIW7KHT6FIH4V5AIJQWV52XR2IIKDPQP2Q/c'
     [exec] cd /var/lib/jenkins/workspace/ch-pipeline_vpb_development-KCTLYUE5TMW7Z33VLFXIW7KHT6FIH4V5AIJQWV52XR2IIKDPQP2Q/c && /usr/bin/cmake -E cmake_depends "Unix Makefiles" /var/lib/jenkins/workspace/ch-pipeline_vpb_development-KCTLYUE5TMW7Z33VLFXIW7KHT6FIH4V5AIJQWV52XR2IIKDPQP2Q/c /var/lib/jenkins/workspace/ch-pipeline_vpb_development-KCTLYUE5TMW7Z33VLFXIW7KHT6FIH4V5AIJQWV52XR2IIKDPQP2Q/c/vdmclib /var/lib/jenkins/workspace/ch-pipeline_vpb_development-KCTLYUE5TMW7Z33VLFXIW7KHT6FIH4V5AIJQWV52XR2IIKDPQP2Q/c /var/lib/jenkins/workspace/ch-pipeline_vpb_development-KCTLYUE5TMW7Z33VLFXIW7KHT6FIH4V5AIJQWV52XR2IIKDPQP2Q/c/vdmclib /var/lib/jenkins/workspace/ch-pipeline_vpb_development-KCTLYUE5TMW7Z33VLFXIW7KHT6FIH4V5AIJQWV52XR2IIKDPQP2Q/c/vdmclib/CMakeFiles/vdmclib.dir/DependInfo.cmake --color=
     [exec] Scanning dependencies of target vdmclib
     [exec] make[2]: Leaving directory '/var/lib/jenkins/workspace/ch-pipeline_vpb_development-KCTLYUE5TMW7Z33VLFXIW7KHT6FIH4V5AIJQWV52XR2IIKDPQP2Q/c'
     [exec] make -f vdmclib/CMakeFiles/vdmclib.dir/build.make vdmclib/CMakeFiles/vdmclib.dir/build
     [exec] make[2]: Entering directory '/var/lib/jenkins/workspace/ch-pipeline_vpb_development-KCTLYUE5TMW7Z33VLFXIW7KHT6FIH4V5AIJQWV52XR2IIKDPQP2Q/c'
     [exec] [  9%] Building C object vdmclib/CMakeFiles/vdmclib.dir/src/main/IOLib.c.o
     [exec] cd /var/lib/jenkins/workspace/ch-pipeline_vpb_development-KCTLYUE5TMW7Z33VLFXIW7KHT6FIH4V5AIJQWV52XR2IIKDPQP2Q/c/vdmclib && /usr/bin/cc   -I/var/lib/jenkins/workspace/ch-pipeline_vpb_development-KCTLYUE5TMW7Z33VLFXIW7KHT6FIH4V5AIJQWV52XR2IIKDPQP2Q/c/vdmclib -I/var/lib/jenkins/workspace/ch-pipeline_vpb_development-KCTLYUE5TMW7Z33VLFXIW7KHT6FIH4V5AIJQWV52XR2IIKDPQP2Q/c/vdmclib/src/test/resources -I/var/lib/jenkins/workspace/ch-pipeline_vpb_development-KCTLYUE5TMW7Z33VLFXIW7KHT6FIH4V5AIJQWV52XR2IIKDPQP2Q/c/vdmclib/src/main -I/var/lib/jenkins/workspace/ch-pipeline_vpb_development-KCTLYUE5TMW7Z33VLFXIW7KHT6FIH4V5AIJQWV52XR2IIKDPQP2Q/c/vdmclib/src/main/classes -I/var/lib/jenkins/workspace/ch-pipeline_vpb_development-KCTLYUE5TMW7Z33VLFXIW7KHT6FIH4V5AIJQWV52XR2IIKDPQP2Q/c/third_party/googletest/googletest/include  -Wall -fmessage-length=0 -std=c89   -o CMakeFiles/vdmclib.dir/src/main/IOLib.c.o   -c /var/lib/jenkins/workspace/ch-pipeline_vpb_development-KCTLYUE5TMW7Z33VLFXIW7KHT6FIH4V5AIJQWV52XR2IIKDPQP2Q/c/vdmclib/src/main/IOLib.c
     [exec] [ 11%] Building C object vdmclib/CMakeFiles/vdmclib.dir/src/main/CSVLib.c.o
     [exec] cd /var/lib/jenkins/workspace/ch-pipeline_vpb_development-KCTLYUE5TMW7Z33VLFXIW7KHT6FIH4V5AIJQWV52XR2IIKDPQP2Q/c/vdmclib && /usr/bin/cc   -I/var/lib/jenkins/workspace/ch-pipeline_vpb_development-KCTLYUE5TMW7Z33VLFXIW7KHT6FIH4V5AIJQWV52XR2IIKDPQP2Q/c/vdmclib -I/var/lib/jenkins/workspace/ch-pipeline_vpb_development-KCTLYUE5TMW7Z33VLFXIW7KHT6FIH4V5AIJQWV52XR2IIKDPQP2Q/c/vdmclib/src/test/resources -I/var/lib/jenkins/workspace/ch-pipeline_vpb_development-KCTLYUE5TMW7Z33VLFXIW7KHT6FIH4V5AIJQWV52XR2IIKDPQP2Q/c/vdmclib/src/main -I/var/lib/jenkins/workspace/ch-pipeline_vpb_development-KCTLYUE5TMW7Z33VLFXIW7KHT6FIH4V5AIJQWV52XR2IIKDPQP2Q/c/vdmclib/src/main/classes -I/var/lib/jenkins/workspace/ch-pipeline_vpb_development-KCTLYUE5TMW7Z33VLFXIW7KHT6FIH4V5AIJQWV52XR2IIKDPQP2Q/c/third_party/googletest/googletest/include  -Wall -fmessage-length=0 -std=c89   -o CMakeFiles/vdmclib.dir/src/main/CSVLib.c.o   -c /var/lib/jenkins/workspace/ch-pipeline_vpb_development-KCTLYUE5TMW7Z33VLFXIW7KHT6FIH4V5AIJQWV52XR2IIKDPQP2Q/c/vdmclib/src/main/CSVLib.c
     [exec] [ 13%] Building C object vdmclib/CMakeFiles/vdmclib.dir/src/main/MATHLib.c.o
     [exec] cd /var/lib/jenkins/workspace/ch-pipeline_vpb_development-KCTLYUE5TMW7Z33VLFXIW7KHT6FIH4V5AIJQWV52XR2IIKDPQP2Q/c/vdmclib && /usr/bin/cc   -I/var/lib/jenkins/workspace/ch-pipeline_vpb_development-KCTLYUE5TMW7Z33VLFXIW7KHT6FIH4V5AIJQWV52XR2IIKDPQP2Q/c/vdmclib -I/var/lib/jenkins/workspace/ch-pipeline_vpb_development-KCTLYUE5TMW7Z33VLFXIW7KHT6FIH4V5AIJQWV52XR2IIKDPQP2Q/c/vdmclib/src/test/resources -I/var/lib/jenkins/workspace/ch-pipeline_vpb_development-KCTLYUE5TMW7Z33VLFXIW7KHT6FIH4V5AIJQWV52XR2IIKDPQP2Q/c/vdmclib/src/main -I/var/lib/jenkins/workspace/ch-pipeline_vpb_development-KCTLYUE5TMW7Z33VLFXIW7KHT6FIH4V5AIJQWV52XR2IIKDPQP2Q/c/vdmclib/src/main/classes -I/var/lib/jenkins/workspace/ch-pipeline_vpb_development-KCTLYUE5TMW7Z33VLFXIW7KHT6FIH4V5AIJQWV52XR2IIKDPQP2Q/c/third_party/googletest/googletest/include  -Wall -fmessage-length=0 -std=c89   -o CMakeFiles/vdmclib.dir/src/main/MATHLib.c.o   -c /var/lib/jenkins/workspace/ch-pipeline_vpb_development-KCTLYUE5TMW7Z33VLFXIW7KHT6FIH4V5AIJQWV52XR2IIKDPQP2Q/c/vdmclib/src/main/MATHLib.c
     [exec] [ 15%] Building C object vdmclib/CMakeFiles/vdmclib.dir/src/main/PrettyPrint.c.o
     [exec] cd /var/lib/jenkins/workspace/ch-pipeline_vpb_development-KCTLYUE5TMW7Z33VLFXIW7KHT6FIH4V5AIJQWV52XR2IIKDPQP2Q/c/vdmclib && /usr/bin/cc   -I/var/lib/jenkins/workspace/ch-pipeline_vpb_development-KCTLYUE5TMW7Z33VLFXIW7KHT6FIH4V5AIJQWV52XR2IIKDPQP2Q/c/vdmclib -I/var/lib/jenkins/workspace/ch-pipeline_vpb_development-KCTLYUE5TMW7Z33VLFXIW7KHT6FIH4V5AIJQWV52XR2IIKDPQP2Q/c/vdmclib/src/test/resources -I/var/lib/jenkins/workspace/ch-pipeline_vpb_development-KCTLYUE5TMW7Z33VLFXIW7KHT6FIH4V5AIJQWV52XR2IIKDPQP2Q/c/vdmclib/src/main -I/var/lib/jenkins/workspace/ch-pipeline_vpb_development-KCTLYUE5TMW7Z33VLFXIW7KHT6FIH4V5AIJQWV52XR2IIKDPQP2Q/c/vdmclib/src/main/classes -I/var/lib/jenkins/workspace/ch-pipeline_vpb_development-KCTLYUE5TMW7Z33VLFXIW7KHT6FIH4V5AIJQWV52XR2IIKDPQP2Q/c/third_party/googletest/googletest/include  -Wall -fmessage-length=0 -std=c89   -o CMakeFiles/vdmclib.dir/src/main/PrettyPrint.c.o   -c /var/lib/jenkins/workspace/ch-pipeline_vpb_development-KCTLYUE5TMW7Z33VLFXIW7KHT6FIH4V5AIJQWV52XR2IIKDPQP2Q/c/vdmclib/src/main/PrettyPrint.c
     [exec] [ 17%] Building C object vdmclib/CMakeFiles/vdmclib.dir/src/main/PatternBindMatch.c.o
     [exec] cd /var/lib/jenkins/workspace/ch-pipeline_vpb_development-KCTLYUE5TMW7Z33VLFXIW7KHT6FIH4V5AIJQWV52XR2IIKDPQP2Q/c/vdmclib && /usr/bin/cc   -I/var/lib/jenkins/workspace/ch-pipeline_vpb_development-KCTLYUE5TMW7Z33VLFXIW7KHT6FIH4V5AIJQWV52XR2IIKDPQP2Q/c/vdmclib -I/var/lib/jenkins/workspace/ch-pipeline_vpb_development-KCTLYUE5TMW7Z33VLFXIW7KHT6FIH4V5AIJQWV52XR2IIKDPQP2Q/c/vdmclib/src/test/resources -I/var/lib/jenkins/workspace/ch-pipeline_vpb_development-KCTLYUE5TMW7Z33VLFXIW7KHT6FIH4V5AIJQWV52XR2IIKDPQP2Q/c/vdmclib/src/main -I/var/lib/jenkins/workspace/ch-pipeline_vpb_development-KCTLYUE5TMW7Z33VLFXIW7KHT6FIH4V5AIJQWV52XR2IIKDPQP2Q/c/vdmclib/src/main/classes -I/var/lib/jenkins/workspace/ch-pipeline_vpb_development-KCTLYUE5TMW7Z33VLFXIW7KHT6FIH4V5AIJQWV52XR2IIKDPQP2Q/c/third_party/googletest/googletest/include  -Wall -fmessage-length=0 -std=c89   -o CMakeFiles/vdmclib.dir/src/main/PatternBindMatch.c.o   -c /var/lib/jenkins/workspace/ch-pipeline_vpb_development-KCTLYUE5TMW7Z33VLFXIW7KHT6FIH4V5AIJQWV52XR2IIKDPQP2Q/c/vdmclib/src/main/PatternBindMatch.c
     [exec] [ 19%] Building C object vdmclib/CMakeFiles/vdmclib.dir/src/main/VdmClass.c.o
     [exec] cd /var/lib/jenkins/workspace/ch-pipeline_vpb_development-KCTLYUE5TMW7Z33VLFXIW7KHT6FIH4V5AIJQWV52XR2IIKDPQP2Q/c/vdmclib && /usr/bin/cc   -I/var/lib/jenkins/workspace/ch-pipeline_vpb_development-KCTLYUE5TMW7Z33VLFXIW7KHT6FIH4V5AIJQWV52XR2IIKDPQP2Q/c/vdmclib -I/var/lib/jenkins/workspace/ch-pipeline_vpb_development-KCTLYUE5TMW7Z33VLFXIW7KHT6FIH4V5AIJQWV52XR2IIKDPQP2Q/c/vdmclib/src/test/resources -I/var/lib/jenkins/workspace/ch-pipeline_vpb_development-KCTLYUE5TMW7Z33VLFXIW7KHT6FIH4V5AIJQWV52XR2IIKDPQP2Q/c/vdmclib/src/main -I/var/lib/jenkins/workspace/ch-pipeline_vpb_development-KCTLYUE5TMW7Z33VLFXIW7KHT6FIH4V5AIJQWV52XR2IIKDPQP2Q/c/vdmclib/src/main/classes -I/var/lib/jenkins/workspace/ch-pipeline_vpb_development-KCTLYUE5TMW7Z33VLFXIW7KHT6FIH4V5AIJQWV52XR2IIKDPQP2Q/c/third_party/googletest/googletest/include  -Wall -fmessage-length=0 -std=c89   -o CMakeFiles/vdmclib.dir/src/main/VdmClass.c.o   -c /var/lib/jenkins/workspace/ch-pipeline_vpb_development-KCTLYUE5TMW7Z33VLFXIW7KHT6FIH4V5AIJQWV52XR2IIKDPQP2Q/c/vdmclib/src/main/VdmClass.c
     [exec] [ 21%] Building C object vdmclib/CMakeFiles/vdmclib.dir/src/main/VdmBasicTypes.c.o
     [exec] [ 23%] Building C object vdmclib/CMakeFiles/vdmclib.dir/src/main/TypedValue.c.o
     [exec] cd /var/lib/jenkins/workspace/ch-pipeline_vpb_development-KCTLYUE5TMW7Z33VLFXIW7KHT6FIH4V5AIJQWV52XR2IIKDPQP2Q/c/vdmclib && /usr/bin/cc   -I/var/lib/jenkins/workspace/ch-pipeline_vpb_development-KCTLYUE5TMW7Z33VLFXIW7KHT6FIH4V5AIJQWV52XR2IIKDPQP2Q/c/vdmclib -I/var/lib/jenkins/workspace/ch-pipeline_vpb_development-KCTLYUE5TMW7Z33VLFXIW7KHT6FIH4V5AIJQWV52XR2IIKDPQP2Q/c/vdmclib/src/test/resources -I/var/lib/jenkins/workspace/ch-pipeline_vpb_development-KCTLYUE5TMW7Z33VLFXIW7KHT6FIH4V5AIJQWV52XR2IIKDPQP2Q/c/vdmclib/src/main -I/var/lib/jenkins/workspace/ch-pipeline_vpb_development-KCTLYUE5TMW7Z33VLFXIW7KHT6FIH4V5AIJQWV52XR2IIKDPQP2Q/c/vdmclib/src/main/classes -I/var/lib/jenkins/workspace/ch-pipeline_vpb_development-KCTLYUE5TMW7Z33VLFXIW7KHT6FIH4V5AIJQWV52XR2IIKDPQP2Q/c/third_party/googletest/googletest/include  -Wall -fmessage-length=0 -std=c89   -o CMakeFiles/vdmclib.dir/src/main/VdmBasicTypes.c.o   -c /var/lib/jenkins/workspace/ch-pipeline_vpb_development-KCTLYUE5TMW7Z33VLFXIW7KHT6FIH4V5AIJQWV52XR2IIKDPQP2Q/c/vdmclib/src/main/VdmBasicTypes.c
     [exec] [ 25%] Building C object vdmclib/CMakeFiles/vdmclib.dir/src/main/VdmGC.c.o
     [exec] cd /var/lib/jenkins/workspace/ch-pipeline_vpb_development-KCTLYUE5TMW7Z33VLFXIW7KHT6FIH4V5AIJQWV52XR2IIKDPQP2Q/c/vdmclib && /usr/bin/cc   -I/var/lib/jenkins/workspace/ch-pipeline_vpb_development-KCTLYUE5TMW7Z33VLFXIW7KHT6FIH4V5AIJQWV52XR2IIKDPQP2Q/c/vdmclib -I/var/lib/jenkins/workspace/ch-pipeline_vpb_development-KCTLYUE5TMW7Z33VLFXIW7KHT6FIH4V5AIJQWV52XR2IIKDPQP2Q/c/vdmclib/src/test/resources -I/var/lib/jenkins/workspace/ch-pipeline_vpb_development-KCTLYUE5TMW7Z33VLFXIW7KHT6FIH4V5AIJQWV52XR2IIKDPQP2Q/c/vdmclib/src/main -I/var/lib/jenkins/workspace/ch-pipeline_vpb_development-KCTLYUE5TMW7Z33VLFXIW7KHT6FIH4V5AIJQWV52XR2IIKDPQP2Q/c/vdmclib/src/main/classes -I/var/lib/jenkins/workspace/ch-pipeline_vpb_development-KCTLYUE5TMW7Z33VLFXIW7KHT6FIH4V5AIJQWV52XR2IIKDPQP2Q/c/third_party/googletest/googletest/include  -Wall -fmessage-length=0 -std=c89   -o CMakeFiles/vdmclib.dir/src/main/VdmGC.c.o   -c /var/lib/jenkins/workspace/ch-pipeline_vpb_development-KCTLYUE5TMW7Z33VLFXIW7KHT6FIH4V5AIJQWV52XR2IIKDPQP2Q/c/vdmclib/src/main/VdmGC.c
     [exec] cd /var/lib/jenkins/workspace/ch-pipeline_vpb_development-KCTLYUE5TMW7Z33VLFXIW7KHT6FIH4V5AIJQWV52XR2IIKDPQP2Q/c/vdmclib && /usr/bin/cc   -I/var/lib/jenkins/workspace/ch-pipeline_vpb_development-KCTLYUE5TMW7Z33VLFXIW7KHT6FIH4V5AIJQWV52XR2IIKDPQP2Q/c/vdmclib -I/var/lib/jenkins/workspace/ch-pipeline_vpb_development-KCTLYUE5TMW7Z33VLFXIW7KHT6FIH4V5AIJQWV52XR2IIKDPQP2Q/c/vdmclib/src/test/resources -I/var/lib/jenkins/workspace/ch-pipeline_vpb_development-KCTLYUE5TMW7Z33VLFXIW7KHT6FIH4V5AIJQWV52XR2IIKDPQP2Q/c/vdmclib/src/main -I/var/lib/jenkins/workspace/ch-pipeline_vpb_development-KCTLYUE5TMW7Z33VLFXIW7KHT6FIH4V5AIJQWV52XR2IIKDPQP2Q/c/vdmclib/src/main/classes -I/var/lib/jenkins/workspace/ch-pipeline_vpb_development-KCTLYUE5TMW7Z33VLFXIW7KHT6FIH4V5AIJQWV52XR2IIKDPQP2Q/c/third_party/googletest/googletest/include  -Wall -fmessage-length=0 -std=c89   -o CMakeFiles/vdmclib.dir/src/main/TypedValue.c.o   -c /var/lib/jenkins/workspace/ch-pipeline_vpb_development-KCTLYUE5TMW7Z33VLFXIW7KHT6FIH4V5AIJQWV52XR2IIKDPQP2Q/c/vdmclib/src/main/TypedValue.c
     [exec] [ 27%] Building C object vdmclib/CMakeFiles/vdmclib.dir/src/main/VdmMap.c.o
     [exec] cd /var/lib/jenkins/workspace/ch-pipeline_vpb_development-KCTLYUE5TMW7Z33VLFXIW7KHT6FIH4V5AIJQWV52XR2IIKDPQP2Q/c/vdmclib && /usr/bin/cc   -I/var/lib/jenkins/workspace/ch-pipeline_vpb_development-KCTLYUE5TMW7Z33VLFXIW7KHT6FIH4V5AIJQWV52XR2IIKDPQP2Q/c/vdmclib -I/var/lib/jenkins/workspace/ch-pipeline_vpb_development-KCTLYUE5TMW7Z33VLFXIW7KHT6FIH4V5AIJQWV52XR2IIKDPQP2Q/c/vdmclib/src/test/resources -I/var/lib/jenkins/workspace/ch-pipeline_vpb_development-KCTLYUE5TMW7Z33VLFXIW7KHT6FIH4V5AIJQWV52XR2IIKDPQP2Q/c/vdmclib/src/main -I/var/lib/jenkins/workspace/ch-pipeline_vpb_development-KCTLYUE5TMW7Z33VLFXIW7KHT6FIH4V5AIJQWV52XR2IIKDPQP2Q/c/vdmclib/src/main/classes -I/var/lib/jenkins/workspace/ch-pipeline_vpb_development-KCTLYUE5TMW7Z33VLFXIW7KHT6FIH4V5AIJQWV52XR2IIKDPQP2Q/c/third_party/googletest/googletest/include  -Wall -fmessage-length=0 -std=c89   -o CMakeFiles/vdmclib.dir/src/main/VdmMap.c.o   -c /var/lib/jenkins/workspace/ch-pipeline_vpb_development-KCTLYUE5TMW7Z33VLFXIW7KHT6FIH4V5AIJQWV52XR2IIKDPQP2Q/c/vdmclib/src/main/VdmMap.c
     [exec] [ 29%] Building C object vdmclib/CMakeFiles/vdmclib.dir/src/main/VdmProduct.c.o
     [exec] cd /var/lib/jenkins/workspace/ch-pipeline_vpb_development-KCTLYUE5TMW7Z33VLFXIW7KHT6FIH4V5AIJQWV52XR2IIKDPQP2Q/c/vdmclib && /usr/bin/cc   -I/var/lib/jenkins/workspace/ch-pipeline_vpb_development-KCTLYUE5TMW7Z33VLFXIW7KHT6FIH4V5AIJQWV52XR2IIKDPQP2Q/c/vdmclib -I/var/lib/jenkins/workspace/ch-pipeline_vpb_development-KCTLYUE5TMW7Z33VLFXIW7KHT6FIH4V5AIJQWV52XR2IIKDPQP2Q/c/vdmclib/src/test/resources -I/var/lib/jenkins/workspace/ch-pipeline_vpb_development-KCTLYUE5TMW7Z33VLFXIW7KHT6FIH4V5AIJQWV52XR2IIKDPQP2Q/c/vdmclib/src/main -I/var/lib/jenkins/workspace/ch-pipeline_vpb_development-KCTLYUE5TMW7Z33VLFXIW7KHT6FIH4V5AIJQWV52XR2IIKDPQP2Q/c/vdmclib/src/main/classes -I/var/lib/jenkins/workspace/ch-pipeline_vpb_development-KCTLYUE5TMW7Z33VLFXIW7KHT6FIH4V5AIJQWV52XR2IIKDPQP2Q/c/third_party/googletest/googletest/include  -Wall -fmessage-length=0 -std=c89   -o CMakeFiles/vdmclib.dir/src/main/VdmProduct.c.o   -c /var/lib/jenkins/workspace/ch-pipeline_vpb_development-KCTLYUE5TMW7Z33VLFXIW7KHT6FIH4V5AIJQWV52XR2IIKDPQP2Q/c/vdmclib/src/main/VdmProduct.c
     [exec] [ 31%] Building C object vdmclib/CMakeFiles/vdmclib.dir/src/main/VdmSeq.c.o
     [exec] cd /var/lib/jenkins/workspace/ch-pipeline_vpb_development-KCTLYUE5TMW7Z33VLFXIW7KHT6FIH4V5AIJQWV52XR2IIKDPQP2Q/c/vdmclib && /usr/bin/cc   -I/var/lib/jenkins/workspace/ch-pipeline_vpb_development-KCTLYUE5TMW7Z33VLFXIW7KHT6FIH4V5AIJQWV52XR2IIKDPQP2Q/c/vdmclib -I/var/lib/jenkins/workspace/ch-pipeline_vpb_development-KCTLYUE5TMW7Z33VLFXIW7KHT6FIH4V5AIJQWV52XR2IIKDPQP2Q/c/vdmclib/src/test/resources -I/var/lib/jenkins/workspace/ch-pipeline_vpb_development-KCTLYUE5TMW7Z33VLFXIW7KHT6FIH4V5AIJQWV52XR2IIKDPQP2Q/c/vdmclib/src/main -I/var/lib/jenkins/workspace/ch-pipeline_vpb_development-KCTLYUE5TMW7Z33VLFXIW7KHT6FIH4V5AIJQWV52XR2IIKDPQP2Q/c/vdmclib/src/main/classes -I/var/lib/jenkins/workspace/ch-pipeline_vpb_development-KCTLYUE5TMW7Z33VLFXIW7KHT6FIH4V5AIJQWV52XR2IIKDPQP2Q/c/third_party/googletest/googletest/include  -Wall -fmessage-length=0 -std=c89   -o CMakeFiles/vdmclib.dir/src/main/VdmSeq.c.o   -c /var/lib/jenkins/workspace/ch-pipeline_vpb_development-KCTLYUE5TMW7Z33VLFXIW7KHT6FIH4V5AIJQWV52XR2IIKDPQP2Q/c/vdmclib/src/main/VdmSeq.c
     [exec] [ 33%] Building C object vdmclib/CMakeFiles/vdmclib.dir/src/main/VdmSet.c.o
     [exec] cd /var/lib/jenkins/workspace/ch-pipeline_vpb_development-KCTLYUE5TMW7Z33VLFXIW7KHT6FIH4V5AIJQWV52XR2IIKDPQP2Q/c/vdmclib && /usr/bin/cc   -I/var/lib/jenkins/workspace/ch-pipeline_vpb_development-KCTLYUE5TMW7Z33VLFXIW7KHT6FIH4V5AIJQWV52XR2IIKDPQP2Q/c/vdmclib -I/var/lib/jenkins/workspace/ch-pipeline_vpb_development-KCTLYUE5TMW7Z33VLFXIW7KHT6FIH4V5AIJQWV52XR2IIKDPQP2Q/c/vdmclib/src/test/resources -I/var/lib/jenkins/workspace/ch-pipeline_vpb_development-KCTLYUE5TMW7Z33VLFXIW7KHT6FIH4V5AIJQWV52XR2IIKDPQP2Q/c/vdmclib/src/main -I/var/lib/jenkins/workspace/ch-pipeline_vpb_development-KCTLYUE5TMW7Z33VLFXIW7KHT6FIH4V5AIJQWV52XR2IIKDPQP2Q/c/vdmclib/src/main/classes -I/var/lib/jenkins/workspace/ch-pipeline_vpb_development-KCTLYUE5TMW7Z33VLFXIW7KHT6FIH4V5AIJQWV52XR2IIKDPQP2Q/c/third_party/googletest/googletest/include  -Wall -fmessage-length=0 -std=c89   -o CMakeFiles/vdmclib.dir/src/main/VdmSet.c.o   -c /var/lib/jenkins/workspace/ch-pipeline_vpb_development-KCTLYUE5TMW7Z33VLFXIW7KHT6FIH4V5AIJQWV52XR2IIKDPQP2Q/c/vdmclib/src/main/VdmSet.c
     [exec] [ 35%] Building C object vdmclib/CMakeFiles/vdmclib.dir/src/main/VdmUnpackString.c.o
     [exec] cd /var/lib/jenkins/workspace/ch-pipeline_vpb_development-KCTLYUE5TMW7Z33VLFXIW7KHT6FIH4V5AIJQWV52XR2IIKDPQP2Q/c/vdmclib && /usr/bin/cc   -I/var/lib/jenkins/workspace/ch-pipeline_vpb_development-KCTLYUE5TMW7Z33VLFXIW7KHT6FIH4V5AIJQWV52XR2IIKDPQP2Q/c/vdmclib -I/var/lib/jenkins/workspace/ch-pipeline_vpb_development-KCTLYUE5TMW7Z33VLFXIW7KHT6FIH4V5AIJQWV52XR2IIKDPQP2Q/c/vdmclib/src/test/resources -I/var/lib/jenkins/workspace/ch-pipeline_vpb_development-KCTLYUE5TMW7Z33VLFXIW7KHT6FIH4V5AIJQWV52XR2IIKDPQP2Q/c/vdmclib/src/main -I/var/lib/jenkins/workspace/ch-pipeline_vpb_development-KCTLYUE5TMW7Z33VLFXIW7KHT6FIH4V5AIJQWV52XR2IIKDPQP2Q/c/vdmclib/src/main/classes -I/var/lib/jenkins/workspace/ch-pipeline_vpb_development-KCTLYUE5TMW7Z33VLFXIW7KHT6FIH4V5AIJQWV52XR2IIKDPQP2Q/c/third_party/googletest/googletest/include  -Wall -fmessage-length=0 -std=c89   -o CMakeFiles/vdmclib.dir/src/main/VdmUnpackString.c.o   -c /var/lib/jenkins/workspace/ch-pipeline_vpb_development-KCTLYUE5TMW7Z33VLFXIW7KHT6FIH4V5AIJQWV52XR2IIKDPQP2Q/c/vdmclib/src/main/VdmUnpackString.c
     [exec] [ 37%] Building C object vdmclib/CMakeFiles/vdmclib.dir/src/test/classes/B.c.o
     [exec] cd /var/lib/jenkins/workspace/ch-pipeline_vpb_development-KCTLYUE5TMW7Z33VLFXIW7KHT6FIH4V5AIJQWV52XR2IIKDPQP2Q/c/vdmclib && /usr/bin/cc   -I/var/lib/jenkins/workspace/ch-pipeline_vpb_development-KCTLYUE5TMW7Z33VLFXIW7KHT6FIH4V5AIJQWV52XR2IIKDPQP2Q/c/vdmclib -I/var/lib/jenkins/workspace/ch-pipeline_vpb_development-KCTLYUE5TMW7Z33VLFXIW7KHT6FIH4V5AIJQWV52XR2IIKDPQP2Q/c/vdmclib/src/test/resources -I/var/lib/jenkins/workspace/ch-pipeline_vpb_development-KCTLYUE5TMW7Z33VLFXIW7KHT6FIH4V5AIJQWV52XR2IIKDPQP2Q/c/vdmclib/src/main -I/var/lib/jenkins/workspace/ch-pipeline_vpb_development-KCTLYUE5TMW7Z33VLFXIW7KHT6FIH4V5AIJQWV52XR2IIKDPQP2Q/c/vdmclib/src/main/classes -I/var/lib/jenkins/workspace/ch-pipeline_vpb_development-KCTLYUE5TMW7Z33VLFXIW7KHT6FIH4V5AIJQWV52XR2IIKDPQP2Q/c/third_party/googletest/googletest/include  -Wall -fmessage-length=0 -std=c89   -o CMakeFiles/vdmclib.dir/src/test/classes/B.c.o   -c /var/lib/jenkins/workspace/ch-pipeline_vpb_development-KCTLYUE5TMW7Z33VLFXIW7KHT6FIH4V5AIJQWV52XR2IIKDPQP2Q/c/vdmclib/src/test/classes/B.c
     [exec] [ 39%] Building C object vdmclib/CMakeFiles/vdmclib.dir/src/test/classes/C.c.o
     [exec] [ 41%] Building C object vdmclib/CMakeFiles/vdmclib.dir/src/test/classes/A.c.o
     [exec] cd /var/lib/jenkins/workspace/ch-pipeline_vpb_development-KCTLYUE5TMW7Z33VLFXIW7KHT6FIH4V5AIJQWV52XR2IIKDPQP2Q/c/vdmclib && /usr/bin/cc   -I/var/lib/jenkins/workspace/ch-pipeline_vpb_development-KCTLYUE5TMW7Z33VLFXIW7KHT6FIH4V5AIJQWV52XR2IIKDPQP2Q/c/vdmclib -I/var/lib/jenkins/workspace/ch-pipeline_vpb_development-KCTLYUE5TMW7Z33VLFXIW7KHT6FIH4V5AIJQWV52XR2IIKDPQP2Q/c/vdmclib/src/test/resources -I/var/lib/jenkins/workspace/ch-pipeline_vpb_development-KCTLYUE5TMW7Z33VLFXIW7KHT6FIH4V5AIJQWV52XR2IIKDPQP2Q/c/vdmclib/src/main -I/var/lib/jenkins/workspace/ch-pipeline_vpb_development-KCTLYUE5TMW7Z33VLFXIW7KHT6FIH4V5AIJQWV52XR2IIKDPQP2Q/c/vdmclib/src/main/classes -I/var/lib/jenkins/workspace/ch-pipeline_vpb_development-KCTLYUE5TMW7Z33VLFXIW7KHT6FIH4V5AIJQWV52XR2IIKDPQP2Q/c/third_party/googletest/googletest/include  -Wall -fmessage-length=0 -std=c89   -o CMakeFiles/vdmclib.dir/src/test/classes/C.c.o   -c /var/lib/jenkins/workspace/ch-pipeline_vpb_development-KCTLYUE5TMW7Z33VLFXIW7KHT6FIH4V5AIJQWV52XR2IIKDPQP2Q/c/vdmclib/src/test/classes/C.c
     [exec] cd /var/lib/jenkins/workspace/ch-pipeline_vpb_development-KCTLYUE5TMW7Z33VLFXIW7KHT6FIH4V5AIJQWV52XR2IIKDPQP2Q/c/vdmclib && /usr/bin/cc   -I/var/lib/jenkins/workspace/ch-pipeline_vpb_development-KCTLYUE5TMW7Z33VLFXIW7KHT6FIH4V5AIJQWV52XR2IIKDPQP2Q/c/vdmclib -I/var/lib/jenkins/workspace/ch-pipeline_vpb_development-KCTLYUE5TMW7Z33VLFXIW7KHT6FIH4V5AIJQWV52XR2IIKDPQP2Q/c/vdmclib/src/test/resources -I/var/lib/jenkins/workspace/ch-pipeline_vpb_development-KCTLYUE5TMW7Z33VLFXIW7KHT6FIH4V5AIJQWV52XR2IIKDPQP2Q/c/vdmclib/src/main -I/var/lib/jenkins/workspace/ch-pipeline_vpb_development-KCTLYUE5TMW7Z33VLFXIW7KHT6FIH4V5AIJQWV52XR2IIKDPQP2Q/c/vdmclib/src/main/classes -I/var/lib/jenkins/workspace/ch-pipeline_vpb_development-KCTLYUE5TMW7Z33VLFXIW7KHT6FIH4V5AIJQWV52XR2IIKDPQP2Q/c/third_party/googletest/googletest/include  -Wall -fmessage-length=0 -std=c89   -o CMakeFiles/vdmclib.dir/src/test/classes/A.c.o   -c /var/lib/jenkins/workspace/ch-pipeline_vpb_development-KCTLYUE5TMW7Z33VLFXIW7KHT6FIH4V5AIJQWV52XR2IIKDPQP2Q/c/vdmclib/src/test/classes/A.c
     [exec] [ 43%] Building C object vdmclib/CMakeFiles/vdmclib.dir/src/test/records/MyRec.c.o
     [exec] cd /var/lib/jenkins/workspace/ch-pipeline_vpb_development-KCTLYUE5TMW7Z33VLFXIW7KHT6FIH4V5AIJQWV52XR2IIKDPQP2Q/c/vdmclib && /usr/bin/cc   -I/var/lib/jenkins/workspace/ch-pipeline_vpb_development-KCTLYUE5TMW7Z33VLFXIW7KHT6FIH4V5AIJQWV52XR2IIKDPQP2Q/c/vdmclib -I/var/lib/jenkins/workspace/ch-pipeline_vpb_development-KCTLYUE5TMW7Z33VLFXIW7KHT6FIH4V5AIJQWV52XR2IIKDPQP2Q/c/vdmclib/src/test/resources -I/var/lib/jenkins/workspace/ch-pipeline_vpb_development-KCTLYUE5TMW7Z33VLFXIW7KHT6FIH4V5AIJQWV52XR2IIKDPQP2Q/c/vdmclib/src/main -I/var/lib/jenkins/workspace/ch-pipeline_vpb_development-KCTLYUE5TMW7Z33VLFXIW7KHT6FIH4V5AIJQWV52XR2IIKDPQP2Q/c/vdmclib/src/main/classes -I/var/lib/jenkins/workspace/ch-pipeline_vpb_development-KCTLYUE5TMW7Z33VLFXIW7KHT6FIH4V5AIJQWV52XR2IIKDPQP2Q/c/third_party/googletest/googletest/include  -Wall -fmessage-length=0 -std=c89   -o CMakeFiles/vdmclib.dir/src/test/records/MyRec.c.o   -c /var/lib/jenkins/workspace/ch-pipeline_vpb_development-KCTLYUE5TMW7Z33VLFXIW7KHT6FIH4V5AIJQWV52XR2IIKDPQP2Q/c/vdmclib/src/test/records/MyRec.c
     [exec] [ 45%] Building C object vdmclib/CMakeFiles/vdmclib.dir/src/test/records/MyRec2.c.o
     [exec] cd /var/lib/jenkins/workspace/ch-pipeline_vpb_development-KCTLYUE5TMW7Z33VLFXIW7KHT6FIH4V5AIJQWV52XR2IIKDPQP2Q/c/vdmclib && /usr/bin/cc   -I/var/lib/jenkins/workspace/ch-pipeline_vpb_development-KCTLYUE5TMW7Z33VLFXIW7KHT6FIH4V5AIJQWV52XR2IIKDPQP2Q/c/vdmclib -I/var/lib/jenkins/workspace/ch-pipeline_vpb_development-KCTLYUE5TMW7Z33VLFXIW7KHT6FIH4V5AIJQWV52XR2IIKDPQP2Q/c/vdmclib/src/test/resources -I/var/lib/jenkins/workspace/ch-pipeline_vpb_development-KCTLYUE5TMW7Z33VLFXIW7KHT6FIH4V5AIJQWV52XR2IIKDPQP2Q/c/vdmclib/src/main -I/var/lib/jenkins/workspace/ch-pipeline_vpb_development-KCTLYUE5TMW7Z33VLFXIW7KHT6FIH4V5AIJQWV52XR2IIKDPQP2Q/c/vdmclib/src/main/classes -I/var/lib/jenkins/workspace/ch-pipeline_vpb_development-KCTLYUE5TMW7Z33VLFXIW7KHT6FIH4V5AIJQWV52XR2IIKDPQP2Q/c/third_party/googletest/googletest/include  -Wall -fmessage-length=0 -std=c89   -o CMakeFiles/vdmclib.dir/src/test/records/MyRec2.c.o   -c /var/lib/jenkins/workspace/ch-pipeline_vpb_development-KCTLYUE5TMW7Z33VLFXIW7KHT6FIH4V5AIJQWV52XR2IIKDPQP2Q/c/vdmclib/src/test/records/MyRec2.c
     [exec] [ 47%] Building C object vdmclib/CMakeFiles/vdmclib.dir/src/test/records/R1.c.o
     [exec] cd /var/lib/jenkins/workspace/ch-pipeline_vpb_development-KCTLYUE5TMW7Z33VLFXIW7KHT6FIH4V5AIJQWV52XR2IIKDPQP2Q/c/vdmclib && /usr/bin/cc   -I/var/lib/jenkins/workspace/ch-pipeline_vpb_development-KCTLYUE5TMW7Z33VLFXIW7KHT6FIH4V5AIJQWV52XR2IIKDPQP2Q/c/vdmclib -I/var/lib/jenkins/workspace/ch-pipeline_vpb_development-KCTLYUE5TMW7Z33VLFXIW7KHT6FIH4V5AIJQWV52XR2IIKDPQP2Q/c/vdmclib/src/test/resources -I/var/lib/jenkins/workspace/ch-pipeline_vpb_development-KCTLYUE5TMW7Z33VLFXIW7KHT6FIH4V5AIJQWV52XR2IIKDPQP2Q/c/vdmclib/src/main -I/var/lib/jenkins/workspace/ch-pipeline_vpb_development-KCTLYUE5TMW7Z33VLFXIW7KHT6FIH4V5AIJQWV52XR2IIKDPQP2Q/c/vdmclib/src/main/classes -I/var/lib/jenkins/workspace/ch-pipeline_vpb_development-KCTLYUE5TMW7Z33VLFXIW7KHT6FIH4V5AIJQWV52XR2IIKDPQP2Q/c/third_party/googletest/googletest/include  -Wall -fmessage-length=0 -std=c89   -o CMakeFiles/vdmclib.dir/src/test/records/R1.c.o   -c /var/lib/jenkins/workspace/ch-pipeline_vpb_development-KCTLYUE5TMW7Z33VLFXIW7KHT6FIH4V5AIJQWV52XR2IIKDPQP2Q/c/vdmclib/src/test/records/R1.c
     [exec] [ 49%] Building C object vdmclib/CMakeFiles/vdmclib.dir/src/test/typeoftest.c.o
     [exec] cd /var/lib/jenkins/workspace/ch-pipeline_vpb_development-KCTLYUE5TMW7Z33VLFXIW7KHT6FIH4V5AIJQWV52XR2IIKDPQP2Q/c/vdmclib && /usr/bin/cc   -I/var/lib/jenkins/workspace/ch-pipeline_vpb_development-KCTLYUE5TMW7Z33VLFXIW7KHT6FIH4V5AIJQWV52XR2IIKDPQP2Q/c/vdmclib -I/var/lib/jenkins/workspace/ch-pipeline_vpb_development-KCTLYUE5TMW7Z33VLFXIW7KHT6FIH4V5AIJQWV52XR2IIKDPQP2Q/c/vdmclib/src/test/resources -I/var/lib/jenkins/workspace/ch-pipeline_vpb_development-KCTLYUE5TMW7Z33VLFXIW7KHT6FIH4V5AIJQWV52XR2IIKDPQP2Q/c/vdmclib/src/main -I/var/lib/jenkins/workspace/ch-pipeline_vpb_development-KCTLYUE5TMW7Z33VLFXIW7KHT6FIH4V5AIJQWV52XR2IIKDPQP2Q/c/vdmclib/src/main/classes -I/var/lib/jenkins/workspace/ch-pipeline_vpb_development-KCTLYUE5TMW7Z33VLFXIW7KHT6FIH4V5AIJQWV52XR2IIKDPQP2Q/c/third_party/googletest/googletest/include  -Wall -fmessage-length=0 -std=c89   -o CMakeFiles/vdmclib.dir/src/test/typeoftest.c.o   -c /var/lib/jenkins/workspace/ch-pipeline_vpb_development-KCTLYUE5TMW7Z33VLFXIW7KHT6FIH4V5AIJQWV52XR2IIKDPQP2Q/c/vdmclib/src/test/typeoftest.c
     [exec] [ 50%] Building C object vdmclib/CMakeFiles/vdmclib.dir/src/test/records/RecordTest.c.o
     [exec] cd /var/lib/jenkins/workspace/ch-pipeline_vpb_development-KCTLYUE5TMW7Z33VLFXIW7KHT6FIH4V5AIJQWV52XR2IIKDPQP2Q/c/vdmclib && /usr/bin/cc   -I/var/lib/jenkins/workspace/ch-pipeline_vpb_development-KCTLYUE5TMW7Z33VLFXIW7KHT6FIH4V5AIJQWV52XR2IIKDPQP2Q/c/vdmclib -I/var/lib/jenkins/workspace/ch-pipeline_vpb_development-KCTLYUE5TMW7Z33VLFXIW7KHT6FIH4V5AIJQWV52XR2IIKDPQP2Q/c/vdmclib/src/test/resources -I/var/lib/jenkins/workspace/ch-pipeline_vpb_development-KCTLYUE5TMW7Z33VLFXIW7KHT6FIH4V5AIJQWV52XR2IIKDPQP2Q/c/vdmclib/src/main -I/var/lib/jenkins/workspace/ch-pipeline_vpb_development-KCTLYUE5TMW7Z33VLFXIW7KHT6FIH4V5AIJQWV52XR2IIKDPQP2Q/c/vdmclib/src/main/classes -I/var/lib/jenkins/workspace/ch-pipeline_vpb_development-KCTLYUE5TMW7Z33VLFXIW7KHT6FIH4V5AIJQWV52XR2IIKDPQP2Q/c/third_party/googletest/googletest/include  -Wall -fmessage-length=0 -std=c89   -o CMakeFiles/vdmclib.dir/src/test/records/RecordTest.c.o   -c /var/lib/jenkins/workspace/ch-pipeline_vpb_development-KCTLYUE5TMW7Z33VLFXIW7KHT6FIH4V5AIJQWV52XR2IIKDPQP2Q/c/vdmclib/src/test/records/RecordTest.c
     [exec] [ 52%] Building CXX object vdmclib/CMakeFiles/vdmclib.dir/src/test/ClassATest.cpp.o
     [exec] cd /var/lib/jenkins/workspace/ch-pipeline_vpb_development-KCTLYUE5TMW7Z33VLFXIW7KHT6FIH4V5AIJQWV52XR2IIKDPQP2Q/c/vdmclib && /usr/bin/c++    -I/var/lib/jenkins/workspace/ch-pipeline_vpb_development-KCTLYUE5TMW7Z33VLFXIW7KHT6FIH4V5AIJQWV52XR2IIKDPQP2Q/c/vdmclib -I/var/lib/jenkins/workspace/ch-pipeline_vpb_development-KCTLYUE5TMW7Z33VLFXIW7KHT6FIH4V5AIJQWV52XR2IIKDPQP2Q/c/vdmclib/src/test/resources -I/var/lib/jenkins/workspace/ch-pipeline_vpb_development-KCTLYUE5TMW7Z33VLFXIW7KHT6FIH4V5AIJQWV52XR2IIKDPQP2Q/c/vdmclib/src/main -I/var/lib/jenkins/workspace/ch-pipeline_vpb_development-KCTLYUE5TMW7Z33VLFXIW7KHT6FIH4V5AIJQWV52XR2IIKDPQP2Q/c/vdmclib/src/main/classes -I/var/lib/jenkins/workspace/ch-pipeline_vpb_development-KCTLYUE5TMW7Z33VLFXIW7KHT6FIH4V5AIJQWV52XR2IIKDPQP2Q/c/third_party/googletest/googletest/include  -fmessage-length=0   -o CMakeFiles/vdmclib.dir/src/test/ClassATest.cpp.o -c /var/lib/jenkins/workspace/ch-pipeline_vpb_development-KCTLYUE5TMW7Z33VLFXIW7KHT6FIH4V5AIJQWV52XR2IIKDPQP2Q/c/vdmclib/src/test/ClassATest.cpp
     [exec] [ 54%] Building CXX object vdmclib/CMakeFiles/vdmclib.dir/src/test/ClassBTest.cpp.o
     [exec] cd /var/lib/jenkins/workspace/ch-pipeline_vpb_development-KCTLYUE5TMW7Z33VLFXIW7KHT6FIH4V5AIJQWV52XR2IIKDPQP2Q/c/vdmclib && /usr/bin/c++    -I/var/lib/jenkins/workspace/ch-pipeline_vpb_development-KCTLYUE5TMW7Z33VLFXIW7KHT6FIH4V5AIJQWV52XR2IIKDPQP2Q/c/vdmclib -I/var/lib/jenkins/workspace/ch-pipeline_vpb_development-KCTLYUE5TMW7Z33VLFXIW7KHT6FIH4V5AIJQWV52XR2IIKDPQP2Q/c/vdmclib/src/test/resources -I/var/lib/jenkins/workspace/ch-pipeline_vpb_development-KCTLYUE5TMW7Z33VLFXIW7KHT6FIH4V5AIJQWV52XR2IIKDPQP2Q/c/vdmclib/src/main -I/var/lib/jenkins/workspace/ch-pipeline_vpb_development-KCTLYUE5TMW7Z33VLFXIW7KHT6FIH4V5AIJQWV52XR2IIKDPQP2Q/c/vdmclib/src/main/classes -I/var/lib/jenkins/workspace/ch-pipeline_vpb_development-KCTLYUE5TMW7Z33VLFXIW7KHT6FIH4V5AIJQWV52XR2IIKDPQP2Q/c/third_party/googletest/googletest/include  -fmessage-length=0   -o CMakeFiles/vdmclib.dir/src/test/ClassBTest.cpp.o -c /var/lib/jenkins/workspace/ch-pipeline_vpb_development-KCTLYUE5TMW7Z33VLFXIW7KHT6FIH4V5AIJQWV52XR2IIKDPQP2Q/c/vdmclib/src/test/ClassBTest.cpp
     [exec] [ 56%] Building CXX object vdmclib/CMakeFiles/vdmclib.dir/src/test/ClassCSV_Tests.cpp.o
     [exec] cd /var/lib/jenkins/workspace/ch-pipeline_vpb_development-KCTLYUE5TMW7Z33VLFXIW7KHT6FIH4V5AIJQWV52XR2IIKDPQP2Q/c/vdmclib && /usr/bin/c++    -I/var/lib/jenkins/workspace/ch-pipeline_vpb_development-KCTLYUE5TMW7Z33VLFXIW7KHT6FIH4V5AIJQWV52XR2IIKDPQP2Q/c/vdmclib -I/var/lib/jenkins/workspace/ch-pipeline_vpb_development-KCTLYUE5TMW7Z33VLFXIW7KHT6FIH4V5AIJQWV52XR2IIKDPQP2Q/c/vdmclib/src/test/resources -I/var/lib/jenkins/workspace/ch-pipeline_vpb_development-KCTLYUE5TMW7Z33VLFXIW7KHT6FIH4V5AIJQWV52XR2IIKDPQP2Q/c/vdmclib/src/main -I/var/lib/jenkins/workspace/ch-pipeline_vpb_development-KCTLYUE5TMW7Z33VLFXIW7KHT6FIH4V5AIJQWV52XR2IIKDPQP2Q/c/vdmclib/src/main/classes -I/var/lib/jenkins/workspace/ch-pipeline_vpb_development-KCTLYUE5TMW7Z33VLFXIW7KHT6FIH4V5AIJQWV52XR2IIKDPQP2Q/c/third_party/googletest/googletest/include  -fmessage-length=0   -o CMakeFiles/vdmclib.dir/src/test/ClassCSV_Tests.cpp.o -c /var/lib/jenkins/workspace/ch-pipeline_vpb_development-KCTLYUE5TMW7Z33VLFXIW7KHT6FIH4V5AIJQWV52XR2IIKDPQP2Q/c/vdmclib/src/test/ClassCSV_Tests.cpp
     [exec] [ 58%] Building CXX object vdmclib/CMakeFiles/vdmclib.dir/src/test/ClassIO_Tests.cpp.o
     [exec] cd /var/lib/jenkins/workspace/ch-pipeline_vpb_development-KCTLYUE5TMW7Z33VLFXIW7KHT6FIH4V5AIJQWV52XR2IIKDPQP2Q/c/vdmclib && /usr/bin/c++    -I/var/lib/jenkins/workspace/ch-pipeline_vpb_development-KCTLYUE5TMW7Z33VLFXIW7KHT6FIH4V5AIJQWV52XR2IIKDPQP2Q/c/vdmclib -I/var/lib/jenkins/workspace/ch-pipeline_vpb_development-KCTLYUE5TMW7Z33VLFXIW7KHT6FIH4V5AIJQWV52XR2IIKDPQP2Q/c/vdmclib/src/test/resources -I/var/lib/jenkins/workspace/ch-pipeline_vpb_development-KCTLYUE5TMW7Z33VLFXIW7KHT6FIH4V5AIJQWV52XR2IIKDPQP2Q/c/vdmclib/src/main -I/var/lib/jenkins/workspace/ch-pipeline_vpb_development-KCTLYUE5TMW7Z33VLFXIW7KHT6FIH4V5AIJQWV52XR2IIKDPQP2Q/c/vdmclib/src/main/classes -I/var/lib/jenkins/workspace/ch-pipeline_vpb_development-KCTLYUE5TMW7Z33VLFXIW7KHT6FIH4V5AIJQWV52XR2IIKDPQP2Q/c/third_party/googletest/googletest/include  -fmessage-length=0   -o CMakeFiles/vdmclib.dir/src/test/ClassIO_Tests.cpp.o -c /var/lib/jenkins/workspace/ch-pipeline_vpb_development-KCTLYUE5TMW7Z33VLFXIW7KHT6FIH4V5AIJQWV52XR2IIKDPQP2Q/c/vdmclib/src/test/ClassIO_Tests.cpp
     [exec] [ 60%] Building CXX object vdmclib/CMakeFiles/vdmclib.dir/src/test/ClassCTest.cpp.o
     [exec] cd /var/lib/jenkins/workspace/ch-pipeline_vpb_development-KCTLYUE5TMW7Z33VLFXIW7KHT6FIH4V5AIJQWV52XR2IIKDPQP2Q/c/vdmclib && /usr/bin/c++    -I/var/lib/jenkins/workspace/ch-pipeline_vpb_development-KCTLYUE5TMW7Z33VLFXIW7KHT6FIH4V5AIJQWV52XR2IIKDPQP2Q/c/vdmclib -I/var/lib/jenkins/workspace/ch-pipeline_vpb_development-KCTLYUE5TMW7Z33VLFXIW7KHT6FIH4V5AIJQWV52XR2IIKDPQP2Q/c/vdmclib/src/test/resources -I/var/lib/jenkins/workspace/ch-pipeline_vpb_development-KCTLYUE5TMW7Z33VLFXIW7KHT6FIH4V5AIJQWV52XR2IIKDPQP2Q/c/vdmclib/src/main -I/var/lib/jenkins/workspace/ch-pipeline_vpb_development-KCTLYUE5TMW7Z33VLFXIW7KHT6FIH4V5AIJQWV52XR2IIKDPQP2Q/c/vdmclib/src/main/classes -I/var/lib/jenkins/workspace/ch-pipeline_vpb_development-KCTLYUE5TMW7Z33VLFXIW7KHT6FIH4V5AIJQWV52XR2IIKDPQP2Q/c/third_party/googletest/googletest/include  -fmessage-length=0   -o CMakeFiles/vdmclib.dir/src/test/ClassCTest.cpp.o -c /var/lib/jenkins/workspace/ch-pipeline_vpb_development-KCTLYUE5TMW7Z33VLFXIW7KHT6FIH4V5AIJQWV52XR2IIKDPQP2Q/c/vdmclib/src/test/ClassCTest.cpp
     [exec] [ 62%] Building CXX object vdmclib/CMakeFiles/vdmclib.dir/src/test/ClassPrivateCallABC_Tests.cpp.o
     [exec] cd /var/lib/jenkins/workspace/ch-pipeline_vpb_development-KCTLYUE5TMW7Z33VLFXIW7KHT6FIH4V5AIJQWV52XR2IIKDPQP2Q/c/vdmclib && /usr/bin/c++    -I/var/lib/jenkins/workspace/ch-pipeline_vpb_development-KCTLYUE5TMW7Z33VLFXIW7KHT6FIH4V5AIJQWV52XR2IIKDPQP2Q/c/vdmclib -I/var/lib/jenkins/workspace/ch-pipeline_vpb_development-KCTLYUE5TMW7Z33VLFXIW7KHT6FIH4V5AIJQWV52XR2IIKDPQP2Q/c/vdmclib/src/test/resources -I/var/lib/jenkins/workspace/ch-pipeline_vpb_development-KCTLYUE5TMW7Z33VLFXIW7KHT6FIH4V5AIJQWV52XR2IIKDPQP2Q/c/vdmclib/src/main -I/var/lib/jenkins/workspace/ch-pipeline_vpb_development-KCTLYUE5TMW7Z33VLFXIW7KHT6FIH4V5AIJQWV52XR2IIKDPQP2Q/c/vdmclib/src/main/classes -I/var/lib/jenkins/workspace/ch-pipeline_vpb_development-KCTLYUE5TMW7Z33VLFXIW7KHT6FIH4V5AIJQWV52XR2IIKDPQP2Q/c/third_party/googletest/googletest/include  -fmessage-length=0   -o CMakeFiles/vdmclib.dir/src/test/ClassPrivateCallABC_Tests.cpp.o -c /var/lib/jenkins/workspace/ch-pipeline_vpb_development-KCTLYUE5TMW7Z33VLFXIW7KHT6FIH4V5AIJQWV52XR2IIKDPQP2Q/c/vdmclib/src/test/ClassPrivateCallABC_Tests.cpp
     [exec] [ 64%] Building CXX object vdmclib/CMakeFiles/vdmclib.dir/src/test/ClassPrivateFieldABC_Tests.cpp.o
     [exec] cd /var/lib/jenkins/workspace/ch-pipeline_vpb_development-KCTLYUE5TMW7Z33VLFXIW7KHT6FIH4V5AIJQWV52XR2IIKDPQP2Q/c/vdmclib && /usr/bin/c++    -I/var/lib/jenkins/workspace/ch-pipeline_vpb_development-KCTLYUE5TMW7Z33VLFXIW7KHT6FIH4V5AIJQWV52XR2IIKDPQP2Q/c/vdmclib -I/var/lib/jenkins/workspace/ch-pipeline_vpb_development-KCTLYUE5TMW7Z33VLFXIW7KHT6FIH4V5AIJQWV52XR2IIKDPQP2Q/c/vdmclib/src/test/resources -I/var/lib/jenkins/workspace/ch-pipeline_vpb_development-KCTLYUE5TMW7Z33VLFXIW7KHT6FIH4V5AIJQWV52XR2IIKDPQP2Q/c/vdmclib/src/main -I/var/lib/jenkins/workspace/ch-pipeline_vpb_development-KCTLYUE5TMW7Z33VLFXIW7KHT6FIH4V5AIJQWV52XR2IIKDPQP2Q/c/vdmclib/src/main/classes -I/var/lib/jenkins/workspace/ch-pipeline_vpb_development-KCTLYUE5TMW7Z33VLFXIW7KHT6FIH4V5AIJQWV52XR2IIKDPQP2Q/c/third_party/googletest/googletest/include  -fmessage-length=0   -o CMakeFiles/vdmclib.dir/src/test/ClassPrivateFieldABC_Tests.cpp.o -c /var/lib/jenkins/workspace/ch-pipeline_vpb_development-KCTLYUE5TMW7Z33VLFXIW7KHT6FIH4V5AIJQWV52XR2IIKDPQP2Q/c/vdmclib/src/test/ClassPrivateFieldABC_Tests.cpp
     [exec] [ 66%] Building CXX object vdmclib/CMakeFiles/vdmclib.dir/src/test/ClassPublicCallABC_Tests.cpp.o
     [exec] cd /var/lib/jenkins/workspace/ch-pipeline_vpb_development-KCTLYUE5TMW7Z33VLFXIW7KHT6FIH4V5AIJQWV52XR2IIKDPQP2Q/c/vdmclib && /usr/bin/c++    -I/var/lib/jenkins/workspace/ch-pipeline_vpb_development-KCTLYUE5TMW7Z33VLFXIW7KHT6FIH4V5AIJQWV52XR2IIKDPQP2Q/c/vdmclib -I/var/lib/jenkins/workspace/ch-pipeline_vpb_development-KCTLYUE5TMW7Z33VLFXIW7KHT6FIH4V5AIJQWV52XR2IIKDPQP2Q/c/vdmclib/src/test/resources -I/var/lib/jenkins/workspace/ch-pipeline_vpb_development-KCTLYUE5TMW7Z33VLFXIW7KHT6FIH4V5AIJQWV52XR2IIKDPQP2Q/c/vdmclib/src/main -I/var/lib/jenkins/workspace/ch-pipeline_vpb_development-KCTLYUE5TMW7Z33VLFXIW7KHT6FIH4V5AIJQWV52XR2IIKDPQP2Q/c/vdmclib/src/main/classes -I/var/lib/jenkins/workspace/ch-pipeline_vpb_development-KCTLYUE5TMW7Z33VLFXIW7KHT6FIH4V5AIJQWV52XR2IIKDPQP2Q/c/third_party/googletest/googletest/include  -fmessage-length=0   -o CMakeFiles/vdmclib.dir/src/test/ClassPublicCallABC_Tests.cpp.o -c /var/lib/jenkins/workspace/ch-pipeline_vpb_development-KCTLYUE5TMW7Z33VLFXIW7KHT6FIH4V5AIJQWV52XR2IIKDPQP2Q/c/vdmclib/src/test/ClassPublicCallABC_Tests.cpp
     [exec] [ 68%] Building CXX object vdmclib/CMakeFiles/vdmclib.dir/src/test/ClassPublicFieldABC_Tests.cpp.o
     [exec] cd /var/lib/jenkins/workspace/ch-pipeline_vpb_development-KCTLYUE5TMW7Z33VLFXIW7KHT6FIH4V5AIJQWV52XR2IIKDPQP2Q/c/vdmclib && /usr/bin/c++    -I/var/lib/jenkins/workspace/ch-pipeline_vpb_development-KCTLYUE5TMW7Z33VLFXIW7KHT6FIH4V5AIJQWV52XR2IIKDPQP2Q/c/vdmclib -I/var/lib/jenkins/workspace/ch-pipeline_vpb_development-KCTLYUE5TMW7Z33VLFXIW7KHT6FIH4V5AIJQWV52XR2IIKDPQP2Q/c/vdmclib/src/test/resources -I/var/lib/jenkins/workspace/ch-pipeline_vpb_development-KCTLYUE5TMW7Z33VLFXIW7KHT6FIH4V5AIJQWV52XR2IIKDPQP2Q/c/vdmclib/src/main -I/var/lib/jenkins/workspace/ch-pipeline_vpb_development-KCTLYUE5TMW7Z33VLFXIW7KHT6FIH4V5AIJQWV52XR2IIKDPQP2Q/c/vdmclib/src/main/classes -I/var/lib/jenkins/workspace/ch-pipeline_vpb_development-KCTLYUE5TMW7Z33VLFXIW7KHT6FIH4V5AIJQWV52XR2IIKDPQP2Q/c/third_party/googletest/googletest/include  -fmessage-length=0   -o CMakeFiles/vdmclib.dir/src/test/ClassPublicFieldABC_Tests.cpp.o -c /var/lib/jenkins/workspace/ch-pipeline_vpb_development-KCTLYUE5TMW7Z33VLFXIW7KHT6FIH4V5AIJQWV52XR2IIKDPQP2Q/c/vdmclib/src/test/ClassPublicFieldABC_Tests.cpp
     [exec] [ 70%] Building CXX object vdmclib/CMakeFiles/vdmclib.dir/src/test/ExpressionForLoop.cpp.o
     [exec] cd /var/lib/jenkins/workspace/ch-pipeline_vpb_development-KCTLYUE5TMW7Z33VLFXIW7KHT6FIH4V5AIJQWV52XR2IIKDPQP2Q/c/vdmclib && /usr/bin/c++    -I/var/lib/jenkins/workspace/ch-pipeline_vpb_development-KCTLYUE5TMW7Z33VLFXIW7KHT6FIH4V5AIJQWV52XR2IIKDPQP2Q/c/vdmclib -I/var/lib/jenkins/workspace/ch-pipeline_vpb_development-KCTLYUE5TMW7Z33VLFXIW7KHT6FIH4V5AIJQWV52XR2IIKDPQP2Q/c/vdmclib/src/test/resources -I/var/lib/jenkins/workspace/ch-pipeline_vpb_development-KCTLYUE5TMW7Z33VLFXIW7KHT6FIH4V5AIJQWV52XR2IIKDPQP2Q/c/vdmclib/src/main -I/var/lib/jenkins/workspace/ch-pipeline_vpb_development-KCTLYUE5TMW7Z33VLFXIW7KHT6FIH4V5AIJQWV52XR2IIKDPQP2Q/c/vdmclib/src/main/classes -I/var/lib/jenkins/workspace/ch-pipeline_vpb_development-KCTLYUE5TMW7Z33VLFXIW7KHT6FIH4V5AIJQWV52XR2IIKDPQP2Q/c/third_party/googletest/googletest/include  -fmessage-length=0   -o CMakeFiles/vdmclib.dir/src/test/ExpressionForLoop.cpp.o -c /var/lib/jenkins/workspace/ch-pipeline_vpb_development-KCTLYUE5TMW7Z33VLFXIW7KHT6FIH4V5AIJQWV52XR2IIKDPQP2Q/c/vdmclib/src/test/ExpressionForLoop.cpp
     [exec] [ 72%] Building CXX object vdmclib/CMakeFiles/vdmclib.dir/src/test/ExpressionsBoolean_Tests.cpp.o
     [exec] cd /var/lib/jenkins/workspace/ch-pipeline_vpb_development-KCTLYUE5TMW7Z33VLFXIW7KHT6FIH4V5AIJQWV52XR2IIKDPQP2Q/c/vdmclib && /usr/bin/c++    -I/var/lib/jenkins/workspace/ch-pipeline_vpb_development-KCTLYUE5TMW7Z33VLFXIW7KHT6FIH4V5AIJQWV52XR2IIKDPQP2Q/c/vdmclib -I/var/lib/jenkins/workspace/ch-pipeline_vpb_development-KCTLYUE5TMW7Z33VLFXIW7KHT6FIH4V5AIJQWV52XR2IIKDPQP2Q/c/vdmclib/src/test/resources -I/var/lib/jenkins/workspace/ch-pipeline_vpb_development-KCTLYUE5TMW7Z33VLFXIW7KHT6FIH4V5AIJQWV52XR2IIKDPQP2Q/c/vdmclib/src/main -I/var/lib/jenkins/workspace/ch-pipeline_vpb_development-KCTLYUE5TMW7Z33VLFXIW7KHT6FIH4V5AIJQWV52XR2IIKDPQP2Q/c/vdmclib/src/main/classes -I/var/lib/jenkins/workspace/ch-pipeline_vpb_development-KCTLYUE5TMW7Z33VLFXIW7KHT6FIH4V5AIJQWV52XR2IIKDPQP2Q/c/third_party/googletest/googletest/include  -fmessage-length=0   -o CMakeFiles/vdmclib.dir/src/test/ExpressionsBoolean_Tests.cpp.o -c /var/lib/jenkins/workspace/ch-pipeline_vpb_development-KCTLYUE5TMW7Z33VLFXIW7KHT6FIH4V5AIJQWV52XR2IIKDPQP2Q/c/vdmclib/src/test/ExpressionsBoolean_Tests.cpp
     [exec] [ 74%] Building CXX object vdmclib/CMakeFiles/vdmclib.dir/src/test/ExpressionsMap_Tests.cpp.o
     [exec] cd /var/lib/jenkins/workspace/ch-pipeline_vpb_development-KCTLYUE5TMW7Z33VLFXIW7KHT6FIH4V5AIJQWV52XR2IIKDPQP2Q/c/vdmclib && /usr/bin/c++    -I/var/lib/jenkins/workspace/ch-pipeline_vpb_development-KCTLYUE5TMW7Z33VLFXIW7KHT6FIH4V5AIJQWV52XR2IIKDPQP2Q/c/vdmclib -I/var/lib/jenkins/workspace/ch-pipeline_vpb_development-KCTLYUE5TMW7Z33VLFXIW7KHT6FIH4V5AIJQWV52XR2IIKDPQP2Q/c/vdmclib/src/test/resources -I/var/lib/jenkins/workspace/ch-pipeline_vpb_development-KCTLYUE5TMW7Z33VLFXIW7KHT6FIH4V5AIJQWV52XR2IIKDPQP2Q/c/vdmclib/src/main -I/var/lib/jenkins/workspace/ch-pipeline_vpb_development-KCTLYUE5TMW7Z33VLFXIW7KHT6FIH4V5AIJQWV52XR2IIKDPQP2Q/c/vdmclib/src/main/classes -I/var/lib/jenkins/workspace/ch-pipeline_vpb_development-KCTLYUE5TMW7Z33VLFXIW7KHT6FIH4V5AIJQWV52XR2IIKDPQP2Q/c/third_party/googletest/googletest/include  -fmessage-length=0   -o CMakeFiles/vdmclib.dir/src/test/ExpressionsMap_Tests.cpp.o -c /var/lib/jenkins/workspace/ch-pipeline_vpb_development-KCTLYUE5TMW7Z33VLFXIW7KHT6FIH4V5AIJQWV52XR2IIKDPQP2Q/c/vdmclib/src/test/ExpressionsMap_Tests.cpp
     [exec] [ 76%] Building CXX object vdmclib/CMakeFiles/vdmclib.dir/src/test/ExpressionsNumeric_Tests.cpp.o
     [exec] cd /var/lib/jenkins/workspace/ch-pipeline_vpb_development-KCTLYUE5TMW7Z33VLFXIW7KHT6FIH4V5AIJQWV52XR2IIKDPQP2Q/c/vdmclib && /usr/bin/c++    -I/var/lib/jenkins/workspace/ch-pipeline_vpb_development-KCTLYUE5TMW7Z33VLFXIW7KHT6FIH4V5AIJQWV52XR2IIKDPQP2Q/c/vdmclib -I/var/lib/jenkins/workspace/ch-pipeline_vpb_development-KCTLYUE5TMW7Z33VLFXIW7KHT6FIH4V5AIJQWV52XR2IIKDPQP2Q/c/vdmclib/src/test/resources -I/var/lib/jenkins/workspace/ch-pipeline_vpb_development-KCTLYUE5TMW7Z33VLFXIW7KHT6FIH4V5AIJQWV52XR2IIKDPQP2Q/c/vdmclib/src/main -I/var/lib/jenkins/workspace/ch-pipeline_vpb_development-KCTLYUE5TMW7Z33VLFXIW7KHT6FIH4V5AIJQWV52XR2IIKDPQP2Q/c/vdmclib/src/main/classes -I/var/lib/jenkins/workspace/ch-pipeline_vpb_development-KCTLYUE5TMW7Z33VLFXIW7KHT6FIH4V5AIJQWV52XR2IIKDPQP2Q/c/third_party/googletest/googletest/include  -fmessage-length=0   -o CMakeFiles/vdmclib.dir/src/test/ExpressionsNumeric_Tests.cpp.o -c /var/lib/jenkins/workspace/ch-pipeline_vpb_development-KCTLYUE5TMW7Z33VLFXIW7KHT6FIH4V5AIJQWV52XR2IIKDPQP2Q/c/vdmclib/src/test/ExpressionsNumeric_Tests.cpp
     [exec] [ 78%] Building CXX object vdmclib/CMakeFiles/vdmclib.dir/src/test/ExpressionsProduct_Tests.cpp.o
     [exec] cd /var/lib/jenkins/workspace/ch-pipeline_vpb_development-KCTLYUE5TMW7Z33VLFXIW7KHT6FIH4V5AIJQWV52XR2IIKDPQP2Q/c/vdmclib && /usr/bin/c++    -I/var/lib/jenkins/workspace/ch-pipeline_vpb_development-KCTLYUE5TMW7Z33VLFXIW7KHT6FIH4V5AIJQWV52XR2IIKDPQP2Q/c/vdmclib -I/var/lib/jenkins/workspace/ch-pipeline_vpb_development-KCTLYUE5TMW7Z33VLFXIW7KHT6FIH4V5AIJQWV52XR2IIKDPQP2Q/c/vdmclib/src/test/resources -I/var/lib/jenkins/workspace/ch-pipeline_vpb_development-KCTLYUE5TMW7Z33VLFXIW7KHT6FIH4V5AIJQWV52XR2IIKDPQP2Q/c/vdmclib/src/main -I/var/lib/jenkins/workspace/ch-pipeline_vpb_development-KCTLYUE5TMW7Z33VLFXIW7KHT6FIH4V5AIJQWV52XR2IIKDPQP2Q/c/vdmclib/src/main/classes -I/var/lib/jenkins/workspace/ch-pipeline_vpb_development-KCTLYUE5TMW7Z33VLFXIW7KHT6FIH4V5AIJQWV52XR2IIKDPQP2Q/c/third_party/googletest/googletest/include  -fmessage-length=0   -o CMakeFiles/vdmclib.dir/src/test/ExpressionsProduct_Tests.cpp.o -c /var/lib/jenkins/workspace/ch-pipeline_vpb_development-KCTLYUE5TMW7Z33VLFXIW7KHT6FIH4V5AIJQWV52XR2IIKDPQP2Q/c/vdmclib/src/test/ExpressionsProduct_Tests.cpp
     [exec] [ 80%] Building CXX object vdmclib/CMakeFiles/vdmclib.dir/src/test/ExpressionsSeq_Tests.cpp.o
     [exec] cd /var/lib/jenkins/workspace/ch-pipeline_vpb_development-KCTLYUE5TMW7Z33VLFXIW7KHT6FIH4V5AIJQWV52XR2IIKDPQP2Q/c/vdmclib && /usr/bin/c++    -I/var/lib/jenkins/workspace/ch-pipeline_vpb_development-KCTLYUE5TMW7Z33VLFXIW7KHT6FIH4V5AIJQWV52XR2IIKDPQP2Q/c/vdmclib -I/var/lib/jenkins/workspace/ch-pipeline_vpb_development-KCTLYUE5TMW7Z33VLFXIW7KHT6FIH4V5AIJQWV52XR2IIKDPQP2Q/c/vdmclib/src/test/resources -I/var/lib/jenkins/workspace/ch-pipeline_vpb_development-KCTLYUE5TMW7Z33VLFXIW7KHT6FIH4V5AIJQWV52XR2IIKDPQP2Q/c/vdmclib/src/main -I/var/lib/jenkins/workspace/ch-pipeline_vpb_development-KCTLYUE5TMW7Z33VLFXIW7KHT6FIH4V5AIJQWV52XR2IIKDPQP2Q/c/vdmclib/src/main/classes -I/var/lib/jenkins/workspace/ch-pipeline_vpb_development-KCTLYUE5TMW7Z33VLFXIW7KHT6FIH4V5AIJQWV52XR2IIKDPQP2Q/c/third_party/googletest/googletest/include  -fmessage-length=0   -o CMakeFiles/vdmclib.dir/src/test/ExpressionsSeq_Tests.cpp.o -c /var/lib/jenkins/workspace/ch-pipeline_vpb_development-KCTLYUE5TMW7Z33VLFXIW7KHT6FIH4V5AIJQWV52XR2IIKDPQP2Q/c/vdmclib/src/test/ExpressionsSeq_Tests.cpp
     [exec] [ 82%] Building CXX object vdmclib/CMakeFiles/vdmclib.dir/src/test/ExpressionsSetRandom_Tests.cpp.o
     [exec] cd /var/lib/jenkins/workspace/ch-pipeline_vpb_development-KCTLYUE5TMW7Z33VLFXIW7KHT6FIH4V5AIJQWV52XR2IIKDPQP2Q/c/vdmclib && /usr/bin/c++    -I/var/lib/jenkins/workspace/ch-pipeline_vpb_development-KCTLYUE5TMW7Z33VLFXIW7KHT6FIH4V5AIJQWV52XR2IIKDPQP2Q/c/vdmclib -I/var/lib/jenkins/workspace/ch-pipeline_vpb_development-KCTLYUE5TMW7Z33VLFXIW7KHT6FIH4V5AIJQWV52XR2IIKDPQP2Q/c/vdmclib/src/test/resources -I/var/lib/jenkins/workspace/ch-pipeline_vpb_development-KCTLYUE5TMW7Z33VLFXIW7KHT6FIH4V5AIJQWV52XR2IIKDPQP2Q/c/vdmclib/src/main -I/var/lib/jenkins/workspace/ch-pipeline_vpb_development-KCTLYUE5TMW7Z33VLFXIW7KHT6FIH4V5AIJQWV52XR2IIKDPQP2Q/c/vdmclib/src/main/classes -I/var/lib/jenkins/workspace/ch-pipeline_vpb_development-KCTLYUE5TMW7Z33VLFXIW7KHT6FIH4V5AIJQWV52XR2IIKDPQP2Q/c/third_party/googletest/googletest/include  -fmessage-length=0   -o CMakeFiles/vdmclib.dir/src/test/ExpressionsSetRandom_Tests.cpp.o -c /var/lib/jenkins/workspace/ch-pipeline_vpb_development-KCTLYUE5TMW7Z33VLFXIW7KHT6FIH4V5AIJQWV52XR2IIKDPQP2Q/c/vdmclib/src/test/ExpressionsSetRandom_Tests.cpp
     [exec] [ 84%] Building CXX object vdmclib/CMakeFiles/vdmclib.dir/src/test/ExpressionsSet_Tests.cpp.o
     [exec] cd /var/lib/jenkins/workspace/ch-pipeline_vpb_development-KCTLYUE5TMW7Z33VLFXIW7KHT6FIH4V5AIJQWV52XR2IIKDPQP2Q/c/vdmclib && /usr/bin/c++    -I/var/lib/jenkins/workspace/ch-pipeline_vpb_development-KCTLYUE5TMW7Z33VLFXIW7KHT6FIH4V5AIJQWV52XR2IIKDPQP2Q/c/vdmclib -I/var/lib/jenkins/workspace/ch-pipeline_vpb_development-KCTLYUE5TMW7Z33VLFXIW7KHT6FIH4V5AIJQWV52XR2IIKDPQP2Q/c/vdmclib/src/test/resources -I/var/lib/jenkins/workspace/ch-pipeline_vpb_development-KCTLYUE5TMW7Z33VLFXIW7KHT6FIH4V5AIJQWV52XR2IIKDPQP2Q/c/vdmclib/src/main -I/var/lib/jenkins/workspace/ch-pipeline_vpb_development-KCTLYUE5TMW7Z33VLFXIW7KHT6FIH4V5AIJQWV52XR2IIKDPQP2Q/c/vdmclib/src/main/classes -I/var/lib/jenkins/workspace/ch-pipeline_vpb_development-KCTLYUE5TMW7Z33VLFXIW7KHT6FIH4V5AIJQWV52XR2IIKDPQP2Q/c/third_party/googletest/googletest/include  -fmessage-length=0   -o CMakeFiles/vdmclib.dir/src/test/ExpressionsSet_Tests.cpp.o -c /var/lib/jenkins/workspace/ch-pipeline_vpb_development-KCTLYUE5TMW7Z33VLFXIW7KHT6FIH4V5AIJQWV52XR2IIKDPQP2Q/c/vdmclib/src/test/ExpressionsSet_Tests.cpp
     [exec] [ 86%] Building CXX object vdmclib/CMakeFiles/vdmclib.dir/src/test/Expressions_Tests.cpp.o
     [exec] cd /var/lib/jenkins/workspace/ch-pipeline_vpb_development-KCTLYUE5TMW7Z33VLFXIW7KHT6FIH4V5AIJQWV52XR2IIKDPQP2Q/c/vdmclib && /usr/bin/c++    -I/var/lib/jenkins/workspace/ch-pipeline_vpb_development-KCTLYUE5TMW7Z33VLFXIW7KHT6FIH4V5AIJQWV52XR2IIKDPQP2Q/c/vdmclib -I/var/lib/jenkins/workspace/ch-pipeline_vpb_development-KCTLYUE5TMW7Z33VLFXIW7KHT6FIH4V5AIJQWV52XR2IIKDPQP2Q/c/vdmclib/src/test/resources -I/var/lib/jenkins/workspace/ch-pipeline_vpb_development-KCTLYUE5TMW7Z33VLFXIW7KHT6FIH4V5AIJQWV52XR2IIKDPQP2Q/c/vdmclib/src/main -I/var/lib/jenkins/workspace/ch-pipeline_vpb_development-KCTLYUE5TMW7Z33VLFXIW7KHT6FIH4V5AIJQWV52XR2IIKDPQP2Q/c/vdmclib/src/main/classes -I/var/lib/jenkins/workspace/ch-pipeline_vpb_development-KCTLYUE5TMW7Z33VLFXIW7KHT6FIH4V5AIJQWV52XR2IIKDPQP2Q/c/third_party/googletest/googletest/include  -fmessage-length=0   -o CMakeFiles/vdmclib.dir/src/test/Expressions_Tests.cpp.o -c /var/lib/jenkins/workspace/ch-pipeline_vpb_development-KCTLYUE5TMW7Z33VLFXIW7KHT6FIH4V5AIJQWV52XR2IIKDPQP2Q/c/vdmclib/src/test/Expressions_Tests.cpp
     [exec] [ 88%] Building CXX object vdmclib/CMakeFiles/vdmclib.dir/src/test/GC_Tests.cpp.o
     [exec] cd /var/lib/jenkins/workspace/ch-pipeline_vpb_development-KCTLYUE5TMW7Z33VLFXIW7KHT6FIH4V5AIJQWV52XR2IIKDPQP2Q/c/vdmclib && /usr/bin/c++    -I/var/lib/jenkins/workspace/ch-pipeline_vpb_development-KCTLYUE5TMW7Z33VLFXIW7KHT6FIH4V5AIJQWV52XR2IIKDPQP2Q/c/vdmclib -I/var/lib/jenkins/workspace/ch-pipeline_vpb_development-KCTLYUE5TMW7Z33VLFXIW7KHT6FIH4V5AIJQWV52XR2IIKDPQP2Q/c/vdmclib/src/test/resources -I/var/lib/jenkins/workspace/ch-pipeline_vpb_development-KCTLYUE5TMW7Z33VLFXIW7KHT6FIH4V5AIJQWV52XR2IIKDPQP2Q/c/vdmclib/src/main -I/var/lib/jenkins/workspace/ch-pipeline_vpb_development-KCTLYUE5TMW7Z33VLFXIW7KHT6FIH4V5AIJQWV52XR2IIKDPQP2Q/c/vdmclib/src/main/classes -I/var/lib/jenkins/workspace/ch-pipeline_vpb_development-KCTLYUE5TMW7Z33VLFXIW7KHT6FIH4V5AIJQWV52XR2IIKDPQP2Q/c/third_party/googletest/googletest/include  -fmessage-length=0   -o CMakeFiles/vdmclib.dir/src/test/GC_Tests.cpp.o -c /var/lib/jenkins/workspace/ch-pipeline_vpb_development-KCTLYUE5TMW7Z33VLFXIW7KHT6FIH4V5AIJQWV52XR2IIKDPQP2Q/c/vdmclib/src/test/GC_Tests.cpp
     [exec] [ 90%] Building CXX object vdmclib/CMakeFiles/vdmclib.dir/src/test/PrettyPrint_Tests.cpp.o
     [exec] cd /var/lib/jenkins/workspace/ch-pipeline_vpb_development-KCTLYUE5TMW7Z33VLFXIW7KHT6FIH4V5AIJQWV52XR2IIKDPQP2Q/c/vdmclib && /usr/bin/c++    -I/var/lib/jenkins/workspace/ch-pipeline_vpb_development-KCTLYUE5TMW7Z33VLFXIW7KHT6FIH4V5AIJQWV52XR2IIKDPQP2Q/c/vdmclib -I/var/lib/jenkins/workspace/ch-pipeline_vpb_development-KCTLYUE5TMW7Z33VLFXIW7KHT6FIH4V5AIJQWV52XR2IIKDPQP2Q/c/vdmclib/src/test/resources -I/var/lib/jenkins/workspace/ch-pipeline_vpb_development-KCTLYUE5TMW7Z33VLFXIW7KHT6FIH4V5AIJQWV52XR2IIKDPQP2Q/c/vdmclib/src/main -I/var/lib/jenkins/workspace/ch-pipeline_vpb_development-KCTLYUE5TMW7Z33VLFXIW7KHT6FIH4V5AIJQWV52XR2IIKDPQP2Q/c/vdmclib/src/main/classes -I/var/lib/jenkins/workspace/ch-pipeline_vpb_development-KCTLYUE5TMW7Z33VLFXIW7KHT6FIH4V5AIJQWV52XR2IIKDPQP2Q/c/third_party/googletest/googletest/include  -fmessage-length=0   -o CMakeFiles/vdmclib.dir/src/test/PrettyPrint_Tests.cpp.o -c /var/lib/jenkins/workspace/ch-pipeline_vpb_development-KCTLYUE5TMW7Z33VLFXIW7KHT6FIH4V5AIJQWV52XR2IIKDPQP2Q/c/vdmclib/src/test/PrettyPrint_Tests.cpp
     [exec] [ 92%] Building CXX object vdmclib/CMakeFiles/vdmclib.dir/src/test/Statements_Record_Tests.cpp.o
     [exec] cd /var/lib/jenkins/workspace/ch-pipeline_vpb_development-KCTLYUE5TMW7Z33VLFXIW7KHT6FIH4V5AIJQWV52XR2IIKDPQP2Q/c/vdmclib && /usr/bin/c++    -I/var/lib/jenkins/workspace/ch-pipeline_vpb_development-KCTLYUE5TMW7Z33VLFXIW7KHT6FIH4V5AIJQWV52XR2IIKDPQP2Q/c/vdmclib -I/var/lib/jenkins/workspace/ch-pipeline_vpb_development-KCTLYUE5TMW7Z33VLFXIW7KHT6FIH4V5AIJQWV52XR2IIKDPQP2Q/c/vdmclib/src/test/resources -I/var/lib/jenkins/workspace/ch-pipeline_vpb_development-KCTLYUE5TMW7Z33VLFXIW7KHT6FIH4V5AIJQWV52XR2IIKDPQP2Q/c/vdmclib/src/main -I/var/lib/jenkins/workspace/ch-pipeline_vpb_development-KCTLYUE5TMW7Z33VLFXIW7KHT6FIH4V5AIJQWV52XR2IIKDPQP2Q/c/vdmclib/src/main/classes -I/var/lib/jenkins/workspace/ch-pipeline_vpb_development-KCTLYUE5TMW7Z33VLFXIW7KHT6FIH4V5AIJQWV52XR2IIKDPQP2Q/c/third_party/googletest/googletest/include  -fmessage-length=0   -o CMakeFiles/vdmclib.dir/src/test/Statements_Record_Tests.cpp.o -c /var/lib/jenkins/workspace/ch-pipeline_vpb_development-KCTLYUE5TMW7Z33VLFXIW7KHT6FIH4V5AIJQWV52XR2IIKDPQP2Q/c/vdmclib/src/test/Statements_Record_Tests.cpp
     [exec] [ 94%] Building CXX object vdmclib/CMakeFiles/vdmclib.dir/src/test/TokenType_Tests.cpp.o
     [exec] cd /var/lib/jenkins/workspace/ch-pipeline_vpb_development-KCTLYUE5TMW7Z33VLFXIW7KHT6FIH4V5AIJQWV52XR2IIKDPQP2Q/c/vdmclib && /usr/bin/c++    -I/var/lib/jenkins/workspace/ch-pipeline_vpb_development-KCTLYUE5TMW7Z33VLFXIW7KHT6FIH4V5AIJQWV52XR2IIKDPQP2Q/c/vdmclib -I/var/lib/jenkins/workspace/ch-pipeline_vpb_development-KCTLYUE5TMW7Z33VLFXIW7KHT6FIH4V5AIJQWV52XR2IIKDPQP2Q/c/vdmclib/src/test/resources -I/var/lib/jenkins/workspace/ch-pipeline_vpb_development-KCTLYUE5TMW7Z33VLFXIW7KHT6FIH4V5AIJQWV52XR2IIKDPQP2Q/c/vdmclib/src/main -I/var/lib/jenkins/workspace/ch-pipeline_vpb_development-KCTLYUE5TMW7Z33VLFXIW7KHT6FIH4V5AIJQWV52XR2IIKDPQP2Q/c/vdmclib/src/main/classes -I/var/lib/jenkins/workspace/ch-pipeline_vpb_development-KCTLYUE5TMW7Z33VLFXIW7KHT6FIH4V5AIJQWV52XR2IIKDPQP2Q/c/third_party/googletest/googletest/include  -fmessage-length=0   -o CMakeFiles/vdmclib.dir/src/test/TokenType_Tests.cpp.o -c /var/lib/jenkins/workspace/ch-pipeline_vpb_development-KCTLYUE5TMW7Z33VLFXIW7KHT6FIH4V5AIJQWV52XR2IIKDPQP2Q/c/vdmclib/src/test/TokenType_Tests.cpp
     [exec] [ 96%] Building CXX object vdmclib/CMakeFiles/vdmclib.dir/src/test/StructOffsetTest_Tests.cpp.o
     [exec] cd /var/lib/jenkins/workspace/ch-pipeline_vpb_development-KCTLYUE5TMW7Z33VLFXIW7KHT6FIH4V5AIJQWV52XR2IIKDPQP2Q/c/vdmclib && /usr/bin/c++    -I/var/lib/jenkins/workspace/ch-pipeline_vpb_development-KCTLYUE5TMW7Z33VLFXIW7KHT6FIH4V5AIJQWV52XR2IIKDPQP2Q/c/vdmclib -I/var/lib/jenkins/workspace/ch-pipeline_vpb_development-KCTLYUE5TMW7Z33VLFXIW7KHT6FIH4V5AIJQWV52XR2IIKDPQP2Q/c/vdmclib/src/test/resources -I/var/lib/jenkins/workspace/ch-pipeline_vpb_development-KCTLYUE5TMW7Z33VLFXIW7KHT6FIH4V5AIJQWV52XR2IIKDPQP2Q/c/vdmclib/src/main -I/var/lib/jenkins/workspace/ch-pipeline_vpb_development-KCTLYUE5TMW7Z33VLFXIW7KHT6FIH4V5AIJQWV52XR2IIKDPQP2Q/c/vdmclib/src/main/classes -I/var/lib/jenkins/workspace/ch-pipeline_vpb_development-KCTLYUE5TMW7Z33VLFXIW7KHT6FIH4V5AIJQWV52XR2IIKDPQP2Q/c/third_party/googletest/googletest/include  -fmessage-length=0   -o CMakeFiles/vdmclib.dir/src/test/StructOffsetTest_Tests.cpp.o -c /var/lib/jenkins/workspace/ch-pipeline_vpb_development-KCTLYUE5TMW7Z33VLFXIW7KHT6FIH4V5AIJQWV52XR2IIKDPQP2Q/c/vdmclib/src/test/StructOffsetTest_Tests.cpp
     [exec] [ 98%] Building CXX object vdmclib/CMakeFiles/vdmclib.dir/src/test/TypeofTest_Tests.cpp.o
     [exec] cd /var/lib/jenkins/workspace/ch-pipeline_vpb_development-KCTLYUE5TMW7Z33VLFXIW7KHT6FIH4V5AIJQWV52XR2IIKDPQP2Q/c/vdmclib && /usr/bin/c++    -I/var/lib/jenkins/workspace/ch-pipeline_vpb_development-KCTLYUE5TMW7Z33VLFXIW7KHT6FIH4V5AIJQWV52XR2IIKDPQP2Q/c/vdmclib -I/var/lib/jenkins/workspace/ch-pipeline_vpb_development-KCTLYUE5TMW7Z33VLFXIW7KHT6FIH4V5AIJQWV52XR2IIKDPQP2Q/c/vdmclib/src/test/resources -I/var/lib/jenkins/workspace/ch-pipeline_vpb_development-KCTLYUE5TMW7Z33VLFXIW7KHT6FIH4V5AIJQWV52XR2IIKDPQP2Q/c/vdmclib/src/main -I/var/lib/jenkins/workspace/ch-pipeline_vpb_development-KCTLYUE5TMW7Z33VLFXIW7KHT6FIH4V5AIJQWV52XR2IIKDPQP2Q/c/vdmclib/src/main/classes -I/var/lib/jenkins/workspace/ch-pipeline_vpb_development-KCTLYUE5TMW7Z33VLFXIW7KHT6FIH4V5AIJQWV52XR2IIKDPQP2Q/c/third_party/googletest/googletest/include  -fmessage-length=0   -o CMakeFiles/vdmclib.dir/src/test/TypeofTest_Tests.cpp.o -c /var/lib/jenkins/workspace/ch-pipeline_vpb_development-KCTLYUE5TMW7Z33VLFXIW7KHT6FIH4V5AIJQWV52XR2IIKDPQP2Q/c/vdmclib/src/test/TypeofTest_Tests.cpp
     [exec] [100%] Linking CXX executable target/vdmclib
     [exec] cd /var/lib/jenkins/workspace/ch-pipeline_vpb_development-KCTLYUE5TMW7Z33VLFXIW7KHT6FIH4V5AIJQWV52XR2IIKDPQP2Q/c/vdmclib && /usr/bin/cmake -E cmake_link_script CMakeFiles/vdmclib.dir/link.txt --verbose=1
     [exec] /usr/bin/c++    -fmessage-length=0   CMakeFiles/vdmclib.dir/src/main/CSVLib.c.o CMakeFiles/vdmclib.dir/src/main/IOLib.c.o CMakeFiles/vdmclib.dir/src/main/MATHLib.c.o CMakeFiles/vdmclib.dir/src/main/PatternBindMatch.c.o CMakeFiles/vdmclib.dir/src/main/PrettyPrint.c.o CMakeFiles/vdmclib.dir/src/main/TypedValue.c.o CMakeFiles/vdmclib.dir/src/main/VdmBasicTypes.c.o CMakeFiles/vdmclib.dir/src/main/VdmClass.c.o CMakeFiles/vdmclib.dir/src/main/VdmGC.c.o CMakeFiles/vdmclib.dir/src/main/VdmMap.c.o CMakeFiles/vdmclib.dir/src/main/VdmProduct.c.o CMakeFiles/vdmclib.dir/src/main/VdmSeq.c.o CMakeFiles/vdmclib.dir/src/main/VdmSet.c.o CMakeFiles/vdmclib.dir/src/main/VdmUnpackString.c.o CMakeFiles/vdmclib.dir/src/test/classes/A.c.o CMakeFiles/vdmclib.dir/src/test/classes/B.c.o CMakeFiles/vdmclib.dir/src/test/classes/C.c.o CMakeFiles/vdmclib.dir/src/test/records/MyRec.c.o CMakeFiles/vdmclib.dir/src/test/records/MyRec2.c.o CMakeFiles/vdmclib.dir/src/test/records/R1.c.o CMakeFiles/vdmclib.dir/src/test/records/RecordTest.c.o CMakeFiles/vdmclib.dir/src/test/typeoftest.c.o CMakeFiles/vdmclib.dir/src/test/ClassATest.cpp.o CMakeFiles/vdmclib.dir/src/test/ClassBTest.cpp.o CMakeFiles/vdmclib.dir/src/test/ClassCSV_Tests.cpp.o CMakeFiles/vdmclib.dir/src/test/ClassCTest.cpp.o CMakeFiles/vdmclib.dir/src/test/ClassIO_Tests.cpp.o CMakeFiles/vdmclib.dir/src/test/ClassPrivateCallABC_Tests.cpp.o CMakeFiles/vdmclib.dir/src/test/ClassPrivateFieldABC_Tests.cpp.o CMakeFiles/vdmclib.dir/src/test/ClassPublicCallABC_Tests.cpp.o CMakeFiles/vdmclib.dir/src/test/ClassPublicFieldABC_Tests.cpp.o CMakeFiles/vdmclib.dir/src/test/ExpressionForLoop.cpp.o CMakeFiles/vdmclib.dir/src/test/ExpressionsBoolean_Tests.cpp.o CMakeFiles/vdmclib.dir/src/test/ExpressionsMap_Tests.cpp.o CMakeFiles/vdmclib.dir/src/test/ExpressionsNumeric_Tests.cpp.o CMakeFiles/vdmclib.dir/src/test/ExpressionsProduct_Tests.cpp.o CMakeFiles/vdmclib.dir/src/test/ExpressionsSeq_Tests.cpp.o CMakeFiles/vdmclib.dir/src/test/ExpressionsSetRandom_Tests.cpp.o CMakeFiles/vdmclib.dir/src/test/ExpressionsSet_Tests.cpp.o CMakeFiles/vdmclib.dir/src/test/Expressions_Tests.cpp.o CMakeFiles/vdmclib.dir/src/test/GC_Tests.cpp.o CMakeFiles/vdmclib.dir/src/test/PrettyPrint_Tests.cpp.o CMakeFiles/vdmclib.dir/src/test/Statements_Record_Tests.cpp.o CMakeFiles/vdmclib.dir/src/test/StructOffsetTest_Tests.cpp.o CMakeFiles/vdmclib.dir/src/test/TokenType_Tests.cpp.o CMakeFiles/vdmclib.dir/src/test/TypeofTest_Tests.cpp.o  -o target/vdmclib -rdynamic ../third_party/googletest/googletest/libgtest_main.a ../third_party/googletest/googletest/libgtest.a -lpthread 
     [exec] make[2]: Leaving directory '/var/lib/jenkins/workspace/ch-pipeline_vpb_development-KCTLYUE5TMW7Z33VLFXIW7KHT6FIH4V5AIJQWV52XR2IIKDPQP2Q/c'
     [exec] [100%] Built target vdmclib
     [exec] make[1]: Leaving directory '/var/lib/jenkins/workspace/ch-pipeline_vpb_development-KCTLYUE5TMW7Z33VLFXIW7KHT6FIH4V5AIJQWV52XR2IIKDPQP2Q/c'
     [exec] /usr/bin/cmake -E cmake_progress_start /var/lib/jenkins/workspace/ch-pipeline_vpb_development-KCTLYUE5TMW7Z33VLFXIW7KHT6FIH4V5AIJQWV52XR2IIKDPQP2Q/c/CMakeFiles 0
     [exec] Running tests...
     [exec] /usr/bin/ctest --force-new-ctest-process 
     [exec] Test project /var/lib/jenkins/workspace/ch-pipeline_vpb_development-KCTLYUE5TMW7Z33VLFXIW7KHT6FIH4V5AIJQWV52XR2IIKDPQP2Q/c/vdmclib
     [exec]     Start 1: vdmclib-tests
     [exec] 1/1 Test #1: vdmclib-tests ....................   Passed    0.15 sec
     [exec] 
     [exec] 100% tests passed, 0 tests failed out of 1
     [exec] 
     [exec] Total Test time (real) =   0.15 sec
[INFO] Executed tasks
[INFO] 
[INFO] --- maven-jar-plugin:2.4:jar (default-jar) @ vdmclib ---
[INFO] Downloading: http://overture.au.dk/artifactory/remote-repos/org/codehaus/plexus/plexus-archiver/2.1/plexus-archiver-2.1.pom
[INFO] Downloaded: http://overture.au.dk/artifactory/remote-repos/org/codehaus/plexus/plexus-archiver/2.1/plexus-archiver-2.1.pom (3 KB at 124.7 KB/sec)
[INFO] Downloading: http://overture.au.dk/artifactory/remote-repos/org/codehaus/plexus/plexus-io/2.0.2/plexus-io-2.0.2.pom
[INFO] Downloaded: http://overture.au.dk/artifactory/remote-repos/org/codehaus/plexus/plexus-io/2.0.2/plexus-io-2.0.2.pom (2 KB at 130.2 KB/sec)
[INFO] Downloading: http://overture.au.dk/artifactory/remote-repos/org/codehaus/plexus/plexus-components/1.1.19/plexus-components-1.1.19.pom
[INFO] Downloaded: http://overture.au.dk/artifactory/remote-repos/org/codehaus/plexus/plexus-components/1.1.19/plexus-components-1.1.19.pom (3 KB at 202.7 KB/sec)
[INFO] Downloading: http://overture.au.dk/artifactory/remote-repos/org/codehaus/plexus/plexus-interpolation/1.15/plexus-interpolation-1.15.jar
[INFO] Downloading: http://overture.au.dk/artifactory/remote-repos/org/codehaus/plexus/plexus-archiver/2.1/plexus-archiver-2.1.jar
[INFO] Downloading: http://overture.au.dk/artifactory/remote-repos/org/codehaus/plexus/plexus-io/2.0.2/plexus-io-2.0.2.jar
[INFO] Downloaded: http://overture.au.dk/artifactory/remote-repos/org/codehaus/plexus/plexus-archiver/2.1/plexus-archiver-2.1.jar (181 KB at 4868.0 KB/sec)
[INFO] Downloaded: http://overture.au.dk/artifactory/remote-repos/org/codehaus/plexus/plexus-io/2.0.2/plexus-io-2.0.2.jar (57 KB at 1835.5 KB/sec)
[INFO] Downloaded: http://overture.au.dk/artifactory/remote-repos/org/codehaus/plexus/plexus-interpolation/1.15/plexus-interpolation-1.15.jar (60 KB at 1181.1 KB/sec)
[INFO] Building jar: /var/lib/jenkins/workspace/ch-pipeline_vpb_development-KCTLYUE5TMW7Z33VLFXIW7KHT6FIH4V5AIJQWV52XR2IIKDPQP2Q/c/vdmclib/target/vdmclib-0.1.15-SNAPSHOT.jar
[INFO] 
[INFO] --- jacoco-maven-plugin:0.7.6.201602180812:report (jacoco-site) @ vdmclib ---
[INFO] Skipping JaCoCo execution due to missing execution data file:/var/lib/jenkins/workspace/ch-pipeline_vpb_development-KCTLYUE5TMW7Z33VLFXIW7KHT6FIH4V5AIJQWV52XR2IIKDPQP2Q/c/vdmclib/target/coverage-reports/jacoco-unit.exec
[INFO] 
[INFO] --- maven-jarsigner-plugin:1.2:sign (sign) @ vdmclib ---
[WARNING] Picked up JAVA_TOOL_OPTIONS: -Dmaven.ext.class.path="/var/lib/jenkins/workspace/ch-pipeline_vpb_development-KCTLYUE5TMW7Z33VLFXIW7KHT6FIH4V5AIJQWV52XR2IIKDPQP2Q@tmp/withMaven0b759eaa/pipeline-maven-spy.jar" -Dorg.jenkinsci.plugins.pipeline.maven.reportsFolder="/var/lib/jenkins/workspace/ch-pipeline_vpb_development-KCTLYUE5TMW7Z33VLFXIW7KHT6FIH4V5AIJQWV52XR2IIKDPQP2Q@tmp/withMaven0b759eaa" 
[INFO] 1 archive(s) processed
[INFO] 
[INFO] --- maven-install-plugin:2.4:install (default-install) @ vdmclib ---
[INFO] Installing /var/lib/jenkins/workspace/ch-pipeline_vpb_development-KCTLYUE5TMW7Z33VLFXIW7KHT6FIH4V5AIJQWV52XR2IIKDPQP2Q/c/vdmclib/target/vdmclib-0.1.15-SNAPSHOT.jar to /var/lib/jenkins/workspace/ch-pipeline_vpb_development-KCTLYUE5TMW7Z33VLFXIW7KHT6FIH4V5AIJQWV52XR2IIKDPQP2Q/.repository/org/overturetool/vdm2c/c/vdmclib/0.1.15-SNAPSHOT/vdmclib-0.1.15-SNAPSHOT.jar
[INFO] Installing /var/lib/jenkins/workspace/ch-pipeline_vpb_development-KCTLYUE5TMW7Z33VLFXIW7KHT6FIH4V5AIJQWV52XR2IIKDPQP2Q/c/vdmclib/pom.xml to /var/lib/jenkins/workspace/ch-pipeline_vpb_development-KCTLYUE5TMW7Z33VLFXIW7KHT6FIH4V5AIJQWV52XR2IIKDPQP2Q/.repository/org/overturetool/vdm2c/c/vdmclib/0.1.15-SNAPSHOT/vdmclib-0.1.15-SNAPSHOT.pom
[INFO]                                                                         
[INFO] ------------------------------------------------------------------------
[INFO] Building Core Tools for vdm2c 0.1.15-SNAPSHOT
[INFO] ------------------------------------------------------------------------
[INFO] 
[INFO] --- maven-enforcer-plugin:1.0:enforce (enforce-maven) @ core ---
[INFO] 
[INFO] --- jacoco-maven-plugin:0.7.6.201602180812:prepare-agent (jacoco-initialize) @ core ---
[INFO] argLine set to -javaagent:/var/lib/jenkins/workspace/ch-pipeline_vpb_development-KCTLYUE5TMW7Z33VLFXIW7KHT6FIH4V5AIJQWV52XR2IIKDPQP2Q/.repository/org/jacoco/org.jacoco.agent/0.7.6.201602180812/org.jacoco.agent-0.7.6.201602180812-runtime.jar=destfile=/var/lib/jenkins/workspace/ch-pipeline_vpb_development-KCTLYUE5TMW7Z33VLFXIW7KHT6FIH4V5AIJQWV52XR2IIKDPQP2Q/core/target/coverage-reports/jacoco-unit.exec,excludes=org/overture/cgc/extast/analysis/**/*.*:org/overture/codegen/vdm2c/extast/expressions/**/*:org/overture/codegen/vdm2c/extast/declarations/**/*:org/overture/codegen/vdm2c/extast/statements/**/*:org/overture/cgc/extast/node/**/*:org/overture/codegen/vdm2c/ast/preview/**/*
[INFO] 
[INFO] --- jacoco-maven-plugin:0.7.6.201602180812:report (jacoco-site) @ core ---
[INFO] Skipping JaCoCo execution due to missing execution data file:/var/lib/jenkins/workspace/ch-pipeline_vpb_development-KCTLYUE5TMW7Z33VLFXIW7KHT6FIH4V5AIJQWV52XR2IIKDPQP2Q/core/target/coverage-reports/jacoco-unit.exec
[INFO] 
[INFO] --- maven-jarsigner-plugin:1.2:sign (sign) @ core ---
[INFO] 0 archive(s) processed
[INFO] 
[INFO] --- maven-javadoc-plugin:2.9:jar (attach-javadocs) @ core ---
[INFO] Downloading: http://overture.au.dk/artifactory/remote-repos/commons-cli/commons-cli/1.2/commons-cli-1.2.pom
[INFO] Downloaded: http://overture.au.dk/artifactory/remote-repos/commons-cli/commons-cli/1.2/commons-cli-1.2.pom (8 KB at 556.6 KB/sec)
[INFO] Downloading: http://overture.au.dk/artifactory/remote-repos/org/apache/commons/commons-parent/11/commons-parent-11.pom
[INFO] Downloaded: http://overture.au.dk/artifactory/remote-repos/org/apache/commons/commons-parent/11/commons-parent-11.pom (25 KB at 1851.6 KB/sec)
[INFO] Downloading: http://overture.au.dk/artifactory/remote-repos/org/apache/maven/shared/maven-invoker/2.0.9/maven-invoker-2.0.9.pom
[INFO] Downloaded: http://overture.au.dk/artifactory/remote-repos/org/apache/maven/shared/maven-invoker/2.0.9/maven-invoker-2.0.9.pom (6 KB at 331.9 KB/sec)
[INFO] Downloading: http://overture.au.dk/artifactory/remote-repos/org/apache/maven/shared/maven-common-artifact-filters/1.3/maven-common-artifact-filters-1.3.pom
[INFO] Downloaded: http://overture.au.dk/artifactory/remote-repos/org/apache/maven/shared/maven-common-artifact-filters/1.3/maven-common-artifact-filters-1.3.pom (4 KB at 212.7 KB/sec)
[INFO] Downloading: http://overture.au.dk/artifactory/remote-repos/org/apache/maven/shared/maven-shared-components/12/maven-shared-components-12.pom
[INFO] Downloaded: http://overture.au.dk/artifactory/remote-repos/org/apache/maven/shared/maven-shared-components/12/maven-shared-components-12.pom (10 KB at 701.4 KB/sec)
[INFO] Downloading: http://overture.au.dk/artifactory/remote-repos/org/apache/maven/maven-plugin-api/2.0.8/maven-plugin-api-2.0.8.pom
[INFO] Downloaded: http://overture.au.dk/artifactory/remote-repos/org/apache/maven/maven-plugin-api/2.0.8/maven-plugin-api-2.0.8.pom (2 KB at 132.6 KB/sec)
[INFO] Downloading: http://overture.au.dk/artifactory/remote-repos/org/codehaus/plexus/plexus-utils/1.4.9/plexus-utils-1.4.9.pom
[INFO] Downloaded: http://overture.au.dk/artifactory/remote-repos/org/codehaus/plexus/plexus-utils/1.4.9/plexus-utils-1.4.9.pom (3 KB at 224.2 KB/sec)
[INFO] Downloading: http://overture.au.dk/artifactory/remote-repos/org/apache/maven/doxia/doxia-site-renderer/1.0/doxia-site-renderer-1.0.pom
[INFO] Downloaded: http://overture.au.dk/artifactory/remote-repos/org/apache/maven/doxia/doxia-site-renderer/1.0/doxia-site-renderer-1.0.pom (5 KB at 432.3 KB/sec)
[INFO] Downloading: http://overture.au.dk/artifactory/remote-repos/org/apache/maven/doxia/doxia-sitetools/1.0/doxia-sitetools-1.0.pom
[INFO] Downloaded: http://overture.au.dk/artifactory/remote-repos/org/apache/maven/doxia/doxia-sitetools/1.0/doxia-sitetools-1.0.pom (10 KB at 624.1 KB/sec)
[INFO] Downloading: http://overture.au.dk/artifactory/remote-repos/org/apache/maven/doxia/doxia-core/1.0/doxia-core-1.0.pom
[INFO] Downloaded: http://overture.au.dk/artifactory/remote-repos/org/apache/maven/doxia/doxia-core/1.0/doxia-core-1.0.pom (3 KB at 212.6 KB/sec)
[INFO] Downloading: http://overture.au.dk/artifactory/remote-repos/org/codehaus/plexus/plexus-utils/1.5.7/plexus-utils-1.5.7.pom
[INFO] Downloaded: http://overture.au.dk/artifactory/remote-repos/org/codehaus/plexus/plexus-utils/1.5.7/plexus-utils-1.5.7.pom (8 KB at 524.9 KB/sec)
[INFO] Downloading: http://overture.au.dk/artifactory/remote-repos/org/apache/maven/doxia/doxia-decoration-model/1.0/doxia-decoration-model-1.0.pom
[INFO] Downloaded: http://overture.au.dk/artifactory/remote-repos/org/apache/maven/doxia/doxia-decoration-model/1.0/doxia-decoration-model-1.0.pom (4 KB at 236.9 KB/sec)
[INFO] Downloading: http://overture.au.dk/artifactory/remote-repos/org/apache/maven/doxia/doxia-module-apt/1.0/doxia-module-apt-1.0.pom
[INFO] Downloaded: http://overture.au.dk/artifactory/remote-repos/org/apache/maven/doxia/doxia-module-apt/1.0/doxia-module-apt-1.0.pom (3 KB at 183.3 KB/sec)
[INFO] Downloading: http://overture.au.dk/artifactory/remote-repos/org/apache/maven/doxia/doxia-modules/1.0/doxia-modules-1.0.pom
[INFO] Downloaded: http://overture.au.dk/artifactory/remote-repos/org/apache/maven/doxia/doxia-modules/1.0/doxia-modules-1.0.pom (3 KB at 212.5 KB/sec)
[INFO] Downloading: http://overture.au.dk/artifactory/remote-repos/org/apache/maven/doxia/doxia-module-fml/1.0/doxia-module-fml-1.0.pom
[INFO] Downloaded: http://overture.au.dk/artifactory/remote-repos/org/apache/maven/doxia/doxia-module-fml/1.0/doxia-module-fml-1.0.pom (3 KB at 138.4 KB/sec)
[INFO] Downloading: http://overture.au.dk/artifactory/remote-repos/org/apache/maven/doxia/doxia-module-xdoc/1.0/doxia-module-xdoc-1.0.pom
[INFO] Downloaded: http://overture.au.dk/artifactory/remote-repos/org/apache/maven/doxia/doxia-module-xdoc/1.0/doxia-module-xdoc-1.0.pom (3 KB at 156.4 KB/sec)
[INFO] Downloading: http://overture.au.dk/artifactory/remote-repos/org/apache/maven/doxia/doxia-module-xhtml/1.0/doxia-module-xhtml-1.0.pom
[INFO] Downloaded: http://overture.au.dk/artifactory/remote-repos/org/apache/maven/doxia/doxia-module-xhtml/1.0/doxia-module-xhtml-1.0.pom (2 KB at 111.5 KB/sec)
[INFO] Downloading: http://overture.au.dk/artifactory/remote-repos/org/apache/maven/wagon/wagon-provider-api/1.0-beta-6/wagon-provider-api-1.0-beta-6.pom
[INFO] Downloaded: http://overture.au.dk/artifactory/remote-repos/org/apache/maven/wagon/wagon-provider-api/1.0-beta-6/wagon-provider-api-1.0-beta-6.pom (2 KB at 85.9 KB/sec)
[INFO] Downloading: http://overture.au.dk/artifactory/remote-repos/org/apache/maven/wagon/wagon/1.0-beta-6/wagon-1.0-beta-6.pom
[INFO] Downloaded: http://overture.au.dk/artifactory/remote-repos/org/apache/maven/wagon/wagon/1.0-beta-6/wagon-1.0-beta-6.pom (13 KB at 1209.6 KB/sec)
[INFO] Downloading: http://overture.au.dk/artifactory/remote-repos/commons-logging/commons-logging/1.1.1/commons-logging-1.1.1.pom
[INFO] Downloaded: http://overture.au.dk/artifactory/remote-repos/commons-logging/commons-logging/1.1.1/commons-logging-1.1.1.pom (18 KB at 1494.5 KB/sec)
[INFO] Downloading: http://overture.au.dk/artifactory/remote-repos/org/apache/commons/commons-parent/5/commons-parent-5.pom
[INFO] Downloaded: http://overture.au.dk/artifactory/remote-repos/org/apache/commons/commons-parent/5/commons-parent-5.pom (16 KB at 1118.9 KB/sec)
[INFO] Downloading: http://overture.au.dk/artifactory/remote-repos/log4j/log4j/1.2.14/log4j-1.2.14.pom
[INFO] Downloaded: http://overture.au.dk/artifactory/remote-repos/log4j/log4j/1.2.14/log4j-1.2.14.pom (3 KB at 165.6 KB/sec)
[INFO] Downloading: http://overture.au.dk/artifactory/remote-repos/com/thoughtworks/qdox/qdox/1.12/qdox-1.12.pom
[INFO] Downloaded: http://overture.au.dk/artifactory/remote-repos/com/thoughtworks/qdox/qdox/1.12/qdox-1.12.pom (19 KB at 1208.0 KB/sec)
[INFO] Downloading: http://overture.au.dk/artifactory/remote-repos/org/codehaus/plexus/plexus-archiver/2.1.2/plexus-archiver-2.1.2.pom
[INFO] Downloaded: http://overture.au.dk/artifactory/remote-repos/org/codehaus/plexus/plexus-archiver/2.1.2/plexus-archiver-2.1.2.pom (4 KB at 204.8 KB/sec)
[INFO] Downloading: http://overture.au.dk/artifactory/remote-repos/org/codehaus/plexus/plexus-utils/3.0.2/plexus-utils-3.0.2.pom
[INFO] Downloaded: http://overture.au.dk/artifactory/remote-repos/org/codehaus/plexus/plexus-utils/3.0.2/plexus-utils-3.0.2.pom (3 KB at 102.2 KB/sec)
[INFO] Downloading: http://overture.au.dk/artifactory/remote-repos/org/codehaus/plexus/plexus-io/2.0.4/plexus-io-2.0.4.pom
[INFO] Downloaded: http://overture.au.dk/artifactory/remote-repos/org/codehaus/plexus/plexus-io/2.0.4/plexus-io-2.0.4.pom (2 KB at 112.8 KB/sec)
[INFO] Downloading: http://overture.au.dk/artifactory/remote-repos/commons-cli/commons-cli/1.2/commons-cli-1.2.jar
[INFO] Downloading: http://overture.au.dk/artifactory/remote-repos/org/apache/maven/shared/maven-common-artifact-filters/1.3/maven-common-artifact-filters-1.3.jar
[INFO] Downloading: http://overture.au.dk/artifactory/remote-repos/org/apache/maven/doxia/doxia-sink-api/1.0/doxia-sink-api-1.0.jar
[INFO] Downloading: http://overture.au.dk/artifactory/remote-repos/org/apache/maven/shared/maven-invoker/2.0.9/maven-invoker-2.0.9.jar
[INFO] Downloading: http://overture.au.dk/artifactory/remote-repos/org/apache/maven/doxia/doxia-site-renderer/1.0/doxia-site-renderer-1.0.jar
[INFO] Downloaded: http://overture.au.dk/artifactory/remote-repos/commons-cli/commons-cli/1.2/commons-cli-1.2.jar (41 KB at 368.4 KB/sec)
[INFO] Downloading: http://overture.au.dk/artifactory/remote-repos/org/apache/maven/doxia/doxia-core/1.0/doxia-core-1.0.jar
[INFO] Downloaded: http://overture.au.dk/artifactory/remote-repos/org/apache/maven/doxia/doxia-sink-api/1.0/doxia-sink-api-1.0.jar (10 KB at 90.2 KB/sec)
[INFO] Downloading: http://overture.au.dk/artifactory/remote-repos/org/apache/maven/doxia/doxia-decoration-model/1.0/doxia-decoration-model-1.0.jar
[INFO] Downloaded: http://overture.au.dk/artifactory/remote-repos/org/apache/maven/shared/maven-invoker/2.0.9/maven-invoker-2.0.9.jar (28 KB at 240.2 KB/sec)
[INFO] Downloading: http://overture.au.dk/artifactory/remote-repos/org/apache/maven/doxia/doxia-module-apt/1.0/doxia-module-apt-1.0.jar
[INFO] Downloaded: http://overture.au.dk/artifactory/remote-repos/org/apache/maven/shared/maven-common-artifact-filters/1.3/maven-common-artifact-filters-1.3.jar (31 KB at 261.5 KB/sec)
[INFO] Downloading: http://overture.au.dk/artifactory/remote-repos/org/apache/maven/doxia/doxia-module-fml/1.0/doxia-module-fml-1.0.jar
[INFO] Downloaded: http://overture.au.dk/artifactory/remote-repos/org/apache/maven/doxia/doxia-site-renderer/1.0/doxia-site-renderer-1.0.jar (46 KB at 388.3 KB/sec)
[INFO] Downloading: http://overture.au.dk/artifactory/remote-repos/org/apache/maven/doxia/doxia-module-xdoc/1.0/doxia-module-xdoc-1.0.jar
[INFO] Downloaded: http://overture.au.dk/artifactory/remote-repos/org/apache/maven/doxia/doxia-decoration-model/1.0/doxia-decoration-model-1.0.jar (48 KB at 405.4 KB/sec)
[INFO] Downloading: http://overture.au.dk/artifactory/remote-repos/org/apache/maven/doxia/doxia-module-xhtml/1.0/doxia-module-xhtml-1.0.jar
[INFO] Downloaded: http://overture.au.dk/artifactory/remote-repos/org/apache/maven/doxia/doxia-core/1.0/doxia-core-1.0.jar (54 KB at 443.5 KB/sec)
[INFO] Downloading: http://overture.au.dk/artifactory/remote-repos/org/apache/maven/wagon/wagon-provider-api/1.0-beta-6/wagon-provider-api-1.0-beta-6.jar
[INFO] Downloaded: http://overture.au.dk/artifactory/remote-repos/org/apache/maven/doxia/doxia-module-apt/1.0/doxia-module-apt-1.0.jar (46 KB at 367.8 KB/sec)
[INFO] Downloading: http://overture.au.dk/artifactory/remote-repos/commons-logging/commons-logging/1.1.1/commons-logging-1.1.1.jar
[INFO] Downloaded: http://overture.au.dk/artifactory/remote-repos/org/apache/maven/doxia/doxia-module-xdoc/1.0/doxia-module-xdoc-1.0.jar (28 KB at 212.1 KB/sec)
[INFO] Downloading: http://overture.au.dk/artifactory/remote-repos/log4j/log4j/1.2.14/log4j-1.2.14.jar
[INFO] Downloaded: http://overture.au.dk/artifactory/remote-repos/org/apache/maven/doxia/doxia-module-fml/1.0/doxia-module-fml-1.0.jar (19 KB at 140.4 KB/sec)
[INFO] Downloading: http://overture.au.dk/artifactory/remote-repos/com/thoughtworks/qdox/qdox/1.12/qdox-1.12.jar
[INFO] Downloaded: http://overture.au.dk/artifactory/remote-repos/org/apache/maven/wagon/wagon-provider-api/1.0-beta-6/wagon-provider-api-1.0-beta-6.jar (52 KB at 390.5 KB/sec)
[INFO] Downloading: http://overture.au.dk/artifactory/remote-repos/org/codehaus/plexus/plexus-archiver/2.1.2/plexus-archiver-2.1.2.jar
[INFO] Downloaded: http://overture.au.dk/artifactory/remote-repos/org/apache/maven/doxia/doxia-module-xhtml/1.0/doxia-module-xhtml-1.0.jar (22 KB at 154.3 KB/sec)
[INFO] Downloading: http://overture.au.dk/artifactory/remote-repos/org/codehaus/plexus/plexus-io/2.0.4/plexus-io-2.0.4.jar
[INFO] Downloaded: http://overture.au.dk/artifactory/remote-repos/commons-logging/commons-logging/1.1.1/commons-logging-1.1.1.jar (60 KB at 417.3 KB/sec)
[INFO] Downloaded: http://overture.au.dk/artifactory/remote-repos/com/thoughtworks/qdox/qdox/1.12/qdox-1.12.jar (176 KB at 1218.8 KB/sec)
[INFO] Downloaded: http://overture.au.dk/artifactory/remote-repos/org/codehaus/plexus/plexus-io/2.0.4/plexus-io-2.0.4.jar (57 KB at 387.2 KB/sec)
[INFO] Downloaded: http://overture.au.dk/artifactory/remote-repos/log4j/log4j/1.2.14/log4j-1.2.14.jar (359 KB at 2392.2 KB/sec)
[INFO] Downloaded: http://overture.au.dk/artifactory/remote-repos/org/codehaus/plexus/plexus-archiver/2.1.2/plexus-archiver-2.1.2.jar (181 KB at 1187.7 KB/sec)
[INFO] Not executing Javadoc as the project is not a Java classpath-capable package
[INFO] 
[INFO] --- maven-install-plugin:2.4:install (default-install) @ core ---
[INFO] Installing /var/lib/jenkins/workspace/ch-pipeline_vpb_development-KCTLYUE5TMW7Z33VLFXIW7KHT6FIH4V5AIJQWV52XR2IIKDPQP2Q/core/pom.xml to /var/lib/jenkins/workspace/ch-pipeline_vpb_development-KCTLYUE5TMW7Z33VLFXIW7KHT6FIH4V5AIJQWV52XR2IIKDPQP2Q/.repository/org/overturetool/vdm2c/core/0.1.15-SNAPSHOT/core-0.1.15-SNAPSHOT.pom
[INFO]                                                                         
[INFO] ------------------------------------------------------------------------
[INFO] Building The C Code Generator 0.1.15-SNAPSHOT
[INFO] ------------------------------------------------------------------------
[INFO] Downloading: http://overture.au.dk/artifactory/remote-repos/org/apache/maven/plugins/maven-assembly-plugin/2.4/maven-assembly-plugin-2.4.pom
[INFO] Downloaded: http://overture.au.dk/artifactory/remote-repos/org/apache/maven/plugins/maven-assembly-plugin/2.4/maven-assembly-plugin-2.4.pom (17 KB at 1096.5 KB/sec)
[INFO] Downloading: http://overture.au.dk/artifactory/remote-repos/org/apache/maven/plugins/maven-assembly-plugin/2.4/maven-assembly-plugin-2.4.jar
[INFO] Downloaded: http://overture.au.dk/artifactory/remote-repos/org/apache/maven/plugins/maven-assembly-plugin/2.4/maven-assembly-plugin-2.4.jar (221 KB at 14705.0 KB/sec)
[INFO] 
[INFO] --- maven-enforcer-plugin:1.0:enforce (enforce-maven) @ vdm2c ---
[INFO] 
[INFO] --- jacoco-maven-plugin:0.7.6.201602180812:prepare-agent (jacoco-initialize) @ vdm2c ---
[INFO] argLine set to -javaagent:/var/lib/jenkins/workspace/ch-pipeline_vpb_development-KCTLYUE5TMW7Z33VLFXIW7KHT6FIH4V5AIJQWV52XR2IIKDPQP2Q/.repository/org/jacoco/org.jacoco.agent/0.7.6.201602180812/org.jacoco.agent-0.7.6.201602180812-runtime.jar=destfile=/var/lib/jenkins/workspace/ch-pipeline_vpb_development-KCTLYUE5TMW7Z33VLFXIW7KHT6FIH4V5AIJQWV52XR2IIKDPQP2Q/core/vdm2c/target/coverage-reports/jacoco-unit.exec,excludes=org/overture/cgc/extast/analysis/**/*.*:org/overture/codegen/vdm2c/extast/expressions/**/*:org/overture/codegen/vdm2c/extast/declarations/**/*:org/overture/codegen/vdm2c/extast/statements/**/*:org/overture/cgc/extast/node/**/*:org/overture/codegen/vdm2c/ast/preview/**/*
[INFO] 
[INFO] --- astcreator-plugin:1.6.8:generate (generate-ast) @ vdm2c ---
[INFO] Preparing for tree generation...
[INFO] Configuring extension
[INFO] 	Extension base dependency is: "org.overturetool.core.codegen:ir"
[INFO] 	Searching for base dependency artifact
[INFO] 	Extension base artifact found - exstracting base tree definition files
[INFO] 	Setting base definition files to:
[INFO] 		base: /var/lib/jenkins/workspace/ch-pipeline_vpb_development-KCTLYUE5TMW7Z33VLFXIW7KHT6FIH4V5AIJQWV52XR2IIKDPQP2Q/core/vdm2c/target/ir.ast
[INFO] 		base tostring: /var/lib/jenkins/workspace/ch-pipeline_vpb_development-KCTLYUE5TMW7Z33VLFXIW7KHT6FIH4V5AIJQWV52XR2IIKDPQP2Q/core/vdm2c/target/ir.ast.tostring
[INFO] 	Extension base artifact configured.
[INFO] Checking if generation required.
[INFO] Extended AST unchanged
[INFO] Nothing to generate, source already up-to-date
[INFO] 
[INFO] --- build-helper-maven-plugin:1.7:add-source (add-source) @ vdm2c ---
[INFO] Source directory: /var/lib/jenkins/workspace/ch-pipeline_vpb_development-KCTLYUE5TMW7Z33VLFXIW7KHT6FIH4V5AIJQWV52XR2IIKDPQP2Q/core/vdm2c/target/generated-sources/astCreator added.
[INFO] 
[INFO] --- maven-resources-plugin:2.6:resources (default-resources) @ vdm2c ---
[INFO] Using 'UTF-8' encoding to copy filtered resources.
[INFO] Copying 87 resources
[INFO] 
[INFO] --- maven-compiler-plugin:3.0:compile (default-compile) @ vdm2c ---
[INFO] Changes detected - recompiling the module!
[INFO] Compiling 121 source files to /var/lib/jenkins/workspace/ch-pipeline_vpb_development-KCTLYUE5TMW7Z33VLFXIW7KHT6FIH4V5AIJQWV52XR2IIKDPQP2Q/core/vdm2c/target/classes
[WARNING] /var/lib/jenkins/workspace/ch-pipeline_vpb_development-KCTLYUE5TMW7Z33VLFXIW7KHT6FIH4V5AIJQWV52XR2IIKDPQP2Q/core/vdm2c/src/main/java/org/overture/codegen/vdm2c/analysis/ClassAssocAnalysis.java: /var/lib/jenkins/workspace/ch-pipeline_vpb_development-KCTLYUE5TMW7Z33VLFXIW7KHT6FIH4V5AIJQWV52XR2IIKDPQP2Q/core/vdm2c/src/main/java/org/overture/codegen/vdm2c/analysis/ClassAssocAnalysis.java uses unchecked or unsafe operations.
[WARNING] /var/lib/jenkins/workspace/ch-pipeline_vpb_development-KCTLYUE5TMW7Z33VLFXIW7KHT6FIH4V5AIJQWV52XR2IIKDPQP2Q/core/vdm2c/src/main/java/org/overture/codegen/vdm2c/analysis/ClassAssocAnalysis.java: Recompile with -Xlint:unchecked for details.
[INFO] 
[INFO] --- maven-resources-plugin:2.6:testResources (default-testResources) @ vdm2c ---
[INFO] Using 'UTF-8' encoding to copy filtered resources.
[INFO] Copying 172 resources
[INFO] 
[INFO] --- maven-compiler-plugin:3.0:testCompile (default-testCompile) @ vdm2c ---
[INFO] Changes detected - recompiling the module!
[INFO] Compiling 19 source files to /var/lib/jenkins/workspace/ch-pipeline_vpb_development-KCTLYUE5TMW7Z33VLFXIW7KHT6FIH4V5AIJQWV52XR2IIKDPQP2Q/core/vdm2c/target/test-classes
[INFO] 
[INFO] --- maven-surefire-plugin:2.19:test (default-test) @ vdm2c ---
[INFO] Downloading: http://overture.au.dk/artifactory/remote-repos/org/apache/maven/surefire/surefire-junit4/2.19/surefire-junit4-2.19.pom
[INFO] Downloaded: http://overture.au.dk/artifactory/remote-repos/org/apache/maven/surefire/surefire-junit4/2.19/surefire-junit4-2.19.pom (4 KB at 65.0 KB/sec)
[INFO] Downloading: http://overture.au.dk/artifactory/remote-repos/org/apache/maven/surefire/surefire-providers/2.19/surefire-providers-2.19.pom
[INFO] Downloaded: http://overture.au.dk/artifactory/remote-repos/org/apache/maven/surefire/surefire-providers/2.19/surefire-providers-2.19.pom (3 KB at 250.1 KB/sec)
[INFO] Downloading: http://overture.au.dk/artifactory/remote-repos/org/apache/maven/surefire/surefire-junit4/2.19/surefire-junit4-2.19.jar
[INFO] Downloaded: http://overture.au.dk/artifactory/remote-repos/org/apache/maven/surefire/surefire-junit4/2.19/surefire-junit4-2.19.jar (75 KB at 4934.0 KB/sec)

-------------------------------------------------------
 T E S T S
-------------------------------------------------------
Picked up JAVA_TOOL_OPTIONS: -Dmaven.ext.class.path="/var/lib/jenkins/workspace/ch-pipeline_vpb_development-KCTLYUE5TMW7Z33VLFXIW7KHT6FIH4V5AIJQWV52XR2IIKDPQP2Q@tmp/withMaven0b759eaa/pipeline-maven-spy.jar" -Dorg.jenkinsci.plugins.pipeline.maven.reportsFolder="/var/lib/jenkins/workspace/ch-pipeline_vpb_development-KCTLYUE5TMW7Z33VLFXIW7KHT6FIH4V5AIJQWV52XR2IIKDPQP2Q@tmp/withMaven0b759eaa" 
Running org.overture.codegen.vdm2c.ValueTypeGarbageCollectionTests
Tests run: 3, Failures: 0, Errors: 0, Skipped: 0, Time elapsed: 19.839 sec - in org.overture.codegen.vdm2c.ValueTypeGarbageCollectionTests
Running org.overture.codegen.vdm2c.ClassAssocAnalysisTest
Tests run: 5, Failures: 0, Errors: 0, Skipped: 0, Time elapsed: 0 sec - in org.overture.codegen.vdm2c.ClassAssocAnalysisTest
Running org.overture.codegen.vdm2c.ValueTypesTests
Tests run: 3, Failures: 0, Errors: 0, Skipped: 0, Time elapsed: 13.621 sec - in org.overture.codegen.vdm2c.ValueTypesTests
Running org.overture.codegen.vdm2c.NativeGarbageCollectionTest
Tests run: 22, Failures: 0, Errors: 1, Skipped: 0, Time elapsed: 93.634 sec <<< FAILURE! - in org.overture.codegen.vdm2c.NativeGarbageCollectionTest
OtherIgnoreVDMUnit(org.overture.codegen.vdm2c.NativeGarbageCollectionTest)  Time elapsed: 4.31 sec  <<< ERROR!
org.overture.codegen.vdm2c.CMakeUtil$CMakeGenerateException: 
In file included from /var/lib/jenkins/workspace/ch-pipeline_vpb_development-KCTLYUE5TMW7Z33VLFXIW7KHT6FIH4V5AIJQWV52XR2IIKDPQP2Q/c/vdmclib/src/main/VdmBasicTypes.c:33:0:
/var/lib/jenkins/workspace/ch-pipeline_vpb_development-KCTLYUE5TMW7Z33VLFXIW7KHT6FIH4V5AIJQWV52XR2IIKDPQP2Q/core/vdm2c/target/test-cgen/NativeGarbageCollectionTest/OtherIgnoreVDMUnit/VdmClassHierarchy.h:5:20: fatal error: Assert.h: No such file or directory
compilation terminated.
make[2]: *** [CMakeFiles/OtherIgnoreVDMUnit.dir/var/lib/jenkins/workspace/ch-pipeline_vpb_development-KCTLYUE5TMW7Z33VLFXIW7KHT6FIH4V5AIJQWV52XR2IIKDPQP2Q/c/vdmclib/src/main/VdmBasicTypes.c.o] Error 1
make[2]: *** Waiting for unfinished jobs....
make[1]: *** [CMakeFiles/OtherIgnoreVDMUnit.dir/all] Error 2
make: *** [all] Error 2


Running org.overture.codegen.vdm2c.PaperExampleTests
Tests run: 4, Failures: 0, Errors: 0, Skipped: 0, Time elapsed: 19.006 sec - in org.overture.codegen.vdm2c.PaperExampleTests
Running org.overture.codegen.vdm2c.NativeClassesTests
Tests run: 26, Failures: 0, Errors: 0, Skipped: 1, Time elapsed: 108.226 sec - in org.overture.codegen.vdm2c.NativeClassesTests
Running org.overture.codegen.vdm2c.ExplicitMemoryManagementTests
Tests run: 1, Failures: 0, Errors: 0, Skipped: 0, Time elapsed: 5.119 sec - in org.overture.codegen.vdm2c.ExplicitMemoryManagementTests
Running org.overture.codegen.vdm2c.TimeFinderTest
Tests run: 1, Failures: 0, Errors: 0, Skipped: 0, Time elapsed: 0.003 sec - in org.overture.codegen.vdm2c.TimeFinderTest
Running org.overture.codegen.vdm2c.NameManglerTests
Tests run: 20, Failures: 0, Errors: 0, Skipped: 0, Time elapsed: 0.007 sec - in org.overture.codegen.vdm2c.NameManglerTests
Running org.overture.codegen.vdm2c.NativeClassesGarbageCollectionTest
Tests run: 26, Failures: 0, Errors: 0, Skipped: 1, Time elapsed: 102.261 sec - in org.overture.codegen.vdm2c.NativeClassesGarbageCollectionTest
Running org.overture.codegen.vdm2c.CasesTest
Tests run: 4, Failures: 0, Errors: 0, Skipped: 0, Time elapsed: 15.15 sec - in org.overture.codegen.vdm2c.CasesTest
Running org.overture.codegen.vdm2c.FeatureAnalysisTest
Tests run: 16, Failures: 0, Errors: 0, Skipped: 0, Time elapsed: 0.012 sec - in org.overture.codegen.vdm2c.FeatureAnalysisTest
Running org.overture.codegen.vdm2c.ExternalTests
Tests run: 1, Failures: 0, Errors: 0, Skipped: 0, Time elapsed: 0 sec - in org.overture.codegen.vdm2c.ExternalTests
Running org.overture.codegen.vdm2c.NativeTests
Tests run: 22, Failures: 0, Errors: 1, Skipped: 0, Time elapsed: 87.061 sec <<< FAILURE! - in org.overture.codegen.vdm2c.NativeTests
OtherIgnoreVDMUnit(org.overture.codegen.vdm2c.NativeTests)  Time elapsed: 3.228 sec  <<< ERROR!
org.overture.codegen.vdm2c.CMakeUtil$CMakeGenerateException: 
In file included from /var/lib/jenkins/workspace/ch-pipeline_vpb_development-KCTLYUE5TMW7Z33VLFXIW7KHT6FIH4V5AIJQWV52XR2IIKDPQP2Q/c/vdmclib/src/main/VdmBasicTypes.c:33:0:
/var/lib/jenkins/workspace/ch-pipeline_vpb_development-KCTLYUE5TMW7Z33VLFXIW7KHT6FIH4V5AIJQWV52XR2IIKDPQP2Q/core/vdm2c/target/test-cgen/NativeTests/OtherIgnoreVDMUnit/VdmClassHierarchy.h:5:20: fatal error: Assert.h: No such file or directory
compilation terminated.
make[2]: *** [CMakeFiles/OtherIgnoreVDMUnit.dir/var/lib/jenkins/workspace/ch-pipeline_vpb_development-KCTLYUE5TMW7Z33VLFXIW7KHT6FIH4V5AIJQWV52XR2IIKDPQP2Q/c/vdmclib/src/main/VdmBasicTypes.c.o] Error 1
make[2]: *** Waiting for unfinished jobs....
make[1]: *** [CMakeFiles/OtherIgnoreVDMUnit.dir/all] Error 2
make: *** [all] Error 2

	at org.overture.codegen.vdm2c.NativeTests.OtherIgnoreVDMUnit(NativeTests.java:163)


Results :

Tests in error: 
  NativeGarbageCollectionTest>NativeTests.OtherIgnoreVDMUnit:163->NativeTestBase.compileAndTest:185->NativeTestBase.runTests:193 » CMakeGenerate
  NativeTests.OtherIgnoreVDMUnit:163->NativeTestBase.compileAndTest:185->NativeTestBase.runTests:193 » CMakeGenerate

Tests run: 154, Failures: 0, Errors: 2, Skipped: 2

[INFO] ------------------------------------------------------------------------
[INFO] Reactor Summary:
[INFO] 
[INFO] Overture VDM 2 C Translator Root ................... SUCCESS [  0.603 s]
[INFO] C native root vdm2c ................................ SUCCESS [  2.750 s]
[INFO] The C Code Generator VDM library sources ........... SUCCESS [ 11.588 s]
[INFO] Core Tools for vdm2c ............................... SUCCESS [  1.021 s]
[INFO] The C Code Generator ............................... FAILURE [07:49 min]
[INFO] Overture FMI IDE Top-level ......................... SKIPPED
[INFO] The C Code Generator Plugin ........................ SKIPPED
[INFO] Overture IDE Eclipse VDM2C features ................ SKIPPED
[INFO] Overture IDE Eclipse C Code Generator feature ...... SKIPPED
[INFO] Overture IDE Eclipse repository .................... SKIPPED
[INFO] ------------------------------------------------------------------------
[INFO] BUILD FAILURE
[INFO] ------------------------------------------------------------------------
[INFO] Total time: 11:36 min
[INFO] Finished at: 2017-10-05T14:27:46+02:00
[INFO] Final Memory: 170M/846M
[INFO] ------------------------------------------------------------------------
[WARNING] The requested profile "force-download-externals" could not be activated because it does not exist.
[jenkins-maven-event-spy] INFO generated /var/lib/jenkins/workspace/ch-pipeline_vpb_development-KCTLYUE5TMW7Z33VLFXIW7KHT6FIH4V5AIJQWV52XR2IIKDPQP2Q@tmp/withMaven0b759eaa/maven-spy-20171005-141610-28.log
[ERROR] Failed to execute goal org.apache.maven.plugins:maven-surefire-plugin:2.19:test (default-test) on project vdm2c: There are test failures.
[ERROR] 
[ERROR] Please refer to /var/lib/jenkins/workspace/ch-pipeline_vpb_development-KCTLYUE5TMW7Z33VLFXIW7KHT6FIH4V5AIJQWV52XR2IIKDPQP2Q/core/vdm2c/target/surefire-reports for the individual test results.
[ERROR] -> [Help 1]
[ERROR] 
[ERROR] To see the full stack trace of the errors, re-run Maven with the -e switch.
[ERROR] Re-run Maven using the -X switch to enable full debug logging.
[ERROR] 
[ERROR] For more information about the errors and possible solutions, please read the following articles:
[ERROR] [Help 1] http://cwiki.apache.org/confluence/display/MAVEN/MojoFailureException
[ERROR] 
[ERROR] After correcting the problems, you can resume the build with the command
[ERROR]   mvn <goals> -rf :vdm2c
[Pipeline] }
[withMaven] artifactsPublisher - Archive artifact pom.xml under org/overturetool/vdm2c/root/0.1.15-SNAPSHOT/root-0.1.15-SNAPSHOT.pom
[withMaven] artifactsPublisher - Archive artifact c/pom.xml under org/overturetool/vdm2c/c/0.1.15-SNAPSHOT/c-0.1.15-SNAPSHOT.pom
[withMaven] artifactsPublisher - Archive artifact c/vdmclib/pom.xml under org/overturetool/vdm2c/c/vdmclib/0.1.15-SNAPSHOT/vdmclib-0.1.15-SNAPSHOT.pom
[withMaven] artifactsPublisher - Archive artifact c/vdmclib/target/vdmclib-0.1.15-SNAPSHOT.jar under org/overturetool/vdm2c/c/vdmclib/0.1.15-SNAPSHOT/vdmclib-0.1.15-SNAPSHOT.jar
[withMaven] artifactsPublisher - Archive artifact core/pom.xml under org/overturetool/vdm2c/core/0.1.15-SNAPSHOT/core-0.1.15-SNAPSHOT.pom
[withMaven] junitPublisher - Archive test results for Maven artifact org.overturetool.vdm2c.c:vdmclib:0.1.15-SNAPSHOT generated by maven-surefire-plugin:test (default-test): c/vdmclib/target/surefire-reports/*.xml
[withMaven] junitPublisher - Jenkins JUnit Attachments Plugin not found, can't publish test attachments.Recording test results
None of the test reports contained any result
[withMaven] junitPublisher - Archive test results for Maven artifact org.overturetool.vdm2c.core:vdm2c:0.1.15-SNAPSHOT generated by maven-surefire-plugin:test (default-test): core/vdm2c/target/surefire-reports/*.xml
[withMaven] junitPublisher - Jenkins JUnit Attachments Plugin not found, can't publish test attachments.Recording test results
[withMaven] openTasksPublisher - Scan Tasks for Maven artifact org.overturetool.vdm2c.core:vdm2c:0.1.15-SNAPSHOT in source directory core/vdm2c/src/main/java
[TASKS] Scanning folder '/var/lib/jenkins/workspace/ch-pipeline_vpb_development-KCTLYUE5TMW7Z33VLFXIW7KHT6FIH4V5AIJQWV52XR2IIKDPQP2Q' for files matching the pattern 'core/vdm2c/src/main/java/**/*' - excludes: null
[TASKS] Found 88 files to scan for tasks
[TASKS] Found 21 open tasks.
Skipping warnings blame since pipelines do not have an SCM link.%n
[TASKS] Computing warning deltas based on reference build #47
[Pipeline] // withMaven
[Pipeline] }
[Pipeline] // stage
[Pipeline] stage
[Pipeline] { (Clean up workspace)
[Pipeline] cleanWs
[WS-CLEANUP] Deleting project workspace...[WS-CLEANUP] done
[Pipeline] }
[Pipeline] // stage
[Pipeline] stage
[Pipeline] { (Reporting)
[Pipeline] emailextrecipients
[Pipeline] emailext
Sending email to: pvj@eng.au.dk victor.bandur@eng.au.dk
[Pipeline] }
[Pipeline] // stage
[Pipeline] }
[Pipeline] // node
[Pipeline] End of Pipeline

GitHub has been notified of this commit’s build result

ERROR: script returned exit code 1
Finished: FAILURE