FailedConsole Output

Started by user Peter W. V. Tran-Jørgensen
Building on master in workspace /var/lib/jenkins/workspace/vdm2c-release
Wiping out workspace first.
Cloning the remote Git repository
Cloning repository git@github.com:overturetool/vdm2c.git
 > /usr/bin/git init /var/lib/jenkins/workspace/vdm2c-release # timeout=10
Fetching upstream changes from git@github.com:overturetool/vdm2c.git
 > /usr/bin/git --version # timeout=10
 > /usr/bin/git -c core.askpass=true fetch --tags --progress git@github.com:overturetool/vdm2c.git +refs/heads/*:refs/remotes/origin/*
 > /usr/bin/git config remote.origin.url git@github.com:overturetool/vdm2c.git # timeout=10
 > /usr/bin/git config --add remote.origin.fetch +refs/heads/*:refs/remotes/origin/* # timeout=10
 > /usr/bin/git config remote.origin.url git@github.com:overturetool/vdm2c.git # timeout=10
Fetching upstream changes from git@github.com:overturetool/vdm2c.git
 > /usr/bin/git -c core.askpass=true fetch --tags --progress git@github.com:overturetool/vdm2c.git +refs/heads/*:refs/remotes/origin/*
 > /usr/bin/git rev-parse refs/remotes/origin/development^{commit} # timeout=10
 > /usr/bin/git rev-parse refs/remotes/origin/refs/heads/development^{commit} # timeout=10
Checking out Revision 9b5fa022fe7a7d356dc5217a8018b75bc0d74641 (refs/remotes/origin/development)
 > /usr/bin/git config core.sparsecheckout # timeout=10
 > /usr/bin/git checkout -f 9b5fa022fe7a7d356dc5217a8018b75bc0d74641
 > /usr/bin/git rev-list 2610125ede6d9d6d647b92ba4658a4046a67d25f # timeout=10
[vdm2c-release] $ /bin/sh -xe /tmp/hudson6977077773799849620.sh
+ wget -q https://raw.githubusercontent.com/overturetool/overture-release-scripts/master/perform-release.sh -O perform-release.sh
+ chmod +x perform-release.sh
+ wget -q https://raw.githubusercontent.com/overturetool/overture-release-scripts/master/git-set-private-key.sh -O git-set-private-key.sh
+ chmod +x git-set-private-key.sh
+ ./git-set-private-key.sh /var/lib/jenkins/.ssh/id_rsa_vdm2c
+ export GIT_SSH=/var/lib/jenkins/workspace/vdm2c-release/ssh
+ batchmode=release ./perform-release.sh /var/lib/jenkins/internal-resources/settings.xml
Building from branch: HEAD
Checking for overture.release.properties
File exists: overture.release.properties
Fetch current version
Current version  : 0.0.3-SNAPSHOT
Next dev version : 0.0.7-SNAPSHOT
Release version  : 0.0.6
Cleaning old release artefacts
Prepare new release -DpushChanges=false
[INFO] Scanning for projects...
[INFO] ------------------------------------------------------------------------
[INFO] Reactor Build Order:
[INFO] 
[INFO] Overture VDM 2 C Translator Root
[INFO] C native root vdm2c
[INFO] The C Code Generator VDM library sources
[INFO] Core Tools for vdm2c
[INFO] The C Code Generator
[INFO]                                                                         
[INFO] ------------------------------------------------------------------------
[INFO] Building Overture VDM 2 C Translator Root 0.0.3-SNAPSHOT
[INFO] ------------------------------------------------------------------------
[INFO] 
[INFO] --- maven-release-plugin:2.5:prepare (default-cli) @ root ---
[INFO] Verifying that there are no local modifications...
[INFO]   ignoring changes on: **/pom.xml.releaseBackup, **/pom.xml.next, **/pom.xml.tag, **/pom.xml.branch, **/release.properties, **/pom.xml.backup
[INFO] Executing: /bin/sh -c cd /var/lib/jenkins/workspace/vdm2c-release && git rev-parse --show-toplevel
[INFO] Working directory: /var/lib/jenkins/workspace/vdm2c-release
[INFO] Executing: /bin/sh -c cd /var/lib/jenkins/workspace/vdm2c-release && git status --porcelain .
[INFO] Working directory: /var/lib/jenkins/workspace/vdm2c-release
[WARNING] Ignoring unrecognized line: ?? git-set-private-key.sh
[WARNING] Ignoring unrecognized line: ?? perform-release.sh
[WARNING] Ignoring unrecognized line: ?? release.properties
[WARNING] Ignoring unrecognized line: ?? ssh
[INFO] Checking dependencies and plugins for snapshots ...
[INFO] Transforming 'Overture VDM 2 C Translator Root'...
[INFO] Transforming 'C native root vdm2c'...
[INFO] Transforming 'The C Code Generator VDM library sources'...
[INFO] Transforming 'Core Tools for vdm2c'...
[INFO] Transforming 'The C Code Generator'...
[INFO] Not generating release POMs
[INFO] Executing goals 'clean verify'...
[INFO] Executing: /bin/sh -c cd /var/lib/jenkins/workspace/vdm2c-release && /usr/share/maven/bin/mvn -s /tmp/release-settings3570523118062669513.xml clean verify --no-plugin-updates --batch-mode -Psonatype-oss-release
    [WARNING] Command line option -npu is deprecated and will be removed in future Maven versions.
    [INFO] Scanning for projects...
    [INFO] ------------------------------------------------------------------------
    [INFO] Reactor Build Order:
    [INFO] 
    [INFO] Overture VDM 2 C Translator Root
    [INFO] C native root vdm2c
    [INFO] The C Code Generator VDM library sources
    [INFO] Core Tools for vdm2c
    [INFO] The C Code Generator
    [INFO]                                                                         
    [INFO] ------------------------------------------------------------------------
    [INFO] Building Overture VDM 2 C Translator Root 0.0.6
    [INFO] ------------------------------------------------------------------------
    Downloading: http://overture.au.dk/artifactory/remote-repos/org/apache/maven/plugins/maven-source-plugin/2.1.2/maven-source-plugin-2.1.2.pom
    Downloaded: http://overture.au.dk/artifactory/remote-repos/org/apache/maven/plugins/maven-source-plugin/2.1.2/maven-source-plugin-2.1.2.pom (6 KB at 31.9 KB/sec)
    Downloading: http://overture.au.dk/artifactory/remote-repos/org/apache/maven/plugins/maven-plugins/18/maven-plugins-18.pom
    Downloaded: http://overture.au.dk/artifactory/remote-repos/org/apache/maven/plugins/maven-plugins/18/maven-plugins-18.pom (13 KB at 423.2 KB/sec)
    Downloading: http://overture.au.dk/artifactory/remote-repos/org/apache/maven/maven-parent/16/maven-parent-16.pom
    Downloaded: http://overture.au.dk/artifactory/remote-repos/org/apache/maven/maven-parent/16/maven-parent-16.pom (23 KB at 1196.1 KB/sec)
    Downloading: http://overture.au.dk/artifactory/remote-repos/org/apache/maven/plugins/maven-source-plugin/2.1.2/maven-source-plugin-2.1.2.jar
    Downloaded: http://overture.au.dk/artifactory/remote-repos/org/apache/maven/plugins/maven-source-plugin/2.1.2/maven-source-plugin-2.1.2.jar (24 KB at 1566.3 KB/sec)
    Downloading: http://overture.au.dk/artifactory/remote-repos/org/apache/maven/plugins/maven-javadoc-plugin/2.7/maven-javadoc-plugin-2.7.pom
    Downloaded: http://overture.au.dk/artifactory/remote-repos/org/apache/maven/plugins/maven-javadoc-plugin/2.7/maven-javadoc-plugin-2.7.pom (16 KB at 883.4 KB/sec)
    Downloading: http://overture.au.dk/artifactory/remote-repos/org/apache/maven/plugins/maven-plugins/17/maven-plugins-17.pom
    Downloaded: http://overture.au.dk/artifactory/remote-repos/org/apache/maven/plugins/maven-plugins/17/maven-plugins-17.pom (13 KB at 743.9 KB/sec)
    Downloading: http://overture.au.dk/artifactory/remote-repos/org/apache/maven/plugins/maven-javadoc-plugin/2.7/maven-javadoc-plugin-2.7.jar
    Downloaded: http://overture.au.dk/artifactory/remote-repos/org/apache/maven/plugins/maven-javadoc-plugin/2.7/maven-javadoc-plugin-2.7.jar (268 KB at 9564.1 KB/sec)
    Downloading: http://overture.au.dk/artifactory/remote-repos/org/apache/maven/plugins/maven-gpg-plugin/1.1/maven-gpg-plugin-1.1.pom
    Downloaded: http://overture.au.dk/artifactory/remote-repos/org/apache/maven/plugins/maven-gpg-plugin/1.1/maven-gpg-plugin-1.1.pom (5 KB at 233.1 KB/sec)
    Downloading: http://overture.au.dk/artifactory/remote-repos/org/apache/maven/plugins/maven-gpg-plugin/1.1/maven-gpg-plugin-1.1.jar
    Downloaded: http://overture.au.dk/artifactory/remote-repos/org/apache/maven/plugins/maven-gpg-plugin/1.1/maven-gpg-plugin-1.1.jar (30 KB at 1544.3 KB/sec)
    [INFO] 
    [INFO] --- maven-clean-plugin:2.5:clean (default-clean) @ root ---
    Downloading: http://overture.au.dk/artifactory/remote-repos/org/apache/maven/maven-plugin-api/2.0.6/maven-plugin-api-2.0.6.pom
    Downloaded: http://overture.au.dk/artifactory/remote-repos/org/apache/maven/maven-plugin-api/2.0.6/maven-plugin-api-2.0.6.pom (2 KB at 101.5 KB/sec)
    Downloading: http://overture.au.dk/artifactory/remote-repos/org/apache/maven/maven/2.0.6/maven-2.0.6.pom
    Downloaded: http://overture.au.dk/artifactory/remote-repos/org/apache/maven/maven/2.0.6/maven-2.0.6.pom (9 KB at 552.2 KB/sec)
    Downloading: http://overture.au.dk/artifactory/remote-repos/org/apache/maven/maven-parent/5/maven-parent-5.pom
    Downloaded: http://overture.au.dk/artifactory/remote-repos/org/apache/maven/maven-parent/5/maven-parent-5.pom (15 KB at 620.0 KB/sec)
    Downloading: http://overture.au.dk/artifactory/remote-repos/org/apache/apache/3/apache-3.pom
    Downloaded: http://overture.au.dk/artifactory/remote-repos/org/apache/apache/3/apache-3.pom (4 KB at 189.5 KB/sec)
    Downloading: http://overture.au.dk/artifactory/remote-repos/org/codehaus/plexus/plexus-utils/3.0/plexus-utils-3.0.pom
    Downloaded: http://overture.au.dk/artifactory/remote-repos/org/codehaus/plexus/plexus-utils/3.0/plexus-utils-3.0.pom (4 KB at 264.8 KB/sec)
    Downloading: http://overture.au.dk/artifactory/remote-repos/org/sonatype/spice/spice-parent/16/spice-parent-16.pom
    Downloaded: http://overture.au.dk/artifactory/remote-repos/org/sonatype/spice/spice-parent/16/spice-parent-16.pom (9 KB at 480.1 KB/sec)
    Downloading: http://overture.au.dk/artifactory/remote-repos/org/sonatype/forge/forge-parent/5/forge-parent-5.pom
    Downloaded: http://overture.au.dk/artifactory/remote-repos/org/sonatype/forge/forge-parent/5/forge-parent-5.pom (9 KB at 510.4 KB/sec)
    Downloading: http://overture.au.dk/artifactory/remote-repos/org/codehaus/plexus/plexus-utils/3.0/plexus-utils-3.0.jar
    Downloaded: http://overture.au.dk/artifactory/remote-repos/org/codehaus/plexus/plexus-utils/3.0/plexus-utils-3.0.jar (221 KB at 3942.4 KB/sec)
    [INFO] 
    [INFO] --- maven-enforcer-plugin:1.0:enforce (enforce-maven) @ root ---
    Downloading: http://overture.au.dk/artifactory/remote-repos/org/apache/maven/maven-artifact/2.0.9/maven-artifact-2.0.9.pom
    Downloaded: http://overture.au.dk/artifactory/remote-repos/org/apache/maven/maven-artifact/2.0.9/maven-artifact-2.0.9.pom (2 KB at 75.3 KB/sec)
    Downloading: http://overture.au.dk/artifactory/remote-repos/org/apache/maven/maven/2.0.9/maven-2.0.9.pom
    Downloaded: http://overture.au.dk/artifactory/remote-repos/org/apache/maven/maven/2.0.9/maven-2.0.9.pom (19 KB at 971.8 KB/sec)
    Downloading: http://overture.au.dk/artifactory/remote-repos/org/apache/maven/maven-parent/8/maven-parent-8.pom
    Downloaded: http://overture.au.dk/artifactory/remote-repos/org/apache/maven/maven-parent/8/maven-parent-8.pom (24 KB at 760.2 KB/sec)
    Downloading: http://overture.au.dk/artifactory/remote-repos/org/codehaus/plexus/plexus-utils/1.5.8/plexus-utils-1.5.8.pom
    Downloaded: http://overture.au.dk/artifactory/remote-repos/org/codehaus/plexus/plexus-utils/1.5.8/plexus-utils-1.5.8.pom (8 KB at 463.2 KB/sec)
    Downloading: http://overture.au.dk/artifactory/remote-repos/org/apache/maven/maven-plugin-api/2.0.9/maven-plugin-api-2.0.9.pom
    Downloaded: http://overture.au.dk/artifactory/remote-repos/org/apache/maven/maven-plugin-api/2.0.9/maven-plugin-api-2.0.9.pom (2 KB at 85.8 KB/sec)
    Downloading: http://overture.au.dk/artifactory/remote-repos/org/apache/maven/maven-project/2.0.9/maven-project-2.0.9.pom
    Downloaded: http://overture.au.dk/artifactory/remote-repos/org/apache/maven/maven-project/2.0.9/maven-project-2.0.9.pom (3 KB at 165.4 KB/sec)
    Downloading: http://overture.au.dk/artifactory/remote-repos/org/apache/maven/maven-settings/2.0.9/maven-settings-2.0.9.pom
    Downloaded: http://overture.au.dk/artifactory/remote-repos/org/apache/maven/maven-settings/2.0.9/maven-settings-2.0.9.pom (3 KB at 154.6 KB/sec)
    Downloading: http://overture.au.dk/artifactory/remote-repos/org/apache/maven/maven-model/2.0.9/maven-model-2.0.9.pom
    Downloaded: http://overture.au.dk/artifactory/remote-repos/org/apache/maven/maven-model/2.0.9/maven-model-2.0.9.pom (4 KB at 191.7 KB/sec)
    Downloading: http://overture.au.dk/artifactory/remote-repos/junit/junit/3.8.2/junit-3.8.2.pom
    Downloaded: http://overture.au.dk/artifactory/remote-repos/junit/junit/3.8.2/junit-3.8.2.pom (747 B at 6.5 KB/sec)
    Downloading: http://overture.au.dk/artifactory/remote-repos/org/apache/maven/maven-profile/2.0.9/maven-profile-2.0.9.pom
    Downloaded: http://overture.au.dk/artifactory/remote-repos/org/apache/maven/maven-profile/2.0.9/maven-profile-2.0.9.pom (3 KB at 91.0 KB/sec)
    Downloading: http://overture.au.dk/artifactory/remote-repos/org/apache/maven/maven-artifact-manager/2.0.9/maven-artifact-manager-2.0.9.pom
    Downloaded: http://overture.au.dk/artifactory/remote-repos/org/apache/maven/maven-artifact-manager/2.0.9/maven-artifact-manager-2.0.9.pom (3 KB at 155.1 KB/sec)
    Downloading: http://overture.au.dk/artifactory/remote-repos/org/apache/maven/maven-repository-metadata/2.0.9/maven-repository-metadata-2.0.9.pom
    Downloaded: http://overture.au.dk/artifactory/remote-repos/org/apache/maven/maven-repository-metadata/2.0.9/maven-repository-metadata-2.0.9.pom (2 KB at 142.8 KB/sec)
    Downloading: http://overture.au.dk/artifactory/remote-repos/org/apache/maven/maven-plugin-registry/2.0.9/maven-plugin-registry-2.0.9.pom
    Downloaded: http://overture.au.dk/artifactory/remote-repos/org/apache/maven/maven-plugin-registry/2.0.9/maven-plugin-registry-2.0.9.pom (2 KB at 160.4 KB/sec)
    Downloading: http://overture.au.dk/artifactory/remote-repos/org/apache/maven/maven-core/2.0.9/maven-core-2.0.9.pom
    Downloaded: http://overture.au.dk/artifactory/remote-repos/org/apache/maven/maven-core/2.0.9/maven-core-2.0.9.pom (8 KB at 568.4 KB/sec)
    Downloading: http://overture.au.dk/artifactory/remote-repos/org/apache/maven/maven-plugin-parameter-documenter/2.0.9/maven-plugin-parameter-documenter-2.0.9.pom
    Downloaded: http://overture.au.dk/artifactory/remote-repos/org/apache/maven/maven-plugin-parameter-documenter/2.0.9/maven-plugin-parameter-documenter-2.0.9.pom (2 KB at 137.0 KB/sec)
    Downloading: http://overture.au.dk/artifactory/remote-repos/org/apache/maven/reporting/maven-reporting-api/2.0.9/maven-reporting-api-2.0.9.pom
    Downloaded: http://overture.au.dk/artifactory/remote-repos/org/apache/maven/reporting/maven-reporting-api/2.0.9/maven-reporting-api-2.0.9.pom (2 KB at 110.0 KB/sec)
    Downloading: http://overture.au.dk/artifactory/remote-repos/org/apache/maven/reporting/maven-reporting/2.0.9/maven-reporting-2.0.9.pom
    Downloaded: http://overture.au.dk/artifactory/remote-repos/org/apache/maven/reporting/maven-reporting/2.0.9/maven-reporting-2.0.9.pom (2 KB at 103.0 KB/sec)
    Downloading: http://overture.au.dk/artifactory/remote-repos/org/apache/maven/doxia/doxia-sink-api/1.0-alpha-10/doxia-sink-api-1.0-alpha-10.pom
    Downloaded: http://overture.au.dk/artifactory/remote-repos/org/apache/maven/doxia/doxia-sink-api/1.0-alpha-10/doxia-sink-api-1.0-alpha-10.pom (2 KB at 87.7 KB/sec)
    Downloading: http://overture.au.dk/artifactory/remote-repos/org/apache/maven/doxia/doxia/1.0-alpha-10/doxia-1.0-alpha-10.pom
    Downloaded: http://overture.au.dk/artifactory/remote-repos/org/apache/maven/doxia/doxia/1.0-alpha-10/doxia-1.0-alpha-10.pom (9 KB at 745.4 KB/sec)
    Downloading: http://overture.au.dk/artifactory/remote-repos/org/apache/maven/maven-parent/6/maven-parent-6.pom
    Downloaded: http://overture.au.dk/artifactory/remote-repos/org/apache/maven/maven-parent/6/maven-parent-6.pom (20 KB at 1151.5 KB/sec)
    Downloading: http://overture.au.dk/artifactory/remote-repos/org/apache/maven/maven-error-diagnostics/2.0.9/maven-error-diagnostics-2.0.9.pom
    Downloaded: http://overture.au.dk/artifactory/remote-repos/org/apache/maven/maven-error-diagnostics/2.0.9/maven-error-diagnostics-2.0.9.pom (2 KB at 121.7 KB/sec)
    Downloading: http://overture.au.dk/artifactory/remote-repos/commons-cli/commons-cli/1.0/commons-cli-1.0.pom
    Downloaded: http://overture.au.dk/artifactory/remote-repos/commons-cli/commons-cli/1.0/commons-cli-1.0.pom (3 KB at 171.3 KB/sec)
    Downloading: http://overture.au.dk/artifactory/remote-repos/org/apache/maven/maven-plugin-descriptor/2.0.9/maven-plugin-descriptor-2.0.9.pom
    Downloaded: http://overture.au.dk/artifactory/remote-repos/org/apache/maven/maven-plugin-descriptor/2.0.9/maven-plugin-descriptor-2.0.9.pom (3 KB at 144.7 KB/sec)
    Downloading: http://overture.au.dk/artifactory/remote-repos/org/apache/maven/maven-monitor/2.0.9/maven-monitor-2.0.9.pom
    Downloaded: http://overture.au.dk/artifactory/remote-repos/org/apache/maven/maven-monitor/2.0.9/maven-monitor-2.0.9.pom (2 KB at 73.8 KB/sec)
    Downloading: http://overture.au.dk/artifactory/remote-repos/commons-lang/commons-lang/2.3/commons-lang-2.3.pom
    Downloaded: http://overture.au.dk/artifactory/remote-repos/commons-lang/commons-lang/2.3/commons-lang-2.3.pom (11 KB at 904.5 KB/sec)
    Downloading: http://overture.au.dk/artifactory/remote-repos/org/apache/maven/enforcer/enforcer-api/1.0/enforcer-api-1.0.pom
    Downloaded: http://overture.au.dk/artifactory/remote-repos/org/apache/maven/enforcer/enforcer-api/1.0/enforcer-api-1.0.pom (4 KB at 200.0 KB/sec)
    Downloading: http://overture.au.dk/artifactory/remote-repos/org/apache/maven/enforcer/enforcer-rules/1.0/enforcer-rules-1.0.pom
    Downloaded: http://overture.au.dk/artifactory/remote-repos/org/apache/maven/enforcer/enforcer-rules/1.0/enforcer-rules-1.0.pom (5 KB at 288.3 KB/sec)
    Downloading: http://overture.au.dk/artifactory/remote-repos/org/apache/maven/shared/maven-common-artifact-filters/1.2/maven-common-artifact-filters-1.2.pom
    Downloaded: http://overture.au.dk/artifactory/remote-repos/org/apache/maven/shared/maven-common-artifact-filters/1.2/maven-common-artifact-filters-1.2.pom (5 KB at 367.9 KB/sec)
    Downloading: http://overture.au.dk/artifactory/remote-repos/org/apache/maven/shared/maven-shared-components/11/maven-shared-components-11.pom
    Downloaded: http://overture.au.dk/artifactory/remote-repos/org/apache/maven/shared/maven-shared-components/11/maven-shared-components-11.pom (9 KB at 626.6 KB/sec)
    Downloading: http://overture.au.dk/artifactory/remote-repos/org/apache/maven/maven-model/2.0.8/maven-model-2.0.8.pom
    Downloaded: http://overture.au.dk/artifactory/remote-repos/org/apache/maven/maven-model/2.0.8/maven-model-2.0.8.pom (4 KB at 235.9 KB/sec)
    Downloading: http://overture.au.dk/artifactory/remote-repos/org/apache/maven/maven/2.0.8/maven-2.0.8.pom
    Downloaded: http://overture.au.dk/artifactory/remote-repos/org/apache/maven/maven/2.0.8/maven-2.0.8.pom (12 KB at 492.1 KB/sec)
    Downloading: http://overture.au.dk/artifactory/remote-repos/org/apache/maven/shared/maven-plugin-testing-harness/1.1/maven-plugin-testing-harness-1.1.pom
    Downloaded: http://overture.au.dk/artifactory/remote-repos/org/apache/maven/shared/maven-plugin-testing-harness/1.1/maven-plugin-testing-harness-1.1.pom (7 KB at 363.9 KB/sec)
    Downloading: http://overture.au.dk/artifactory/remote-repos/org/apache/maven/shared/maven-shared-components/7/maven-shared-components-7.pom
    Downloaded: http://overture.au.dk/artifactory/remote-repos/org/apache/maven/shared/maven-shared-components/7/maven-shared-components-7.pom (3 KB at 211.5 KB/sec)
    Downloading: http://overture.au.dk/artifactory/remote-repos/org/codehaus/plexus/plexus-archiver/1.0-alpha-7/plexus-archiver-1.0-alpha-7.pom
    Downloaded: http://overture.au.dk/artifactory/remote-repos/org/codehaus/plexus/plexus-archiver/1.0-alpha-7/plexus-archiver-1.0-alpha-7.pom (2 KB at 59.9 KB/sec)
    Downloading: http://overture.au.dk/artifactory/remote-repos/org/codehaus/plexus/plexus-components/1.1.6/plexus-components-1.1.6.pom
    Downloaded: http://overture.au.dk/artifactory/remote-repos/org/codehaus/plexus/plexus-components/1.1.6/plexus-components-1.1.6.pom (2 KB at 122.9 KB/sec)
    Downloading: http://overture.au.dk/artifactory/remote-repos/org/codehaus/plexus/plexus/1.0.8/plexus-1.0.8.pom
    Downloaded: http://overture.au.dk/artifactory/remote-repos/org/codehaus/plexus/plexus/1.0.8/plexus-1.0.8.pom (7 KB at 493.3 KB/sec)
    Downloading: http://overture.au.dk/artifactory/remote-repos/org/codehaus/plexus/plexus-container-default/1.0-alpha-8/plexus-container-default-1.0-alpha-8.pom
    Downloaded: http://overture.au.dk/artifactory/remote-repos/org/codehaus/plexus/plexus-container-default/1.0-alpha-8/plexus-container-default-1.0-alpha-8.pom (7 KB at 330.3 KB/sec)
    Downloading: http://overture.au.dk/artifactory/remote-repos/org/beanshell/bsh/2.0b4/bsh-2.0b4.pom
    Downloaded: http://overture.au.dk/artifactory/remote-repos/org/beanshell/bsh/2.0b4/bsh-2.0b4.pom (2 KB at 83.4 KB/sec)
    Downloading: http://overture.au.dk/artifactory/remote-repos/org/beanshell/beanshell/2.0b4/beanshell-2.0b4.pom
    Downloaded: http://overture.au.dk/artifactory/remote-repos/org/beanshell/beanshell/2.0b4/beanshell-2.0b4.pom (2 KB at 76.6 KB/sec)
    Downloading: http://overture.au.dk/artifactory/remote-repos/org/apache/maven/shared/maven-dependency-tree/1.2/maven-dependency-tree-1.2.pom
    Downloaded: http://overture.au.dk/artifactory/remote-repos/org/apache/maven/shared/maven-dependency-tree/1.2/maven-dependency-tree-1.2.pom (4 KB at 230.2 KB/sec)
    Downloading: http://overture.au.dk/artifactory/remote-repos/org/apache/maven/shared/maven-shared-components/9/maven-shared-components-9.pom
    Downloaded: http://overture.au.dk/artifactory/remote-repos/org/apache/maven/shared/maven-shared-components/9/maven-shared-components-9.pom (4 KB at 189.9 KB/sec)
    Downloading: http://overture.au.dk/artifactory/remote-repos/org/codehaus/plexus/plexus-i18n/1.0-beta-6/plexus-i18n-1.0-beta-6.pom
    Downloaded: http://overture.au.dk/artifactory/remote-repos/org/codehaus/plexus/plexus-i18n/1.0-beta-6/plexus-i18n-1.0-beta-6.pom (771 B at 53.8 KB/sec)
    Downloading: http://overture.au.dk/artifactory/remote-repos/org/codehaus/plexus/plexus-components/1.1.4/plexus-components-1.1.4.pom
    Downloaded: http://overture.au.dk/artifactory/remote-repos/org/codehaus/plexus/plexus-components/1.1.4/plexus-components-1.1.4.pom (3 KB at 144.5 KB/sec)
    Downloading: http://overture.au.dk/artifactory/remote-repos/org/apache/maven/reporting/maven-reporting-api/2.0.9/maven-reporting-api-2.0.9.jar
    Downloading: http://overture.au.dk/artifactory/remote-repos/commons-cli/commons-cli/1.0/commons-cli-1.0.jar
    Downloading: http://overture.au.dk/artifactory/remote-repos/org/codehaus/plexus/plexus-utils/1.5.8/plexus-utils-1.5.8.jar
    Downloading: http://overture.au.dk/artifactory/remote-repos/org/apache/maven/doxia/doxia-sink-api/1.0-alpha-10/doxia-sink-api-1.0-alpha-10.jar
    Downloading: http://overture.au.dk/artifactory/remote-repos/org/codehaus/plexus/plexus-interactivity-api/1.0-alpha-4/plexus-interactivity-api-1.0-alpha-4.jar
    Downloaded: http://overture.au.dk/artifactory/remote-repos/org/apache/maven/reporting/maven-reporting-api/2.0.9/maven-reporting-api-2.0.9.jar (10 KB at 618.7 KB/sec)
    Downloading: http://overture.au.dk/artifactory/remote-repos/commons-lang/commons-lang/2.3/commons-lang-2.3.jar
    Downloaded: http://overture.au.dk/artifactory/remote-repos/commons-cli/commons-cli/1.0/commons-cli-1.0.jar (30 KB at 1470.6 KB/sec)
    Downloading: http://overture.au.dk/artifactory/remote-repos/org/apache/maven/enforcer/enforcer-api/1.0/enforcer-api-1.0.jar
    Downloaded: http://overture.au.dk/artifactory/remote-repos/org/codehaus/plexus/plexus-interactivity-api/1.0-alpha-4/plexus-interactivity-api-1.0-alpha-4.jar (14 KB at 545.5 KB/sec)
    Downloading: http://overture.au.dk/artifactory/remote-repos/org/apache/maven/enforcer/enforcer-rules/1.0/enforcer-rules-1.0.jar
    Downloaded: http://overture.au.dk/artifactory/remote-repos/org/apache/maven/doxia/doxia-sink-api/1.0-alpha-10/doxia-sink-api-1.0-alpha-10.jar (10 KB at 387.0 KB/sec)
    Downloading: http://overture.au.dk/artifactory/remote-repos/org/apache/maven/shared/maven-common-artifact-filters/1.2/maven-common-artifact-filters-1.2.jar
    Downloaded: http://overture.au.dk/artifactory/remote-repos/org/codehaus/plexus/plexus-utils/1.5.8/plexus-utils-1.5.8.jar (262 KB at 10899.0 KB/sec)
    Downloading: http://overture.au.dk/artifactory/remote-repos/org/beanshell/bsh/2.0b4/bsh-2.0b4.jar
    Downloaded: http://overture.au.dk/artifactory/remote-repos/org/apache/maven/enforcer/enforcer-api/1.0/enforcer-api-1.0.jar (10 KB at 532.0 KB/sec)
    Downloading: http://overture.au.dk/artifactory/remote-repos/org/apache/maven/shared/maven-dependency-tree/1.2/maven-dependency-tree-1.2.jar
    Downloaded: http://overture.au.dk/artifactory/remote-repos/commons-lang/commons-lang/2.3/commons-lang-2.3.jar (240 KB at 9980.2 KB/sec)
    Downloading: http://overture.au.dk/artifactory/remote-repos/org/codehaus/plexus/plexus-i18n/1.0-beta-6/plexus-i18n-1.0-beta-6.jar
    Downloaded: http://overture.au.dk/artifactory/remote-repos/org/apache/maven/enforcer/enforcer-rules/1.0/enforcer-rules-1.0.jar (60 KB at 2835.3 KB/sec)
    Downloaded: http://overture.au.dk/artifactory/remote-repos/org/apache/maven/shared/maven-common-artifact-filters/1.2/maven-common-artifact-filters-1.2.jar (31 KB at 1402.7 KB/sec)
    Downloaded: http://overture.au.dk/artifactory/remote-repos/org/beanshell/bsh/2.0b4/bsh-2.0b4.jar (276 KB at 12504.2 KB/sec)
    Downloaded: http://overture.au.dk/artifactory/remote-repos/org/apache/maven/shared/maven-dependency-tree/1.2/maven-dependency-tree-1.2.jar (34 KB at 2249.9 KB/sec)
    Downloaded: http://overture.au.dk/artifactory/remote-repos/org/codehaus/plexus/plexus-i18n/1.0-beta-6/plexus-i18n-1.0-beta-6.jar (12 KB at 617.2 KB/sec)
    [INFO] 
    [INFO] --- jacoco-maven-plugin:0.7.6.201602180812:prepare-agent (jacoco-initialize) @ root ---
    Downloading: http://overture.au.dk/artifactory/remote-repos/org/codehaus/plexus/plexus-utils/1.5.15/plexus-utils-1.5.15.pom
    Downloaded: http://overture.au.dk/artifactory/remote-repos/org/codehaus/plexus/plexus-utils/1.5.15/plexus-utils-1.5.15.pom (7 KB at 393.4 KB/sec)
    Downloading: http://overture.au.dk/artifactory/remote-repos/junit/junit/4.8.2/junit-4.8.2.pom
    Downloaded: http://overture.au.dk/artifactory/remote-repos/junit/junit/4.8.2/junit-4.8.2.pom (2 KB at 131.6 KB/sec)
    Downloading: http://overture.au.dk/artifactory/remote-repos/org/codehaus/plexus/plexus-utils/1.0.4/plexus-utils-1.0.4.pom
    Downloaded: http://overture.au.dk/artifactory/remote-repos/org/codehaus/plexus/plexus-utils/1.0.4/plexus-utils-1.0.4.pom (6 KB at 345.0 KB/sec)
    Downloading: http://overture.au.dk/artifactory/remote-repos/org/codehaus/plexus/plexus-utils/1.5.6/plexus-utils-1.5.6.pom
    Downloaded: http://overture.au.dk/artifactory/remote-repos/org/codehaus/plexus/plexus-utils/1.5.6/plexus-utils-1.5.6.pom (6 KB at 369.8 KB/sec)
    Downloading: http://overture.au.dk/artifactory/remote-repos/org/codehaus/plexus/plexus/1.0.12/plexus-1.0.12.pom
    Downloaded: http://overture.au.dk/artifactory/remote-repos/org/codehaus/plexus/plexus/1.0.12/plexus-1.0.12.pom (10 KB at 697.3 KB/sec)
    Downloading: http://overture.au.dk/artifactory/remote-repos/org/apache/maven/shared/file-management/1.2.1/file-management-1.2.1.pom
    Downloaded: http://overture.au.dk/artifactory/remote-repos/org/apache/maven/shared/file-management/1.2.1/file-management-1.2.1.pom (4 KB at 236.9 KB/sec)
    Downloading: http://overture.au.dk/artifactory/remote-repos/org/apache/maven/shared/maven-shared-components/10/maven-shared-components-10.pom
    Downloaded: http://overture.au.dk/artifactory/remote-repos/org/apache/maven/shared/maven-shared-components/10/maven-shared-components-10.pom (9 KB at 633.5 KB/sec)
    Downloading: http://overture.au.dk/artifactory/remote-repos/org/apache/maven/maven-parent/9/maven-parent-9.pom
    Downloaded: http://overture.au.dk/artifactory/remote-repos/org/apache/maven/maven-parent/9/maven-parent-9.pom (33 KB at 1781.5 KB/sec)
    Downloading: http://overture.au.dk/artifactory/remote-repos/org/apache/maven/shared/maven-shared-io/1.1/maven-shared-io-1.1.pom
    Downloaded: http://overture.au.dk/artifactory/remote-repos/org/apache/maven/shared/maven-shared-io/1.1/maven-shared-io-1.1.pom (4 KB at 305.0 KB/sec)
    Downloading: http://overture.au.dk/artifactory/remote-repos/org/apache/maven/shared/maven-shared-components/8/maven-shared-components-8.pom
    Downloaded: http://overture.au.dk/artifactory/remote-repos/org/apache/maven/shared/maven-shared-components/8/maven-shared-components-8.pom (3 KB at 200.9 KB/sec)
    Downloading: http://overture.au.dk/artifactory/remote-repos/org/apache/maven/maven-parent/7/maven-parent-7.pom
    Downloaded: http://overture.au.dk/artifactory/remote-repos/org/apache/maven/maven-parent/7/maven-parent-7.pom (21 KB at 1152.6 KB/sec)
    Downloading: http://overture.au.dk/artifactory/remote-repos/org/apache/maven/maven-artifact/2.0.2/maven-artifact-2.0.2.pom
    Downloaded: http://overture.au.dk/artifactory/remote-repos/org/apache/maven/maven-artifact/2.0.2/maven-artifact-2.0.2.pom (765 B at 57.5 KB/sec)
    Downloading: http://overture.au.dk/artifactory/remote-repos/org/apache/maven/maven/2.0.2/maven-2.0.2.pom
    Downloaded: http://overture.au.dk/artifactory/remote-repos/org/apache/maven/maven/2.0.2/maven-2.0.2.pom (13 KB at 619.8 KB/sec)
    Downloading: http://overture.au.dk/artifactory/remote-repos/org/codehaus/plexus/plexus-utils/1.1/plexus-utils-1.1.pom
    Downloaded: http://overture.au.dk/artifactory/remote-repos/org/codehaus/plexus/plexus-utils/1.1/plexus-utils-1.1.pom (767 B at 44.1 KB/sec)
    Downloading: http://overture.au.dk/artifactory/remote-repos/org/apache/maven/maven-artifact-manager/2.0.2/maven-artifact-manager-2.0.2.pom
    Downloaded: http://overture.au.dk/artifactory/remote-repos/org/apache/maven/maven-artifact-manager/2.0.2/maven-artifact-manager-2.0.2.pom (2 KB at 97.3 KB/sec)
    Downloading: http://overture.au.dk/artifactory/remote-repos/org/apache/maven/maven-repository-metadata/2.0.2/maven-repository-metadata-2.0.2.pom
    Downloaded: http://overture.au.dk/artifactory/remote-repos/org/apache/maven/maven-repository-metadata/2.0.2/maven-repository-metadata-2.0.2.pom (2 KB at 98.3 KB/sec)
    Downloading: http://overture.au.dk/artifactory/remote-repos/org/apache/maven/wagon/wagon-provider-api/1.0-alpha-6/wagon-provider-api-1.0-alpha-6.pom
    Downloaded: http://overture.au.dk/artifactory/remote-repos/org/apache/maven/wagon/wagon-provider-api/1.0-alpha-6/wagon-provider-api-1.0-alpha-6.pom (588 B at 41.0 KB/sec)
    Downloading: http://overture.au.dk/artifactory/remote-repos/org/apache/maven/wagon/wagon/1.0-alpha-6/wagon-1.0-alpha-6.pom
    Downloaded: http://overture.au.dk/artifactory/remote-repos/org/apache/maven/wagon/wagon/1.0-alpha-6/wagon-1.0-alpha-6.pom (7 KB at 347.4 KB/sec)
    Downloading: http://overture.au.dk/artifactory/remote-repos/org/codehaus/plexus/plexus-utils/1.4.6/plexus-utils-1.4.6.pom
    Downloaded: http://overture.au.dk/artifactory/remote-repos/org/codehaus/plexus/plexus-utils/1.4.6/plexus-utils-1.4.6.pom (3 KB at 130.1 KB/sec)
    Downloading: http://overture.au.dk/artifactory/remote-repos/org/codehaus/plexus/plexus-utils/1.4.5/plexus-utils-1.4.5.pom
    Downloaded: http://overture.au.dk/artifactory/remote-repos/org/codehaus/plexus/plexus-utils/1.4.5/plexus-utils-1.4.5.pom (3 KB at 138.2 KB/sec)
    Downloading: http://overture.au.dk/artifactory/remote-repos/org/apache/maven/reporting/maven-reporting-impl/2.1/maven-reporting-impl-2.1.pom
    Downloaded: http://overture.au.dk/artifactory/remote-repos/org/apache/maven/reporting/maven-reporting-impl/2.1/maven-reporting-impl-2.1.pom (5 KB at 315.6 KB/sec)
    Downloading: http://overture.au.dk/artifactory/remote-repos/org/apache/maven/shared/maven-shared-components/15/maven-shared-components-15.pom
    Downloaded: http://overture.au.dk/artifactory/remote-repos/org/apache/maven/shared/maven-shared-components/15/maven-shared-components-15.pom (10 KB at 607.9 KB/sec)
    Downloading: http://overture.au.dk/artifactory/remote-repos/org/apache/maven/reporting/maven-reporting-api/3.0/maven-reporting-api-3.0.pom
    Downloaded: http://overture.au.dk/artifactory/remote-repos/org/apache/maven/reporting/maven-reporting-api/3.0/maven-reporting-api-3.0.pom (3 KB at 165.5 KB/sec)
    Downloading: http://overture.au.dk/artifactory/remote-repos/org/apache/maven/doxia/doxia-sink-api/1.0/doxia-sink-api-1.0.pom
    Downloaded: http://overture.au.dk/artifactory/remote-repos/org/apache/maven/doxia/doxia-sink-api/1.0/doxia-sink-api-1.0.pom (2 KB at 96.7 KB/sec)
    Downloading: http://overture.au.dk/artifactory/remote-repos/org/apache/maven/doxia/doxia/1.0/doxia-1.0.pom
    Downloaded: http://overture.au.dk/artifactory/remote-repos/org/apache/maven/doxia/doxia/1.0/doxia-1.0.pom (10 KB at 724.5 KB/sec)
    Downloading: http://overture.au.dk/artifactory/remote-repos/org/apache/maven/maven-parent/10/maven-parent-10.pom
    Downloaded: http://overture.au.dk/artifactory/remote-repos/org/apache/maven/maven-parent/10/maven-parent-10.pom (31 KB at 2206.7 KB/sec)
    Downloading: http://overture.au.dk/artifactory/remote-repos/org/apache/maven/maven-project/2.0.10/maven-project-2.0.10.pom
    Downloaded: http://overture.au.dk/artifactory/remote-repos/org/apache/maven/maven-project/2.0.10/maven-project-2.0.10.pom (3 KB at 198.6 KB/sec)
    Downloading: http://overture.au.dk/artifactory/remote-repos/org/apache/maven/maven/2.0.10/maven-2.0.10.pom
    Downloaded: http://overture.au.dk/artifactory/remote-repos/org/apache/maven/maven/2.0.10/maven-2.0.10.pom (24 KB at 1580.9 KB/sec)
    Downloading: http://overture.au.dk/artifactory/remote-repos/org/apache/maven/maven-settings/2.0.10/maven-settings-2.0.10.pom
    Downloaded: http://overture.au.dk/artifactory/remote-repos/org/apache/maven/maven-settings/2.0.10/maven-settings-2.0.10.pom (3 KB at 136.6 KB/sec)
    Downloading: http://overture.au.dk/artifactory/remote-repos/org/apache/maven/maven-model/2.0.10/maven-model-2.0.10.pom
    Downloaded: http://overture.au.dk/artifactory/remote-repos/org/apache/maven/maven-model/2.0.10/maven-model-2.0.10.pom (4 KB at 181.0 KB/sec)
    Downloading: http://overture.au.dk/artifactory/remote-repos/org/codehaus/plexus/plexus-utils/1.5.5/plexus-utils-1.5.5.pom
    Downloaded: http://overture.au.dk/artifactory/remote-repos/org/codehaus/plexus/plexus-utils/1.5.5/plexus-utils-1.5.5.pom (6 KB at 359.0 KB/sec)
    Downloading: http://overture.au.dk/artifactory/remote-repos/org/codehaus/plexus/plexus-interpolation/1.1/plexus-interpolation-1.1.pom
    Downloaded: http://overture.au.dk/artifactory/remote-repos/org/codehaus/plexus/plexus-interpolation/1.1/plexus-interpolation-1.1.pom (2 KB at 107.9 KB/sec)
    Downloading: http://overture.au.dk/artifactory/remote-repos/org/apache/maven/maven-profile/2.0.10/maven-profile-2.0.10.pom
    Downloaded: http://overture.au.dk/artifactory/remote-repos/org/apache/maven/maven-profile/2.0.10/maven-profile-2.0.10.pom (3 KB at 146.1 KB/sec)
    Downloading: http://overture.au.dk/artifactory/remote-repos/org/apache/maven/maven-artifact-manager/2.0.10/maven-artifact-manager-2.0.10.pom
    Downloaded: http://overture.au.dk/artifactory/remote-repos/org/apache/maven/maven-artifact-manager/2.0.10/maven-artifact-manager-2.0.10.pom (3 KB at 202.9 KB/sec)
    Downloading: http://overture.au.dk/artifactory/remote-repos/org/apache/maven/maven-repository-metadata/2.0.10/maven-repository-metadata-2.0.10.pom
    Downloaded: http://overture.au.dk/artifactory/remote-repos/org/apache/maven/maven-repository-metadata/2.0.10/maven-repository-metadata-2.0.10.pom (3 KB at 161.5 KB/sec)
    Downloading: http://overture.au.dk/artifactory/remote-repos/org/apache/maven/maven-artifact/2.0.10/maven-artifact-2.0.10.pom
    Downloaded: http://overture.au.dk/artifactory/remote-repos/org/apache/maven/maven-artifact/2.0.10/maven-artifact-2.0.10.pom (2 KB at 121.7 KB/sec)
    Downloading: http://overture.au.dk/artifactory/remote-repos/org/apache/maven/maven-plugin-registry/2.0.10/maven-plugin-registry-2.0.10.pom
    Downloaded: http://overture.au.dk/artifactory/remote-repos/org/apache/maven/maven-plugin-registry/2.0.10/maven-plugin-registry-2.0.10.pom (2 KB at 140.6 KB/sec)
    Downloading: http://overture.au.dk/artifactory/remote-repos/org/apache/maven/maven-plugin-api/2.0.10/maven-plugin-api-2.0.10.pom
    Downloaded: http://overture.au.dk/artifactory/remote-repos/org/apache/maven/maven-plugin-api/2.0.10/maven-plugin-api-2.0.10.pom (2 KB at 104.3 KB/sec)
    Downloading: http://overture.au.dk/artifactory/remote-repos/org/apache/maven/doxia/doxia-sink-api/1.1.2/doxia-sink-api-1.1.2.pom
    Downloaded: http://overture.au.dk/artifactory/remote-repos/org/apache/maven/doxia/doxia-sink-api/1.1.2/doxia-sink-api-1.1.2.pom (2 KB at 96.1 KB/sec)
    Downloading: http://overture.au.dk/artifactory/remote-repos/org/apache/maven/doxia/doxia/1.1.2/doxia-1.1.2.pom
    Downloaded: http://overture.au.dk/artifactory/remote-repos/org/apache/maven/doxia/doxia/1.1.2/doxia-1.1.2.pom (18 KB at 1182.0 KB/sec)
    Downloading: http://overture.au.dk/artifactory/remote-repos/org/apache/maven/maven-parent/15/maven-parent-15.pom
    Downloaded: http://overture.au.dk/artifactory/remote-repos/org/apache/maven/maven-parent/15/maven-parent-15.pom (24 KB at 1674.3 KB/sec)
    Downloading: http://overture.au.dk/artifactory/remote-repos/org/apache/apache/6/apache-6.pom
    Downloaded: http://overture.au.dk/artifactory/remote-repos/org/apache/apache/6/apache-6.pom (13 KB at 938.0 KB/sec)
    Downloading: http://overture.au.dk/artifactory/remote-repos/org/apache/maven/doxia/doxia-logging-api/1.1.2/doxia-logging-api-1.1.2.pom
    Downloaded: http://overture.au.dk/artifactory/remote-repos/org/apache/maven/doxia/doxia-logging-api/1.1.2/doxia-logging-api-1.1.2.pom (2 KB at 118.7 KB/sec)
    Downloading: http://overture.au.dk/artifactory/remote-repos/org/apache/maven/doxia/doxia-core/1.1.2/doxia-core-1.1.2.pom
    Downloaded: http://overture.au.dk/artifactory/remote-repos/org/apache/maven/doxia/doxia-core/1.1.2/doxia-core-1.1.2.pom (4 KB at 191.2 KB/sec)
    Downloading: http://overture.au.dk/artifactory/remote-repos/org/codehaus/plexus/plexus-utils/1.5.12/plexus-utils-1.5.12.pom
    Downloaded: http://overture.au.dk/artifactory/remote-repos/org/codehaus/plexus/plexus-utils/1.5.12/plexus-utils-1.5.12.pom (6 KB at 393.0 KB/sec)
    Downloading: http://overture.au.dk/artifactory/remote-repos/xerces/xercesImpl/2.8.1/xercesImpl-2.8.1.pom
    Downloaded: http://overture.au.dk/artifactory/remote-repos/xerces/xercesImpl/2.8.1/xercesImpl-2.8.1.pom (3 KB at 165.8 KB/sec)
    Downloading: http://overture.au.dk/artifactory/remote-repos/xml-apis/xml-apis/1.3.03/xml-apis-1.3.03.pom
    Downloaded: http://overture.au.dk/artifactory/remote-repos/xml-apis/xml-apis/1.3.03/xml-apis-1.3.03.pom (738 B at 45.0 KB/sec)
    Downloading: http://overture.au.dk/artifactory/remote-repos/org/apache/apache/1/apache-1.pom
    Downloaded: http://overture.au.dk/artifactory/remote-repos/org/apache/apache/1/apache-1.pom (4 KB at 251.5 KB/sec)
    Downloading: http://overture.au.dk/artifactory/remote-repos/commons-httpclient/commons-httpclient/3.1/commons-httpclient-3.1.pom
    Downloaded: http://overture.au.dk/artifactory/remote-repos/commons-httpclient/commons-httpclient/3.1/commons-httpclient-3.1.pom (8 KB at 445.9 KB/sec)
    Downloading: http://overture.au.dk/artifactory/remote-repos/commons-logging/commons-logging/1.0.4/commons-logging-1.0.4.pom
    Downloaded: http://overture.au.dk/artifactory/remote-repos/commons-logging/commons-logging/1.0.4/commons-logging-1.0.4.pom (6 KB at 367.2 KB/sec)
    Downloading: http://overture.au.dk/artifactory/remote-repos/commons-codec/commons-codec/1.2/commons-codec-1.2.pom
    Downloaded: http://overture.au.dk/artifactory/remote-repos/commons-codec/commons-codec/1.2/commons-codec-1.2.pom (4 KB at 287.3 KB/sec)
    Downloading: http://overture.au.dk/artifactory/remote-repos/org/apache/maven/doxia/doxia-site-renderer/1.1.2/doxia-site-renderer-1.1.2.pom
    Downloaded: http://overture.au.dk/artifactory/remote-repos/org/apache/maven/doxia/doxia-site-renderer/1.1.2/doxia-site-renderer-1.1.2.pom (6 KB at 459.7 KB/sec)
    Downloading: http://overture.au.dk/artifactory/remote-repos/org/apache/maven/doxia/doxia-sitetools/1.1.2/doxia-sitetools-1.1.2.pom
    Downloaded: http://overture.au.dk/artifactory/remote-repos/org/apache/maven/doxia/doxia-sitetools/1.1.2/doxia-sitetools-1.1.2.pom (15 KB at 995.1 KB/sec)
    Downloading: http://overture.au.dk/artifactory/remote-repos/org/apache/maven/doxia/doxia-decoration-model/1.1.2/doxia-decoration-model-1.1.2.pom
    Downloaded: http://overture.au.dk/artifactory/remote-repos/org/apache/maven/doxia/doxia-decoration-model/1.1.2/doxia-decoration-model-1.1.2.pom (3 KB at 161.4 KB/sec)
    Downloading: http://overture.au.dk/artifactory/remote-repos/org/apache/maven/doxia/doxia-module-xhtml/1.1.2/doxia-module-xhtml-1.1.2.pom
    Downloaded: http://overture.au.dk/artifactory/remote-repos/org/apache/maven/doxia/doxia-module-xhtml/1.1.2/doxia-module-xhtml-1.1.2.pom (2 KB at 104.3 KB/sec)
    Downloading: http://overture.au.dk/artifactory/remote-repos/org/apache/maven/doxia/doxia-modules/1.1.2/doxia-modules-1.1.2.pom
    Downloaded: http://overture.au.dk/artifactory/remote-repos/org/apache/maven/doxia/doxia-modules/1.1.2/doxia-modules-1.1.2.pom (3 KB at 140.0 KB/sec)
    Downloading: http://overture.au.dk/artifactory/remote-repos/org/apache/maven/doxia/doxia-module-fml/1.1.2/doxia-module-fml-1.1.2.pom
    Downloaded: http://overture.au.dk/artifactory/remote-repos/org/apache/maven/doxia/doxia-module-fml/1.1.2/doxia-module-fml-1.1.2.pom (6 KB at 357.7 KB/sec)
    Downloading: http://overture.au.dk/artifactory/remote-repos/org/codehaus/plexus/plexus-i18n/1.0-beta-7/plexus-i18n-1.0-beta-7.pom
    Downloaded: http://overture.au.dk/artifactory/remote-repos/org/codehaus/plexus/plexus-i18n/1.0-beta-7/plexus-i18n-1.0-beta-7.pom (2 KB at 73.9 KB/sec)
    Downloading: http://overture.au.dk/artifactory/remote-repos/org/codehaus/plexus/plexus-components/1.1.12/plexus-components-1.1.12.pom
    Downloaded: http://overture.au.dk/artifactory/remote-repos/org/codehaus/plexus/plexus-components/1.1.12/plexus-components-1.1.12.pom (3 KB at 195.5 KB/sec)
    Downloading: http://overture.au.dk/artifactory/remote-repos/org/codehaus/plexus/plexus-utils/1.4.1/plexus-utils-1.4.1.pom
    Downloaded: http://overture.au.dk/artifactory/remote-repos/org/codehaus/plexus/plexus-utils/1.4.1/plexus-utils-1.4.1.pom (2 KB at 143.4 KB/sec)
    Downloading: http://overture.au.dk/artifactory/remote-repos/org/codehaus/plexus/plexus-velocity/1.1.7/plexus-velocity-1.1.7.pom
    Downloaded: http://overture.au.dk/artifactory/remote-repos/org/codehaus/plexus/plexus-velocity/1.1.7/plexus-velocity-1.1.7.pom (2 KB at 159.3 KB/sec)
    Downloading: http://overture.au.dk/artifactory/remote-repos/org/codehaus/plexus/plexus-container-default/1.0-alpha-20/plexus-container-default-1.0-alpha-20.pom
    Downloaded: http://overture.au.dk/artifactory/remote-repos/org/codehaus/plexus/plexus-container-default/1.0-alpha-20/plexus-container-default-1.0-alpha-20.pom (3 KB at 224.7 KB/sec)
    Downloading: http://overture.au.dk/artifactory/remote-repos/org/codehaus/plexus/plexus-containers/1.0-alpha-20/plexus-containers-1.0-alpha-20.pom
    Downloaded: http://overture.au.dk/artifactory/remote-repos/org/codehaus/plexus/plexus-containers/1.0-alpha-20/plexus-containers-1.0-alpha-20.pom (2 KB at 141.7 KB/sec)
    Downloading: http://overture.au.dk/artifactory/remote-repos/org/codehaus/plexus/plexus-utils/1.3/plexus-utils-1.3.pom
    Downloaded: http://overture.au.dk/artifactory/remote-repos/org/codehaus/plexus/plexus-utils/1.3/plexus-utils-1.3.pom (2 KB at 42.1 KB/sec)
    Downloading: http://overture.au.dk/artifactory/remote-repos/org/codehaus/plexus/plexus-classworlds/1.2-alpha-7/plexus-classworlds-1.2-alpha-7.pom
    Downloaded: http://overture.au.dk/artifactory/remote-repos/org/codehaus/plexus/plexus-classworlds/1.2-alpha-7/plexus-classworlds-1.2-alpha-7.pom (3 KB at 154.4 KB/sec)
    Downloading: http://overture.au.dk/artifactory/remote-repos/org/codehaus/plexus/plexus/1.0.9/plexus-1.0.9.pom
    Downloaded: http://overture.au.dk/artifactory/remote-repos/org/codehaus/plexus/plexus/1.0.9/plexus-1.0.9.pom (7 KB at 534.2 KB/sec)
    Downloading: http://overture.au.dk/artifactory/remote-repos/org/apache/velocity/velocity/1.5/velocity-1.5.pom
    Downloaded: http://overture.au.dk/artifactory/remote-repos/org/apache/velocity/velocity/1.5/velocity-1.5.pom (8 KB at 579.5 KB/sec)
    Downloading: http://overture.au.dk/artifactory/remote-repos/commons-collections/commons-collections/3.1/commons-collections-3.1.pom
    Downloaded: http://overture.au.dk/artifactory/remote-repos/commons-collections/commons-collections/3.1/commons-collections-3.1.pom (6 KB at 349.5 KB/sec)
    Downloading: http://overture.au.dk/artifactory/remote-repos/commons-lang/commons-lang/2.1/commons-lang-2.1.pom
    Downloaded: http://overture.au.dk/artifactory/remote-repos/commons-lang/commons-lang/2.1/commons-lang-2.1.pom (10 KB at 745.8 KB/sec)
    Downloading: http://overture.au.dk/artifactory/remote-repos/oro/oro/2.0.8/oro-2.0.8.pom
    Downloaded: http://overture.au.dk/artifactory/remote-repos/oro/oro/2.0.8/oro-2.0.8.pom (140 B at 9.8 KB/sec)
    Downloading: http://overture.au.dk/artifactory/remote-repos/commons-collections/commons-collections/3.2/commons-collections-3.2.pom
    Downloaded: http://overture.au.dk/artifactory/remote-repos/commons-collections/commons-collections/3.2/commons-collections-3.2.pom (11 KB at 897.9 KB/sec)
    Downloading: http://overture.au.dk/artifactory/remote-repos/commons-validator/commons-validator/1.2.0/commons-validator-1.2.0.pom
    Downloaded: http://overture.au.dk/artifactory/remote-repos/commons-validator/commons-validator/1.2.0/commons-validator-1.2.0.pom (9 KB at 682.4 KB/sec)
    Downloading: http://overture.au.dk/artifactory/remote-repos/commons-beanutils/commons-beanutils/1.7.0/commons-beanutils-1.7.0.pom
    Downloaded: http://overture.au.dk/artifactory/remote-repos/commons-beanutils/commons-beanutils/1.7.0/commons-beanutils-1.7.0.pom (357 B at 19.4 KB/sec)
    Downloading: http://overture.au.dk/artifactory/remote-repos/commons-logging/commons-logging/1.0.3/commons-logging-1.0.3.pom
    Downloaded: http://overture.au.dk/artifactory/remote-repos/commons-logging/commons-logging/1.0.3/commons-logging-1.0.3.pom (866 B at 65.1 KB/sec)
    Downloading: http://overture.au.dk/artifactory/remote-repos/commons-digester/commons-digester/1.6/commons-digester-1.6.pom
    Downloaded: http://overture.au.dk/artifactory/remote-repos/commons-digester/commons-digester/1.6/commons-digester-1.6.pom (974 B at 73.2 KB/sec)
    Downloading: http://overture.au.dk/artifactory/remote-repos/commons-beanutils/commons-beanutils/1.6/commons-beanutils-1.6.pom
    Downloaded: http://overture.au.dk/artifactory/remote-repos/commons-beanutils/commons-beanutils/1.6/commons-beanutils-1.6.pom (3 KB at 141.0 KB/sec)
    Downloading: http://overture.au.dk/artifactory/remote-repos/commons-logging/commons-logging/1.0/commons-logging-1.0.pom
    Downloaded: http://overture.au.dk/artifactory/remote-repos/commons-logging/commons-logging/1.0/commons-logging-1.0.pom (163 B at 13.3 KB/sec)
    Downloading: http://overture.au.dk/artifactory/remote-repos/commons-collections/commons-collections/2.0/commons-collections-2.0.pom
    Downloaded: http://overture.au.dk/artifactory/remote-repos/commons-collections/commons-collections/2.0/commons-collections-2.0.pom (171 B at 12.8 KB/sec)
    Downloading: http://overture.au.dk/artifactory/remote-repos/commons-collections/commons-collections/2.1/commons-collections-2.1.pom
    Downloaded: http://overture.au.dk/artifactory/remote-repos/commons-collections/commons-collections/2.1/commons-collections-2.1.pom (4 KB at 171.5 KB/sec)
    Downloading: http://overture.au.dk/artifactory/remote-repos/xml-apis/xml-apis/1.0.b2/xml-apis-1.0.b2.pom
    Downloaded: http://overture.au.dk/artifactory/remote-repos/xml-apis/xml-apis/1.0.b2/xml-apis-1.0.b2.pom (3 KB at 129.2 KB/sec)
    Downloading: http://overture.au.dk/artifactory/remote-repos/xml-apis/xml-apis/2.0.2/xml-apis-2.0.2.pom
    Downloaded: http://overture.au.dk/artifactory/remote-repos/xml-apis/xml-apis/2.0.2/xml-apis-2.0.2.pom (346 B at 26.0 KB/sec)
    Downloading: http://overture.au.dk/artifactory/remote-repos/org/jacoco/org.jacoco.agent/0.7.6.201602180812/org.jacoco.agent-0.7.6.201602180812.pom
    Downloaded: http://overture.au.dk/artifactory/remote-repos/org/jacoco/org.jacoco.agent/0.7.6.201602180812/org.jacoco.agent-0.7.6.201602180812.pom (3 KB at 216.9 KB/sec)
    Downloading: http://overture.au.dk/artifactory/remote-repos/org/jacoco/org.jacoco.core/0.7.6.201602180812/org.jacoco.core-0.7.6.201602180812.pom
    Downloaded: http://overture.au.dk/artifactory/remote-repos/org/jacoco/org.jacoco.core/0.7.6.201602180812/org.jacoco.core-0.7.6.201602180812.pom (2 KB at 99.6 KB/sec)
    Downloading: http://overture.au.dk/artifactory/remote-repos/org/ow2/asm/asm-debug-all/5.0.4/asm-debug-all-5.0.4.pom
    Downloaded: http://overture.au.dk/artifactory/remote-repos/org/ow2/asm/asm-debug-all/5.0.4/asm-debug-all-5.0.4.pom (2 KB at 96.8 KB/sec)
    Downloading: http://overture.au.dk/artifactory/remote-repos/org/ow2/asm/asm-parent/5.0.4/asm-parent-5.0.4.pom
    Downloaded: http://overture.au.dk/artifactory/remote-repos/org/ow2/asm/asm-parent/5.0.4/asm-parent-5.0.4.pom (6 KB at 335.4 KB/sec)
    Downloading: http://overture.au.dk/artifactory/remote-repos/org/ow2/ow2/1.3/ow2-1.3.pom
    Downloaded: http://overture.au.dk/artifactory/remote-repos/org/ow2/ow2/1.3/ow2-1.3.pom (9 KB at 666.9 KB/sec)
    Downloading: http://overture.au.dk/artifactory/remote-repos/org/jacoco/org.jacoco.report/0.7.6.201602180812/org.jacoco.report-0.7.6.201602180812.pom
    Downloaded: http://overture.au.dk/artifactory/remote-repos/org/jacoco/org.jacoco.report/0.7.6.201602180812/org.jacoco.report-0.7.6.201602180812.pom (2 KB at 110.6 KB/sec)
    Downloading: http://overture.au.dk/artifactory/remote-repos/org/codehaus/plexus/plexus-interpolation/1.11/plexus-interpolation-1.11.jar
    Downloading: http://overture.au.dk/artifactory/remote-repos/junit/junit/4.8.2/junit-4.8.2.jar
    Downloading: http://overture.au.dk/artifactory/remote-repos/org/codehaus/plexus/plexus-utils/1.5.6/plexus-utils-1.5.6.jar
    Downloading: http://overture.au.dk/artifactory/remote-repos/org/apache/maven/shared/file-management/1.2.1/file-management-1.2.1.jar
    Downloading: http://overture.au.dk/artifactory/remote-repos/org/apache/maven/shared/maven-shared-io/1.1/maven-shared-io-1.1.jar
    Downloaded: http://overture.au.dk/artifactory/remote-repos/org/apache/maven/shared/file-management/1.2.1/file-management-1.2.1.jar (37 KB at 2446.4 KB/sec)
    Downloading: http://overture.au.dk/artifactory/remote-repos/org/apache/maven/reporting/maven-reporting-impl/2.1/maven-reporting-impl-2.1.jar
    Downloaded: http://overture.au.dk/artifactory/remote-repos/junit/junit/4.8.2/junit-4.8.2.jar (232 KB at 11589.1 KB/sec)
    Downloading: http://overture.au.dk/artifactory/remote-repos/org/apache/maven/doxia/doxia-core/1.1.2/doxia-core-1.1.2.jar
    Downloaded: http://overture.au.dk/artifactory/remote-repos/org/codehaus/plexus/plexus-interpolation/1.11/plexus-interpolation-1.11.jar (50 KB at 2487.1 KB/sec)
    Downloading: http://overture.au.dk/artifactory/remote-repos/xerces/xercesImpl/2.8.1/xercesImpl-2.8.1.jar
    Downloaded: http://overture.au.dk/artifactory/remote-repos/org/apache/maven/shared/maven-shared-io/1.1/maven-shared-io-1.1.jar (39 KB at 1752.5 KB/sec)
    Downloading: http://overture.au.dk/artifactory/remote-repos/commons-httpclient/commons-httpclient/3.1/commons-httpclient-3.1.jar
    Downloaded: http://overture.au.dk/artifactory/remote-repos/org/apache/maven/reporting/maven-reporting-impl/2.1/maven-reporting-impl-2.1.jar (17 KB at 1156.5 KB/sec)
    Downloading: http://overture.au.dk/artifactory/remote-repos/commons-codec/commons-codec/1.2/commons-codec-1.2.jar
    Downloaded: http://overture.au.dk/artifactory/remote-repos/org/codehaus/plexus/plexus-utils/1.5.6/plexus-utils-1.5.6.jar (245 KB at 6438.8 KB/sec)
    Downloading: http://overture.au.dk/artifactory/remote-repos/org/apache/maven/doxia/doxia-site-renderer/1.1.2/doxia-site-renderer-1.1.2.jar
    Downloaded: http://overture.au.dk/artifactory/remote-repos/org/apache/maven/doxia/doxia-core/1.1.2/doxia-core-1.1.2.jar (155 KB at 7729.4 KB/sec)
    Downloading: http://overture.au.dk/artifactory/remote-repos/org/apache/maven/doxia/doxia-decoration-model/1.1.2/doxia-decoration-model-1.1.2.jar
    Downloaded: http://overture.au.dk/artifactory/remote-repos/commons-codec/commons-codec/1.2/commons-codec-1.2.jar (30 KB at 1958.7 KB/sec)
    Downloading: http://overture.au.dk/artifactory/remote-repos/org/apache/maven/doxia/doxia-module-xhtml/1.1.2/doxia-module-xhtml-1.1.2.jar
    Downloaded: http://overture.au.dk/artifactory/remote-repos/commons-httpclient/commons-httpclient/3.1/commons-httpclient-3.1.jar (298 KB at 9307.9 KB/sec)
    Downloading: http://overture.au.dk/artifactory/remote-repos/org/apache/maven/doxia/doxia-module-fml/1.1.2/doxia-module-fml-1.1.2.jar
    Downloaded: http://overture.au.dk/artifactory/remote-repos/xerces/xercesImpl/2.8.1/xercesImpl-2.8.1.jar (1185 KB at 30372.7 KB/sec)
    Downloaded: http://overture.au.dk/artifactory/remote-repos/org/apache/maven/doxia/doxia-site-renderer/1.1.2/doxia-site-renderer-1.1.2.jar (50 KB at 1970.6 KB/sec)
    Downloaded: http://overture.au.dk/artifactory/remote-repos/org/apache/maven/doxia/doxia-module-xhtml/1.1.2/doxia-module-xhtml-1.1.2.jar (15 KB at 916.0 KB/sec)
    Downloading: http://overture.au.dk/artifactory/remote-repos/org/codehaus/plexus/plexus-i18n/1.0-beta-7/plexus-i18n-1.0-beta-7.jar
    Downloaded: http://overture.au.dk/artifactory/remote-repos/org/apache/maven/doxia/doxia-decoration-model/1.1.2/doxia-decoration-model-1.1.2.jar (52 KB at 3004.8 KB/sec)
    Downloading: http://overture.au.dk/artifactory/remote-repos/org/codehaus/plexus/plexus-velocity/1.1.7/plexus-velocity-1.1.7.jar
    Downloading: http://overture.au.dk/artifactory/remote-repos/org/apache/velocity/velocity/1.5/velocity-1.5.jar
    Downloading: http://overture.au.dk/artifactory/remote-repos/commons-collections/commons-collections/3.2/commons-collections-3.2.jar
    Downloaded: http://overture.au.dk/artifactory/remote-repos/org/codehaus/plexus/plexus-i18n/1.0-beta-7/plexus-i18n-1.0-beta-7.jar (11 KB at 684.2 KB/sec)
    Downloading: http://overture.au.dk/artifactory/remote-repos/commons-validator/commons-validator/1.2.0/commons-validator-1.2.0.jar
    Downloaded: http://overture.au.dk/artifactory/remote-repos/org/codehaus/plexus/plexus-velocity/1.1.7/plexus-velocity-1.1.7.jar (8 KB at 374.4 KB/sec)
    Downloading: http://overture.au.dk/artifactory/remote-repos/commons-beanutils/commons-beanutils/1.7.0/commons-beanutils-1.7.0.jar
    Downloaded: http://overture.au.dk/artifactory/remote-repos/org/apache/maven/doxia/doxia-module-fml/1.1.2/doxia-module-fml-1.1.2.jar (37 KB at 987.1 KB/sec)
    Downloading: http://overture.au.dk/artifactory/remote-repos/commons-digester/commons-digester/1.6/commons-digester-1.6.jar
    Downloaded: http://overture.au.dk/artifactory/remote-repos/org/apache/velocity/velocity/1.5/velocity-1.5.jar (383 KB at 12352.7 KB/sec)
    Downloading: http://overture.au.dk/artifactory/remote-repos/commons-logging/commons-logging/1.0.4/commons-logging-1.0.4.jar
    Downloaded: http://overture.au.dk/artifactory/remote-repos/commons-collections/commons-collections/3.2/commons-collections-3.2.jar (558 KB at 17995.8 KB/sec)
    Downloading: http://overture.au.dk/artifactory/remote-repos/oro/oro/2.0.8/oro-2.0.8.jar
    Downloaded: http://overture.au.dk/artifactory/remote-repos/commons-beanutils/commons-beanutils/1.7.0/commons-beanutils-1.7.0.jar (185 KB at 12283.3 KB/sec)
    Downloading: http://overture.au.dk/artifactory/remote-repos/xml-apis/xml-apis/1.0.b2/xml-apis-1.0.b2.jar
    Downloaded: http://overture.au.dk/artifactory/remote-repos/commons-validator/commons-validator/1.2.0/commons-validator-1.2.0.jar (89 KB at 3707.4 KB/sec)
    Downloading: http://overture.au.dk/artifactory/remote-repos/org/jacoco/org.jacoco.agent/0.7.6.201602180812/org.jacoco.agent-0.7.6.201602180812-runtime.jar
    Downloaded: http://overture.au.dk/artifactory/remote-repos/commons-logging/commons-logging/1.0.4/commons-logging-1.0.4.jar (38 KB at 2855.7 KB/sec)
    Downloading: http://overture.au.dk/artifactory/remote-repos/org/jacoco/org.jacoco.core/0.7.6.201602180812/org.jacoco.core-0.7.6.201602180812.jar
    Downloaded: http://overture.au.dk/artifactory/remote-repos/oro/oro/2.0.8/oro-2.0.8.jar (64 KB at 4552.2 KB/sec)
    Downloading: http://overture.au.dk/artifactory/remote-repos/org/ow2/asm/asm-debug-all/5.0.4/asm-debug-all-5.0.4.jar
    Downloaded: http://overture.au.dk/artifactory/remote-repos/xml-apis/xml-apis/1.0.b2/xml-apis-1.0.b2.jar (107 KB at 8212.0 KB/sec)
    Downloading: http://overture.au.dk/artifactory/remote-repos/org/jacoco/org.jacoco.report/0.7.6.201602180812/org.jacoco.report-0.7.6.201602180812.jar
    Downloaded: http://overture.au.dk/artifactory/remote-repos/commons-digester/commons-digester/1.6/commons-digester-1.6.jar (165 KB at 8657.8 KB/sec)
    Downloaded: http://overture.au.dk/artifactory/remote-repos/org/jacoco/org.jacoco.agent/0.7.6.201602180812/org.jacoco.agent-0.7.6.201602180812-runtime.jar (283 KB at 12833.2 KB/sec)
    Downloaded: http://overture.au.dk/artifactory/remote-repos/org/jacoco/org.jacoco.core/0.7.6.201602180812/org.jacoco.core-0.7.6.201602180812.jar (133 KB at 8291.1 KB/sec)
    Downloaded: http://overture.au.dk/artifactory/remote-repos/org/ow2/asm/asm-debug-all/5.0.4/asm-debug-all-5.0.4.jar (371 KB at 23134.5 KB/sec)
    Downloaded: http://overture.au.dk/artifactory/remote-repos/org/jacoco/org.jacoco.report/0.7.6.201602180812/org.jacoco.report-0.7.6.201602180812.jar (139 KB at 8641.2 KB/sec)
    [INFO] argLine set to -javaagent:/var/lib/jenkins/workspace/vdm2c-release/repository/org/jacoco/org.jacoco.agent/0.7.6.201602180812/org.jacoco.agent-0.7.6.201602180812-runtime.jar=destfile=/var/lib/jenkins/workspace/vdm2c-release/target/coverage-reports/jacoco-unit.exec,excludes=org/overture/cgc/extast/analysis/**/*.*:org/overture/codegen/vdm2c/extast/expressions/**/*:org/overture/codegen/vdm2c/extast/declarations/**/*:org/overture/codegen/vdm2c/extast/statements/**/*:org/overture/cgc/extast/node/**/*:org/overture/codegen/vdm2c/ast/preview/**/*
    [INFO] 
    [INFO] --- maven-source-plugin:2.1.2:jar-no-fork (attach-sources) @ root ---
    Downloading: http://overture.au.dk/artifactory/remote-repos/org/codehaus/plexus/plexus-utils/1.5.1/plexus-utils-1.5.1.pom
    Downloaded: http://overture.au.dk/artifactory/remote-repos/org/codehaus/plexus/plexus-utils/1.5.1/plexus-utils-1.5.1.pom (3 KB at 160.2 KB/sec)
    Downloading: http://overture.au.dk/artifactory/remote-repos/org/apache/maven/maven-archiver/2.4.1/maven-archiver-2.4.1.pom
    Downloaded: http://overture.au.dk/artifactory/remote-repos/org/apache/maven/maven-archiver/2.4.1/maven-archiver-2.4.1.pom (4 KB at 321.7 KB/sec)
    Downloading: http://overture.au.dk/artifactory/remote-repos/org/apache/maven/maven-artifact/2.0.6/maven-artifact-2.0.6.pom
    Downloaded: http://overture.au.dk/artifactory/remote-repos/org/apache/maven/maven-artifact/2.0.6/maven-artifact-2.0.6.pom (2 KB at 110.0 KB/sec)
    Downloading: http://overture.au.dk/artifactory/remote-repos/org/apache/maven/maven-model/2.0.6/maven-model-2.0.6.pom
    Downloaded: http://overture.au.dk/artifactory/remote-repos/org/apache/maven/maven-model/2.0.6/maven-model-2.0.6.pom (3 KB at 228.9 KB/sec)
    Downloading: http://overture.au.dk/artifactory/remote-repos/org/codehaus/plexus/plexus-archiver/1.0/plexus-archiver-1.0.pom
    Downloaded: http://overture.au.dk/artifactory/remote-repos/org/codehaus/plexus/plexus-archiver/1.0/plexus-archiver-1.0.pom (2 KB at 112.3 KB/sec)
    Downloading: http://overture.au.dk/artifactory/remote-repos/org/codehaus/plexus/plexus-components/1.1.17/plexus-components-1.1.17.pom
    Downloaded: http://overture.au.dk/artifactory/remote-repos/org/codehaus/plexus/plexus-components/1.1.17/plexus-components-1.1.17.pom (6 KB at 318.0 KB/sec)
    Downloading: http://overture.au.dk/artifactory/remote-repos/org/codehaus/plexus/plexus/2.0.5/plexus-2.0.5.pom
    Downloaded: http://overture.au.dk/artifactory/remote-repos/org/codehaus/plexus/plexus/2.0.5/plexus-2.0.5.pom (17 KB at 996.6 KB/sec)
    Downloading: http://overture.au.dk/artifactory/remote-repos/org/codehaus/plexus/plexus-utils/2.0.5/plexus-utils-2.0.5.pom
    Downloaded: http://overture.au.dk/artifactory/remote-repos/org/codehaus/plexus/plexus-utils/2.0.5/plexus-utils-2.0.5.pom (4 KB at 171.4 KB/sec)
    Downloading: http://overture.au.dk/artifactory/remote-repos/org/codehaus/plexus/plexus/2.0.6/plexus-2.0.6.pom
    Downloaded: http://overture.au.dk/artifactory/remote-repos/org/codehaus/plexus/plexus/2.0.6/plexus-2.0.6.pom (17 KB at 909.5 KB/sec)
    Downloading: http://overture.au.dk/artifactory/remote-repos/org/codehaus/plexus/plexus-io/1.0/plexus-io-1.0.pom
    Downloaded: http://overture.au.dk/artifactory/remote-repos/org/codehaus/plexus/plexus-io/1.0/plexus-io-1.0.pom (2 KB at 66.6 KB/sec)
    Downloading: http://overture.au.dk/artifactory/remote-repos/org/codehaus/plexus/plexus-interpolation/1.13/plexus-interpolation-1.13.pom
    Downloaded: http://overture.au.dk/artifactory/remote-repos/org/codehaus/plexus/plexus-interpolation/1.13/plexus-interpolation-1.13.pom (890 B at 62.1 KB/sec)
    Downloading: http://overture.au.dk/artifactory/remote-repos/org/codehaus/plexus/plexus-components/1.1.15/plexus-components-1.1.15.pom
    Downloaded: http://overture.au.dk/artifactory/remote-repos/org/codehaus/plexus/plexus-components/1.1.15/plexus-components-1.1.15.pom (3 KB at 213.9 KB/sec)
    Downloading: http://overture.au.dk/artifactory/remote-repos/org/codehaus/plexus/plexus/2.0.3/plexus-2.0.3.pom
    Downloaded: http://overture.au.dk/artifactory/remote-repos/org/codehaus/plexus/plexus/2.0.3/plexus-2.0.3.pom (16 KB at 1161.4 KB/sec)
    Downloading: http://overture.au.dk/artifactory/remote-repos/org/apache/maven/maven-archiver/2.4.1/maven-archiver-2.4.1.jar
    Downloading: http://overture.au.dk/artifactory/remote-repos/org/codehaus/plexus/plexus-interpolation/1.13/plexus-interpolation-1.13.jar
    Downloading: http://overture.au.dk/artifactory/remote-repos/org/codehaus/plexus/plexus-archiver/1.0/plexus-archiver-1.0.jar
    Downloading: http://overture.au.dk/artifactory/remote-repos/org/codehaus/plexus/plexus-io/1.0/plexus-io-1.0.jar
    Downloading: http://overture.au.dk/artifactory/remote-repos/org/codehaus/plexus/plexus-utils/2.0.5/plexus-utils-2.0.5.jar
    Downloaded: http://overture.au.dk/artifactory/remote-repos/org/apache/maven/maven-archiver/2.4.1/maven-archiver-2.4.1.jar (20 KB at 1401.9 KB/sec)
    Downloaded: http://overture.au.dk/artifactory/remote-repos/org/codehaus/plexus/plexus-interpolation/1.13/plexus-interpolation-1.13.jar (60 KB at 3138.2 KB/sec)
    Downloaded: http://overture.au.dk/artifactory/remote-repos/org/codehaus/plexus/plexus-archiver/1.0/plexus-archiver-1.0.jar (174 KB at 8650.5 KB/sec)
    Downloaded: http://overture.au.dk/artifactory/remote-repos/org/codehaus/plexus/plexus-io/1.0/plexus-io-1.0.jar (50 KB at 2611.2 KB/sec)
    Downloaded: http://overture.au.dk/artifactory/remote-repos/org/codehaus/plexus/plexus-utils/2.0.5/plexus-utils-2.0.5.jar (218 KB at 8717.6 KB/sec)
    [INFO] 
    [INFO] --- maven-javadoc-plugin:2.7:jar (attach-javadocs) @ root ---
    Downloading: http://overture.au.dk/artifactory/remote-repos/org/apache/maven/maven-archiver/2.3/maven-archiver-2.3.pom
    Downloaded: http://overture.au.dk/artifactory/remote-repos/org/apache/maven/maven-archiver/2.3/maven-archiver-2.3.pom (4 KB at 254.9 KB/sec)
    Downloading: http://overture.au.dk/artifactory/remote-repos/org/apache/maven/maven-artifact/2.0/maven-artifact-2.0.pom
    Downloaded: http://overture.au.dk/artifactory/remote-repos/org/apache/maven/maven-artifact/2.0/maven-artifact-2.0.pom (723 B at 64.2 KB/sec)
    Downloading: http://overture.au.dk/artifactory/remote-repos/org/apache/maven/maven/2.0/maven-2.0.pom
    Downloaded: http://overture.au.dk/artifactory/remote-repos/org/apache/maven/maven/2.0/maven-2.0.pom (9 KB at 689.4 KB/sec)
    Downloading: http://overture.au.dk/artifactory/remote-repos/org/apache/maven/maven-model/2.0/maven-model-2.0.pom
    Downloaded: http://overture.au.dk/artifactory/remote-repos/org/apache/maven/maven-model/2.0/maven-model-2.0.pom (3 KB at 167.9 KB/sec)
    Downloading: http://overture.au.dk/artifactory/remote-repos/org/apache/maven/maven-project/2.0/maven-project-2.0.pom
    Downloaded: http://overture.au.dk/artifactory/remote-repos/org/apache/maven/maven-project/2.0/maven-project-2.0.pom (2 KB at 114.1 KB/sec)
    Downloading: http://overture.au.dk/artifactory/remote-repos/org/apache/maven/maven-profile/2.0/maven-profile-2.0.pom
    Downloaded: http://overture.au.dk/artifactory/remote-repos/org/apache/maven/maven-profile/2.0/maven-profile-2.0.pom (2 KB at 83.7 KB/sec)
    Downloading: http://overture.au.dk/artifactory/remote-repos/org/apache/maven/maven-artifact-manager/2.0/maven-artifact-manager-2.0.pom
    Downloaded: http://overture.au.dk/artifactory/remote-repos/org/apache/maven/maven-artifact-manager/2.0/maven-artifact-manager-2.0.pom (2 KB at 82.3 KB/sec)
    Downloading: http://overture.au.dk/artifactory/remote-repos/org/apache/maven/maven-repository-metadata/2.0/maven-repository-metadata-2.0.pom
    Downloaded: http://overture.au.dk/artifactory/remote-repos/org/apache/maven/maven-repository-metadata/2.0/maven-repository-metadata-2.0.pom (2 KB at 92.2 KB/sec)
    Downloading: http://overture.au.dk/artifactory/remote-repos/org/codehaus/plexus/plexus-archiver/1.0-alpha-9/plexus-archiver-1.0-alpha-9.pom
    Downloaded: http://overture.au.dk/artifactory/remote-repos/org/codehaus/plexus/plexus-archiver/1.0-alpha-9/plexus-archiver-1.0-alpha-9.pom (2 KB at 117.1 KB/sec)
    Downloading: http://overture.au.dk/artifactory/remote-repos/org/codehaus/plexus/plexus-container-default/1.0-alpha-15/plexus-container-default-1.0-alpha-15.pom
    Downloaded: http://overture.au.dk/artifactory/remote-repos/org/codehaus/plexus/plexus-container-default/1.0-alpha-15/plexus-container-default-1.0-alpha-15.pom (2 KB at 104.2 KB/sec)
    Downloading: http://overture.au.dk/artifactory/remote-repos/org/codehaus/plexus/plexus-containers/1.0-alpha-15/plexus-containers-1.0-alpha-15.pom
    Downloaded: http://overture.au.dk/artifactory/remote-repos/org/codehaus/plexus/plexus-containers/1.0-alpha-15/plexus-containers-1.0-alpha-15.pom (2 KB at 142.1 KB/sec)
    Downloading: http://overture.au.dk/artifactory/remote-repos/org/codehaus/plexus/plexus-component-api/1.0-alpha-15/plexus-component-api-1.0-alpha-15.pom
    Downloaded: http://overture.au.dk/artifactory/remote-repos/org/codehaus/plexus/plexus-component-api/1.0-alpha-15/plexus-component-api-1.0-alpha-15.pom (948 B at 57.9 KB/sec)
    Downloading: http://overture.au.dk/artifactory/remote-repos/org/codehaus/plexus/plexus-classworlds/1.2-alpha-6/plexus-classworlds-1.2-alpha-6.pom
    Downloaded: http://overture.au.dk/artifactory/remote-repos/org/codehaus/plexus/plexus-classworlds/1.2-alpha-6/plexus-classworlds-1.2-alpha-6.pom (3 KB at 178.2 KB/sec)
    Downloading: http://overture.au.dk/artifactory/remote-repos/org/codehaus/plexus/plexus-io/1.0-alpha-1/plexus-io-1.0-alpha-1.pom
    Downloaded: http://overture.au.dk/artifactory/remote-repos/org/codehaus/plexus/plexus-io/1.0-alpha-1/plexus-io-1.0-alpha-1.pom (2 KB at 104.7 KB/sec)
    Downloading: http://overture.au.dk/artifactory/remote-repos/org/codehaus/plexus/plexus-component-api/1.0-alpha-16/plexus-component-api-1.0-alpha-16.pom
    Downloaded: http://overture.au.dk/artifactory/remote-repos/org/codehaus/plexus/plexus-component-api/1.0-alpha-16/plexus-component-api-1.0-alpha-16.pom (3 KB at 144.2 KB/sec)
    Downloading: http://overture.au.dk/artifactory/remote-repos/org/codehaus/plexus/plexus-containers/1.0-alpha-16/plexus-containers-1.0-alpha-16.pom
    Downloaded: http://overture.au.dk/artifactory/remote-repos/org/codehaus/plexus/plexus-containers/1.0-alpha-16/plexus-containers-1.0-alpha-16.pom (2 KB at 141.6 KB/sec)
    Downloading: http://overture.au.dk/artifactory/remote-repos/org/codehaus/plexus/plexus-utils/1.4.9/plexus-utils-1.4.9.pom
    Downloaded: http://overture.au.dk/artifactory/remote-repos/org/codehaus/plexus/plexus-utils/1.4.9/plexus-utils-1.4.9.pom (3 KB at 140.1 KB/sec)
    Downloading: http://overture.au.dk/artifactory/remote-repos/org/apache/maven/shared/maven-invoker/2.0.9/maven-invoker-2.0.9.pom
    Downloaded: http://overture.au.dk/artifactory/remote-repos/org/apache/maven/shared/maven-invoker/2.0.9/maven-invoker-2.0.9.pom (6 KB at 352.6 KB/sec)
    Downloading: http://overture.au.dk/artifactory/remote-repos/org/apache/maven/doxia/doxia-site-renderer/1.0/doxia-site-renderer-1.0.pom
    Downloaded: http://overture.au.dk/artifactory/remote-repos/org/apache/maven/doxia/doxia-site-renderer/1.0/doxia-site-renderer-1.0.pom (5 KB at 216.2 KB/sec)
    Downloading: http://overture.au.dk/artifactory/remote-repos/org/apache/maven/doxia/doxia-sitetools/1.0/doxia-sitetools-1.0.pom
    Downloaded: http://overture.au.dk/artifactory/remote-repos/org/apache/maven/doxia/doxia-sitetools/1.0/doxia-sitetools-1.0.pom (10 KB at 720.1 KB/sec)
    Downloading: http://overture.au.dk/artifactory/remote-repos/org/apache/maven/doxia/doxia-core/1.0/doxia-core-1.0.pom
    Downloaded: http://overture.au.dk/artifactory/remote-repos/org/apache/maven/doxia/doxia-core/1.0/doxia-core-1.0.pom (3 KB at 179.9 KB/sec)
    Downloading: http://overture.au.dk/artifactory/remote-repos/org/codehaus/plexus/plexus-utils/1.5.7/plexus-utils-1.5.7.pom
    Downloaded: http://overture.au.dk/artifactory/remote-repos/org/codehaus/plexus/plexus-utils/1.5.7/plexus-utils-1.5.7.pom (8 KB at 492.1 KB/sec)
    Downloading: http://overture.au.dk/artifactory/remote-repos/org/apache/maven/doxia/doxia-decoration-model/1.0/doxia-decoration-model-1.0.pom
    Downloaded: http://overture.au.dk/artifactory/remote-repos/org/apache/maven/doxia/doxia-decoration-model/1.0/doxia-decoration-model-1.0.pom (4 KB at 181.2 KB/sec)
    Downloading: http://overture.au.dk/artifactory/remote-repos/org/apache/maven/doxia/doxia-module-apt/1.0/doxia-module-apt-1.0.pom
    Downloaded: http://overture.au.dk/artifactory/remote-repos/org/apache/maven/doxia/doxia-module-apt/1.0/doxia-module-apt-1.0.pom (3 KB at 129.4 KB/sec)
    Downloading: http://overture.au.dk/artifactory/remote-repos/org/apache/maven/doxia/doxia-modules/1.0/doxia-modules-1.0.pom
    Downloaded: http://overture.au.dk/artifactory/remote-repos/org/apache/maven/doxia/doxia-modules/1.0/doxia-modules-1.0.pom (3 KB at 194.8 KB/sec)
    Downloading: http://overture.au.dk/artifactory/remote-repos/org/apache/maven/doxia/doxia-module-fml/1.0/doxia-module-fml-1.0.pom
    Downloaded: http://overture.au.dk/artifactory/remote-repos/org/apache/maven/doxia/doxia-module-fml/1.0/doxia-module-fml-1.0.pom (3 KB at 219.1 KB/sec)
    Downloading: http://overture.au.dk/artifactory/remote-repos/org/apache/maven/doxia/doxia-module-xdoc/1.0/doxia-module-xdoc-1.0.pom
    Downloaded: http://overture.au.dk/artifactory/remote-repos/org/apache/maven/doxia/doxia-module-xdoc/1.0/doxia-module-xdoc-1.0.pom (3 KB at 168.4 KB/sec)
    Downloading: http://overture.au.dk/artifactory/remote-repos/org/apache/maven/doxia/doxia-module-xhtml/1.0/doxia-module-xhtml-1.0.pom
    Downloaded: http://overture.au.dk/artifactory/remote-repos/org/apache/maven/doxia/doxia-module-xhtml/1.0/doxia-module-xhtml-1.0.pom (2 KB at 120.1 KB/sec)
    Downloading: http://overture.au.dk/artifactory/remote-repos/org/apache/maven/wagon/wagon-provider-api/1.0-beta-6/wagon-provider-api-1.0-beta-6.pom
    Downloaded: http://overture.au.dk/artifactory/remote-repos/org/apache/maven/wagon/wagon-provider-api/1.0-beta-6/wagon-provider-api-1.0-beta-6.pom (2 KB at 132.2 KB/sec)
    Downloading: http://overture.au.dk/artifactory/remote-repos/org/apache/maven/wagon/wagon/1.0-beta-6/wagon-1.0-beta-6.pom
    Downloaded: http://overture.au.dk/artifactory/remote-repos/org/apache/maven/wagon/wagon/1.0-beta-6/wagon-1.0-beta-6.pom (13 KB at 864.0 KB/sec)
    Downloading: http://overture.au.dk/artifactory/remote-repos/org/codehaus/plexus/plexus-utils/1.4.2/plexus-utils-1.4.2.pom
    Downloaded: http://overture.au.dk/artifactory/remote-repos/org/codehaus/plexus/plexus-utils/1.4.2/plexus-utils-1.4.2.pom (2 KB at 147.2 KB/sec)
    Downloading: http://overture.au.dk/artifactory/remote-repos/commons-logging/commons-logging/1.1.1/commons-logging-1.1.1.pom
    Downloaded: http://overture.au.dk/artifactory/remote-repos/commons-logging/commons-logging/1.1.1/commons-logging-1.1.1.pom (18 KB at 1494.5 KB/sec)
    Downloading: http://overture.au.dk/artifactory/remote-repos/org/apache/commons/commons-parent/5/commons-parent-5.pom
    Downloaded: http://overture.au.dk/artifactory/remote-repos/org/apache/commons/commons-parent/5/commons-parent-5.pom (16 KB at 1205.0 KB/sec)
    Downloading: http://overture.au.dk/artifactory/remote-repos/log4j/log4j/1.2.14/log4j-1.2.14.pom
    Downloaded: http://overture.au.dk/artifactory/remote-repos/log4j/log4j/1.2.14/log4j-1.2.14.pom (3 KB at 193.2 KB/sec)
    Downloading: http://overture.au.dk/artifactory/remote-repos/com/thoughtworks/qdox/qdox/1.9.2/qdox-1.9.2.pom
    Downloaded: http://overture.au.dk/artifactory/remote-repos/com/thoughtworks/qdox/qdox/1.9.2/qdox-1.9.2.pom (17 KB at 985.1 KB/sec)
    Downloading: http://overture.au.dk/artifactory/remote-repos/org/apache/maven/maven-toolchain/1.0/maven-toolchain-1.0.pom
    Downloaded: http://overture.au.dk/artifactory/remote-repos/org/apache/maven/maven-toolchain/1.0/maven-toolchain-1.0.pom (4 KB at 208.4 KB/sec)
    Downloading: http://overture.au.dk/artifactory/remote-repos/org/apache/maven/maven-core/2.0.6/maven-core-2.0.6.pom
    Downloaded: http://overture.au.dk/artifactory/remote-repos/org/apache/maven/maven-core/2.0.6/maven-core-2.0.6.pom (7 KB at 504.1 KB/sec)
    Downloading: http://overture.au.dk/artifactory/remote-repos/org/apache/maven/maven-settings/2.0.6/maven-settings-2.0.6.pom
    Downloaded: http://overture.au.dk/artifactory/remote-repos/org/apache/maven/maven-settings/2.0.6/maven-settings-2.0.6.pom (2 KB at 139.6 KB/sec)
    Downloading: http://overture.au.dk/artifactory/remote-repos/org/apache/maven/maven-plugin-parameter-documenter/2.0.6/maven-plugin-parameter-documenter-2.0.6.pom
    Downloaded: http://overture.au.dk/artifactory/remote-repos/org/apache/maven/maven-plugin-parameter-documenter/2.0.6/maven-plugin-parameter-documenter-2.0.6.pom (2 KB at 143.6 KB/sec)
    Downloading: http://overture.au.dk/artifactory/remote-repos/org/apache/maven/reporting/maven-reporting-api/2.0.6/maven-reporting-api-2.0.6.pom
    Downloaded: http://overture.au.dk/artifactory/remote-repos/org/apache/maven/reporting/maven-reporting-api/2.0.6/maven-reporting-api-2.0.6.pom (2 KB at 142.6 KB/sec)
    Downloading: http://overture.au.dk/artifactory/remote-repos/org/apache/maven/reporting/maven-reporting/2.0.6/maven-reporting-2.0.6.pom
    Downloaded: http://overture.au.dk/artifactory/remote-repos/org/apache/maven/reporting/maven-reporting/2.0.6/maven-reporting-2.0.6.pom (2 KB at 82.7 KB/sec)
    Downloading: http://overture.au.dk/artifactory/remote-repos/org/apache/maven/doxia/doxia-sink-api/1.0-alpha-7/doxia-sink-api-1.0-alpha-7.pom
    Downloaded: http://overture.au.dk/artifactory/remote-repos/org/apache/maven/doxia/doxia-sink-api/1.0-alpha-7/doxia-sink-api-1.0-alpha-7.pom (424 B at 21.8 KB/sec)
    Downloading: http://overture.au.dk/artifactory/remote-repos/org/apache/maven/doxia/doxia/1.0-alpha-7/doxia-1.0-alpha-7.pom
    Downloaded: http://overture.au.dk/artifactory/remote-repos/org/apache/maven/doxia/doxia/1.0-alpha-7/doxia-1.0-alpha-7.pom (4 KB at 318.4 KB/sec)
    Downloading: http://overture.au.dk/artifactory/remote-repos/org/apache/maven/maven-profile/2.0.6/maven-profile-2.0.6.pom
    Downloaded: http://overture.au.dk/artifactory/remote-repos/org/apache/maven/maven-profile/2.0.6/maven-profile-2.0.6.pom (2 KB at 128.9 KB/sec)
    Downloading: http://overture.au.dk/artifactory/remote-repos/org/apache/maven/maven-repository-metadata/2.0.6/maven-repository-metadata-2.0.6.pom
    Downloaded: http://overture.au.dk/artifactory/remote-repos/org/apache/maven/maven-repository-metadata/2.0.6/maven-repository-metadata-2.0.6.pom (2 KB at 120.4 KB/sec)
    Downloading: http://overture.au.dk/artifactory/remote-repos/org/apache/maven/maven-error-diagnostics/2.0.6/maven-error-diagnostics-2.0.6.pom
    Downloaded: http://overture.au.dk/artifactory/remote-repos/org/apache/maven/maven-error-diagnostics/2.0.6/maven-error-diagnostics-2.0.6.pom (2 KB at 92.4 KB/sec)
    Downloading: http://overture.au.dk/artifactory/remote-repos/org/apache/maven/maven-project/2.0.6/maven-project-2.0.6.pom
    Downloaded: http://overture.au.dk/artifactory/remote-repos/org/apache/maven/maven-project/2.0.6/maven-project-2.0.6.pom (3 KB at 183.9 KB/sec)
    Downloading: http://overture.au.dk/artifactory/remote-repos/org/apache/maven/maven-artifact-manager/2.0.6/maven-artifact-manager-2.0.6.pom
    Downloaded: http://overture.au.dk/artifactory/remote-repos/org/apache/maven/maven-artifact-manager/2.0.6/maven-artifact-manager-2.0.6.pom (3 KB at 182.9 KB/sec)
    Downloading: http://overture.au.dk/artifactory/remote-repos/org/apache/maven/maven-plugin-registry/2.0.6/maven-plugin-registry-2.0.6.pom
    Downloaded: http://overture.au.dk/artifactory/remote-repos/org/apache/maven/maven-plugin-registry/2.0.6/maven-plugin-registry-2.0.6.pom (2 KB at 86.4 KB/sec)
    Downloading: http://overture.au.dk/artifactory/remote-repos/org/apache/maven/maven-plugin-descriptor/2.0.6/maven-plugin-descriptor-2.0.6.pom
    Downloaded: http://overture.au.dk/artifactory/remote-repos/org/apache/maven/maven-plugin-descriptor/2.0.6/maven-plugin-descriptor-2.0.6.pom (2 KB at 164.2 KB/sec)
    Downloading: http://overture.au.dk/artifactory/remote-repos/org/apache/maven/maven-monitor/2.0.6/maven-monitor-2.0.6.pom
    Downloaded: http://overture.au.dk/artifactory/remote-repos/org/apache/maven/maven-monitor/2.0.6/maven-monitor-2.0.6.pom (2 KB at 5.1 KB/sec)
    Downloading: http://overture.au.dk/artifactory/remote-repos/org/apache/maven/maven-artifact/2.0.8/maven-artifact-2.0.8.pom
    Downloaded: http://overture.au.dk/artifactory/remote-repos/org/apache/maven/maven-artifact/2.0.8/maven-artifact-2.0.8.pom (2 KB at 121.6 KB/sec)
    Downloading: http://overture.au.dk/artifactory/remote-repos/org/apache/maven/maven-project/2.0.8/maven-project-2.0.8.pom
    Downloaded: http://overture.au.dk/artifactory/remote-repos/org/apache/maven/maven-project/2.0.8/maven-project-2.0.8.pom (3 KB at 189.0 KB/sec)
    Downloading: http://overture.au.dk/artifactory/remote-repos/org/apache/maven/maven-settings/2.0.8/maven-settings-2.0.8.pom
    Downloaded: http://overture.au.dk/artifactory/remote-repos/org/apache/maven/maven-settings/2.0.8/maven-settings-2.0.8.pom (3 KB at 134.0 KB/sec)
    Downloading: http://overture.au.dk/artifactory/remote-repos/org/apache/maven/maven-profile/2.0.8/maven-profile-2.0.8.pom
    Downloaded: http://overture.au.dk/artifactory/remote-repos/org/apache/maven/maven-profile/2.0.8/maven-profile-2.0.8.pom (2 KB at 132.6 KB/sec)
    Downloading: http://overture.au.dk/artifactory/remote-repos/org/apache/maven/maven-artifact-manager/2.0.8/maven-artifact-manager-2.0.8.pom
    Downloaded: http://overture.au.dk/artifactory/remote-repos/org/apache/maven/maven-artifact-manager/2.0.8/maven-artifact-manager-2.0.8.pom (3 KB at 188.3 KB/sec)
    Downloading: http://overture.au.dk/artifactory/remote-repos/org/apache/maven/maven-repository-metadata/2.0.8/maven-repository-metadata-2.0.8.pom
    Downloaded: http://overture.au.dk/artifactory/remote-repos/org/apache/maven/maven-repository-metadata/2.0.8/maven-repository-metadata-2.0.8.pom (2 KB at 154.7 KB/sec)
    Downloading: http://overture.au.dk/artifactory/remote-repos/org/apache/maven/maven-plugin-registry/2.0.8/maven-plugin-registry-2.0.8.pom
    Downloaded: http://overture.au.dk/artifactory/remote-repos/org/apache/maven/maven-plugin-registry/2.0.8/maven-plugin-registry-2.0.8.pom (2 KB at 102.7 KB/sec)
    Downloading: http://overture.au.dk/artifactory/remote-repos/org/apache/maven/maven-plugin-api/2.0.8/maven-plugin-api-2.0.8.pom
    Downloaded: http://overture.au.dk/artifactory/remote-repos/org/apache/maven/maven-plugin-api/2.0.8/maven-plugin-api-2.0.8.pom (2 KB at 104.2 KB/sec)
    Downloading: http://overture.au.dk/artifactory/remote-repos/org/apache/maven/maven-core/2.0/maven-core-2.0.pom
    Downloaded: http://overture.au.dk/artifactory/remote-repos/org/apache/maven/maven-core/2.0/maven-core-2.0.pom (6 KB at 364.3 KB/sec)
    Downloading: http://overture.au.dk/artifactory/remote-repos/org/apache/maven/maven-settings/2.0/maven-settings-2.0.pom
    Downloaded: http://overture.au.dk/artifactory/remote-repos/org/apache/maven/maven-settings/2.0/maven-settings-2.0.pom (2 KB at 89.8 KB/sec)
    Downloading: http://overture.au.dk/artifactory/remote-repos/org/apache/maven/maven-plugin-parameter-documenter/2.0/maven-plugin-parameter-documenter-2.0.pom
    Downloaded: http://overture.au.dk/artifactory/remote-repos/org/apache/maven/maven-plugin-parameter-documenter/2.0/maven-plugin-parameter-documenter-2.0.pom (2 KB at 106.5 KB/sec)
    Downloading: http://overture.au.dk/artifactory/remote-repos/org/apache/maven/reporting/maven-reporting-api/2.0/maven-reporting-api-2.0.pom
    Downloaded: http://overture.au.dk/artifactory/remote-repos/org/apache/maven/reporting/maven-reporting-api/2.0/maven-reporting-api-2.0.pom (2 KB at 67.7 KB/sec)
    Downloading: http://overture.au.dk/artifactory/remote-repos/org/apache/maven/reporting/maven-reporting/2.0/maven-reporting-2.0.pom
    Downloaded: http://overture.au.dk/artifactory/remote-repos/org/apache/maven/reporting/maven-reporting/2.0/maven-reporting-2.0.pom (504 B at 24.6 KB/sec)
    Downloading: http://overture.au.dk/artifactory/remote-repos/doxia/doxia-sink-api/1.0-alpha-4/doxia-sink-api-1.0-alpha-4.pom
    Downloaded: http://overture.au.dk/artifactory/remote-repos/doxia/doxia-sink-api/1.0-alpha-4/doxia-sink-api-1.0-alpha-4.pom (2 KB at 88.9 KB/sec)
    Downloading: http://overture.au.dk/artifactory/remote-repos/org/apache/maven/maven-error-diagnostics/2.0/maven-error-diagnostics-2.0.pom
    Downloaded: http://overture.au.dk/artifactory/remote-repos/org/apache/maven/maven-error-diagnostics/2.0/maven-error-diagnostics-2.0.pom (812 B at 49.6 KB/sec)
    Downloading: http://overture.au.dk/artifactory/remote-repos/org/apache/maven/maven-plugin-registry/2.0/maven-plugin-registry-2.0.pom
    Downloaded: http://overture.au.dk/artifactory/remote-repos/org/apache/maven/maven-plugin-registry/2.0/maven-plugin-registry-2.0.pom (2 KB at 104.5 KB/sec)
    Downloading: http://overture.au.dk/artifactory/remote-repos/org/apache/maven/maven-plugin-api/2.0/maven-plugin-api-2.0.pom
    Downloaded: http://overture.au.dk/artifactory/remote-repos/org/apache/maven/maven-plugin-api/2.0/maven-plugin-api-2.0.pom (601 B at 53.4 KB/sec)
    Downloading: http://overture.au.dk/artifactory/remote-repos/org/apache/maven/maven-plugin-descriptor/2.0/maven-plugin-descriptor-2.0.pom
    Downloaded: http://overture.au.dk/artifactory/remote-repos/org/apache/maven/maven-plugin-descriptor/2.0/maven-plugin-descriptor-2.0.pom (2 KB at 118.9 KB/sec)
    Downloading: http://overture.au.dk/artifactory/remote-repos/org/apache/maven/maven-monitor/2.0/maven-monitor-2.0.pom
    Downloaded: http://overture.au.dk/artifactory/remote-repos/org/apache/maven/maven-monitor/2.0/maven-monitor-2.0.pom (400 B at 26.0 KB/sec)
    Downloading: http://overture.au.dk/artifactory/remote-repos/org/codehaus/plexus/plexus-utils/1.2/plexus-utils-1.2.pom
    Downloaded: http://overture.au.dk/artifactory/remote-repos/org/codehaus/plexus/plexus-utils/1.2/plexus-utils-1.2.pom (767 B at 35.7 KB/sec)
    Downloading: http://overture.au.dk/artifactory/remote-repos/org/codehaus/plexus/plexus/1.0.5/plexus-1.0.5.pom
    Downloaded: http://overture.au.dk/artifactory/remote-repos/org/codehaus/plexus/plexus/1.0.5/plexus-1.0.5.pom (6 KB at 483.6 KB/sec)
    Downloading: http://overture.au.dk/artifactory/remote-repos/org/apache/maven/maven-archiver/2.3/maven-archiver-2.3.jar
    Downloading: http://overture.au.dk/artifactory/remote-repos/org/apache/maven/shared/maven-invoker/2.0.9/maven-invoker-2.0.9.jar
    Downloading: http://overture.au.dk/artifactory/remote-repos/org/apache/maven/doxia/doxia-sink-api/1.0/doxia-sink-api-1.0.jar
    Downloading: http://overture.au.dk/artifactory/remote-repos/org/apache/maven/doxia/doxia-core/1.0/doxia-core-1.0.jar
    Downloading: http://overture.au.dk/artifactory/remote-repos/org/apache/maven/doxia/doxia-site-renderer/1.0/doxia-site-renderer-1.0.jar
    Downloaded: http://overture.au.dk/artifactory/remote-repos/org/apache/maven/shared/maven-invoker/2.0.9/maven-invoker-2.0.9.jar (28 KB at 1624.7 KB/sec)
    Downloading: http://overture.au.dk/artifactory/remote-repos/org/apache/maven/doxia/doxia-decoration-model/1.0/doxia-decoration-model-1.0.jar
    Downloaded: http://overture.au.dk/artifactory/remote-repos/org/apache/maven/doxia/doxia-core/1.0/doxia-core-1.0.jar (54 KB at 3833.0 KB/sec)
    Downloading: http://overture.au.dk/artifactory/remote-repos/org/apache/maven/doxia/doxia-module-apt/1.0/doxia-module-apt-1.0.jar
    Downloaded: http://overture.au.dk/artifactory/remote-repos/org/apache/maven/doxia/doxia-sink-api/1.0/doxia-sink-api-1.0.jar (10 KB at 655.8 KB/sec)
    Downloading: http://overture.au.dk/artifactory/remote-repos/org/apache/maven/doxia/doxia-module-fml/1.0/doxia-module-fml-1.0.jar
    Downloaded: http://overture.au.dk/artifactory/remote-repos/org/apache/maven/doxia/doxia-site-renderer/1.0/doxia-site-renderer-1.0.jar (46 KB at 2672.2 KB/sec)
    Downloading: http://overture.au.dk/artifactory/remote-repos/org/apache/maven/doxia/doxia-module-xdoc/1.0/doxia-module-xdoc-1.0.jar
    Downloaded: http://overture.au.dk/artifactory/remote-repos/org/apache/maven/maven-archiver/2.3/maven-archiver-2.3.jar (18 KB at 721.9 KB/sec)
    Downloading: http://overture.au.dk/artifactory/remote-repos/org/apache/maven/doxia/doxia-module-xhtml/1.0/doxia-module-xhtml-1.0.jar
    Downloaded: http://overture.au.dk/artifactory/remote-repos/org/apache/maven/doxia/doxia-decoration-model/1.0/doxia-decoration-model-1.0.jar (48 KB at 3417.0 KB/sec)
    Downloading: http://overture.au.dk/artifactory/remote-repos/commons-logging/commons-logging/1.1.1/commons-logging-1.1.1.jar
    Downloaded: http://overture.au.dk/artifactory/remote-repos/org/apache/maven/doxia/doxia-module-xdoc/1.0/doxia-module-xdoc-1.0.jar (28 KB at 2262.1 KB/sec)
    Downloading: http://overture.au.dk/artifactory/remote-repos/log4j/log4j/1.2.14/log4j-1.2.14.jar
    Downloaded: http://overture.au.dk/artifactory/remote-repos/org/apache/maven/doxia/doxia-module-fml/1.0/doxia-module-fml-1.0.jar (19 KB at 1065.3 KB/sec)
    Downloading: http://overture.au.dk/artifactory/remote-repos/com/thoughtworks/qdox/qdox/1.9.2/qdox-1.9.2.jar
    Downloaded: http://overture.au.dk/artifactory/remote-repos/org/apache/maven/doxia/doxia-module-apt/1.0/doxia-module-apt-1.0.jar (46 KB at 2419.7 KB/sec)
    Downloading: http://overture.au.dk/artifactory/remote-repos/org/codehaus/plexus/plexus-archiver/1.0-alpha-9/plexus-archiver-1.0-alpha-9.jar
    Downloaded: http://overture.au.dk/artifactory/remote-repos/org/apache/maven/doxia/doxia-module-xhtml/1.0/doxia-module-xhtml-1.0.jar (22 KB at 1120.7 KB/sec)
    Downloading: http://overture.au.dk/artifactory/remote-repos/org/codehaus/plexus/plexus-io/1.0-alpha-1/plexus-io-1.0-alpha-1.jar
    Downloaded: http://overture.au.dk/artifactory/remote-repos/commons-logging/commons-logging/1.1.1/commons-logging-1.1.1.jar (60 KB at 3704.0 KB/sec)
    Downloading: http://overture.au.dk/artifactory/remote-repos/org/apache/maven/shared/maven-plugin-testing-harness/1.1/maven-plugin-testing-harness-1.1.jar
    Downloaded: http://overture.au.dk/artifactory/remote-repos/com/thoughtworks/qdox/qdox/1.9.2/qdox-1.9.2.jar (167 KB at 9769.2 KB/sec)
    Downloaded: http://overture.au.dk/artifactory/remote-repos/org/codehaus/plexus/plexus-io/1.0-alpha-1/plexus-io-1.0-alpha-1.jar (12 KB at 796.2 KB/sec)
    Downloaded: http://overture.au.dk/artifactory/remote-repos/log4j/log4j/1.2.14/log4j-1.2.14.jar (359 KB at 14951.3 KB/sec)
    Downloaded: http://overture.au.dk/artifactory/remote-repos/org/codehaus/plexus/plexus-archiver/1.0-alpha-9/plexus-archiver-1.0-alpha-9.jar (154 KB at 6669.2 KB/sec)
    Downloaded: http://overture.au.dk/artifactory/remote-repos/org/apache/maven/shared/maven-plugin-testing-harness/1.1/maven-plugin-testing-harness-1.1.jar (32 KB at 1866.7 KB/sec)
    [INFO] Not executing Javadoc as the project is not a Java classpath-capable package
    [INFO] 
    [INFO] --- jacoco-maven-plugin:0.7.6.201602180812:report (jacoco-site) @ root ---
    [INFO] Skipping JaCoCo execution due to missing execution data file:/var/lib/jenkins/workspace/vdm2c-release/target/coverage-reports/jacoco-unit.exec
    [INFO] 
    [INFO] --- maven-gpg-plugin:1.1:sign (sign-artifacts) @ root ---
    [INFO]                                                                         
    [INFO] ------------------------------------------------------------------------
    [INFO] Building C native root vdm2c 0.0.6
    [INFO] ------------------------------------------------------------------------
    Downloading: http://overture.au.dk/artifactory/remote-repos/org/codehaus/mojo/exec-maven-plugin/1.5.0/exec-maven-plugin-1.5.0.pom
    Downloaded: http://overture.au.dk/artifactory/remote-repos/org/codehaus/mojo/exec-maven-plugin/1.5.0/exec-maven-plugin-1.5.0.pom (13 KB at 633.4 KB/sec)
    Downloading: http://overture.au.dk/artifactory/remote-repos/org/codehaus/mojo/mojo-parent/38/mojo-parent-38.pom
    Downloaded: http://overture.au.dk/artifactory/remote-repos/org/codehaus/mojo/mojo-parent/38/mojo-parent-38.pom (33 KB at 1922.5 KB/sec)
    Downloading: http://overture.au.dk/artifactory/remote-repos/org/codehaus/mojo/exec-maven-plugin/1.5.0/exec-maven-plugin-1.5.0.jar
    Downloaded: http://overture.au.dk/artifactory/remote-repos/org/codehaus/mojo/exec-maven-plugin/1.5.0/exec-maven-plugin-1.5.0.jar (53 KB at 2891.9 KB/sec)
    [INFO] 
    [INFO] --- maven-clean-plugin:2.5:clean (default-clean) @ c ---
    [INFO] 
    [INFO] --- maven-enforcer-plugin:1.0:enforce (enforce-maven) @ c ---
    [INFO] 
    [INFO] --- jacoco-maven-plugin:0.7.6.201602180812:prepare-agent (jacoco-initialize) @ c ---
    [INFO] argLine set to -javaagent:/var/lib/jenkins/workspace/vdm2c-release/repository/org/jacoco/org.jacoco.agent/0.7.6.201602180812/org.jacoco.agent-0.7.6.201602180812-runtime.jar=destfile=/var/lib/jenkins/workspace/vdm2c-release/c/target/coverage-reports/jacoco-unit.exec,excludes=org/overture/cgc/extast/analysis/**/*.*:org/overture/codegen/vdm2c/extast/expressions/**/*:org/overture/codegen/vdm2c/extast/declarations/**/*:org/overture/codegen/vdm2c/extast/statements/**/*:org/overture/cgc/extast/node/**/*:org/overture/codegen/vdm2c/ast/preview/**/*
    [INFO] 
    [INFO] --- exec-maven-plugin:1.5.0:exec (run-lib-tests) @ c ---
    Downloading: http://overture.au.dk/artifactory/remote-repos/junit/junit/4.12/junit-4.12.pom
    Downloaded: http://overture.au.dk/artifactory/remote-repos/junit/junit/4.12/junit-4.12.pom (24 KB at 1445.2 KB/sec)
    Downloading: http://overture.au.dk/artifactory/remote-repos/org/hamcrest/hamcrest-core/1.3/hamcrest-core-1.3.pom
    Downloaded: http://overture.au.dk/artifactory/remote-repos/org/hamcrest/hamcrest-core/1.3/hamcrest-core-1.3.pom (766 B at 57.5 KB/sec)
    Downloading: http://overture.au.dk/artifactory/remote-repos/org/hamcrest/hamcrest-parent/1.3/hamcrest-parent-1.3.pom
    Downloaded: http://overture.au.dk/artifactory/remote-repos/org/hamcrest/hamcrest-parent/1.3/hamcrest-parent-1.3.pom (2 KB at 91.7 KB/sec)
    Downloading: http://overture.au.dk/artifactory/remote-repos/org/codehaus/plexus/plexus-utils/3.0.20/plexus-utils-3.0.20.pom
    Downloaded: http://overture.au.dk/artifactory/remote-repos/org/codehaus/plexus/plexus-utils/3.0.20/plexus-utils-3.0.20.pom (4 KB at 265.8 KB/sec)
    Downloading: http://overture.au.dk/artifactory/remote-repos/org/codehaus/plexus/plexus/3.3.1/plexus-3.3.1.pom
    Downloaded: http://overture.au.dk/artifactory/remote-repos/org/codehaus/plexus/plexus/3.3.1/plexus-3.3.1.pom (20 KB at 1535.9 KB/sec)
    Downloading: http://overture.au.dk/artifactory/remote-repos/org/apache/commons/commons-exec/1.3/commons-exec-1.3.pom
    Downloaded: http://overture.au.dk/artifactory/remote-repos/org/apache/commons/commons-exec/1.3/commons-exec-1.3.pom (11 KB at 894.7 KB/sec)
    Downloading: http://overture.au.dk/artifactory/remote-repos/org/apache/commons/commons-parent/35/commons-parent-35.pom
    Downloaded: http://overture.au.dk/artifactory/remote-repos/org/apache/commons/commons-parent/35/commons-parent-35.pom (57 KB at 4029.9 KB/sec)
    Downloading: http://overture.au.dk/artifactory/remote-repos/org/apache/apache/15/apache-15.pom
    Downloaded: http://overture.au.dk/artifactory/remote-repos/org/apache/apache/15/apache-15.pom (15 KB at 1248.5 KB/sec)
    Downloading: http://overture.au.dk/artifactory/remote-repos/org/codehaus/plexus/plexus-utils/3.0.20/plexus-utils-3.0.20.jar
    Downloading: http://overture.au.dk/artifactory/remote-repos/org/apache/commons/commons-exec/1.3/commons-exec-1.3.jar
    Downloaded: http://overture.au.dk/artifactory/remote-repos/org/apache/commons/commons-exec/1.3/commons-exec-1.3.jar (54 KB at 3321.7 KB/sec)
    Downloaded: http://overture.au.dk/artifactory/remote-repos/org/codehaus/plexus/plexus-utils/3.0.20/plexus-utils-3.0.20.jar (238 KB at 12496.3 KB/sec)
    -- The C compiler identification is GNU 4.8.4
    -- The CXX compiler identification is GNU 4.8.4
    -- Check for working C compiler: /usr/bin/cc
    -- Check for working C compiler: /usr/bin/cc -- works
    -- Detecting C compiler ABI info
    -- Detecting C compiler ABI info - done
    -- Check for working CXX compiler: /usr/bin/c++
    -- Check for working CXX compiler: /usr/bin/c++ -- works
    -- Detecting CXX compiler ABI info
    -- Detecting CXX compiler ABI info - done
    CMake Error at CMakeLists.txt:13 (add_subdirectory):
      add_subdirectory given source "third_party/googletest/googletest" which is
      not an existing directory.
    
    
    -- Found PkgConfig: /usr/bin/pkg-config (found version "0.26") 
    -- checking for module 'glib-2.0>=2.36.0'
    --   found glib-2.0, version 2.40.2
    -- Performing Test COMPILER_SUPPORTS_CXX11
    -- Performing Test COMPILER_SUPPORTS_CXX11 - Success
    -- Performing Test COMPILER_SUPPORTS_CXX0X
    -- Performing Test COMPILER_SUPPORTS_CXX0X - Success
    -- Configuring incomplete, errors occurred!
    See also "/var/lib/jenkins/workspace/vdm2c-release/c/CMakeFiles/CMakeOutput.log".
    /var/lib/jenkins/workspace/vdm2c-release/c/run-lib-tests.sh: line 5: ./vdmclib/src/main/vdmclib: No such file or directory
    [ERROR] Command execution failed.
    org.apache.commons.exec.ExecuteException: Process exited with an error: 127 (Exit value: 127)
    	at org.apache.commons.exec.DefaultExecutor.executeInternal(DefaultExecutor.java:404)
    	at org.apache.commons.exec.DefaultExecutor.execute(DefaultExecutor.java:166)
    	at org.codehaus.mojo.exec.ExecMojo.executeCommandLine(ExecMojo.java:764)
    	at org.codehaus.mojo.exec.ExecMojo.executeCommandLine(ExecMojo.java:711)
    	at org.codehaus.mojo.exec.ExecMojo.execute(ExecMojo.java:289)
    	at org.apache.maven.plugin.DefaultBuildPluginManager.executeMojo(DefaultBuildPluginManager.java:101)
    	at org.apache.maven.lifecycle.internal.MojoExecutor.execute(MojoExecutor.java:209)
    	at org.apache.maven.lifecycle.internal.MojoExecutor.execute(MojoExecutor.java:153)
    	at org.apache.maven.lifecycle.internal.MojoExecutor.execute(MojoExecutor.java:145)
    	at org.apache.maven.lifecycle.internal.LifecycleModuleBuilder.buildProject(LifecycleModuleBuilder.java:84)
    	at org.apache.maven.lifecycle.internal.LifecycleModuleBuilder.buildProject(LifecycleModuleBuilder.java:59)
    	at org.apache.maven.lifecycle.internal.LifecycleStarter.singleThreadedBuild(LifecycleStarter.java:183)
    	at org.apache.maven.lifecycle.internal.LifecycleStarter.execute(LifecycleStarter.java:161)
    	at org.apache.maven.DefaultMaven.doExecute(DefaultMaven.java:320)
    	at org.apache.maven.DefaultMaven.execute(DefaultMaven.java:156)
    	at org.apache.maven.cli.MavenCli.execute(MavenCli.java:537)
    	at org.apache.maven.cli.MavenCli.doMain(MavenCli.java:196)
    	at org.apache.maven.cli.MavenCli.main(MavenCli.java:141)
    	at sun.reflect.NativeMethodAccessorImpl.invoke0(Native Method)
    	at sun.reflect.NativeMethodAccessorImpl.invoke(NativeMethodAccessorImpl.java:62)
    	at sun.reflect.DelegatingMethodAccessorImpl.invoke(DelegatingMethodAccessorImpl.java:43)
    	at java.lang.reflect.Method.invoke(Method.java:498)
    	at org.codehaus.plexus.classworlds.launcher.Launcher.launchEnhanced(Launcher.java:289)
    	at org.codehaus.plexus.classworlds.launcher.Launcher.launch(Launcher.java:229)
    	at org.codehaus.plexus.classworlds.launcher.Launcher.mainWithExitCode(Launcher.java:415)
    	at org.codehaus.plexus.classworlds.launcher.Launcher.main(Launcher.java:356)
    [INFO] ------------------------------------------------------------------------
    [INFO] Reactor Summary:
    [INFO] 
    [INFO] Overture VDM 2 C Translator Root .................. SUCCESS [6.461s]
    [INFO] C native root vdm2c ............................... FAILURE [1.472s]
    [INFO] The C Code Generator VDM library sources .......... SKIPPED
    [INFO] Core Tools for vdm2c .............................. SKIPPED
    [INFO] The C Code Generator .............................. SKIPPED
    [INFO] ------------------------------------------------------------------------
    [INFO] BUILD FAILURE
    [INFO] ------------------------------------------------------------------------
    [INFO] Total time: 8.244s
    [INFO] Finished at: Mon Sep 26 15:55:20 CEST 2016
    [INFO] Final Memory: 22M/489M
    [INFO] ------------------------------------------------------------------------
    [ERROR] Failed to execute goal org.codehaus.mojo:exec-maven-plugin:1.5.0:exec (run-lib-tests) on project c: Command execution failed. Process exited with an error: 127 (Exit value: 127) -> [Help 1]
    [ERROR] 
    [ERROR] To see the full stack trace of the errors, re-run Maven with the -e switch.
    [ERROR] Re-run Maven using the -X switch to enable full debug logging.
    [ERROR] 
    [ERROR] For more information about the errors and possible solutions, please read the following articles:
    [ERROR] [Help 1] http://cwiki.apache.org/confluence/display/MAVEN/MojoExecutionException
    [ERROR] 
    [ERROR] After correcting the problems, you can resume the build with the command
    [ERROR]   mvn <goals> -rf :c
[INFO] ------------------------------------------------------------------------
[INFO] Reactor Summary:
[INFO] 
[INFO] Overture VDM 2 C Translator Root .................. FAILURE [11.121s]
[INFO] C native root vdm2c ............................... SKIPPED
[INFO] The C Code Generator VDM library sources .......... SKIPPED
[INFO] Core Tools for vdm2c .............................. SKIPPED
[INFO] The C Code Generator .............................. SKIPPED
[INFO] ------------------------------------------------------------------------
[INFO] BUILD FAILURE
[INFO] ------------------------------------------------------------------------
[INFO] Total time: 11.932s
[INFO] Finished at: Mon Sep 26 15:55:21 CEST 2016
[INFO] Final Memory: 17M/212M
[INFO] ------------------------------------------------------------------------
[ERROR] Failed to execute goal org.apache.maven.plugins:maven-release-plugin:2.5:prepare (default-cli) on project root: Maven execution failed, exit code: '1' -> [Help 1]
[ERROR] 
[ERROR] To see the full stack trace of the errors, re-run Maven with the -e switch.
[ERROR] Re-run Maven using the -X switch to enable full debug logging.
[ERROR] 
[ERROR] For more information about the errors and possible solutions, please read the following articles:
[ERROR] [Help 1] http://cwiki.apache.org/confluence/display/MAVEN/MojoExecutionException
Build step 'Execute shell' marked build as failure
SSH: Current build result is [FAILURE], not going to run.
Started calculate disk usage of build
Finished Calculation of disk usage of build in 0 seconds
Started calculate disk usage of workspace
Finished Calculation of disk usage of workspace in 0 seconds
Finished: FAILURE