FailedConsole Output

Skipping 181 KB.. Full Log
r = (expression)) \
         [exec]                                                     ^
         [exec] /var/lib/jenkins/workspace/vdm2c-release/c/third_party/googletest/googletest/include/gtest/gtest_pred_impl.h:162:3: note: in expansion of macro ‘GTEST_PRED_FORMAT2_’
         [exec]    GTEST_PRED_FORMAT2_(pred_format, v1, v2, GTEST_NONFATAL_FAILURE_)
         [exec]    ^
         [exec] /var/lib/jenkins/workspace/vdm2c-release/c/third_party/googletest/googletest/include/gtest/gtest.h:1923:3: note: in expansion of macro ‘EXPECT_PRED_FORMAT2’
         [exec]    EXPECT_PRED_FORMAT2(::testing::internal:: \
         [exec]    ^
         [exec] /var/lib/jenkins/workspace/vdm2c-release/c/third_party/googletest/googletest/include/gtest/gtest.h:1924:32: note: in expansion of macro ‘GTEST_IS_NULL_LITERAL_’
         [exec]                        EqHelper<GTEST_IS_NULL_LITERAL_(val1)>::Compare, \
         [exec]                                 ^
         [exec] /var/lib/jenkins/workspace/vdm2c-release/c/vdmclib/src/test/ExpressionsMap_Tests.cpp:381:2: note: in expansion of macro ‘EXPECT_EQ’
         [exec]   EXPECT_EQ(false, map_not_eq1);
         [exec]   ^
         [exec] /usr/bin/cmake -E cmake_progress_report /var/lib/jenkins/workspace/vdm2c-release/c/CMakeFiles 31
         [exec] [ 77%] /usr/bin/cmake -E cmake_progress_report /var/lib/jenkins/workspace/vdm2c-release/c/CMakeFiles 32
         [exec] Building CXX object vdmclib/CMakeFiles/vdmclib.dir/src/test/ExpressionsSet_Tests.cpp.o
         [exec] cd /var/lib/jenkins/workspace/vdm2c-release/c/vdmclib && /usr/bin/c++    -std=c++11 -fmessage-length=0 -I/var/lib/jenkins/workspace/vdm2c-release/c/vdmclib -I/var/lib/jenkins/workspace/vdm2c-release/c/vdmclib/src/main -I/var/lib/jenkins/workspace/vdm2c-release/c/vdmclib/src/main/classes -I/var/lib/jenkins/workspace/vdm2c-release/c/third_party/googletest/googletest/include -I/usr/include/glib-2.0 -I/usr/lib/x86_64-linux-gnu/glib-2.0/include    -o CMakeFiles/vdmclib.dir/src/test/ExpressionsSet_Tests.cpp.o -c /var/lib/jenkins/workspace/vdm2c-release/c/vdmclib/src/test/ExpressionsSet_Tests.cpp
         [exec] [ 80%] Building CXX object vdmclib/CMakeFiles/vdmclib.dir/src/test/ClassATest.cpp.o
         [exec] cd /var/lib/jenkins/workspace/vdm2c-release/c/vdmclib && /usr/bin/c++    -std=c++11 -fmessage-length=0 -I/var/lib/jenkins/workspace/vdm2c-release/c/vdmclib -I/var/lib/jenkins/workspace/vdm2c-release/c/vdmclib/src/main -I/var/lib/jenkins/workspace/vdm2c-release/c/vdmclib/src/main/classes -I/var/lib/jenkins/workspace/vdm2c-release/c/third_party/googletest/googletest/include -I/usr/include/glib-2.0 -I/usr/lib/x86_64-linux-gnu/glib-2.0/include    -o CMakeFiles/vdmclib.dir/src/test/ClassATest.cpp.o -c /var/lib/jenkins/workspace/vdm2c-release/c/vdmclib/src/test/ClassATest.cpp
         [exec] /usr/bin/cmake -E cmake_progress_report /var/lib/jenkins/workspace/vdm2c-release/c/CMakeFiles 33
         [exec] [ 82%] Building CXX object vdmclib/CMakeFiles/vdmclib.dir/src/test/ExpressionsNumeric_Tests.cpp.o
         [exec] cd /var/lib/jenkins/workspace/vdm2c-release/c/vdmclib && /usr/bin/c++    -std=c++11 -fmessage-length=0 -I/var/lib/jenkins/workspace/vdm2c-release/c/vdmclib -I/var/lib/jenkins/workspace/vdm2c-release/c/vdmclib/src/main -I/var/lib/jenkins/workspace/vdm2c-release/c/vdmclib/src/main/classes -I/var/lib/jenkins/workspace/vdm2c-release/c/third_party/googletest/googletest/include -I/usr/include/glib-2.0 -I/usr/lib/x86_64-linux-gnu/glib-2.0/include    -o CMakeFiles/vdmclib.dir/src/test/ExpressionsNumeric_Tests.cpp.o -c /var/lib/jenkins/workspace/vdm2c-release/c/vdmclib/src/test/ExpressionsNumeric_Tests.cpp
         [exec] In file included from /var/lib/jenkins/workspace/vdm2c-release/c/third_party/googletest/googletest/include/gtest/gtest.h:1874:0,
         [exec]                  from /var/lib/jenkins/workspace/vdm2c-release/c/vdmclib/src/test/ExpressionsBoolean_Tests.cpp:23:
         [exec] /var/lib/jenkins/workspace/vdm2c-release/c/vdmclib/src/test/ExpressionsBoolean_Tests.cpp: In member function ‘virtual void Expression_Boolean_andExp_Test::TestBody()’:
         [exec] /var/lib/jenkins/workspace/vdm2c-release/c/third_party/googletest/googletest/include/gtest/internal/gtest-internal.h:133:55: warning: converting ‘false’ to pointer type for argument 1 of ‘char testing::internal::IsNullLiteralHelper(testing::internal::Secret*)’ [-Wconversion-null]
         [exec]      (sizeof(::testing::internal::IsNullLiteralHelper(x)) == 1)
         [exec]                                                        ^
         [exec] /var/lib/jenkins/workspace/vdm2c-release/c/third_party/googletest/googletest/include/gtest/gtest_pred_impl.h:77:52: note: in definition of macro ‘GTEST_ASSERT_’
         [exec]    if (const ::testing::AssertionResult gtest_ar = (expression)) \
         [exec]                                                     ^
         [exec] /var/lib/jenkins/workspace/vdm2c-release/c/third_party/googletest/googletest/include/gtest/gtest_pred_impl.h:162:3: note: in expansion of macro ‘GTEST_PRED_FORMAT2_’
         [exec]    GTEST_PRED_FORMAT2_(pred_format, v1, v2, GTEST_NONFATAL_FAILURE_)
         [exec]    ^
         [exec] /var/lib/jenkins/workspace/vdm2c-release/c/third_party/googletest/googletest/include/gtest/gtest.h:1923:3: note: in expansion of macro ‘EXPECT_PRED_FORMAT2’
         [exec]    EXPECT_PRED_FORMAT2(::testing::internal:: \
         [exec]    ^
         [exec] /var/lib/jenkins/workspace/vdm2c-release/c/third_party/googletest/googletest/include/gtest/gtest.h:1924:32: note: in expansion of macro ‘GTEST_IS_NULL_LITERAL_’
         [exec]                        EqHelper<GTEST_IS_NULL_LITERAL_(val1)>::Compare, \
         [exec]                                 ^
         [exec] /var/lib/jenkins/workspace/vdm2c-release/c/vdmclib/src/test/ExpressionsBoolean_Tests.cpp:56:2: note: in expansion of macro ‘EXPECT_EQ’
         [exec]   EXPECT_EQ (false,res->value.boolVal);
         [exec]   ^
         [exec] /var/lib/jenkins/workspace/vdm2c-release/c/third_party/googletest/googletest/include/gtest/internal/gtest-internal.h:133:55: warning: converting ‘false’ to pointer type for argument 1 of ‘char testing::internal::IsNullLiteralHelper(testing::internal::Secret*)’ [-Wconversion-null]
         [exec]      (sizeof(::testing::internal::IsNullLiteralHelper(x)) == 1)
         [exec]                                                        ^
         [exec] /var/lib/jenkins/workspace/vdm2c-release/c/third_party/googletest/googletest/include/gtest/gtest_pred_impl.h:77:52: note: in definition of macro ‘GTEST_ASSERT_’
         [exec]    if (const ::testing::AssertionResult gtest_ar = (expression)) \
         [exec]                                                     ^
         [exec] /var/lib/jenkins/workspace/vdm2c-release/c/third_party/googletest/googletest/include/gtest/gtest_pred_impl.h:162:3: note: in expansion of macro ‘GTEST_PRED_FORMAT2_’
         [exec]    GTEST_PRED_FORMAT2_(pred_format, v1, v2, GTEST_NONFATAL_FAILURE_)
         [exec]    ^
         [exec] /var/lib/jenkins/workspace/vdm2c-release/c/third_party/googletest/googletest/include/gtest/gtest.h:1923:3: note: in expansion of macro ‘EXPECT_PRED_FORMAT2’
         [exec]    EXPECT_PRED_FORMAT2(::testing::internal:: \
         [exec]    ^
         [exec] /var/lib/jenkins/workspace/vdm2c-release/c/third_party/googletest/googletest/include/gtest/gtest.h:1924:32: note: in expansion of macro ‘GTEST_IS_NULL_LITERAL_’
         [exec]                        EqHelper<GTEST_IS_NULL_LITERAL_(val1)>::Compare, \
         [exec]                                 ^
         [exec] /var/lib/jenkins/workspace/vdm2c-release/c/vdmclib/src/test/ExpressionsBoolean_Tests.cpp:75:2: note: in expansion of macro ‘EXPECT_EQ’
         [exec]   EXPECT_EQ(false, res->value.boolVal);
         [exec]   ^
         [exec] /var/lib/jenkins/workspace/vdm2c-release/c/third_party/googletest/googletest/include/gtest/internal/gtest-internal.h:133:55: warning: converting ‘false’ to pointer type for argument 1 of ‘char testing::internal::IsNullLiteralHelper(testing::internal::Secret*)’ [-Wconversion-null]
         [exec]      (sizeof(::testing::internal::IsNullLiteralHelper(x)) == 1)
         [exec]                                                        ^
         [exec] /var/lib/jenkins/workspace/vdm2c-release/c/third_party/googletest/googletest/include/gtest/gtest_pred_impl.h:77:52: note: in definition of macro ‘GTEST_ASSERT_’
         [exec]    if (const ::testing::AssertionResult gtest_ar = (expression)) \
         [exec]                                                     ^
         [exec] /var/lib/jenkins/workspace/vdm2c-release/c/third_party/googletest/googletest/include/gtest/gtest_pred_impl.h:162:3: note: in expansion of macro ‘GTEST_PRED_FORMAT2_’
         [exec]    GTEST_PRED_FORMAT2_(pred_format, v1, v2, GTEST_NONFATAL_FAILURE_)
         [exec]    ^
         [exec] /var/lib/jenkins/workspace/vdm2c-release/c/third_party/googletest/googletest/include/gtest/gtest.h:1923:3: note: in expansion of macro ‘EXPECT_PRED_FORMAT2’
         [exec]    EXPECT_PRED_FORMAT2(::testing::internal:: \
         [exec]    ^
         [exec] /var/lib/jenkins/workspace/vdm2c-release/c/third_party/googletest/googletest/include/gtest/gtest.h:1924:32: note: in expansion of macro ‘GTEST_IS_NULL_LITERAL_’
         [exec]                        EqHelper<GTEST_IS_NULL_LITERAL_(val1)>::Compare, \
         [exec]                                 ^
         [exec] /var/lib/jenkins/workspace/vdm2c-release/c/vdmclib/src/test/ExpressionsBoolean_Tests.cpp:81:2: note: in expansion of macro ‘EXPECT_EQ’
         [exec]   EXPECT_EQ(false, res->value.boolVal);
         [exec]   ^
         [exec] /var/lib/jenkins/workspace/vdm2c-release/c/vdmclib/src/test/ExpressionsBoolean_Tests.cpp: In member function ‘virtual void Expression_Boolean_implicationExp_Test::TestBody()’:
         [exec] /var/lib/jenkins/workspace/vdm2c-release/c/third_party/googletest/googletest/include/gtest/internal/gtest-internal.h:133:55: warning: converting ‘false’ to pointer type for argument 1 of ‘char testing::internal::IsNullLiteralHelper(testing::internal::Secret*)’ [-Wconversion-null]
         [exec]      (sizeof(::testing::internal::IsNullLiteralHelper(x)) == 1)
         [exec]                                                        ^
         [exec] /var/lib/jenkins/workspace/vdm2c-release/c/third_party/googletest/googletest/include/gtest/gtest_pred_impl.h:77:52: note: in definition of macro ‘GTEST_ASSERT_’
         [exec]    if (const ::testing::AssertionResult gtest_ar = (expression)) \
         [exec]                                                     ^
         [exec] /var/lib/jenkins/workspace/vdm2c-release/c/third_party/googletest/googletest/include/gtest/gtest_pred_impl.h:162:3: note: in expansion of macro ‘GTEST_PRED_FORMAT2_’
         [exec]    GTEST_PRED_FORMAT2_(pred_format, v1, v2, GTEST_NONFATAL_FAILURE_)
         [exec]    ^
         [exec] /var/lib/jenkins/workspace/vdm2c-release/c/third_party/googletest/googletest/include/gtest/gtest.h:1923:3: note: in expansion of macro ‘EXPECT_PRED_FORMAT2’
         [exec]    EXPECT_PRED_FORMAT2(::testing::internal:: \
         [exec]    ^
         [exec] /var/lib/jenkins/workspace/vdm2c-release/c/third_party/googletest/googletest/include/gtest/gtest.h:1924:32: note: in expansion of macro ‘GTEST_IS_NULL_LITERAL_’
         [exec]                        EqHelper<GTEST_IS_NULL_LITERAL_(val1)>::Compare, \
         [exec]                                 ^
         [exec] /var/lib/jenkins/workspace/vdm2c-release/c/vdmclib/src/test/ExpressionsBoolean_Tests.cpp:157:2: note: in expansion of macro ‘EXPECT_EQ’
         [exec]   EXPECT_EQ (false,res->value.boolVal);
         [exec]   ^
         [exec] /var/lib/jenkins/workspace/vdm2c-release/c/third_party/googletest/googletest/include/gtest/internal/gtest-internal.h:133:55: warning: converting ‘false’ to pointer type for argument 1 of ‘char testing::internal::IsNullLiteralHelper(testing::internal::Secret*)’ [-Wconversion-null]
         [exec]      (sizeof(::testing::internal::IsNullLiteralHelper(x)) == 1)
         [exec]                                                        ^
         [exec] /var/lib/jenkins/workspace/vdm2c-release/c/third_party/googletest/googletest/include/gtest/gtest_pred_impl.h:77:52: note: in definition of macro ‘GTEST_ASSERT_’
         [exec]    if (const ::testing::AssertionResult gtest_ar = (expression)) \
         [exec]                                                     ^
         [exec] /var/lib/jenkins/workspace/vdm2c-release/c/third_party/googletest/googletest/include/gtest/gtest_pred_impl.h:162:3: note: in expansion of macro ‘GTEST_PRED_FORMAT2_’
         [exec]    GTEST_PRED_FORMAT2_(pred_format, v1, v2, GTEST_NONFATAL_FAILURE_)
         [exec]    ^
         [exec] /var/lib/jenkins/workspace/vdm2c-release/c/third_party/googletest/googletest/include/gtest/gtest.h:1923:3: note: in expansion of macro ‘EXPECT_PRED_FORMAT2’
         [exec]    EXPECT_PRED_FORMAT2(::testing::internal:: \
         [exec]    ^
         [exec] /var/lib/jenkins/workspace/vdm2c-release/c/third_party/googletest/googletest/include/gtest/gtest.h:1924:32: note: in expansion of macro ‘GTEST_IS_NULL_LITERAL_’
         [exec]                        EqHelper<GTEST_IS_NULL_LITERAL_(val1)>::Compare, \
         [exec]                                 ^
         [exec] /var/lib/jenkins/workspace/vdm2c-release/c/vdmclib/src/test/ExpressionsBoolean_Tests.cpp:175:2: note: in expansion of macro ‘EXPECT_EQ’
         [exec]   EXPECT_EQ(false, res->value.boolVal);
         [exec]   ^
         [exec] /var/lib/jenkins/workspace/vdm2c-release/c/vdmclib/src/test/ExpressionsBoolean_Tests.cpp: In member function ‘virtual void Expression_Boolean_biimplicationExp_Test::TestBody()’:
         [exec] /var/lib/jenkins/workspace/vdm2c-release/c/third_party/googletest/googletest/include/gtest/internal/gtest-internal.h:133:55: warning: converting ‘false’ to pointer type for argument 1 of ‘char testing::internal::IsNullLiteralHelper(testing::internal::Secret*)’ [-Wconversion-null]
         [exec]      (sizeof(::testing::internal::IsNullLiteralHelper(x)) == 1)
         [exec]                                                        ^
         [exec] /var/lib/jenkins/workspace/vdm2c-release/c/third_party/googletest/googletest/include/gtest/gtest_pred_impl.h:77:52: note: in definition of macro ‘GTEST_ASSERT_’
         [exec]    if (const ::testing::AssertionResult gtest_ar = (expression)) \
         [exec]                                                     ^
         [exec] /var/lib/jenkins/workspace/vdm2c-release/c/third_party/googletest/googletest/include/gtest/gtest_pred_impl.h:162:3: note: in expansion of macro ‘GTEST_PRED_FORMAT2_’
         [exec]    GTEST_PRED_FORMAT2_(pred_format, v1, v2, GTEST_NONFATAL_FAILURE_)
         [exec]    ^
         [exec] /var/lib/jenkins/workspace/vdm2c-release/c/third_party/googletest/googletest/include/gtest/gtest.h:1923:3: note: in expansion of macro ‘EXPECT_PRED_FORMAT2’
         [exec]    EXPECT_PRED_FORMAT2(::testing::internal:: \
         [exec]    ^
         [exec] /var/lib/jenkins/workspace/vdm2c-release/c/third_party/googletest/googletest/include/gtest/gtest.h:1924:32: note: in expansion of macro ‘GTEST_IS_NULL_LITERAL_’
         [exec]                        EqHelper<GTEST_IS_NULL_LITERAL_(val1)>::Compare, \
         [exec]                                 ^
         [exec] /var/lib/jenkins/workspace/vdm2c-release/c/vdmclib/src/test/ExpressionsBoolean_Tests.cpp:198:2: note: in expansion of macro ‘EXPECT_EQ’
         [exec]   EXPECT_EQ (false,res->value.boolVal);
         [exec]   ^
         [exec] /usr/bin/cmake -E cmake_progress_report /var/lib/jenkins/workspace/vdm2c-release/c/CMakeFiles 34
         [exec] [ 85%] In file included from /var/lib/jenkins/workspace/vdm2c-release/c/third_party/googletest/googletest/include/gtest/gtest.h:1874:0,
         [exec]                  from /var/lib/jenkins/workspace/vdm2c-release/c/vdmclib/src/test/ExpressionsSet_Tests.cpp:23:
         [exec] /var/lib/jenkins/workspace/vdm2c-release/c/vdmclib/src/test/ExpressionsSet_Tests.cpp: In member function ‘virtual void Expression_Set_setGrow_Test::TestBody()’:
         [exec] /var/lib/jenkins/workspace/vdm2c-release/c/third_party/googletest/googletest/include/gtest/internal/gtest-internal.h:133:55: warning: converting ‘false’ to pointer type for argument 1 of ‘char testing::internal::IsNullLiteralHelper(testing::internal::Secret*)’ [-Wconversion-null]
         [exec]      (sizeof(::testing::internal::IsNullLiteralHelper(x)) == 1)
         [exec]                                                        ^
         [exec] /var/lib/jenkins/workspace/vdm2c-release/c/third_party/googletest/googletest/include/gtest/gtest_pred_impl.h:77:52: note: in definition of macro ‘GTEST_ASSERT_’
         [exec]    if (const ::testing::AssertionResult gtest_ar = (expression)) \
         [exec]                                                     ^
         [exec] /var/lib/jenkins/workspace/vdm2c-release/c/third_party/googletest/googletest/include/gtest/gtest_pred_impl.h:162:3: note: in expansion of macro ‘GTEST_PRED_FORMAT2_’
         [exec]    GTEST_PRED_FORMAT2_(pred_format, v1, v2, GTEST_NONFATAL_FAILURE_)
         [exec]    ^
         [exec] /var/lib/jenkins/workspace/vdm2c-release/c/third_party/googletest/googletest/include/gtest/gtest.h:1923:3: note: in expansion of macro ‘EXPECT_PRED_FORMAT2’
         [exec]    EXPECT_PRED_FORMAT2(::testing::internal:: \
         [exec]    ^
         [exec] /var/lib/jenkins/workspace/vdm2c-release/c/third_party/googletest/googletest/include/gtest/gtest.h:1924:32: note: in expansion of macro ‘GTEST_IS_NULL_LITERAL_’
         [exec]                        EqHelper<GTEST_IS_NULL_LITERAL_(val1)>::Compare, \
         [exec]                                 ^
         [exec] /var/lib/jenkins/workspace/vdm2c-release/c/vdmclib/src/test/ExpressionsSet_Tests.cpp:81:2: note: in expansion of macro ‘EXPECT_EQ’
         [exec]   EXPECT_EQ(false, res->value.boolVal);
         [exec]   ^
         [exec] /var/lib/jenkins/workspace/vdm2c-release/c/vdmclib/src/test/ExpressionsSet_Tests.cpp: In member function ‘virtual void Expression_Set_setFit_Test::TestBody()’:
         [exec] /var/lib/jenkins/workspace/vdm2c-release/c/third_party/googletest/googletest/include/gtest/internal/gtest-internal.h:133:55: warning: converting ‘false’ to pointer type for argument 1 of ‘char testing::internal::IsNullLiteralHelper(testing::internal::Secret*)’ [-Wconversion-null]
         [exec]      (sizeof(::testing::internal::IsNullLiteralHelper(x)) == 1)
         [exec]                                                        ^
         [exec] /var/lib/jenkins/workspace/vdm2c-release/c/third_party/googletest/googletest/include/gtest/gtest_pred_impl.h:77:52: note: in definition of macro ‘GTEST_ASSERT_’
         [exec]    if (const ::testing::AssertionResult gtest_ar = (expression)) \
         [exec]                                                     ^
         [exec] /var/lib/jenkins/workspace/vdm2c-release/c/third_party/googletest/googletest/include/gtest/gtest_pred_impl.h:162:3: note: in expansion of macro ‘GTEST_PRED_FORMAT2_’
         [exec]    GTEST_PRED_FORMAT2_(pred_format, v1, v2, GTEST_NONFATAL_FAILURE_)
         [exec]    ^
         [exec] /var/lib/jenkins/workspace/vdm2c-release/c/third_party/googletest/googletest/include/gtest/gtest.h:1923:3: note: in expansion of macro ‘EXPECT_PRED_FORMAT2’
         [exec]    EXPECT_PRED_FORMAT2(::testing::internal:: \
         [exec]    ^
         [exec] /var/lib/jenkins/workspace/vdm2c-release/c/third_party/googletest/googletest/include/gtest/gtest.h:1924:32: note: in expansion of macro ‘GTEST_IS_NULL_LITERAL_’
         [exec]                        EqHelper<GTEST_IS_NULL_LITERAL_(val1)>::Compare, \
         [exec]                                 ^
         [exec] /var/lib/jenkins/workspace/vdm2c-release/c/vdmclib/src/test/ExpressionsSet_Tests.cpp:111:2: note: in expansion of macro ‘EXPECT_EQ’
         [exec]   EXPECT_EQ(false, res->value.boolVal);
         [exec]   ^
         [exec] /var/lib/jenkins/workspace/vdm2c-release/c/vdmclib/src/test/ExpressionsSet_Tests.cpp: In member function ‘virtual void Expression_Set_setEnumerateSetOfInts_Test::TestBody()’:
         [exec] /var/lib/jenkins/workspace/vdm2c-release/c/third_party/googletest/googletest/include/gtest/internal/gtest-internal.h:133:55: warning: converting ‘false’ to pointer type for argument 1 of ‘char testing::internal::IsNullLiteralHelper(testing::internal::Secret*)’ [-Wconversion-null]
         [exec]      (sizeof(::testing::internal::IsNullLiteralHelper(x)) == 1)
         [exec]                                                        ^
         [exec] /var/lib/jenkins/workspace/vdm2c-release/c/third_party/googletest/googletest/include/gtest/gtest_pred_impl.h:77:52: note: in definition of macro ‘GTEST_ASSERT_’
         [exec]    if (const ::testing::AssertionResult gtest_ar = (expression)) \
         [exec]                                                     ^
         [exec] /var/lib/jenkins/workspace/vdm2c-release/c/third_party/googletest/googletest/include/gtest/gtest_pred_impl.h:162:3: note: in expansion of macro ‘GTEST_PRED_FORMAT2_’
         [exec]    GTEST_PRED_FORMAT2_(pred_format, v1, v2, GTEST_NONFATAL_FAILURE_)
         [exec]    ^
         [exec] /var/lib/jenkins/workspace/vdm2c-release/c/third_party/googletest/googletest/include/gtest/gtest.h:1923:3: note: in expansion of macro ‘EXPECT_PRED_FORMAT2’
         [exec]    EXPECT_PRED_FORMAT2(::testing::internal:: \
         [exec]    ^
         [exec] /var/lib/jenkins/workspace/vdm2c-release/c/third_party/googletest/googletest/include/gtest/gtest.h:1924:32: note: in expansion of macro ‘GTEST_IS_NULL_LITERAL_’
         [exec]                        EqHelper<GTEST_IS_NULL_LITERAL_(val1)>::Compare, \
         [exec]                                 ^
         [exec] /var/lib/jenkins/workspace/vdm2c-release/c/vdmclib/src/test/ExpressionsSet_Tests.cpp:159:2: note: in expansion of macro ‘EXPECT_EQ’
         [exec]   EXPECT_EQ(false, res->value.boolVal);
         [exec]   ^
         [exec] /var/lib/jenkins/workspace/vdm2c-release/c/vdmclib/src/test/ExpressionsSet_Tests.cpp: In member function ‘virtual void Expression_Set_setNotInSet_Test::TestBody()’:
         [exec] /var/lib/jenkins/workspace/vdm2c-release/c/third_party/googletest/googletest/include/gtest/internal/gtest-internal.h:133:55: warning: converting ‘false’ to pointer type for argument 1 of ‘char testing::internal::IsNullLiteralHelper(testing::internal::Secret*)’ [-Wconversion-null]
         [exec]      (sizeof(::testing::internal::IsNullLiteralHelper(x)) == 1)
         [exec]                                                        ^
         [exec] /var/lib/jenkins/workspace/vdm2c-release/c/third_party/googletest/googletest/include/gtest/gtest_pred_impl.h:77:52: note: in definition of macro ‘GTEST_ASSERT_’
         [exec]    if (const ::testing::AssertionResult gtest_ar = (expression)) \
         [exec]                                                     ^
         [exec] /var/lib/jenkins/workspace/vdm2c-release/c/third_party/googletest/googletest/include/gtest/gtest_pred_impl.h:162:3: note: in expansion of macro ‘GTEST_PRED_FORMAT2_’
         [exec]    GTEST_PRED_FORMAT2_(pred_format, v1, v2, GTEST_NONFATAL_FAILURE_)
         [exec]    ^
         [exec] /var/lib/jenkins/workspace/vdm2c-release/c/third_party/googletest/googletest/include/gtest/gtest.h:1923:3: note: in expansion of macro ‘EXPECT_PRED_FORMAT2’
         [exec]    EXPECT_PRED_FORMAT2(::testing::internal:: \
         [exec]    ^
         [exec] /var/lib/jenkins/workspace/vdm2c-release/c/third_party/googletest/googletest/include/gtest/gtest.h:1924:32: note: in expansion of macro ‘GTEST_IS_NULL_LITERAL_’
         [exec]                        EqHelper<GTEST_IS_NULL_LITERAL_(val1)>::Compare, \
         [exec]                                 ^
         [exec] /var/lib/jenkins/workspace/vdm2c-release/c/vdmclib/src/test/ExpressionsSet_Tests.cpp:321:2: note: in expansion of macro ‘EXPECT_EQ’
         [exec]   EXPECT_EQ(false, res->value.boolVal);
         [exec]   ^
         [exec] /var/lib/jenkins/workspace/vdm2c-release/c/third_party/googletest/googletest/include/gtest/internal/gtest-internal.h:133:55: warning: converting ‘false’ to pointer type for argument 1 of ‘char testing::internal::IsNullLiteralHelper(testing::internal::Secret*)’ [-Wconversion-null]
         [exec]      (sizeof(::testing::internal::IsNullLiteralHelper(x)) == 1)
         [exec]                                                        ^
         [exec] /var/lib/jenkins/workspace/vdm2c-release/c/third_party/googletest/googletest/include/gtest/gtest_pred_impl.h:77:52: note: in definition of macro ‘GTEST_ASSERT_’
         [exec]    if (const ::testing::AssertionResult gtest_ar = (expression)) \
         [exec]                                                     ^
         [exec] /var/lib/jenkins/workspace/vdm2c-release/c/third_party/googletest/googletest/include/gtest/gtest_pred_impl.h:162:3: note: in expansion of macro ‘GTEST_PRED_FORMAT2_’
         [exec]    GTEST_PRED_FORMAT2_(pred_format, v1, v2, GTEST_NONFATAL_FAILURE_)
         [exec]    ^
         [exec] /var/lib/jenkins/workspace/vdm2c-release/c/third_party/googletest/googletest/include/gtest/gtest.h:1923:3: note: in expansion of macro ‘EXPECT_PRED_FORMAT2’
         [exec]    EXPECT_PRED_FORMAT2(::testing::internal:: \
         [exec]    ^
         [exec] /var/lib/jenkins/workspace/vdm2c-release/c/third_party/googletest/googletest/include/gtest/gtest.h:1924:32: note: in expansion of macro ‘GTEST_IS_NULL_LITERAL_’
         [exec]                        EqHelper<GTEST_IS_NULL_LITERAL_(val1)>::Compare, \
         [exec]                                 ^
         [exec] /var/lib/jenkins/workspace/vdm2c-release/c/vdmclib/src/test/ExpressionsSet_Tests.cpp:347:3: note: in expansion of macro ‘EXPECT_EQ’
         [exec]    EXPECT_EQ(false, res->value.boolVal);
         [exec]    ^
         [exec] /var/lib/jenkins/workspace/vdm2c-release/c/vdmclib/src/test/ExpressionsSet_Tests.cpp: In member function ‘virtual void Expression_Set_setSubset_Test::TestBody()’:
         [exec] /var/lib/jenkins/workspace/vdm2c-release/c/third_party/googletest/googletest/include/gtest/internal/gtest-internal.h:133:55: warning: converting ‘false’ to pointer type for argument 1 of ‘char testing::internal::IsNullLiteralHelper(testing::internal::Secret*)’ [-Wconversion-null]
         [exec]      (sizeof(::testing::internal::IsNullLiteralHelper(x)) == 1)
         [exec]                                                        ^
         [exec] /var/lib/jenkins/workspace/vdm2c-release/c/third_party/googletest/googletest/include/gtest/gtest_pred_impl.h:77:52: note: in definition of macro ‘GTEST_ASSERT_’
         [exec]    if (const ::testing::AssertionResult gtest_ar = (expression)) \
         [exec]                                                     ^
         [exec] /var/lib/jenkins/workspace/vdm2c-release/c/third_party/googletest/googletest/include/gtest/gtest_pred_impl.h:162:3: note: in expansion of macro ‘GTEST_PRED_FORMAT2_’
         [exec]    GTEST_PRED_FORMAT2_(pred_format, v1, v2, GTEST_NONFATAL_FAILURE_)
         [exec]    ^
         [exec] /var/lib/jenkins/workspace/vdm2c-release/c/third_party/googletest/googletest/include/gtest/gtest.h:1923:3: note: in expansion of macro ‘EXPECT_PRED_FORMAT2’
         [exec]    EXPECT_PRED_FORMAT2(::testing::internal:: \
         [exec]    ^
         [exec] /var/lib/jenkins/workspace/vdm2c-release/c/third_party/googletest/googletest/include/gtest/gtest.h:1924:32: note: in expansion of macro ‘GTEST_IS_NULL_LITERAL_’
         [exec]                        EqHelper<GTEST_IS_NULL_LITERAL_(val1)>::Compare, \
         [exec]                                 ^
         [exec] /var/lib/jenkins/workspace/vdm2c-release/c/vdmclib/src/test/ExpressionsSet_Tests.cpp:576:2: note: in expansion of macro ‘EXPECT_EQ’
         [exec]   EXPECT_EQ(false, res->value.boolVal);
         [exec]   ^
         [exec] /var/lib/jenkins/workspace/vdm2c-release/c/vdmclib/src/test/ExpressionsSet_Tests.cpp: In member function ‘virtual void Expression_Set_setProperSubset_Test::TestBody()’:
         [exec] /var/lib/jenkins/workspace/vdm2c-release/c/third_party/googletest/googletest/include/gtest/internal/gtest-internal.h:133:55: warning: converting ‘false’ to pointer type for argument 1 of ‘char testing::internal::IsNullLiteralHelper(testing::internal::Secret*)’ [-Wconversion-null]
         [exec]      (sizeof(::testing::internal::IsNullLiteralHelper(x)) == 1)
         [exec]                                                        ^
         [exec] /var/lib/jenkins/workspace/vdm2c-release/c/third_party/googletest/googletest/include/gtest/gtest_pred_impl.h:77:52: note: in definition of macro ‘GTEST_ASSERT_’
         [exec]    if (const ::testing::AssertionResult gtest_ar = (expression)) \
         [exec]                                                     ^
         [exec] /var/lib/jenkins/workspace/vdm2c-release/c/third_party/googletest/googletest/include/gtest/gtest_pred_impl.h:162:3: note: in expansion of macro ‘GTEST_PRED_FORMAT2_’
         [exec]    GTEST_PRED_FORMAT2_(pred_format, v1, v2, GTEST_NONFATAL_FAILURE_)
         [exec]    ^
         [exec] /var/lib/jenkins/workspace/vdm2c-release/c/third_party/googletest/googletest/include/gtest/gtest.h:1923:3: note: in expansion of macro ‘EXPECT_PRED_FORMAT2’
         [exec]    EXPECT_PRED_FORMAT2(::testing::internal:: \
         [exec]    ^
         [exec] /var/lib/jenkins/workspace/vdm2c-release/c/third_party/googletest/googletest/include/gtest/gtest.h:1924:32: note: in expansion of macro ‘GTEST_IS_NULL_LITERAL_’
         [exec]                        EqHelper<GTEST_IS_NULL_LITERAL_(val1)>::Compare, \
         [exec]                                 ^
         [exec] /var/lib/jenkins/workspace/vdm2c-release/c/vdmclib/src/test/ExpressionsSet_Tests.cpp:609:2: note: in expansion of macro ‘EXPECT_EQ’
         [exec]   EXPECT_EQ(false, res->value.boolVal);
         [exec]   ^
         [exec] /var/lib/jenkins/workspace/vdm2c-release/c/third_party/googletest/googletest/include/gtest/internal/gtest-internal.h:133:55: warning: converting ‘false’ to pointer type for argument 1 of ‘char testing::internal::IsNullLiteralHelper(testing::internal::Secret*)’ [-Wconversion-null]
         [exec]      (sizeof(::testing::internal::IsNullLiteralHelper(x)) == 1)
         [exec]                                                        ^
         [exec] /var/lib/jenkins/workspace/vdm2c-release/c/third_party/googletest/googletest/include/gtest/gtest_pred_impl.h:77:52: note: in definition of macro ‘GTEST_ASSERT_’
         [exec]    if (const ::testing::AssertionResult gtest_ar = (expression)) \
         [exec]                                                     ^
         [exec] /var/lib/jenkins/workspace/vdm2c-release/c/third_party/googletest/googletest/include/gtest/gtest_pred_impl.h:162:3: note: in expansion of macro ‘GTEST_PRED_FORMAT2_’
         [exec]    GTEST_PRED_FORMAT2_(pred_format, v1, v2, GTEST_NONFATAL_FAILURE_)
         [exec]    ^
         [exec] /var/lib/jenkins/workspace/vdm2c-release/c/third_party/googletest/googletest/include/gtest/gtest.h:1923:3: note: in expansion of macro ‘EXPECT_PRED_FORMAT2’
         [exec]    EXPECT_PRED_FORMAT2(::testing::internal:: \
         [exec]    ^
         [exec] /var/lib/jenkins/workspace/vdm2c-release/c/third_party/googletest/googletest/include/gtest/gtest.h:1924:32: note: in expansion of macro ‘GTEST_IS_NULL_LITERAL_’
         [exec]                        EqHelper<GTEST_IS_NULL_LITERAL_(val1)>::Compare, \
         [exec]                                 ^
         [exec] /var/lib/jenkins/workspace/vdm2c-release/c/vdmclib/src/test/ExpressionsSet_Tests.cpp:626:2: note: in expansion of macro ‘EXPECT_EQ’
         [exec]   EXPECT_EQ(false, res->value.boolVal);
         [exec]   ^
         [exec] /var/lib/jenkins/workspace/vdm2c-release/c/vdmclib/src/test/ExpressionsSet_Tests.cpp: In member function ‘virtual void Expression_Set_setEquality_Test::TestBody()’:
         [exec] /var/lib/jenkins/workspace/vdm2c-release/c/third_party/googletest/googletest/include/gtest/internal/gtest-internal.h:133:55: warning: converting ‘false’ to pointer type for argument 1 of ‘char testing::internal::IsNullLiteralHelper(testing::internal::Secret*)’ [-Wconversion-null]
         [exec]      (sizeof(::testing::internal::IsNullLiteralHelper(x)) == 1)
         [exec]                                                        ^
         [exec] /var/lib/jenkins/workspace/vdm2c-release/c/third_party/googletest/googletest/include/gtest/gtest_pred_impl.h:77:52: note: in definition of macro ‘GTEST_ASSERT_’
         [exec]    if (const ::testing::AssertionResult gtest_ar = (expression)) \
         [exec]                                                     ^
         [exec] /var/lib/jenkins/workspace/vdm2c-release/c/third_party/googletest/googletest/include/gtest/gtest_pred_impl.h:162:3: note: in expansion of macro ‘GTEST_PRED_FORMAT2_’
         [exec]    GTEST_PRED_FORMAT2_(pred_format, v1, v2, GTEST_NONFATAL_FAILURE_)
         [exec]    ^
         [exec] /var/lib/jenkins/workspace/vdm2c-release/c/third_party/googletest/googletest/include/gtest/gtest.h:1923:3: note: in expansion of macro ‘EXPECT_PRED_FORMAT2’
         [exec]    EXPECT_PRED_FORMAT2(::testing::internal:: \
         [exec]    ^
         [exec] /var/lib/jenkins/workspace/vdm2c-release/c/third_party/googletest/googletest/include/gtest/gtest.h:1924:32: note: in expansion of macro ‘GTEST_IS_NULL_LITERAL_’
         [exec]                        EqHelper<GTEST_IS_NULL_LITERAL_(val1)>::Compare, \
         [exec]                                 ^
         [exec] /var/lib/jenkins/workspace/vdm2c-release/c/vdmclib/src/test/ExpressionsSet_Tests.cpp:669:2: note: in expansion of macro ‘EXPECT_EQ’
         [exec]   EXPECT_EQ(false, res->value.boolVal);
         [exec]   ^
         [exec] /var/lib/jenkins/workspace/vdm2c-release/c/vdmclib/src/test/ExpressionsSet_Tests.cpp: In member function ‘virtual void Expression_Set_setInequality_Test::TestBody()’:
         [exec] /var/lib/jenkins/workspace/vdm2c-release/c/third_party/googletest/googletest/include/gtest/internal/gtest-internal.h:133:55: warning: converting ‘false’ to pointer type for argument 1 of ‘char testing::internal::IsNullLiteralHelper(testing::internal::Secret*)’ [-Wconversion-null]
         [exec]      (sizeof(::testing::internal::IsNullLiteralHelper(x)) == 1)
         [exec]                                                        ^
         [exec] /var/lib/jenkins/workspace/vdm2c-release/c/third_party/googletest/googletest/include/gtest/gtest_pred_impl.h:77:52: note: in definition of macro ‘GTEST_ASSERT_’
         [exec]    if (const ::testing::AssertionResult gtest_ar = (expression)) \
         [exec]                                                     ^
         [exec] /var/lib/jenkins/workspace/vdm2c-release/c/third_party/googletest/googletest/include/gtest/gtest_pred_impl.h:162:3: note: in expansion of macro ‘GTEST_PRED_FORMAT2_’
         [exec]    GTEST_PRED_FORMAT2_(pred_format, v1, v2, GTEST_NONFATAL_FAILURE_)
         [exec]    ^
         [exec] /var/lib/jenkins/workspace/vdm2c-release/c/third_party/googletest/googletest/include/gtest/gtest.h:1923:3: note: in expansion of macro ‘EXPECT_PRED_FORMAT2’
         [exec]    EXPECT_PRED_FORMAT2(::testing::internal:: \
         [exec]    ^
         [exec] /var/lib/jenkins/workspace/vdm2c-release/c/third_party/googletest/googletest/include/gtest/gtest.h:1924:32: note: in expansion of macro ‘GTEST_IS_NULL_LITERAL_’
         [exec]                        EqHelper<GTEST_IS_NULL_LITERAL_(val1)>::Compare, \
         [exec]                                 ^
         [exec] /var/lib/jenkins/workspace/vdm2c-release/c/vdmclib/src/test/ExpressionsSet_Tests.cpp:703:2: note: in expansion of macro ‘EXPECT_EQ’
         [exec]   EXPECT_EQ(false, res->value.boolVal);
         [exec]   ^
         [exec] /var/lib/jenkins/workspace/vdm2c-release/c/vdmclib/src/test/ExpressionsSet_Tests.cpp: In member function ‘virtual void Expression_Set_setDinter_Test::TestBody()’:
         [exec] /var/lib/jenkins/workspace/vdm2c-release/c/third_party/googletest/googletest/include/gtest/internal/gtest-internal.h:133:55: warning: converting ‘false’ to pointer type for argument 1 of ‘char testing::internal::IsNullLiteralHelper(testing::internal::Secret*)’ [-Wconversion-null]
         [exec]      (sizeof(::testing::internal::IsNullLiteralHelper(x)) == 1)
         [exec]                                                        ^
         [exec] /var/lib/jenkins/workspace/vdm2c-release/c/third_party/googletest/googletest/include/gtest/gtest_pred_impl.h:77:52: note: in definition of macro ‘GTEST_ASSERT_’
         [exec]    if (const ::testing::AssertionResult gtest_ar = (expression)) \
         [exec]                                                     ^
         [exec] /var/lib/jenkins/workspace/vdm2c-release/c/third_party/googletest/googletest/include/gtest/gtest_pred_impl.h:162:3: note: in expansion of macro ‘GTEST_PRED_FORMAT2_’
         [exec]    GTEST_PRED_FORMAT2_(pred_format, v1, v2, GTEST_NONFATAL_FAILURE_)
         [exec]    ^
         [exec] /var/lib/jenkins/workspace/vdm2c-release/c/third_party/googletest/googletest/include/gtest/gtest.h:1923:3: note: in expansion of macro ‘EXPECT_PRED_FORMAT2’
         [exec]    EXPECT_PRED_FORMAT2(::testing::internal:: \
         [exec]    ^
         [exec] /var/lib/jenkins/workspace/vdm2c-release/c/third_party/googletest/googletest/include/gtest/gtest.h:1924:32: note: in expansion of macro ‘GTEST_IS_NULL_LITERAL_’
         [exec]                        EqHelper<GTEST_IS_NULL_LITERAL_(val1)>::Compare, \
         [exec]                                 ^
         [exec] /var/lib/jenkins/workspace/vdm2c-release/c/vdmclib/src/test/ExpressionsSet_Tests.cpp:867:2: note: in expansion of macro ‘EXPECT_EQ’
         [exec]   EXPECT_EQ(false, res->value.boolVal);
         [exec]   ^
         [exec] /var/lib/jenkins/workspace/vdm2c-release/c/vdmclib/src/test/ExpressionsSet_Tests.cpp: In member function ‘virtual void Expression_Set_setPower_Test::TestBody()’:
         [exec] /var/lib/jenkins/workspace/vdm2c-release/c/third_party/googletest/googletest/include/gtest/internal/gtest-internal.h:133:55: warning: converting ‘false’ to pointer type for argument 1 of ‘char testing::internal::IsNullLiteralHelper(testing::internal::Secret*)’ [-Wconversion-null]
         [exec]      (sizeof(::testing::internal::IsNullLiteralHelper(x)) == 1)
         [exec]                                                        ^
         [exec] /var/lib/jenkins/workspace/vdm2c-release/c/third_party/googletest/googletest/include/gtest/gtest_pred_impl.h:77:52: note: in definition of macro ‘GTEST_ASSERT_’
         [exec]    if (const ::testing::AssertionResult gtest_ar = (expression)) \
         [exec]                                                     ^
         [exec] /var/lib/jenkins/workspace/vdm2c-release/c/third_party/googletest/googletest/include/gtest/gtest_pred_impl.h:162:3: note: in expansion of macro ‘GTEST_PRED_FORMAT2_’
         [exec]    GTEST_PRED_FORMAT2_(pred_format, v1, v2, GTEST_NONFATAL_FAILURE_)
         [exec]    ^
         [exec] /var/lib/jenkins/workspace/vdm2c-release/c/third_party/googletest/googletest/include/gtest/gtest.h:1923:3: note: in expansion of macro ‘EXPECT_PRED_FORMAT2’
         [exec]    EXPECT_PRED_FORMAT2(::testing::internal:: \
         [exec]    ^
         [exec] /var/lib/jenkins/workspace/vdm2c-release/c/third_party/googletest/googletest/include/gtest/gtest.h:1924:32: note: in expansion of macro ‘GTEST_IS_NULL_LITERAL_’
         [exec]                        EqHelper<GTEST_IS_NULL_LITERAL_(val1)>::Compare, \
         [exec]                                 ^
         [exec] /var/lib/jenkins/workspace/vdm2c-release/c/vdmclib/src/test/ExpressionsSet_Tests.cpp:891:2: note: in expansion of macro ‘EXPECT_EQ’
         [exec]   EXPECT_EQ(false, col->size == pow(2, 5));
         [exec]   ^
         [exec] /var/lib/jenkins/workspace/vdm2c-release/c/third_party/googletest/googletest/include/gtest/internal/gtest-internal.h:133:55: warning: converting ‘false’ to pointer type for argument 1 of ‘char testing::internal::IsNullLiteralHelper(testing::internal::Secret*)’ [-Wconversion-null]
         [exec]      (sizeof(::testing::internal::IsNullLiteralHelper(x)) == 1)
         [exec]                                                        ^
         [exec] /var/lib/jenkins/workspace/vdm2c-release/c/third_party/googletest/googletest/include/gtest/gtest_pred_impl.h:77:52: note: in definition of macro ‘GTEST_ASSERT_’
         [exec]    if (const ::testing::AssertionResult gtest_ar = (expression)) \
         [exec]                                                     ^
         [exec] /var/lib/jenkins/workspace/vdm2c-release/c/third_party/googletest/googletest/include/gtest/gtest_pred_impl.h:162:3: note: in expansion of macro ‘GTEST_PRED_FORMAT2_’
         [exec]    GTEST_PRED_FORMAT2_(pred_format, v1, v2, GTEST_NONFATAL_FAILURE_)
         [exec]    ^
         [exec] /var/lib/jenkins/workspace/vdm2c-release/c/third_party/googletest/googletest/include/gtest/gtest.h:1923:3: note: in expansion of macro ‘EXPECT_PRED_FORMAT2’
         [exec]    EXPECT_PRED_FORMAT2(::testing::internal:: \
         [exec]    ^
         [exec] /var/lib/jenkins/workspace/vdm2c-release/c/third_party/googletest/googletest/include/gtest/gtest.h:1924:32: note: in expansion of macro ‘GTEST_IS_NULL_LITERAL_’
         [exec]                        EqHelper<GTEST_IS_NULL_LITERAL_(val1)>::Compare, \
         [exec]                                 ^
         [exec] /var/lib/jenkins/workspace/vdm2c-release/c/vdmclib/src/test/ExpressionsSet_Tests.cpp:924:2: note: in expansion of macro ‘EXPECT_EQ’
         [exec]   EXPECT_EQ(false, res->value.boolVal);
         [exec]   ^
         [exec] Building CXX object vdmclib/CMakeFiles/vdmclib.dir/src/test/ClassCTest.cpp.o
         [exec] cd /var/lib/jenkins/workspace/vdm2c-release/c/vdmclib && /usr/bin/c++    -std=c++11 -fmessage-length=0 -I/var/lib/jenkins/workspace/vdm2c-release/c/vdmclib -I/var/lib/jenkins/workspace/vdm2c-release/c/vdmclib/src/main -I/var/lib/jenkins/workspace/vdm2c-release/c/vdmclib/src/main/classes -I/var/lib/jenkins/workspace/vdm2c-release/c/third_party/googletest/googletest/include -I/usr/include/glib-2.0 -I/usr/lib/x86_64-linux-gnu/glib-2.0/include    -o CMakeFiles/vdmclib.dir/src/test/ClassCTest.cpp.o -c /var/lib/jenkins/workspace/vdm2c-release/c/vdmclib/src/test/ClassCTest.cpp
         [exec] /usr/bin/cmake -E cmake_progress_report /var/lib/jenkins/workspace/vdm2c-release/c/CMakeFiles 35
         [exec] [ 87%] Building CXX object vdmclib/CMakeFiles/vdmclib.dir/src/test/ClassIO_Tests.cpp.o
         [exec] cd /var/lib/jenkins/workspace/vdm2c-release/c/vdmclib && /usr/bin/c++    -std=c++11 -fmessage-length=0 -I/var/lib/jenkins/workspace/vdm2c-release/c/vdmclib -I/var/lib/jenkins/workspace/vdm2c-release/c/vdmclib/src/main -I/var/lib/jenkins/workspace/vdm2c-release/c/vdmclib/src/main/classes -I/var/lib/jenkins/workspace/vdm2c-release/c/third_party/googletest/googletest/include -I/usr/include/glib-2.0 -I/usr/lib/x86_64-linux-gnu/glib-2.0/include    -o CMakeFiles/vdmclib.dir/src/test/ClassIO_Tests.cpp.o -c /var/lib/jenkins/workspace/vdm2c-release/c/vdmclib/src/test/ClassIO_Tests.cpp
         [exec] /usr/bin/cmake -E cmake_progress_report /var/lib/jenkins/workspace/vdm2c-release/c/CMakeFiles 36
         [exec] [ 90%] Building CXX object vdmclib/CMakeFiles/vdmclib.dir/src/test/ExpressionsProduct_Tests.cpp.o
         [exec] cd /var/lib/jenkins/workspace/vdm2c-release/c/vdmclib && /usr/bin/c++    -std=c++11 -fmessage-length=0 -I/var/lib/jenkins/workspace/vdm2c-release/c/vdmclib -I/var/lib/jenkins/workspace/vdm2c-release/c/vdmclib/src/main -I/var/lib/jenkins/workspace/vdm2c-release/c/vdmclib/src/main/classes -I/var/lib/jenkins/workspace/vdm2c-release/c/third_party/googletest/googletest/include -I/usr/include/glib-2.0 -I/usr/lib/x86_64-linux-gnu/glib-2.0/include    -o CMakeFiles/vdmclib.dir/src/test/ExpressionsProduct_Tests.cpp.o -c /var/lib/jenkins/workspace/vdm2c-release/c/vdmclib/src/test/ExpressionsProduct_Tests.cpp
         [exec] /usr/bin/cmake -E cmake_progress_report /var/lib/jenkins/workspace/vdm2c-release/c/CMakeFiles 37
         [exec] [ 92%] Building CXX object vdmclib/CMakeFiles/vdmclib.dir/src/test/TypeofTest_Tests.cpp.o
         [exec] cd /var/lib/jenkins/workspace/vdm2c-release/c/vdmclib && /usr/bin/c++    -std=c++11 -fmessage-length=0 -I/var/lib/jenkins/workspace/vdm2c-release/c/vdmclib -I/var/lib/jenkins/workspace/vdm2c-release/c/vdmclib/src/main -I/var/lib/jenkins/workspace/vdm2c-release/c/vdmclib/src/main/classes -I/var/lib/jenkins/workspace/vdm2c-release/c/third_party/googletest/googletest/include -I/usr/include/glib-2.0 -I/usr/lib/x86_64-linux-gnu/glib-2.0/include    -o CMakeFiles/vdmclib.dir/src/test/TypeofTest_Tests.cpp.o -c /var/lib/jenkins/workspace/vdm2c-release/c/vdmclib/src/test/TypeofTest_Tests.cpp
         [exec] /usr/bin/cmake -E cmake_progress_report /var/lib/jenkins/workspace/vdm2c-release/c/CMakeFiles 38
         [exec] [ 95%] Building CXX object vdmclib/CMakeFiles/vdmclib.dir/src/test/ExpressionForLoop.cpp.o
         [exec] cd /var/lib/jenkins/workspace/vdm2c-release/c/vdmclib && /usr/bin/c++    -std=c++11 -fmessage-length=0 -I/var/lib/jenkins/workspace/vdm2c-release/c/vdmclib -I/var/lib/jenkins/workspace/vdm2c-release/c/vdmclib/src/main -I/var/lib/jenkins/workspace/vdm2c-release/c/vdmclib/src/main/classes -I/var/lib/jenkins/workspace/vdm2c-release/c/third_party/googletest/googletest/include -I/usr/include/glib-2.0 -I/usr/lib/x86_64-linux-gnu/glib-2.0/include    -o CMakeFiles/vdmclib.dir/src/test/ExpressionForLoop.cpp.o -c /var/lib/jenkins/workspace/vdm2c-release/c/vdmclib/src/test/ExpressionForLoop.cpp
         [exec] /usr/bin/cmake -E cmake_progress_report /var/lib/jenkins/workspace/vdm2c-release/c/CMakeFiles 39
         [exec] [ 97%] Building CXX object vdmclib/CMakeFiles/vdmclib.dir/src/test/Expressions_Tests.cpp.o
         [exec] cd /var/lib/jenkins/workspace/vdm2c-release/c/vdmclib && /usr/bin/c++    -std=c++11 -fmessage-length=0 -I/var/lib/jenkins/workspace/vdm2c-release/c/vdmclib -I/var/lib/jenkins/workspace/vdm2c-release/c/vdmclib/src/main -I/var/lib/jenkins/workspace/vdm2c-release/c/vdmclib/src/main/classes -I/var/lib/jenkins/workspace/vdm2c-release/c/third_party/googletest/googletest/include -I/usr/include/glib-2.0 -I/usr/lib/x86_64-linux-gnu/glib-2.0/include    -o CMakeFiles/vdmclib.dir/src/test/Expressions_Tests.cpp.o -c /var/lib/jenkins/workspace/vdm2c-release/c/vdmclib/src/test/Expressions_Tests.cpp
         [exec] /usr/bin/cmake -E cmake_progress_report /var/lib/jenkins/workspace/vdm2c-release/c/CMakeFiles 40
         [exec] [100%] Building CXX object vdmclib/CMakeFiles/vdmclib.dir/src/test/PrettyPrint_Tests.cpp.o
         [exec] cd /var/lib/jenkins/workspace/vdm2c-release/c/vdmclib && /usr/bin/c++    -std=c++11 -fmessage-length=0 -I/var/lib/jenkins/workspace/vdm2c-release/c/vdmclib -I/var/lib/jenkins/workspace/vdm2c-release/c/vdmclib/src/main -I/var/lib/jenkins/workspace/vdm2c-release/c/vdmclib/src/main/classes -I/var/lib/jenkins/workspace/vdm2c-release/c/third_party/googletest/googletest/include -I/usr/include/glib-2.0 -I/usr/lib/x86_64-linux-gnu/glib-2.0/include    -o CMakeFiles/vdmclib.dir/src/test/PrettyPrint_Tests.cpp.o -c /var/lib/jenkins/workspace/vdm2c-release/c/vdmclib/src/test/PrettyPrint_Tests.cpp
         [exec] Linking CXX executable target/vdmclib
         [exec] cd /var/lib/jenkins/workspace/vdm2c-release/c/vdmclib && /usr/bin/cmake -E cmake_link_script CMakeFiles/vdmclib.dir/link.txt --verbose=1
         [exec] /usr/bin/c++    -std=c++11 -fmessage-length=0    CMakeFiles/vdmclib.dir/src/main/VdmSet.c.o CMakeFiles/vdmclib.dir/src/main/VdmClass.c.o CMakeFiles/vdmclib.dir/src/main/VdmProduct.c.o CMakeFiles/vdmclib.dir/src/main/PatternBindMatch.c.o CMakeFiles/vdmclib.dir/src/main/VdmMap.c.o CMakeFiles/vdmclib.dir/src/main/PrettyPrint.c.o CMakeFiles/vdmclib.dir/src/main/VdmBasicTypes.c.o CMakeFiles/vdmclib.dir/src/main/MATHLib.c.o CMakeFiles/vdmclib.dir/src/main/IOLib.c.o CMakeFiles/vdmclib.dir/src/main/TypedValue.c.o CMakeFiles/vdmclib.dir/src/main/VdmSeq.c.o CMakeFiles/vdmclib.dir/src/test/classes/B.c.o CMakeFiles/vdmclib.dir/src/test/classes/A.c.o CMakeFiles/vdmclib.dir/src/test/classes/C.c.o CMakeFiles/vdmclib.dir/src/test/records/R1.c.o CMakeFiles/vdmclib.dir/src/test/typeoftest.c.o CMakeFiles/vdmclib.dir/src/test/ClassPrivateCallABC_Tests.cpp.o CMakeFiles/vdmclib.dir/src/test/HashTable_Tests.cpp.o CMakeFiles/vdmclib.dir/src/test/ClassPrivateFieldABC_Tests.cpp.o CMakeFiles/vdmclib.dir/src/test/ClassBTest.cpp.o CMakeFiles/vdmclib.dir/src/test/ExpressionsSetRandom_Tests.cpp.o CMakeFiles/vdmclib.dir/src/test/StructOffsetTest_Tests.cpp.o CMakeFiles/vdmclib.dir/src/test/ExpressionsSeq_Tests.cpp.o CMakeFiles/vdmclib.dir/src/test/Statements_Record_Tests.cpp.o CMakeFiles/vdmclib.dir/src/test/ExpressionsMap_Tests.cpp.o CMakeFiles/vdmclib.dir/src/test/ClassPublicFieldABC_Tests.cpp.o CMakeFiles/vdmclib.dir/src/test/ExpressionsBoolean_Tests.cpp.o CMakeFiles/vdmclib.dir/src/test/ClassPublicCallABC_Tests.cpp.o CMakeFiles/vdmclib.dir/src/test/ExpressionsSet_Tests.cpp.o CMakeFiles/vdmclib.dir/src/test/ClassATest.cpp.o CMakeFiles/vdmclib.dir/src/test/ExpressionsNumeric_Tests.cpp.o CMakeFiles/vdmclib.dir/src/test/ClassCTest.cpp.o CMakeFiles/vdmclib.dir/src/test/ClassIO_Tests.cpp.o CMakeFiles/vdmclib.dir/src/test/ExpressionsProduct_Tests.cpp.o CMakeFiles/vdmclib.dir/src/test/TypeofTest_Tests.cpp.o CMakeFiles/vdmclib.dir/src/test/ExpressionForLoop.cpp.o CMakeFiles/vdmclib.dir/src/test/Expressions_Tests.cpp.o CMakeFiles/vdmclib.dir/src/test/PrettyPrint_Tests.cpp.o  -o target/vdmclib -rdynamic ../third_party/googletest/googletest/libgtest_main.a -lglib-2.0 ../third_party/googletest/googletest/libgtest.a -lpthread 
         [exec] make[2]: Leaving directory `/var/lib/jenkins/workspace/vdm2c-release/c'
         [exec] /usr/bin/cmake -E cmake_progress_report /var/lib/jenkins/workspace/vdm2c-release/c/CMakeFiles  3 4 5 6 7 8 9 10 11 12 13 14 15 16 17 18 19 20 21 22 23 24 25 26 27 28 29 30 31 32 33 34 35 36 37 38 39 40
         [exec] [100%] Built target vdmclib
         [exec] make[1]: Leaving directory `/var/lib/jenkins/workspace/vdm2c-release/c'
         [exec] /usr/bin/cmake -E cmake_progress_start /var/lib/jenkins/workspace/vdm2c-release/c/CMakeFiles 0
         [exec] Running tests...
         [exec] /usr/bin/ctest --force-new-ctest-process 
         [exec] Test project /var/lib/jenkins/workspace/vdm2c-release/c/vdmclib
         [exec]     Start 1: vdmclib-tests
         [exec] 1/1 Test #1: vdmclib-tests ....................   Passed    0.04 sec
         [exec] 
         [exec] 100% tests passed, 0 tests failed out of 1
         [exec] 
         [exec] Total Test time (real) =   0.04 sec
    [INFO] Executed tasks
    [INFO] 
    [INFO] --- maven-jar-plugin:2.4:jar (default-jar) @ vdmclib ---
    Downloading: http://overture.au.dk/artifactory/remote-repos/org/apache/maven/maven-archiver/2.5/maven-archiver-2.5.pom
    Downloaded: http://overture.au.dk/artifactory/remote-repos/org/apache/maven/maven-archiver/2.5/maven-archiver-2.5.pom (5 KB at 192.7 KB/sec)
    Downloading: http://overture.au.dk/artifactory/remote-repos/org/codehaus/plexus/plexus-archiver/2.1/plexus-archiver-2.1.pom
    Downloaded: http://overture.au.dk/artifactory/remote-repos/org/codehaus/plexus/plexus-archiver/2.1/plexus-archiver-2.1.pom (3 KB at 101.6 KB/sec)
    Downloading: http://overture.au.dk/artifactory/remote-repos/org/codehaus/plexus/plexus-io/2.0.2/plexus-io-2.0.2.pom
    Downloaded: http://overture.au.dk/artifactory/remote-repos/org/codehaus/plexus/plexus-io/2.0.2/plexus-io-2.0.2.pom (2 KB at 94.0 KB/sec)
    Downloading: http://overture.au.dk/artifactory/remote-repos/org/codehaus/plexus/plexus-components/1.1.19/plexus-components-1.1.19.pom
    Downloaded: http://overture.au.dk/artifactory/remote-repos/org/codehaus/plexus/plexus-components/1.1.19/plexus-components-1.1.19.pom (3 KB at 164.7 KB/sec)
    Downloading: http://overture.au.dk/artifactory/remote-repos/org/codehaus/plexus/plexus/3.0.1/plexus-3.0.1.pom
    Downloaded: http://overture.au.dk/artifactory/remote-repos/org/codehaus/plexus/plexus/3.0.1/plexus-3.0.1.pom (19 KB at 908.9 KB/sec)
    Downloading: http://overture.au.dk/artifactory/remote-repos/org/codehaus/plexus/plexus-interpolation/1.15/plexus-interpolation-1.15.pom
    Downloaded: http://overture.au.dk/artifactory/remote-repos/org/codehaus/plexus/plexus-interpolation/1.15/plexus-interpolation-1.15.pom (1018 B at 36.8 KB/sec)
    Downloading: http://overture.au.dk/artifactory/remote-repos/org/apache/maven/maven-archiver/2.5/maven-archiver-2.5.jar
    Downloading: http://overture.au.dk/artifactory/remote-repos/org/codehaus/plexus/plexus-interpolation/1.15/plexus-interpolation-1.15.jar
    Downloading: http://overture.au.dk/artifactory/remote-repos/org/codehaus/plexus/plexus-archiver/2.1/plexus-archiver-2.1.jar
    Downloading: http://overture.au.dk/artifactory/remote-repos/commons-lang/commons-lang/2.1/commons-lang-2.1.jar
    Downloading: http://overture.au.dk/artifactory/remote-repos/org/codehaus/plexus/plexus-io/2.0.2/plexus-io-2.0.2.jar
    Downloaded: http://overture.au.dk/artifactory/remote-repos/org/apache/maven/maven-archiver/2.5/maven-archiver-2.5.jar (22 KB at 1014.4 KB/sec)
    Downloaded: http://overture.au.dk/artifactory/remote-repos/org/codehaus/plexus/plexus-interpolation/1.15/plexus-interpolation-1.15.jar (60 KB at 1373.4 KB/sec)
    Downloaded: http://overture.au.dk/artifactory/remote-repos/commons-lang/commons-lang/2.1/commons-lang-2.1.jar (203 KB at 4947.7 KB/sec)
    Downloaded: http://overture.au.dk/artifactory/remote-repos/org/codehaus/plexus/plexus-archiver/2.1/plexus-archiver-2.1.jar (181 KB at 4188.7 KB/sec)
    Downloaded: http://overture.au.dk/artifactory/remote-repos/org/codehaus/plexus/plexus-io/2.0.2/plexus-io-2.0.2.jar (57 KB at 1293.2 KB/sec)
    [INFO] Building jar: /var/lib/jenkins/workspace/vdm2c-release/c/vdmclib/target/vdmclib-0.0.6.jar
    [INFO] 
    [INFO] --- maven-source-plugin:2.1.2:jar-no-fork (attach-sources) @ vdmclib ---
    [INFO] Building jar: /var/lib/jenkins/workspace/vdm2c-release/c/vdmclib/target/vdmclib-0.0.6-sources.jar
    [INFO] 
    [INFO] --- maven-javadoc-plugin:2.7:jar (attach-javadocs) @ vdmclib ---
    [INFO] 
    [INFO] --- jacoco-maven-plugin:0.7.6.201602180812:report (jacoco-site) @ vdmclib ---
    [INFO] Skipping JaCoCo execution due to missing execution data file:/var/lib/jenkins/workspace/vdm2c-release/c/vdmclib/target/coverage-reports/jacoco-unit.exec
    [INFO] 
    [INFO] --- maven-gpg-plugin:1.1:sign (sign-artifacts) @ vdmclib ---
    [INFO]                                                                         
    [INFO] ------------------------------------------------------------------------
    [INFO] Building Core Tools for vdm2c 0.0.6
    [INFO] ------------------------------------------------------------------------
    Downloading: http://overture.au.dk/artifactory/remote-repos/junit/junit/4.11/junit-4.11.pom
    Downloaded: http://overture.au.dk/artifactory/remote-repos/junit/junit/4.11/junit-4.11.pom (3 KB at 95.4 KB/sec)
    Downloading: http://overture.au.dk/artifactory/remote-repos/junit/junit/4.11/junit-4.11.jar
    Downloaded: http://overture.au.dk/artifactory/remote-repos/junit/junit/4.11/junit-4.11.jar (240 KB at 7038.1 KB/sec)
    [INFO] 
    [INFO] --- maven-clean-plugin:2.5:clean (default-clean) @ core ---
    [INFO] 
    [INFO] --- maven-enforcer-plugin:1.0:enforce (enforce-maven) @ core ---
    [INFO] 
    [INFO] --- jacoco-maven-plugin:0.7.6.201602180812:prepare-agent (jacoco-initialize) @ core ---
    [INFO] argLine set to -javaagent:/var/lib/jenkins/workspace/vdm2c-release/repository/org/jacoco/org.jacoco.agent/0.7.6.201602180812/org.jacoco.agent-0.7.6.201602180812-runtime.jar=destfile=/var/lib/jenkins/workspace/vdm2c-release/core/target/coverage-reports/jacoco-unit.exec,excludes=org/overture/cgc/extast/analysis/**/*.*:org/overture/codegen/vdm2c/extast/expressions/**/*:org/overture/codegen/vdm2c/extast/declarations/**/*:org/overture/codegen/vdm2c/extast/statements/**/*:org/overture/cgc/extast/node/**/*:org/overture/codegen/vdm2c/ast/preview/**/*
    [INFO] 
    [INFO] --- maven-source-plugin:2.1.2:jar-no-fork (attach-sources) @ core ---
    [INFO] 
    [INFO] --- maven-javadoc-plugin:2.9:jar (attach-javadocs) @ core ---
    Downloading: http://overture.au.dk/artifactory/remote-repos/org/apache/maven/shared/maven-common-artifact-filters/1.3/maven-common-artifact-filters-1.3.pom
    Downloaded: http://overture.au.dk/artifactory/remote-repos/org/apache/maven/shared/maven-common-artifact-filters/1.3/maven-common-artifact-filters-1.3.pom (4 KB at 144.6 KB/sec)
    Downloading: http://overture.au.dk/artifactory/remote-repos/org/apache/maven/shared/maven-shared-components/12/maven-shared-components-12.pom
    Downloaded: http://overture.au.dk/artifactory/remote-repos/org/apache/maven/shared/maven-shared-components/12/maven-shared-components-12.pom (10 KB at 536.4 KB/sec)
    Downloading: http://overture.au.dk/artifactory/remote-repos/org/apache/maven/maven-parent/13/maven-parent-13.pom
    Downloaded: http://overture.au.dk/artifactory/remote-repos/org/apache/maven/maven-parent/13/maven-parent-13.pom (23 KB at 690.7 KB/sec)
    Downloading: http://overture.au.dk/artifactory/remote-repos/com/thoughtworks/qdox/qdox/1.12/qdox-1.12.pom
    Downloaded: http://overture.au.dk/artifactory/remote-repos/com/thoughtworks/qdox/qdox/1.12/qdox-1.12.pom (19 KB at 464.6 KB/sec)
    Downloading: http://overture.au.dk/artifactory/remote-repos/org/codehaus/plexus/plexus-archiver/2.1.2/plexus-archiver-2.1.2.pom
    Downloaded: http://overture.au.dk/artifactory/remote-repos/org/codehaus/plexus/plexus-archiver/2.1.2/plexus-archiver-2.1.2.pom (4 KB at 194.0 KB/sec)
    Downloading: http://overture.au.dk/artifactory/remote-repos/org/codehaus/plexus/plexus-utils/3.0.2/plexus-utils-3.0.2.pom
    Downloaded: http://overture.au.dk/artifactory/remote-repos/org/codehaus/plexus/plexus-utils/3.0.2/plexus-utils-3.0.2.pom (3 KB at 163.5 KB/sec)
    Downloading: http://overture.au.dk/artifactory/remote-repos/org/codehaus/plexus/plexus/3.1/plexus-3.1.pom
    Downloaded: http://overture.au.dk/artifactory/remote-repos/org/codehaus/plexus/plexus/3.1/plexus-3.1.pom (19 KB at 454.5 KB/sec)
    Downloading: http://overture.au.dk/artifactory/remote-repos/org/codehaus/plexus/plexus-io/2.0.4/plexus-io-2.0.4.pom
    Downloaded: http://overture.au.dk/artifactory/remote-repos/org/codehaus/plexus/plexus-io/2.0.4/plexus-io-2.0.4.pom (2 KB at 80.6 KB/sec)
    Downloading: http://overture.au.dk/artifactory/remote-repos/org/codehaus/plexus/plexus-utils/3.0.5/plexus-utils-3.0.5.pom
    Downloaded: http://overture.au.dk/artifactory/remote-repos/org/codehaus/plexus/plexus-utils/3.0.5/plexus-utils-3.0.5.pom (3 KB at 102.2 KB/sec)
    Downloading: http://overture.au.dk/artifactory/remote-repos/org/apache/maven/shared/maven-common-artifact-filters/1.3/maven-common-artifact-filters-1.3.jar
    Downloading: http://overture.au.dk/artifactory/remote-repos/com/thoughtworks/qdox/qdox/1.12/qdox-1.12.jar
    Downloading: http://overture.au.dk/artifactory/remote-repos/org/codehaus/plexus/plexus-archiver/2.1.2/plexus-archiver-2.1.2.jar
    Downloading: http://overture.au.dk/artifactory/remote-repos/org/codehaus/plexus/plexus-io/2.0.4/plexus-io-2.0.4.jar
    Downloading: http://overture.au.dk/artifactory/remote-repos/org/codehaus/plexus/plexus-utils/3.0.5/plexus-utils-3.0.5.jar
    Downloaded: http://overture.au.dk/artifactory/remote-repos/org/codehaus/plexus/plexus-io/2.0.4/plexus-io-2.0.4.jar (57 KB at 1778.5 KB/sec)
    Downloaded: http://overture.au.dk/artifactory/remote-repos/org/apache/maven/shared/maven-common-artifact-filters/1.3/maven-common-artifact-filters-1.3.jar (31 KB at 842.5 KB/sec)
    Downloaded: http://overture.au.dk/artifactory/remote-repos/com/thoughtworks/qdox/qdox/1.12/qdox-1.12.jar (176 KB at 3441.3 KB/sec)
    Downloaded: http://overture.au.dk/artifactory/remote-repos/org/codehaus/plexus/plexus-utils/3.0.5/plexus-utils-3.0.5.jar (226 KB at 3214.9 KB/sec)
    Downloaded: http://overture.au.dk/artifactory/remote-repos/org/codehaus/plexus/plexus-archiver/2.1.2/plexus-archiver-2.1.2.jar (181 KB at 2344.5 KB/sec)
    [INFO] Not executing Javadoc as the project is not a Java classpath-capable package
    [INFO] 
    [INFO] --- jacoco-maven-plugin:0.7.6.201602180812:report (jacoco-site) @ core ---
    [INFO] Skipping JaCoCo execution due to missing execution data file:/var/lib/jenkins/workspace/vdm2c-release/core/target/coverage-reports/jacoco-unit.exec
    [INFO] 
    [INFO] --- maven-gpg-plugin:1.1:sign (sign-artifacts) @ core ---
    [INFO]                                                                         
    [INFO] ------------------------------------------------------------------------
    [INFO] Building The C Code Generator 0.0.6
    [INFO] ------------------------------------------------------------------------
    Downloading: http://overture.au.dk/artifactory/remote-repos/org/apache/maven/plugins/maven-javadoc-plugin/2.10.3/maven-javadoc-plugin-2.10.3.pom
    Downloaded: http://overture.au.dk/artifactory/remote-repos/org/apache/maven/plugins/maven-javadoc-plugin/2.10.3/maven-javadoc-plugin-2.10.3.pom (16 KB at 513.1 KB/sec)
    Downloading: http://overture.au.dk/artifactory/remote-repos/org/apache/maven/plugins/maven-plugins/27/maven-plugins-27.pom
    Downloaded: http://overture.au.dk/artifactory/remote-repos/org/apache/maven/plugins/maven-plugins/27/maven-plugins-27.pom (12 KB at 347.6 KB/sec)
    Downloading: http://overture.au.dk/artifactory/remote-repos/org/apache/maven/plugins/maven-javadoc-plugin/2.10.3/maven-javadoc-plugin-2.10.3.jar
    Downloaded: http://overture.au.dk/artifactory/remote-repos/org/apache/maven/plugins/maven-javadoc-plugin/2.10.3/maven-javadoc-plugin-2.10.3.jar (396 KB at 7760.1 KB/sec)
    Downloading: http://overture.au.dk/artifactory/remote-repos/org/overturetool/astcreator/astcreator-plugin/1.6.8/astcreator-plugin-1.6.8.pom
    Downloaded: http://overture.au.dk/artifactory/remote-repos/org/overturetool/astcreator/astcreator-plugin/1.6.8/astcreator-plugin-1.6.8.pom (2 KB at 48.3 KB/sec)
    Downloading: http://overture.au.dk/artifactory/remote-repos/org/overturetool/astcreator/root/1.6.8/root-1.6.8.pom
    Downloaded: http://overture.au.dk/artifactory/remote-repos/org/overturetool/astcreator/root/1.6.8/root-1.6.8.pom (6 KB at 166.0 KB/sec)
    Downloading: http://overture.au.dk/artifactory/remote-repos/org/overturetool/astcreator/astcreator-plugin/1.6.8/astcreator-plugin-1.6.8.jar
    Downloaded: http://overture.au.dk/artifactory/remote-repos/org/overturetool/astcreator/astcreator-plugin/1.6.8/astcreator-plugin-1.6.8.jar (17 KB at 785.2 KB/sec)
    Downloading: http://overture.au.dk/artifactory/remote-repos/org/overturetool/core/typechecker/2.4.0/typechecker-2.4.0.pom
    Downloaded: http://overture.au.dk/artifactory/remote-repos/org/overturetool/core/typechecker/2.4.0/typechecker-2.4.0.pom (3 KB at 63.7 KB/sec)
    Downloading: http://overture.au.dk/artifactory/remote-repos/org/overturetool/core/2.4.0/core-2.4.0.pom
    Downloaded: http://overture.au.dk/artifactory/remote-repos/org/overturetool/core/2.4.0/core-2.4.0.pom (2 KB at 43.1 KB/sec)
    Downloading: http://overture.au.dk/artifactory/remote-repos/org/overturetool/root/2.4.0/root-2.4.0.pom
    Downloaded: http://overture.au.dk/artifactory/remote-repos/org/overturetool/root/2.4.0/root-2.4.0.pom (13 KB at 453.3 KB/sec)
    Downloading: http://overture.au.dk/artifactory/remote-repos/org/overturetool/core/ast/2.4.0/ast-2.4.0.pom
    Downloaded: http://overture.au.dk/artifactory/remote-repos/org/overturetool/core/ast/2.4.0/ast-2.4.0.pom (5 KB at 197.9 KB/sec)
    Downloading: http://overture.au.dk/artifactory/remote-repos/org/overturetool/core/parser/2.4.0/parser-2.4.0.pom
    Downloaded: http://overture.au.dk/artifactory/remote-repos/org/overturetool/core/parser/2.4.0/parser-2.4.0.pom (4 KB at 101.6 KB/sec)
    Downloading: http://overture.au.dk/artifactory/remote-repos/org/overturetool/core/testframework/2.4.0/testframework-2.4.0.pom
    Downloaded: http://overture.au.dk/artifactory/remote-repos/org/overturetool/core/testframework/2.4.0/testframework-2.4.0.pom (2 KB at 56.6 KB/sec)
    Downloading: http://overture.au.dk/artifactory/remote-repos/org/overturetool/core/codegen/platform/2.4.0/platform-2.4.0.pom
    Downloaded: http://overture.au.dk/artifactory/remote-repos/org/overturetool/core/codegen/platform/2.4.0/platform-2.4.0.pom (3 KB at 65.2 KB/sec)
    Downloading: http://overture.au.dk/artifactory/remote-repos/org/overturetool/core/codegen/2.4.0/codegen-2.4.0.pom
    Downloaded: http://overture.au.dk/artifactory/remote-repos/org/overturetool/core/codegen/2.4.0/codegen-2.4.0.pom (964 B at 23.0 KB/sec)
    Downloading: http://overture.au.dk/artifactory/remote-repos/org/overturetool/core/interpreter/2.4.0/interpreter-2.4.0.pom
    Downloaded: http://overture.au.dk/artifactory/remote-repos/org/overturetool/core/interpreter/2.4.0/interpreter-2.4.0.pom (3 KB at 67.0 KB/sec)
    Downloading: http://overture.au.dk/artifactory/remote-repos/org/overturetool/core/pog/2.4.0/pog-2.4.0.pom
    Downloaded: http://overture.au.dk/artifactory/remote-repos/org/overturetool/core/pog/2.4.0/pog-2.4.0.pom (6 KB at 256.5 KB/sec)
    Downloading: http://overture.au.dk/artifactory/remote-repos/com/google/code/gson/gson/2.2.4/gson-2.2.4.pom
    Downloaded: http://overture.au.dk/artifactory/remote-repos/com/google/code/gson/gson/2.2.4/gson-2.2.4.pom (8 KB at 237.9 KB/sec)
    Downloading: http://overture.au.dk/artifactory/remote-repos/org/overturetool/core/prettyprinting/prettyprinter/2.4.0/prettyprinter-2.4.0.pom
    Downloaded: http://overture.au.dk/artifactory/remote-repos/org/overturetool/core/prettyprinting/prettyprinter/2.4.0/prettyprinter-2.4.0.pom (2 KB at 61.5 KB/sec)
    Downloading: http://overture.au.dk/artifactory/remote-repos/org/overturetool/core/prettyprinting/2.4.0/prettyprinting-2.4.0.pom
    Downloaded: http://overture.au.dk/artifactory/remote-repos/org/overturetool/core/prettyprinting/2.4.0/prettyprinting-2.4.0.pom (661 B at 43.0 KB/sec)
    Downloading: http://overture.au.dk/artifactory/remote-repos/commons-io/commons-io/2.4/commons-io-2.4.pom
    Downloaded: http://overture.au.dk/artifactory/remote-repos/commons-io/commons-io/2.4/commons-io-2.4.pom (10 KB at 584.0 KB/sec)
    Downloading: http://overture.au.dk/artifactory/remote-repos/org/apache/commons/commons-parent/25/commons-parent-25.pom
    Downloaded: http://overture.au.dk/artifactory/remote-repos/org/apache/commons/commons-parent/25/commons-parent-25.pom (48 KB at 1209.5 KB/sec)
    Downloading: http://overture.au.dk/artifactory/remote-repos/org/apache/commons/commons-collections4/4.0/commons-collections4-4.0.pom
    Downloaded: http://overture.au.dk/artifactory/remote-repos/org/apache/commons/commons-collections4/4.0/commons-collections4-4.0.pom (20 KB at 1158.2 KB/sec)
    Downloading: http://overture.au.dk/artifactory/remote-repos/org/apache/commons/commons-parent/32/commons-parent-32.pom
    Downloaded: http://overture.au.dk/artifactory/remote-repos/org/apache/commons/commons-parent/32/commons-parent-32.pom (52 KB at 1393.1 KB/sec)
    Downloading: http://overture.au.dk/artifactory/remote-repos/org/overturetool/core/codegen/ir/2.4.0/ir-2.4.0.pom
    Downloaded: http://overture.au.dk/artifactory/remote-repos/org/overturetool/core/codegen/ir/2.4.0/ir-2.4.0.pom (4 KB at 142.4 KB/sec)
    Downloading: http://overture.au.dk/artifactory/remote-repos/org/apache/velocity/velocity/1.7/velocity-1.7.pom
    Downloaded: http://overture.au.dk/artifactory/remote-repos/org/apache/velocity/velocity/1.7/velocity-1.7.pom (11 KB at 258.6 KB/sec)
    Downloading: http://overture.au.dk/artifactory/remote-repos/commons-collections/commons-collections/3.2.1/commons-collections-3.2.1.pom
    Downloaded: http://overture.au.dk/artifactory/remote-repos/commons-collections/commons-collections/3.2.1/commons-collections-3.2.1.pom (13 KB at 407.1 KB/sec)
    Downloading: http://overture.au.dk/artifactory/remote-repos/org/overturetool/core/combinatorialtesting/ctruntime/2.4.0/ctruntime-2.4.0.pom
    Downloaded: http://overture.au.dk/artifactory/remote-repos/org/overturetool/core/combinatorialtesting/ctruntime/2.4.0/ctruntime-2.4.0.pom (3 KB at 83.0 KB/sec)
    Downloading: http://overture.au.dk/artifactory/remote-repos/org/overturetool/core/combinatorialtesting/2.4.0/combinatorialtesting-2.4.0.pom
    Downloaded: http://overture.au.dk/artifactory/remote-repos/org/overturetool/core/combinatorialtesting/2.4.0/combinatorialtesting-2.4.0.pom (2 KB at 77.0 KB/sec)
    Downloading: http://overture.au.dk/artifactory/remote-repos/org/overturetool/core/combinatorialtesting/ctutils/2.4.0/ctutils-2.4.0.pom
    Downloaded: http://overture.au.dk/artifactory/remote-repos/org/overturetool/core/combinatorialtesting/ctutils/2.4.0/ctutils-2.4.0.pom (2 KB at 27.7 KB/sec)
    Downloading: http://overture.au.dk/artifactory/remote-repos/log4j/log4j/1.2.17/log4j-1.2.17.pom
    Downloaded: http://overture.au.dk/artifactory/remote-repos/log4j/log4j/1.2.17/log4j-1.2.17.pom (22 KB at 598.6 KB/sec)
    Downloading: http://overture.au.dk/artifactory/remote-repos/commons-cli/commons-cli/1.3/commons-cli-1.3.pom
    Downloaded: http://overture.au.dk/artifactory/remote-repos/commons-cli/commons-cli/1.3/commons-cli-1.3.pom (11 KB at 362.5 KB/sec)
    Downloading: http://overture.au.dk/artifactory/remote-repos/org/apache/commons/commons-parent/37/commons-parent-37.pom
    Downloaded: http://overture.au.dk/artifactory/remote-repos/org/apache/commons/commons-parent/37/commons-parent-37.pom (62 KB at 1399.2 KB/sec)
    Downloading: http://overture.au.dk/artifactory/remote-repos/org/slf4j/slf4j-api/1.7.16/slf4j-api-1.7.16.pom
    Downloaded: http://overture.au.dk/artifactory/remote-repos/org/slf4j/slf4j-api/1.7.16/slf4j-api-1.7.16.pom (3 KB at 100.4 KB/sec)
    Downloading: http://overture.au.dk/artifactory/remote-repos/org/slf4j/slf4j-parent/1.7.16/slf4j-parent-1.7.16.pom
    Downloaded: http://overture.au.dk/artifactory/remote-repos/org/slf4j/slf4j-parent/1.7.16/slf4j-parent-1.7.16.pom (14 KB at 437.7 KB/sec)
    Downloading: http://overture.au.dk/artifactory/remote-repos/org/slf4j/slf4j-log4j12/1.7.16/slf4j-log4j12-1.7.16.pom
    Downloaded: http://overture.au.dk/artifactory/remote-repos/org/slf4j/slf4j-log4j12/1.7.16/slf4j-log4j12-1.7.16.pom (909 B at 27.7 KB/sec)
    Downloading: http://overture.au.dk/artifactory/remote-repos/org/overturetool/core/typechecker/2.4.0/typechecker-2.4.0.jar
    Downloading: http://overture.au.dk/artifactory/remote-repos/org/overturetool/core/ast/2.4.0/ast-2.4.0.jar
    Downloading: http://overture.au.dk/artifactory/remote-repos/org/overturetool/core/parser/2.4.0/parser-2.4.0.jar
    Downloading: http://overture.au.dk/artifactory/remote-repos/org/overturetool/core/codegen/platform/2.4.0/platform-2.4.0.jar
    Downloading: http://overture.au.dk/artifactory/remote-repos/org/overturetool/core/interpreter/2.4.0/interpreter-2.4.0.jar
    Downloaded: http://overture.au.dk/artifactory/remote-repos/org/overturetool/core/parser/2.4.0/parser-2.4.0.jar (117 KB at 2333.5 KB/sec)
    Downloading: http://overture.au.dk/artifactory/remote-repos/org/overturetool/core/pog/2.4.0/pog-2.4.0.jar
    Downloaded: http://overture.au.dk/artifactory/remote-repos/org/overturetool/core/typechecker/2.4.0/typechecker-2.4.0.jar (387 KB at 6669.7 KB/sec)
    Downloading: http://overture.au.dk/artifactory/remote-repos/com/google/code/gson/gson/2.2.4/gson-2.2.4.jar
    Downloaded: http://overture.au.dk/artifactory/remote-repos/org/overturetool/core/interpreter/2.4.0/interpreter-2.4.0.jar (716 KB at 11012.6 KB/sec)
    Downloading: http://overture.au.dk/artifactory/remote-repos/org/overturetool/core/prettyprinting/prettyprinter/2.4.0/prettyprinter-2.4.0.jar
    Downloaded: http://overture.au.dk/artifactory/remote-repos/org/overturetool/core/codegen/platform/2.4.0/platform-2.4.0.jar (406 KB at 5560.4 KB/sec)
    Downloading: http://overture.au.dk/artifactory/remote-repos/commons-io/commons-io/2.4/commons-io-2.4.jar
    Downloaded: http://overture.au.dk/artifactory/remote-repos/com/google/code/gson/gson/2.2.4/gson-2.2.4.jar (186 KB at 7152.6 KB/sec)
    Downloading: http://overture.au.dk/artifactory/remote-repos/org/apache/commons/commons-collections4/4.0/commons-collections4-4.0.jar
    Downloaded: http://overture.au.dk/artifactory/remote-repos/org/overturetool/core/pog/2.4.0/pog-2.4.0.jar (260 KB at 7423.5 KB/sec)
    Downloading: http://overture.au.dk/artifactory/remote-repos/org/apache/velocity/velocity/1.7/velocity-1.7.jar
    Downloaded: http://overture.au.dk/artifactory/remote-repos/org/overturetool/core/ast/2.4.0/ast-2.4.0.jar (1323 KB at 14537.8 KB/sec)
    Downloading: http://overture.au.dk/artifactory/remote-repos/commons-collections/commons-collections/3.2.1/commons-collections-3.2.1.jar
    Downloaded: http://overture.au.dk/artifactory/remote-repos/org/overturetool/core/prettyprinting/prettyprinter/2.4.0/prettyprinter-2.4.0.jar (12 KB at 426.7 KB/sec)
    Downloading: http://overture.au.dk/artifactory/remote-repos/org/overturetool/core/combinatorialtesting/ctruntime/2.4.0/ctruntime-2.4.0.jar
    Downloaded: http://overture.au.dk/artifactory/remote-repos/commons-io/commons-io/2.4/commons-io-2.4.jar (181 KB at 5317.7 KB/sec)
    Downloading: http://overture.au.dk/artifactory/remote-repos/org/overturetool/core/combinatorialtesting/ctutils/2.4.0/ctutils-2.4.0.jar
    Downloaded: http://overture.au.dk/artifactory/remote-repos/org/overturetool/core/combinatorialtesting/ctruntime/2.4.0/ctruntime-2.4.0.jar (46 KB at 1676.7 KB/sec)
    Downloading: http://overture.au.dk/artifactory/remote-repos/log4j/log4j/1.2.17/log4j-1.2.17.jar
    Downloaded: http://overture.au.dk/artifactory/remote-repos/org/overturetool/core/combinatorialtesting/ctutils/2.4.0/ctutils-2.4.0.jar (10 KB at 415.5 KB/sec)
    Downloading: http://overture.au.dk/artifactory/remote-repos/org/overturetool/core/codegen/ir/2.4.0/ir-2.4.0.jar
    Downloaded: http://overture.au.dk/artifactory/remote-repos/org/apache/commons/commons-collections4/4.0/commons-collections4-4.0.jar (596 KB at 9459.6 KB/sec)
    Downloading: http://overture.au.dk/artifactory/remote-repos/org/overturetool/core/testframework/2.4.0/testframework-2.4.0.jar
    Downloaded: http://overture.au.dk/artifactory/remote-repos/org/apache/velocity/velocity/1.7/velocity-1.7.jar (439 KB at 5627.8 KB/sec)
    Downloading: http://overture.au.dk/artifactory/remote-repos/commons-cli/commons-cli/1.3/commons-cli-1.3.jar
    Downloaded: http://overture.au.dk/artifactory/remote-repos/org/overturetool/core/codegen/ir/2.4.0/ir-2.4.0.jar (1111 KB at 24683.8 KB/sec)
    Downloading: http://overture.au.dk/artifactory/remote-repos/org/slf4j/slf4j-api/1.7.16/slf4j-api-1.7.16.jar
    Downloaded: http://overture.au.dk/artifactory/remote-repos/commons-collections/commons-collections/3.2.1/commons-collections-3.2.1.jar (562 KB at 6313.5 KB/sec)
    Downloading: http://overture.au.dk/artifactory/remote-repos/org/slf4j/slf4j-log4j12/1.7.16/slf4j-log4j12-1.7.16.jar
    Downloaded: http://overture.au.dk/artifactory/remote-repos/org/overturetool/core/testframework/2.4.0/testframework-2.4.0.jar (37 KB at 1068.1 KB/sec)
    Downloaded: http://overture.au.dk/artifactory/remote-repos/org/slf4j/slf4j-log4j12/1.7.16/slf4j-log4j12-1.7.16.jar (10 KB at 746.6 KB/sec)
    Downloaded: http://overture.au.dk/artifactory/remote-repos/log4j/log4j/1.2.17/log4j-1.2.17.jar (479 KB at 6644.5 KB/sec)
    Downloaded: http://overture.au.dk/artifactory/remote-repos/org/slf4j/slf4j-api/1.7.16/slf4j-api-1.7.16.jar (40 KB at 879.1 KB/sec)
    Downloaded: http://overture.au.dk/artifactory/remote-repos/commons-cli/commons-cli/1.3/commons-cli-1.3.jar (52 KB at 257.2 KB/sec)
    [INFO] 
    [INFO] --- maven-clean-plugin:2.5:clean (default-clean) @ vdm2c ---
    [INFO] 
    [INFO] --- maven-enforcer-plugin:1.0:enforce (enforce-maven) @ vdm2c ---
    [INFO] 
    [INFO] --- jacoco-maven-plugin:0.7.6.201602180812:prepare-agent (jacoco-initialize) @ vdm2c ---
    [INFO] argLine set to -javaagent:/var/lib/jenkins/workspace/vdm2c-release/repository/org/jacoco/org.jacoco.agent/0.7.6.201602180812/org.jacoco.agent-0.7.6.201602180812-runtime.jar=destfile=/var/lib/jenkins/workspace/vdm2c-release/core/vdm2c/target/coverage-reports/jacoco-unit.exec,excludes=org/overture/cgc/extast/analysis/**/*.*:org/overture/codegen/vdm2c/extast/expressions/**/*:org/overture/codegen/vdm2c/extast/declarations/**/*:org/overture/codegen/vdm2c/extast/statements/**/*:org/overture/cgc/extast/node/**/*:org/overture/codegen/vdm2c/ast/preview/**/*
    [INFO] 
    [INFO] --- astcreator-plugin:1.6.8:generate (generate-ast) @ vdm2c ---
    Downloading: http://overture.au.dk/artifactory/remote-repos/org/overturetool/astcreator/astcreator/1.6.8/astcreator-1.6.8.pom
    Downloaded: http://overture.au.dk/artifactory/remote-repos/org/overturetool/astcreator/astcreator/1.6.8/astcreator-1.6.8.pom (3 KB at 103.0 KB/sec)
    Downloading: http://overture.au.dk/artifactory/remote-repos/org/antlr/antlr/3.5/antlr-3.5.pom
    Downloaded: http://overture.au.dk/artifactory/remote-repos/org/antlr/antlr/3.5/antlr-3.5.pom (3 KB at 98.3 KB/sec)
    Downloading: http://overture.au.dk/artifactory/remote-repos/org/antlr/antlr-master/3.5/antlr-master-3.5.pom
    Downloaded: http://overture.au.dk/artifactory/remote-repos/org/antlr/antlr-master/3.5/antlr-master-3.5.pom (11 KB at 424.6 KB/sec)
    Downloading: http://overture.au.dk/artifactory/remote-repos/org/antlr/antlr-runtime/3.5/antlr-runtime-3.5.pom
    Downloaded: http://overture.au.dk/artifactory/remote-repos/org/antlr/antlr-runtime/3.5/antlr-runtime-3.5.pom (3 KB at 119.7 KB/sec)
    Downloading: http://overture.au.dk/artifactory/remote-repos/org/antlr/stringtemplate/3.2.1/stringtemplate-3.2.1.pom
    Downloaded: http://overture.au.dk/artifactory/remote-repos/org/antlr/stringtemplate/3.2.1/stringtemplate-3.2.1.pom (8 KB at 260.2 KB/sec)
    Downloading: http://overture.au.dk/artifactory/remote-repos/antlr/antlr/2.7.7/antlr-2.7.7.pom
    Downloaded: http://overture.au.dk/artifactory/remote-repos/antlr/antlr/2.7.7/antlr-2.7.7.pom (632 B at 22.9 KB/sec)
    Downloading: http://overture.au.dk/artifactory/remote-repos/org/antlr/ST4/4.0.7/ST4-4.0.7.pom
    Downloaded: http://overture.au.dk/artifactory/remote-repos/org/antlr/ST4/4.0.7/ST4-4.0.7.pom (13 KB at 609.8 KB/sec)
    Downloading: http://overture.au.dk/artifactory/remote-repos/org/apache/maven/plugins/maven-project-info-reports-plugin/2.1.1/maven-project-info-reports-plugin-2.1.1.pom
    Downloaded: http://overture.au.dk/artifactory/remote-repos/org/apache/maven/plugins/maven-project-info-reports-plugin/2.1.1/maven-project-info-reports-plugin-2.1.1.pom (14 KB at 655.1 KB/sec)
    Downloading: http://overture.au.dk/artifactory/remote-repos/org/apache/maven/plugins/maven-plugins/13/maven-plugins-13.pom
    Downloaded: http://overture.au.dk/artifactory/remote-repos/org/apache/maven/plugins/maven-plugins/13/maven-plugins-13.pom (12 KB at 605.7 KB/sec)
    Downloading: http://overture.au.dk/artifactory/remote-repos/org/apache/maven/reporting/maven-reporting-impl/2.0.4.1/maven-reporting-impl-2.0.4.1.pom
    Downloaded: http://overture.au.dk/artifactory/remote-repos/org/apache/maven/reporting/maven-reporting-impl/2.0.4.1/maven-reporting-impl-2.0.4.1.pom (3 KB at 132.7 KB/sec)
    Downloading: http://overture.au.dk/artifactory/remote-repos/org/apache/maven/maven-project/2.0.4/maven-project-2.0.4.pom
    Downloaded: http://overture.au.dk/artifactory/remote-repos/org/apache/maven/maven-project/2.0.4/maven-project-2.0.4.pom (2 KB at 105.8 KB/sec)
    Downloading: http://overture.au.dk/artifactory/remote-repos/org/apache/maven/maven/2.0.4/maven-2.0.4.pom
    Downloaded: http://overture.au.dk/artifactory/remote-repos/org/apache/maven/maven/2.0.4/maven-2.0.4.pom (11 KB at 574.3 KB/sec)
    Downloading: http://overture.au.dk/artifactory/remote-repos/org/apache/maven/maven-settings/2.0.4/maven-settings-2.0.4.pom
    Downloaded: http://overture.au.dk/artifactory/remote-repos/org/apache/maven/maven-settings/2.0.4/maven-settings-2.0.4.pom (2 KB at 79.4 KB/sec)
    Downloading: http://overture.au.dk/artifactory/remote-repos/org/apache/maven/maven-model/2.0.4/maven-model-2.0.4.pom
    Downloaded: http://overture.au.dk/artifactory/remote-repos/org/apache/maven/maven-model/2.0.4/maven-model-2.0.4.pom (3 KB at 80.2 KB/sec)
    Downloading: http://overture.au.dk/artifactory/remote-repos/org/apache/maven/maven-profile/2.0.4/maven-profile-2.0.4.pom
    Downloaded: http://overture.au.dk/artifactory/remote-repos/org/apache/maven/maven-profile/2.0.4/maven-profile-2.0.4.pom (2 KB at 98.8 KB/sec)
    Downloading: http://overture.au.dk/artifactory/remote-repos/org/apache/maven/maven-artifact-manager/2.0.4/maven-artifact-manager-2.0.4.pom
    Downloaded: http://overture.au.dk/artifactory/remote-repos/org/apache/maven/maven-artifact-manager/2.0.4/maven-artifact-manager-2.0.4.pom (2 KB at 49.1 KB/sec)
    Downloading: http://overture.au.dk/artifactory/remote-repos/org/apache/maven/maven-repository-metadata/2.0.4/maven-repository-metadata-2.0.4.pom
    Downloaded: http://overture.au.dk/artifactory/remote-repos/org/apache/maven/maven-repository-metadata/2.0.4/maven-repository-metadata-2.0.4.pom (2 KB at 90.8 KB/sec)
    Downloading: http://overture.au.dk/artifactory/remote-repos/org/apache/maven/maven-artifact/2.0.4/maven-artifact-2.0.4.pom
    Downloaded: http://overture.au.dk/artifactory/remote-repos/org/apache/maven/maven-artifact/2.0.4/maven-artifact-2.0.4.pom (765 B at 46.7 KB/sec)
    Downloading: http://overture.au.dk/artifactory/remote-repos/org/apache/maven/doxia/doxia-core/1.0-alpha-10/doxia-core-1.0-alpha-10.pom
    Downloaded: http://overture.au.dk/artifactory/remote-repos/org/apache/maven/doxia/doxia-core/1.0-alpha-10/doxia-core-1.0-alpha-10.pom (3 KB at 95.7 KB/sec)
    Downloading: http://overture.au.dk/artifactory/remote-repos/org/apache/maven/maven-plugin-api/2.0.4/maven-plugin-api-2.0.4.pom
    Downloaded: http://overture.au.dk/artifactory/remote-repos/org/apache/maven/maven-plugin-api/2.0.4/maven-plugin-api-2.0.4.pom (643 B at 39.2 KB/sec)
    Downloading: http://overture.au.dk/artifactory/remote-repos/org/apache/maven/reporting/maven-reporting-api/2.0.4/maven-reporting-api-2.0.4.pom
    Downloaded: http://overture.au.dk/artifactory/remote-repos/org/apache/maven/reporting/maven-reporting-api/2.0.4/maven-reporting-api-2.0.4.pom (902 B at 46.4 KB/sec)
    Downloading: http://overture.au.dk/artifactory/remote-repos/org/apache/maven/reporting/maven-reporting/2.0.4/maven-reporting-2.0.4.pom
    Downloaded: http://overture.au.dk/artifactory/remote-repos/org/apache/maven/reporting/maven-reporting/2.0.4/maven-reporting-2.0.4.pom (700 B at 29.7 KB/sec)
    Downloading: http://overture.au.dk/artifactory/remote-repos/org/apache/maven/doxia/doxia-site-renderer/1.0-alpha-10/doxia-site-renderer-1.0-alpha-10.pom
    Downloaded: http://overture.au.dk/artifactory/remote-repos/org/apache/maven/doxia/doxia-site-renderer/1.0-alpha-10/doxia-site-renderer-1.0-alpha-10.pom (5 KB at 224.6 KB/sec)
    Downloading: http://overture.au.dk/artifactory/remote-repos/org/apache/maven/doxia/doxia-sitetools/1.0-alpha-10/doxia-sitetools-1.0-alpha-10.pom
    Downloaded: http://overture.au.dk/artifactory/remote-repos/org/apache/maven/doxia/doxia-sitetools/1.0-alpha-10/doxia-sitetools-1.0-alpha-10.pom (8 KB at 443.2 KB/sec)
    Downloading: http://overture.au.dk/artifactory/remote-repos/org/apache/maven/doxia/doxia-decoration-model/1.0-alpha-10/doxia-decoration-model-1.0-alpha-10.pom
    Downloaded: http://overture.au.dk/artifactory/remote-repos/org/apache/maven/doxia/doxia-decoration-model/1.0-alpha-10/doxia-decoration-model-1.0-alpha-10.pom (3 KB at 149.1 KB/sec)
    Downloading: http://overture.au.dk/artifactory/remote-repos/org/apache/maven/doxia/doxia-module-apt/1.0-alpha-10/doxia-module-apt-1.0-alpha-10.pom
    Downloaded: http://overture.au.dk/artifactory/remote-repos/org/apache/maven/doxia/doxia-module-apt/1.0-alpha-10/doxia-module-apt-1.0-alpha-10.pom (3 KB at 83.1 KB/sec)
    Downloading: http://overture.au.dk/artifactory/remote-repos/org/apache/maven/doxia/doxia-modules/1.0-alpha-10/doxia-modules-1.0-alpha-10.pom
    Downloaded: http://overture.au.dk/artifactory/remote-repos/org/apache/maven/doxia/doxia-modules/1.0-alpha-10/doxia-modules-1.0-alpha-10.pom (3 KB at 127.8 KB/sec)
    Downloading: http://overture.au.dk/artifactory/remote-repos/org/apache/maven/doxia/doxia-module-fml/1.0-alpha-10/doxia-module-fml-1.0-alpha-10.pom
    Downloaded: http://overture.au.dk/artifactory/remote-repos/org/apache/maven/doxia/doxia-module-fml/1.0-alpha-10/doxia-module-fml-1.0-alpha-10.pom (3 KB at 131.0 KB/sec)
    Downloading: http://overture.au.dk/artifactory/remote-repos/org/apache/maven/doxia/doxia-module-xdoc/1.0-alpha-10/doxia-module-xdoc-1.0-alpha-10.pom
    Downloaded: http://overture.au.dk/artifactory/remote-repos/org/apache/maven/doxia/doxia-module-xdoc/1.0-alpha-10/doxia-module-xdoc-1.0-alpha-10.pom (3 KB at 107.5 KB/sec)
    Downloading: http://overture.au.dk/artifactory/remote-repos/org/apache/maven/doxia/doxia-module-xhtml/1.0-alpha-10/doxia-module-xhtml-1.0-alpha-10.pom
    Downloaded: http://overture.au.dk/artifactory/remote-repos/org/apache/maven/doxia/doxia-module-xhtml/1.0-alpha-10/doxia-module-xhtml-1.0-alpha-10.pom (2 KB at 89.2 KB/sec)
    Downloading: http://overture.au.dk/artifactory/remote-repos/org/apache/maven/shared/maven-doxia-tools/1.0.1/maven-doxia-tools-1.0.1.pom
    Downloaded: http://overture.au.dk/artifactory/remote-repos/org/apache/maven/shared/maven-doxia-tools/1.0.1/maven-doxia-tools-1.0.1.pom (6 KB at 330.8 KB/sec)
    Downloading: http://overture.au.dk/artifactory/remote-repos/commons-io/commons-io/1.4/commons-io-1.4.pom
    Downloaded: http://overture.au.dk/artifactory/remote-repos/commons-io/commons-io/1.4/commons-io-1.4.pom (13 KB at 347.5 KB/sec)
    Downloading: http://overture.au.dk/artifactory/remote-repos/org/apache/commons/commons-parent/7/commons-parent-7.pom
    Downloaded: http://overture.au.dk/artifactory/remote-repos/org/apache/commons/commons-parent/7/commons-parent-7.pom (18 KB at 899.3 KB/sec)
    Downloading: http://overture.au.dk/artifactory/remote-repos/org/apache/maven/maven-model/2.0.2/maven-model-2.0.2.pom
    Downloaded: http://overture.au.dk/artifactory/remote-repos/org/apache/maven/maven-model/2.0.2/maven-model-2.0.2.pom (3 KB at 112.3 KB/sec)
    Downloading: http://overture.au.dk/artifactory/remote-repos/org/apache/maven/doxia/doxia-decoration-model/1.0-alpha-11/doxia-decoration-model-1.0-alpha-11.pom
    Downloaded: http://overture.au.dk/artifactory/remote-repos/org/apache/maven/doxia/doxia-decoration-model/1.0-alpha-11/doxia-decoration-model-1.0-alpha-11.pom (3 KB at 183.8 KB/sec)
    Downloading: http://overture.au.dk/artifactory/remote-repos/org/apache/maven/doxia/doxia-sitetools/1.0-alpha-11/doxia-sitetools-1.0-alpha-11.pom
    Downloaded: http://overture.au.dk/artifactory/remote-repos/org/apache/maven/doxia/doxia-sitetools/1.0-alpha-11/doxia-sitetools-1.0-alpha-11.pom (9 KB at 150.9 KB/sec)
    Downloading: http://overture.au.dk/artifactory/remote-repos/org/apache/maven/shared/maven-shared-jar/1.0/maven-shared-jar-1.0.pom
    Downloaded: http://overture.au.dk/artifactory/remote-repos/org/apache/maven/shared/maven-shared-jar/1.0/maven-shared-jar-1.0.pom (5 KB at 166.8 KB/sec)
    Downloading: http://overture.au.dk/artifactory/remote-repos/org/apache/maven/maven-model/2.0.7/maven-model-2.0.7.pom
    Downloaded: http://overture.au.dk/artifactory/remote-repos/org/apache/maven/maven-model/2.0.7/maven-model-2.0.7.pom (3 KB at 129.4 KB/sec)
    Downloading: http://overture.au.dk/artifactory/remote-repos/org/apache/maven/maven/2.0.7/maven-2.0.7.pom
    Downloaded: http://overture.au.dk/artifactory/remote-repos/org/apache/maven/maven/2.0.7/maven-2.0.7.pom (11 KB at 429.8 KB/sec)
    Downloading: http://overture.au.dk/artifactory/remote-repos/org/apache/maven/maven-artifact/2.0.7/maven-artifact-2.0.7.pom
    Downloaded: http://overture.au.dk/artifactory/remote-repos/org/apache/maven/maven-artifact/2.0.7/maven-artifact-2.0.7.pom (2 KB at 90.6 KB/sec)
    Downloading: http://overture.au.dk/artifactory/remote-repos/org/codehaus/plexus/plexus-digest/1.0/plexus-digest-1.0.pom
    Downloaded: http://overture.au.dk/artifactory/remote-repos/org/codehaus/plexus/plexus-digest/1.0/plexus-digest-1.0.pom (2 KB at 34.5 KB/sec)
    Downloading: http://overture.au.dk/artifactory/remote-repos/org/codehaus/plexus/plexus-components/1.1.7/plexus-components-1.1.7.pom
    Downloaded: http://overture.au.dk/artifactory/remote-repos/org/codehaus/plexus/plexus-components/1.1.7/plexus-components-1.1.7.pom (5 KB at 242.9 KB/sec)
    Downloading: http://overture.au.dk/artifactory/remote-repos/org/apache/bcel/bcel/5.2/bcel-5.2.pom
    Downloaded: http://overture.au.dk/artifactory/remote-repos/org/apache/bcel/bcel/5.2/bcel-5.2.pom (619 B at 40.3 KB/sec)
    Downloading: http://overture.au.dk/artifactory/remote-repos/jakarta-regexp/jakarta-regexp/1.4/jakarta-regexp-1.4.pom
    Downloaded: http://overture.au.dk/artifactory/remote-repos/jakarta-regexp/jakarta-regexp/1.4/jakarta-regexp-1.4.pom (160 B at 9.2 KB/sec)
    Downloading: http://overture.au.dk/artifactory/remote-repos/org/apache/maven/wagon/wagon-provider-api/1.0-beta-3/wagon-provider-api-1.0-beta-3.pom
    Downloaded: http://overture.au.dk/artifactory/remote-repos/org/apache/maven/wagon/wagon-provider-api/1.0-beta-3/wagon-provider-api-1.0-beta-3.pom (906 B at 52.0 KB/sec)
    Downloading: http://overture.au.dk/artifactory/remote-repos/org/apache/maven/wagon/wagon/1.0-beta-3/wagon-1.0-beta-3.pom
    Downloaded: http://overture.au.dk/artifactory/remote-repos/org/apache/maven/wagon/wagon/1.0-beta-3/wagon-1.0-beta-3.pom (9 KB at 301.0 KB/sec)
    Downloading: http://overture.au.dk/artifactory/remote-repos/org/apache/maven/wagon/wagon-ssh/1.0-beta-3/wagon-ssh-1.0-beta-3.pom
    Downloaded: http://overture.au.dk/artifactory/remote-repos/org/apache/maven/wagon/wagon-ssh/1.0-beta-3/wagon-ssh-1.0-beta-3.pom (2 KB at 59.8 KB/sec)
    Downloading: http://overture.au.dk/artifactory/remote-repos/org/apache/maven/wagon/wagon-providers/1.0-beta-3/wagon-providers-1.0-beta-3.pom
    Downloaded: http://overture.au.dk/artifactory/remote-repos/org/apache/maven/wagon/wagon-providers/1.0-beta-3/wagon-providers-1.0-beta-3.pom (2 KB at 61.6 KB/sec)
    Downloading: http://overture.au.dk/artifactory/remote-repos/com/jcraft/jsch/0.1.38/jsch-0.1.38.pom
    Downloaded: http://overture.au.dk/artifactory/remote-repos/com/jcraft/jsch/0.1.38/jsch-0.1.38.pom (967 B at 63.0 KB/sec)
    Downloading: http://overture.au.dk/artifactory/remote-repos/org/apache/maven/wagon/wagon-ssh-common/1.0-beta-3/wagon-ssh-common-1.0-beta-3.pom
    Downloaded: http://overture.au.dk/artifactory/remote-repos/org/apache/maven/wagon/wagon-ssh-common/1.0-beta-3/wagon-ssh-common-1.0-beta-3.pom (968 B at 49.8 KB/sec)
    Downloading: http://overture.au.dk/artifactory/remote-repos/org/codehaus/plexus/plexus-utils/1.4/plexus-utils-1.4.pom
    Downloaded: http://overture.au.dk/artifactory/remote-repos/org/codehaus/plexus/plexus-utils/1.4/plexus-utils-1.4.pom (2 KB at 56.2 KB/sec)
    Downloading: http://overture.au.dk/artifactory/remote-repos/org/apache/maven/wagon/wagon-file/1.0-beta-3/wagon-file-1.0-beta-3.pom
    Downloaded: http://overture.au.dk/artifactory/remote-repos/org/apache/maven/wagon/wagon-file/1.0-beta-3/wagon-file-1.0-beta-3.pom (575 B at 31.2 KB/sec)
    Downloading: http://overture.au.dk/artifactory/remote-repos/org/apache/maven/wagon/wagon-http-lightweight/1.0-beta-3/wagon-http-lightweight-1.0-beta-3.pom
    Downloaded: http://overture.au.dk/artifactory/remote-repos/org/apache/maven/wagon/wagon-http-lightweight/1.0-beta-3/wagon-http-lightweight-1.0-beta-3.pom (2 KB at 48.9 KB/sec)
    Downloading: http://overture.au.dk/artifactory/remote-repos/org/apache/maven/wagon/wagon-http-shared/1.0-beta-3/wagon-http-shared-1.0-beta-3.pom
    Downloaded: http://overture.au.dk/artifactory/remote-repos/org/apache/maven/wagon/wagon-http-shared/1.0-beta-3/wagon-http-shared-1.0-beta-3.pom (2 KB at 76.5 KB/sec)
    Downloading: http://overture.au.dk/artifactory/remote-repos/nekohtml/xercesMinimal/1.9.6.2/xercesMinimal-1.9.6.2.pom
    Downloaded: http://overture.au.dk/artifactory/remote-repos/nekohtml/xercesMinimal/1.9.6.2/xercesMinimal-1.9.6.2.pom (390 B at 22.4 KB/sec)
    Downloading: http://overture.au.dk/artifactory/remote-repos/nekohtml/nekohtml/1.9.6.2/nekohtml-1.9.6.2.pom
    Downloaded: http://overture.au.dk/artifactory/remote-repos/nekohtml/nekohtml/1.9.6.2/nekohtml-1.9.6.2.pom (704 B at 36.2 KB/sec)
    Downloading: http://overture.au.dk/artifactory/remote-repos/org/apache/maven/scm/maven-scm-api/1.1/maven-scm-api-1.1.pom
    Downloaded: http://overture.au.dk/artifactory/remote-repos/org/apache/maven/scm/maven-scm-api/1.1/maven-scm-api-1.1.pom (2 KB at 80.9 KB/sec)
    Downloading: http://overture.au.dk/artifactory/remote-repos/org/apache/maven/scm/maven-scm/1.1/maven-scm-1.1.pom
    Downloaded: http://overture.au.dk/artifactory/remote-repos/org/apache/maven/scm/maven-scm/1.1/maven-scm-1.1.pom (20 KB at 1019.3 KB/sec)
    Downloading: http://overture.au.dk/artifactory/remote-repos/org/apache/maven/scm/maven-scm-manager-plexus/1.1/maven-scm-manager-plexus-1.1.pom
    Downloaded: http://overture.au.dk/artifactory/remote-repos/org/apache/maven/scm/maven-scm-manager-plexus/1.1/maven-scm-manager-plexus-1.1.pom (3 KB at 105.7 KB/sec)
    Downloading: http://overture.au.dk/artifactory/remote-repos/org/apache/maven/scm/maven-scm-managers/1.1/maven-scm-managers-1.1.pom
    Downloaded: http://overture.au.dk/artifactory/remote-repos/org/apache/maven/scm/maven-scm-managers/1.1/maven-scm-managers-1.1.pom (2 KB at 44.0 KB/sec)
    Downloading: http://overture.au.dk/artifactory/remote-repos/org/apache/maven/scm/maven-scm-provider-perforce/1.1/maven-scm-provider-perforce-1.1.pom
    Downloaded: http://overture.au.dk/artifactory/remote-repos/org/apache/maven/scm/maven-scm-provider-perforce/1.1/maven-scm-provider-perforce-1.1.pom (3 KB at 81.9 KB/sec)
    Downloading: http://overture.au.dk/artifactory/remote-repos/org/apache/maven/scm/maven-scm-providers/1.1/maven-scm-providers-1.1.pom
    Downloaded: http://overture.au.dk/artifactory/remote-repos/org/apache/maven/scm/maven-scm-providers/1.1/maven-scm-providers-1.1.pom (4 KB at 219.4 KB/sec)
    Downloading: http://overture.au.dk/artifactory/remote-repos/org/apache/maven/scm/maven-scm-provider-starteam/1.1/maven-scm-provider-starteam-1.1.pom
    Downloaded: http://overture.au.dk/artifactory/remote-repos/org/apache/maven/scm/maven-scm-provider-starteam/1.1/maven-scm-provider-starteam-1.1.pom (3 KB at 54.5 KB/sec)
    Downloading: http://overture.au.dk/artifactory/remote-repos/org/apache/maven/scm/maven-scm-provider-svn-commons/1.1/maven-scm-provider-svn-commons-1.1.pom
    Downloaded: http://overture.au.dk/artifactory/remote-repos/org/apache/maven/scm/maven-scm-provider-svn-commons/1.1/maven-scm-provider-svn-commons-1.1.pom (2 KB at 70.0 KB/sec)
    Downloading: http://overture.au.dk/artifactory/remote-repos/org/apache/maven/scm/maven-scm-providers-svn/1.1/maven-scm-providers-svn-1.1.pom
    Downloaded: http://overture.au.dk/artifactory/remote-repos/org/apache/maven/scm/maven-scm-providers-svn/1.1/maven-scm-providers-svn-1.1.pom (2 KB at 67.9 KB/sec)
    Downloading: http://overture.au.dk/artifactory/remote-repos/org/apache/maven/scm/maven-scm-provider-svnexe/1.1/maven-scm-provider-svnexe-1.1.pom
    Downloaded: http://overture.au.dk/artifactory/remote-repos/org/apache/maven/scm/maven-scm-provider-svnexe/1.1/maven-scm-provider-svnexe-1.1.pom (3 KB at 101.0 KB/sec)
    Downloading: http://overture.au.dk/artifactory/remote-repos/org/apache/maven/scm/maven-scm-provider-cvs-commons/1.1/maven-scm-provider-cvs-commons-1.1.pom
    Downloaded: http://overture.au.dk/artifactory/remote-repos/org/apache/maven/scm/maven-scm-provider-cvs-commons/1.1/maven-scm-provider-cvs-commons-1.1.pom (3 KB at 89.6 KB/sec)
    Downloading: http://overture.au.dk/artifactory/remote-repos/org/apache/maven/scm/maven-scm-providers-cvs/1.1/maven-scm-providers-cvs-1.1.pom
    Downloaded: http://overture.au.dk/artifactory/remote-repos/org/apache/maven/scm/maven-scm-providers-cvs/1.1/maven-scm-providers-cvs-1.1.pom (2 KB at 98.0 KB/sec)
    Downloading: http://overture.au.dk/artifactory/remote-repos/org/apache/maven/scm/maven-scm-provider-cvsexe/1.1/maven-scm-provider-cvsexe-1.1.pom
    Downloaded: http://overture.au.dk/artifactory/remote-repos/org/apache/maven/scm/maven-scm-provider-cvsexe/1.1/maven-scm-provider-cvsexe-1.1.pom (3 KB at 147.5 KB/sec)
    Downloading: http://overture.au.dk/artifactory/remote-repos/org/apache/maven/scm/maven-scm-provider-cvsjava/1.1/maven-scm-provider-cvsjava-1.1.pom
    Downloaded: http://overture.au.dk/artifactory/remote-repos/org/apache/maven/scm/maven-scm-provider-cvsjava/1.1/maven-scm-provider-cvsjava-1.1.pom (3 KB at 101.5 KB/sec)
    Downloading: http://overture.au.dk/artifactory/remote-repos/org/apache/maven/doxia/doxia-core/1.0-alpha-11/doxia-core-1.0-alpha-11.pom
    Downloaded: http://overture.au.dk/artifactory/remote-repos/org/apache/maven/doxia/doxia-core/1.0-alpha-11/doxia-core-1.0-alpha-11.pom (3 KB at 127.7 KB/sec)
    Downloading: http://overture.au.dk/artifactory/remote-repos/org/apache/maven/doxia/doxia/1.0-alpha-11/doxia-1.0-alpha-11.pom
    Downloaded: http://overture.au.dk/artifactory/remote-repos/org/apache/maven/doxia/doxia/1.0-alpha-11/doxia-1.0-alpha-11.pom (10 KB at 462.4 KB/sec)
    Downloading: http://overture.au.dk/artifactory/remote-repos/org/apache/maven/doxia/doxia-sink-api/1.0-alpha-11/doxia-sink-api-1.0-alpha-11.pom
    Downloaded: http://overture.au.dk/artifactory/remote-repos/org/apache/maven/doxia/doxia-sink-api/1.0-alpha-11/doxia-sink-api-1.0-alpha-11.pom (2 KB at 73.1 KB/sec)
    Downloading: http://overture.au.dk/artifactory/remote-repos/org/apache/maven/doxia/doxia-module-xhtml/1.0-alpha-11/doxia-module-xhtml-1.0-alpha-11.pom
    Downloaded: http://overture.au.dk/artifactory/remote-repos/org/apache/maven/doxia/doxia-module-xhtml/1.0-alpha-11/doxia-module-xhtml-1.0-alpha-11.pom (2 KB at 60.7 KB/sec)
    Downloading: http://overture.au.dk/artifactory/remote-repos/org/apache/maven/doxia/doxia-modules/1.0-alpha-11/doxia-modules-1.0-alpha-11.pom
    Downloaded: http://overture.au.dk/artifactory/remote-repos/org/apache/maven/doxia/doxia-modules/1.0-alpha-11/doxia-modules-1.0-alpha-11.pom (3 KB at 135.3 KB/sec)
    Downloading: http://overture.au.dk/artifactory/remote-repos/org/apache/maven/doxia/doxia-site-renderer/1.0-alpha-11/doxia-site-renderer-1.0-alpha-11.pom
    Downloaded: http://overture.au.dk/artifactory/remote-repos/org/apache/maven/doxia/doxia-site-renderer/1.0-alpha-11/doxia-site-renderer-1.0-alpha-11.pom (5 KB at 251.0 KB/sec)
    Downloading: http://overture.au.dk/artifactory/remote-repos/org/apache/maven/doxia/doxia-module-apt/1.0-alpha-11/doxia-module-apt-1.0-alpha-11.pom
    Downloaded: http://overture.au.dk/artifactory/remote-repos/org/apache/maven/doxia/doxia-module-apt/1.0-alpha-11/doxia-module-apt-1.0-alpha-11.pom (3 KB at 120.1 KB/sec)
    Downloading: http://overture.au.dk/artifactory/remote-repos/org/apache/maven/doxia/doxia-module-fml/1.0-alpha-11/doxia-module-fml-1.0-alpha-11.pom
    Downloaded: http://overture.au.dk/artifactory/remote-repos/org/apache/maven/doxia/doxia-module-fml/1.0-alpha-11/doxia-module-fml-1.0-alpha-11.pom (3 KB at 152.2 KB/sec)
    Downloading: http://overture.au.dk/artifactory/remote-repos/org/apache/maven/doxia/doxia-module-xdoc/1.0-alpha-11/doxia-module-xdoc-1.0-alpha-11.pom
    Downloaded: http://overture.au.dk/artifactory/remote-repos/org/apache/maven/doxia/doxia-module-xdoc/1.0-alpha-11/doxia-module-xdoc-1.0-alpha-11.pom (3 KB at 134.4 KB/sec)
    Downloading: http://overture.au.dk/artifactory/remote-repos/org/overturetool/astcreator/astcreator/1.6.8/astcreator-1.6.8.jar
    Downloading: http://overture.au.dk/artifactory/remote-repos/org/antlr/antlr/3.5/antlr-3.5.jar
    Downloading: http://overture.au.dk/artifactory/remote-repos/org/antlr/ST4/4.0.7/ST4-4.0.7.jar
    Downloading: http://overture.au.dk/artifactory/remote-repos/org/antlr/antlr-runtime/3.5/antlr-runtime-3.5.jar
    Downloading: http://overture.au.dk/artifactory/remote-repos/org/antlr/stringtemplate/3.2.1/stringtemplate-3.2.1.jar
    Downloaded: http://overture.au.dk/artifactory/remote-repos/org/overturetool/astcreator/astcreator/1.6.8/astcreator-1.6.8.jar (301 KB at 4849.7 KB/sec)
    Downloading: http://overture.au.dk/artifactory/remote-repos/antlr/antlr/2.7.7/antlr-2.7.7.jar
    Downloaded: http://overture.au.dk/artifactory/remote-repos/org/antlr/antlr-runtime/3.5/antlr-runtime-3.5.jar (164 KB at 2925.1 KB/sec)
    Downloading: http://overture.au.dk/artifactory/remote-repos/org/apache/maven/plugins/maven-project-info-reports-plugin/2.1.1/maven-project-info-reports-plugin-2.1.1.jar
    Downloaded: http://overture.au.dk/artifactory/remote-repos/org/antlr/ST4/4.0.7/ST4-4.0.7.jar (231 KB at 3719.2 KB/sec)
    Downloading: http://overture.au.dk/artifactory/remote-repos/org/apache/maven/reporting/maven-reporting-impl/2.0.4.1/maven-reporting-impl-2.0.4.1.jar
    Downloaded: http://overture.au.dk/artifactory/remote-repos/org/antlr/stringtemplate/3.2.1/stringtemplate-3.2.1.jar (146 KB at 2460.1 KB/sec)
    Downloading: http://overture.au.dk/artifactory/remote-repos/org/apache/maven/shared/maven-doxia-tools/1.0.1/maven-doxia-tools-1.0.1.jar
    Downloaded: http://overture.au.dk/artifactory/remote-repos/org/antlr/antlr/3.5/antlr-3.5.jar (1118 KB at 16438.8 KB/sec)
    Downloading: http://overture.au.dk/artifactory/remote-repos/commons-io/commons-io/1.4/commons-io-1.4.jar
    Downloaded: http://overture.au.dk/artifactory/remote-repos/org/apache/maven/reporting/maven-reporting-impl/2.0.4.1/maven-reporting-impl-2.0.4.1.jar (19 KB at 1652.8 KB/sec)
    Downloading: http://overture.au.dk/artifactory/remote-repos/org/apache/maven/shared/maven-shared-jar/1.0/maven-shared-jar-1.0.jar
    Downloaded: http://overture.au.dk/artifactory/remote-repos/commons-io/commons-io/1.4/commons-io-1.4.jar (107 KB at 3672.0 KB/sec)
    Downloading: http://overture.au.dk/artifactory/remote-repos/org/codehaus/plexus/plexus-digest/1.0/plexus-digest-1.0.jar
    Downloaded: http://overture.au.dk/artifactory/remote-repos/org/apache/maven/shared/maven-shared-jar/1.0/maven-shared-jar-1.0.jar (37 KB at 1506.8 KB/sec)
    Downloading: http://overture.au.dk/artifactory/remote-repos/org/apache/bcel/bcel/5.2/bcel-5.2.jar
    Downloaded: http://overture.au.dk/artifactory/remote-repos/org/apache/maven/shared/maven-doxia-tools/1.0.1/maven-doxia-tools-1.0.1.jar (38 KB at 1042.9 KB/sec)
    Downloading: http://overture.au.dk/artifactory/remote-repos/jakarta-regexp/jakarta-regexp/1.4/jakarta-regexp-1.4.jar
    Downloaded: http://overture.au.dk/artifactory/remote-repos/org/apache/maven/plugins/maven-project-info-reports-plugin/2.1.1/maven-project-info-reports-plugin-2.1.1.jar (206 KB at 4779.9 KB/sec)
    Downloading: http://overture.au.dk/artifactory/remote-repos/commons-collections/commons-collections/3.1/commons-collections-3.1.jar
    Downloaded: http://overture.au.dk/artifactory/remote-repos/org/codehaus/plexus/plexus-digest/1.0/plexus-digest-1.0.jar (12 KB at 579.0 KB/sec)
    Downloading: http://overture.au.dk/artifactory/remote-repos/org/apache/maven/wagon/wagon-ssh/1.0-beta-3/wagon-ssh-1.0-beta-3.jar
    Downloaded: http://overture.au.dk/artifactory/remote-repos/jakarta-regexp/jakarta-regexp/1.4/jakarta-regexp-1.4.jar (28 KB at 1860.4 KB/sec)
    Downloading: http://overture.au.dk/artifactory/remote-repos/com/jcraft/jsch/0.1.38/jsch-0.1.38.jar
    Downloaded: http://overture.au.dk/artifactory/remote-repos/org/apache/maven/wagon/wagon-ssh/1.0-beta-3/wagon-ssh-1.0-beta-3.jar (28 KB at 1845.7 KB/sec)
    Downloading: http://overture.au.dk/artifactory/remote-repos/org/apache/maven/wagon/wagon-ssh-common/1.0-beta-3/wagon-ssh-common-1.0-beta-3.jar
    Downloaded: http://overture.au.dk/artifactory/remote-repos/com/jcraft/jsch/0.1.38/jsch-0.1.38.jar (174 KB at 7547.0 KB/sec)
    Downloading: http://overture.au.dk/artifactory/remote-repos/org/apache/maven/wagon/wagon-file/1.0-beta-3/wagon-file-1.0-beta-3.jar
    Downloaded: http://overture.au.dk/artifactory/remote-repos/org/apache/maven/wagon/wagon-ssh-common/1.0-beta-3/wagon-ssh-common-1.0-beta-3.jar (24 KB at 1813.4 KB/sec)
    Downloading: http://overture.au.dk/artifactory/remote-repos/org/apache/maven/wagon/wagon-http-lightweight/1.0-beta-3/wagon-http-lightweight-1.0-beta-3.jar
    Downloaded: http://overture.au.dk/artifactory/remote-repos/antlr/antlr/2.7.7/antlr-2.7.7.jar (435 KB at 4886.0 KB/sec)
    Downloading: http://overture.au.dk/artifactory/remote-repos/org/apache/maven/wagon/wagon-http-shared/1.0-beta-3/wagon-http-shared-1.0-beta-3.jar
    Downloaded: http://overture.au.dk/artifactory/remote-repos/commons-collections/commons-collections/3.1/commons-collections-3.1.jar (547 KB at 11622.5 KB/sec)
    Downloading: http://overture.au.dk/artifactory/remote-repos/nekohtml/xercesMinimal/1.9.6.2/xercesMinimal-1.9.6.2.jar
    Downloaded: http://overture.au.dk/artifactory/remote-repos/org/apache/bcel/bcel/5.2/bcel-5.2.jar (521 KB at 9827.1 KB/sec)
    Downloading: http://overture.au.dk/artifactory/remote-repos/nekohtml/nekohtml/1.9.6.2/nekohtml-1.9.6.2.jar
    Downloaded: http://overture.au.dk/artifactory/remote-repos/org/apache/maven/wagon/wagon-file/1.0-beta-3/wagon-file-1.0-beta-3.jar (10 KB at 494.0 KB/sec)
    Downloading: http://overture.au.dk/artifactory/remote-repos/org/apache/maven/scm/maven-scm-api/1.1/maven-scm-api-1.1.jar
    Downloaded: http://overture.au.dk/artifactory/remote-repos/org/apache/maven/scm/maven-scm-api/1.1/maven-scm-api-1.1.jar (81 KB at 3352.7 KB/sec)
    Downloading: http://overture.au.dk/artifactory/remote-repos/org/apache/maven/scm/maven-scm-manager-plexus/1.1/maven-scm-manager-plexus-1.1.jar
    Downloaded: http://overture.au.dk/artifactory/remote-repos/org/apache/maven/scm/maven-scm-manager-plexus/1.1/maven-scm-manager-plexus-1.1.jar (10 KB at 657.3 KB/sec)
    Downloading: http://overture.au.dk/artifactory/remote-repos/org/apache/maven/scm/maven-scm-provider-perforce/1.1/maven-scm-provider-perforce-1.1.jar
    Downloaded: http://overture.au.dk/artifactory/remote-repos/org/apache/maven/scm/maven-scm-provider-perforce/1.1/maven-scm-provider-perforce-1.1.jar (64 KB at 3352.7 KB/sec)
    Downloading: http://overture.au.dk/artifactory/remote-repos/org/apache/maven/scm/maven-scm-provider-starteam/1.1/maven-scm-provider-starteam-1.1.jar
    Downloaded: http://overture.au.dk/artifactory/remote-repos/org/apache/maven/scm/maven-scm-provider-starteam/1.1/maven-scm-provider-starteam-1.1.jar (68 KB at 4826.5 KB/sec)
    Downloading: http://overture.au.dk/artifactory/remote-repos/org/apache/maven/scm/maven-scm-provider-svn-commons/1.1/maven-scm-provider-svn-commons-1.1.jar
    Downloaded: http://overture.au.dk/artifactory/remote-repos/org/apache/maven/scm/maven-scm-provider-svn-commons/1.1/maven-scm-provider-svn-commons-1.1.jar (37 KB at 2808.1 KB/sec)
    Downloading: http://overture.au.dk/artifactory/remote-repos/org/apache/maven/scm/maven-scm-provider-svnexe/1.1/maven-scm-provider-svnexe-1.1.jar
    Downloaded: http://overture.au.dk/artifactory/remote-repos/org/apache/maven/scm/maven-scm-provider-svnexe/1.1/maven-scm-provider-svnexe-1.1.jar (58 KB at 4414.4 KB/sec)
    Downloading: http://overture.au.dk/artifactory/remote-repos/org/apache/maven/scm/maven-scm-provider-cvs-commons/1.1/maven-scm-provider-cvs-commons-1.1.jar
    Downloaded: http://overture.au.dk/artifactory/remote-repos/org/apache/maven/scm/maven-scm-provider-cvs-commons/1.1/maven-scm-provider-cvs-commons-1.1.jar (69 KB at 3420.8 KB/sec)
    Downloading: http://overture.au.dk/artifactory/remote-repos/org/apache/maven/scm/maven-scm-provider-cvsexe/1.1/maven-scm-provider-cvsexe-1.1.jar
    Downloaded: http://overture.au.dk/artifactory/remote-repos/org/apache/maven/scm/maven-scm-provider-cvsexe/1.1/maven-scm-provider-cvsexe-1.1.jar (26 KB at 930.4 KB/sec)
    Downloading: http://overture.au.dk/artifactory/remote-repos/org/apache/maven/scm/maven-scm-provider-cvsjava/1.1/maven-scm-provider-cvsjava-1.1.jar
    Downloaded: http://overture.au.dk/artifactory/remote-repos/org/apache/maven/scm/maven-scm-provider-cvsjava/1.1/maven-scm-provider-cvsjava-1.1.jar (40 KB at 2456.4 KB/sec)
    Downloading: http://overture.au.dk/artifactory/remote-repos/org/apache/maven/doxia/doxia-core/1.0-alpha-11/doxia-core-1.0-alpha-11.jar
    Downloaded: http://overture.au.dk/artifactory/remote-repos/org/apache/maven/doxia/doxia-core/1.0-alpha-11/doxia-core-1.0-alpha-11.jar (54 KB at 3811.5 KB/sec)
    Downloading: http://overture.au.dk/artifactory/remote-repos/org/apache/maven/doxia/doxia-module-xhtml/1.0-alpha-11/doxia-module-xhtml-1.0-alpha-11.jar
    Downloaded: http://overture.au.dk/artifactory/remote-repos/org/apache/maven/doxia/doxia-module-xhtml/1.0-alpha-11/doxia-module-xhtml-1.0-alpha-11.jar (21 KB at 1613.4 KB/sec)
    Downloading: http://overture.au.dk/artifactory/remote-repos/org/apache/maven/doxia/doxia-sink-api/1.0-alpha-11/doxia-sink-api-1.0-alpha-11.jar
    Downloaded: http://overture.au.dk/artifactory/remote-repos/org/apache/maven/doxia/doxia-sink-api/1.0-alpha-11/doxia-sink-api-1.0-alpha-11.jar (10 KB at 310.6 KB/sec)
    Downloading: http://overture.au.dk/artifactory/remote-repos/org/apache/maven/doxia/doxia-decoration-model/1.0-alpha-11/doxia-decoration-model-1.0-alpha-11.jar
    Downloaded: http://overture.au.dk/artifactory/remote-repos/org/apache/maven/wagon/wagon-http-lightweight/1.0-beta-3/wagon-http-lightweight-1.0-beta-3.jar (14 KB at 24.8 KB/sec)
    Downloading: http://overture.au.dk/artifactory/remote-repos/org/apache/maven/doxia/doxia-site-renderer/1.0-alpha-11/doxia-site-renderer-1.0-alpha-11.jar
    Downloaded: http://overture.au.dk/artifactory/remote-repos/nekohtml/xercesMinimal/1.9.6.2/xercesMinimal-1.9.6.2.jar (39 KB at 71.8 KB/sec)
    Downloading: http://overture.au.dk/artifactory/remote-repos/org/apache/maven/doxia/doxia-module-apt/1.0-alpha-11/doxia-module-apt-1.0-alpha-11.jar
    Downloaded: http://overture.au.dk/artifactory/remote-repos/org/apache/maven/wagon/wagon-http-shared/1.0-beta-3/wagon-http-shared-1.0-beta-3.jar (19 KB at 34.4 KB/sec)
    Downloading: http://overture.au.dk/artifactory/remote-repos/org/apache/maven/doxia/doxia-module-fml/1.0-alpha-11/doxia-module-fml-1.0-alpha-11.jar
    Downloaded: http://overture.au.dk/artifactory/remote-repos/org/apache/maven/doxia/doxia-decoration-model/1.0-alpha-11/doxia-decoration-model-1.0-alpha-11.jar (49 KB at 151.0 KB/sec)
    Downloading: http://overture.au.dk/artifactory/remote-repos/org/apache/maven/doxia/doxia-module-xdoc/1.0-alpha-11/doxia-module-xdoc-1.0-alpha-11.jar
    Downloaded: http://overture.au.dk/artifactory/remote-repos/nekohtml/nekohtml/1.9.6.2/nekohtml-1.9.6.2.jar (110 KB at 198.3 KB/sec)
    Downloading: http://overture.au.dk/artifactory/remote-repos/org/codehaus/plexus/plexus-utils/1.5.5/plexus-utils-1.5.5.jar
    Downloaded: http://overture.au.dk/artifactory/remote-repos/org/apache/maven/doxia/doxia-module-apt/1.0-alpha-11/doxia-module-apt-1.0-alpha-11.jar (46 KB at 2686.1 KB/sec)
    Downloaded: http://overture.au.dk/artifactory/remote-repos/org/apache/maven/doxia/doxia-site-renderer/1.0-alpha-11/doxia-site-renderer-1.0-alpha-11.jar (45 KB at 2493.4 KB/sec)
    Downloaded: http://overture.au.dk/artifactory/remote-repos/org/apache/maven/doxia/doxia-module-fml/1.0-alpha-11/doxia-module-fml-1.0-alpha-11.jar (18 KB at 890.0 KB/sec)
    Downloaded: http://overture.au.dk/artifactory/remote-repos/org/apache/maven/doxia/doxia-module-xdoc/1.0-alpha-11/doxia-module-xdoc-1.0-alpha-11.jar (27 KB at 1916.7 KB/sec)
    Downloaded: http://overture.au.dk/artifactory/remote-repos/org/codehaus/plexus/plexus-utils/1.5.5/plexus-utils-1.5.5.jar (246 KB at 9088.4 KB/sec)
    [INFO] Preparing for tree generation...
    [INFO] Configuring extension
    [INFO] 	Extension base dependency is: "org.overturetool.core.codegen:ir"
    [INFO] 	Searching for base dependency artifact
    [INFO] 	Extension base artifact found - exstracting base tree definition files
    [INFO] 	Setting base definition files to:
    [INFO] 		base: /var/lib/jenkins/workspace/vdm2c-release/core/vdm2c/target/ir.ast
    [INFO] 		base tostring: /var/lib/jenkins/workspace/vdm2c-release/core/vdm2c/target/ir.ast.tostring
    [INFO] 	Extension base artifact configured.
    [INFO] Checking if generation required.
    [INFO] Full AST generation needed
    [INFO] Generating...
    [INFO] Generator starting with input: /var/lib/jenkins/workspace/vdm2c-release/core/vdm2c/target/ir.ast
    [INFO] Generator starting with extension input: /var/lib/jenkins/workspace/vdm2c-release/core/vdm2c/src/main/resources/ccg.ast
    Generating base and extension tree, standby ... 
    Extension tree only: true
    Adding aspect fields: PIRBase.{sourceNode,tag,metaData}
    WARNING: Using SubProduction class found without using package name. SImportsIRBase
    WARNING: Using SubProduction class found without using package name. SImportIRBase
    Adding aspect fields: SImportIRBase.{name,renamed,fromModuleName}
    Adding aspect fields: SValueImportBase.{importType}
    WARNING: Using SubProduction class found without using package name. SExportsIRBase
    WARNING: Using SubProduction class found without using package name. SExportIRBase
    Adding aspect fields: SExportIRBase.{decl}
    WARNING: Using SubProduction class found without using package name. SPatternIRBase
    WARNING: Using SubProduction class found without using package name. SBindIRBase
    Adding aspect fields: SBindIRBase.{pattern}
    WARNING: Using SubProduction class found without using package name. SMultipleBindIRBase
    Adding aspect fields: SMultipleBindIRBase.{patterns}
    WARNING: Using SubProduction class found without using package name. SNameIRBase
    WARNING: Using SubProduction class found without using package name. SDeclIRBase
    Adding aspect fields: SClassDeclBase.{globalMetaData,package,dependencies,access,abstract,static,name,fields,invariant,methods,functions,traces,superNames,thread,innerClasses,interfaces,typeDecls,perSyncs,mutexSyncs}
    WARNING: Using SubProduction class found without using package name. SStateDesignatorIRBase
    Adding aspect fields: SStateDesignatorIRBase.{type}
    WARNING: Using SubProduction class found without using package name. SObjectDesignatorIRBase
    WARNING: Using SubProduction class found without using package name. SLocalParamIRBase
    WARNING: Using SubProduction class found without using package name. SStmIRBase
    Adding aspect fields: SCallStmBase.{type,isStatic,name,args}
    WARNING: Using SubProduction class found without using package name. SLetBeStIRBase
    WARNING: Using SubProduction class found without using package name. SExpIRBase
    Adding aspect fields: SExpIRBase.{type}
    WARNING: Using SubProduction class found without using package name. SModifierIRBase
    Adding aspect fields: SIsExpBase.{exp}
    Adding aspect fields: SVarExpBase.{isLambda,isLocal,name}
    Adding aspect fields: SQuantifierExpBase.{bindList,predicate}
    Adding aspect fields: SBinaryExpBase.{left,right}
    Adding aspect fields: SUnaryExpBase.{exp}
    WARNING: Using SubProduction class found without using package name. STypeIRBase
    Adding aspect fields: STypeIRBase.{optional,namedInvType}
    Adding aspect fields: SSetTypeBase.{empty,setOf}
    Adding aspect fields: SSeqTypeBase.{empty,seq1,seqOf}
    Adding aspect fields: SMapTypeBase.{empty,injective,from,to}
    WARNING: Using SubProduction class found without using package name. STermIRBase
    WARNING: Using SubProduction class found without using package name. STraceDeclIRBase
    WARNING: Using SubProduction class found without using package name. STraceCoreDeclIRBase
    Retry Create interfaces - with 17 not yet created interfaces.
    Done creating interfaces
    Generating toString add on...
    WARNING: Using SubProduction class found without using package name. SExpIRBase
    WARNING: Using SubProduction class found without using package name. SStmIRBase
    WARNING: Using SubProduction class found without using package name. SDeclIRBase
    Done creating interfaces
    Generating toString add on...
    ***********************************************
    AST Creator Extensions
    ***********************************************
    Generating enumerations...
    Generating analysis visitors...
    Analysis...Answer...Question...Question-Answer...Depth-First...
    Writing sources to the file system, standby ... 
    Destination: /var/lib/jenkins/workspace/vdm2c-release/core/vdm2c/target/generated-sources/astCreator
    Copying base classes to destination...
    Writing source files.:
    ................................
    File write completed in 1 secs
    Created AST with extensions.
    [INFO] 
    [INFO] --- build-helper-maven-plugin:1.7:add-source (add-source) @ vdm2c ---
    [INFO] Source directory: /var/lib/jenkins/workspace/vdm2c-release/core/vdm2c/target/generated-sources/astCreator added.
    [INFO] 
    [INFO] --- maven-resources-plugin:2.6:resources (default-resources) @ vdm2c ---
    [INFO] Using 'UTF-8' encoding to copy filtered resources.
    [INFO] Copying 190 resources
    [INFO] 
    [INFO] --- maven-compiler-plugin:3.0:compile (default-compile) @ vdm2c ---
    [INFO] Changes detected - recompiling the module!
    [INFO] Compiling 92 source files to /var/lib/jenkins/workspace/vdm2c-release/core/vdm2c/target/classes
    [WARNING] /var/lib/jenkins/workspace/vdm2c-release/core/vdm2c/src/main/java/org/overture/codegen/vdm2c/transformations/FreeLocalBlockDeclsTrans.java: /var/lib/jenkins/workspace/vdm2c-release/core/vdm2c/src/main/java/org/overture/codegen/vdm2c/transformations/FreeLocalBlockDeclsTrans.java uses unchecked or unsafe operations.
    [WARNING] /var/lib/jenkins/workspace/vdm2c-release/core/vdm2c/src/main/java/org/overture/codegen/vdm2c/transformations/FreeLocalBlockDeclsTrans.java: Recompile with -Xlint:unchecked for details.
    [INFO] 
    [INFO] --- maven-resources-plugin:2.6:testResources (default-testResources) @ vdm2c ---
    [INFO] Using 'UTF-8' encoding to copy filtered resources.
    [INFO] Copying 96 resources
    [INFO] 
    [INFO] --- maven-compiler-plugin:3.0:testCompile (default-testCompile) @ vdm2c ---
    [INFO] Changes detected - recompiling the module!
    [INFO] Compiling 8 source files to /var/lib/jenkins/workspace/vdm2c-release/core/vdm2c/target/test-classes
    [INFO] 
    [INFO] --- maven-surefire-plugin:2.19:test (default-test) @ vdm2c ---
    Downloading: http://overture.au.dk/artifactory/remote-repos/org/apache/maven/surefire/surefire-junit4/2.19/surefire-junit4-2.19.pom
    Downloaded: http://overture.au.dk/artifactory/remote-repos/org/apache/maven/surefire/surefire-junit4/2.19/surefire-junit4-2.19.pom (4 KB at 132.8 KB/sec)
    Downloading: http://overture.au.dk/artifactory/remote-repos/org/apache/maven/surefire/surefire-providers/2.19/surefire-providers-2.19.pom
    Downloaded: http://overture.au.dk/artifactory/remote-repos/org/apache/maven/surefire/surefire-providers/2.19/surefire-providers-2.19.pom (3 KB at 92.6 KB/sec)
    Downloading: http://overture.au.dk/artifactory/remote-repos/org/apache/maven/surefire/surefire-junit4/2.19/surefire-junit4-2.19.jar
    Downloaded: http://overture.au.dk/artifactory/remote-repos/org/apache/maven/surefire/surefire-junit4/2.19/surefire-junit4-2.19.jar (75 KB at 2643.2 KB/sec)
    
    -------------------------------------------------------
     T E S T S
    -------------------------------------------------------
    Running org.overture.codegen.vdm2c.NativeClassesTests
    Tests run: 24, Failures: 0, Errors: 0, Skipped: 0, Time elapsed: 93.32 sec - in org.overture.codegen.vdm2c.NativeClassesTests
    Running org.overture.codegen.vdm2c.ExternalTests
    Tests run: 1, Failures: 0, Errors: 0, Skipped: 0, Time elapsed: 0 sec - in org.overture.codegen.vdm2c.ExternalTests
    Running org.overture.codegen.vdm2c.NativeTests
    Tests run: 13, Failures: 0, Errors: 0, Skipped: 0, Time elapsed: 42.612 sec - in org.overture.codegen.vdm2c.NativeTests
    
    Results :
    
    Tests run: 38, Failures: 0, Errors: 0, Skipped: 0
    
    [INFO] 
    [INFO] --- maven-jar-plugin:2.4:jar (default-jar) @ vdm2c ---
    [INFO] Building jar: /var/lib/jenkins/workspace/vdm2c-release/core/vdm2c/target/vdm2c-0.0.6.jar
    [INFO] 
    [INFO] --- maven-source-plugin:2.1.2:jar-no-fork (attach-sources) @ vdm2c ---
    [INFO] org already added, skipping
    [INFO] org/overture already added, skipping
    [INFO] org/overture/codegen already added, skipping
    [INFO] org/overture/codegen/vdm2c already added, skipping
    [INFO] Building jar: /var/lib/jenkins/workspace/vdm2c-release/core/vdm2c/target/vdm2c-0.0.6-sources.jar
    [INFO] org already added, skipping
    [INFO] org/overture already added, skipping
    [INFO] org/overture/codegen already added, skipping
    [INFO] org/overture/codegen/vdm2c already added, skipping
    [INFO] 
    [INFO] --- maven-assembly-plugin:2.4:single (make-my-jar-with-dependencies) @ vdm2c ---
    Downloading: http://overture.au.dk/artifactory/remote-repos/org/apache/maven/shared/maven-common-artifact-filters/1.4/maven-common-artifact-filters-1.4.pom
    Downloaded: http://overture.au.dk/artifactory/remote-repos/org/apache/maven/shared/maven-common-artifact-filters/1.4/maven-common-artifact-filters-1.4.pom (4 KB at 111.3 KB/sec)
    Downloading: http://overture.au.dk/artifactory/remote-repos/org/codehaus/plexus/plexus-utils/2.1/plexus-utils-2.1.pom
    Downloaded: http://overture.au.dk/artifactory/remote-repos/org/codehaus/plexus/plexus-utils/2.1/plexus-utils-2.1.pom (4 KB at 157.6 KB/sec)
    Downloading: http://overture.au.dk/artifactory/remote-repos/org/codehaus/plexus/plexus-archiver/2.2/plexus-archiver-2.2.pom
    Downloaded: http://overture.au.dk/artifactory/remote-repos/org/codehaus/plexus/plexus-archiver/2.2/plexus-archiver-2.2.pom (4 KB at 95.1 KB/sec)
    Downloading: http://overture.au.dk/artifactory/remote-repos/org/codehaus/plexus/plexus-components/1.1.20/plexus-components-1.1.20.pom
    Downloaded: http://overture.au.dk/artifactory/remote-repos/org/codehaus/plexus/plexus-components/1.1.20/plexus-components-1.1.20.pom (3 KB at 151.7 KB/sec)
    Downloading: http://overture.au.dk/artifactory/remote-repos/org/codehaus/plexus/plexus-utils/3.0.7/plexus-utils-3.0.7.pom
    Downloaded: http://overture.au.dk/artifactory/remote-repos/org/codehaus/plexus/plexus-utils/3.0.7/plexus-utils-3.0.7.pom (3 KB at 90.9 KB/sec)
    Downloading: http://overture.au.dk/artifactory/remote-repos/org/apache/maven/shared/file-management/1.1/file-management-1.1.pom
    Downloaded: http://overture.au.dk/artifactory/remote-repos/org/apache/maven/shared/file-management/1.1/file-management-1.1.pom (3 KB at 123.6 KB/sec)
    Downloading: http://overture.au.dk/artifactory/remote-repos/org/apache/maven/shared/maven-shared-components/4/maven-shared-components-4.pom
    Downloaded: http://overture.au.dk/artifactory/remote-repos/org/apache/maven/shared/maven-shared-components/4/maven-shared-components-4.pom (3 KB at 86.3 KB/sec)
    Downloading: http://overture.au.dk/artifactory/remote-repos/org/apache/maven/maven-parent/4/maven-parent-4.pom
    Downloaded: http://overture.au.dk/artifactory/remote-repos/org/apache/maven/maven-parent/4/maven-parent-4.pom (10 KB at 348.6 KB/sec)
    Downloading: http://overture.au.dk/artifactory/remote-repos/org/apache/maven/shared/maven-shared-io/1.0/maven-shared-io-1.0.pom
    Downloaded: http://overture.au.dk/artifactory/remote-repos/org/apache/maven/shared/maven-shared-io/1.0/maven-shared-io-1.0.pom (3 KB at 95.4 KB/sec)
    Downloading: http://overture.au.dk/artifactory/remote-repos/org/codehaus/plexus/plexus-io/2.0.6/plexus-io-2.0.6.pom
    Downloaded: http://overture.au.dk/artifactory/remote-repos/org/codehaus/plexus/plexus-io/2.0.6/plexus-io-2.0.6.pom (3 KB at 67.5 KB/sec)
    Downloading: http://overture.au.dk/artifactory/remote-repos/org/codehaus/plexus/plexus-components/1.2/plexus-components-1.2.pom
    Downloaded: http://overture.au.dk/artifactory/remote-repos/org/codehaus/plexus/plexus-components/1.2/plexus-components-1.2.pom (3 KB at 72.8 KB/sec)
    Downloading: http://overture.au.dk/artifactory/remote-repos/org/apache/maven/shared/maven-repository-builder/1.0-alpha-2/maven-repository-builder-1.0-alpha-2.pom
    Downloaded: http://overture.au.dk/artifactory/remote-repos/org/apache/maven/shared/maven-repository-builder/1.0-alpha-2/maven-repository-builder-1.0-alpha-2.pom (4 KB at 137.1 KB/sec)
    Downloading: http://overture.au.dk/artifactory/remote-repos/org/apache/maven/shared/maven-common-artifact-filters/1.0-alpha-1/maven-common-artifact-filters-1.0-alpha-1.pom
    Downloaded: http://overture.au.dk/artifactory/remote-repos/org/apache/maven/shared/maven-common-artifact-filters/1.0-alpha-1/maven-common-artifact-filters-1.0-alpha-1.pom (2 KB at 97.7 KB/sec)
    Downloading: http://overture.au.dk/artifactory/remote-repos/org/apache/maven/shared/maven-shared-components/6/maven-shared-components-6.pom
    Downloaded: http://overture.au.dk/artifactory/remote-repos/org/apache/maven/shared/maven-shared-components/6/maven-shared-components-6.pom (4 KB at 178.4 KB/sec)
    Downloading: http://overture.au.dk/artifactory/remote-repos/org/apache/maven/shared/maven-common-artifact-filters/1.4/maven-common-artifact-filters-1.4.jar
    Downloading: http://overture.au.dk/artifactory/remote-repos/org/codehaus/plexus/plexus-archiver/2.2/plexus-archiver-2.2.jar
    Downloading: http://overture.au.dk/artifactory/remote-repos/org/apache/maven/shared/file-management/1.1/file-management-1.1.jar
    Downloading: http://overture.au.dk/artifactory/remote-repos/org/codehaus/plexus/plexus-io/2.0.6/plexus-io-2.0.6.jar
    Downloading: http://overture.au.dk/artifactory/remote-repos/org/apache/maven/shared/maven-repository-builder/1.0-alpha-2/maven-repository-builder-1.0-alpha-2.jar
    Downloaded: http://overture.au.dk/artifactory/remote-repos/org/apache/maven/shared/maven-common-artifact-filters/1.4/maven-common-artifact-filters-1.4.jar (31 KB at 907.6 KB/sec)
    Downloaded: http://overture.au.dk/artifactory/remote-repos/org/apache/maven/shared/file-management/1.1/file-management-1.1.jar (31 KB at 922.4 KB/sec)
    Downloaded: http://overture.au.dk/artifactory/remote-repos/org/apache/maven/shared/maven-repository-builder/1.0-alpha-2/maven-repository-builder-1.0-alpha-2.jar (23 KB at 628.1 KB/sec)
    Downloaded: http://overture.au.dk/artifactory/remote-repos/org/codehaus/plexus/plexus-io/2.0.6/plexus-io-2.0.6.jar (57 KB at 1173.3 KB/sec)
    Downloaded: http://overture.au.dk/artifactory/remote-repos/org/codehaus/plexus/plexus-archiver/2.2/plexus-archiver-2.2.jar (181 KB at 3225.7 KB/sec)
    [INFO] Building jar: /var/lib/jenkins/workspace/vdm2c-release/core/vdm2c/target/vdm2c-0.0.6-jar-with-dependencies.jar
    [INFO] 
    [INFO] --- maven-javadoc-plugin:2.10.3:jar (attach-javadocs) @ vdm2c ---
    Downloading: http://overture.au.dk/artifactory/remote-repos/org/apache/maven/doxia/doxia-sink-api/1.4/doxia-sink-api-1.4.pom
    Downloaded: http://overture.au.dk/artifactory/remote-repos/org/apache/maven/doxia/doxia-sink-api/1.4/doxia-sink-api-1.4.pom (2 KB at 40.4 KB/sec)
    Downloading: http://overture.au.dk/artifactory/remote-repos/org/apache/maven/doxia/doxia/1.4/doxia-1.4.pom
    Downloaded: http://overture.au.dk/artifactory/remote-repos/org/apache/maven/doxia/doxia/1.4/doxia-1.4.pom (18 KB at 674.4 KB/sec)
    Downloading: http://overture.au.dk/artifactory/remote-repos/org/apache/maven/doxia/doxia-logging-api/1.4/doxia-logging-api-1.4.pom
    Downloaded: http://overture.au.dk/artifactory/remote-repos/org/apache/maven/doxia/doxia-logging-api/1.4/doxia-logging-api-1.4.pom (2 KB at 62.5 KB/sec)
    Downloading: http://overture.au.dk/artifactory/remote-repos/org/apache/maven/doxia/doxia-site-renderer/1.4/doxia-site-renderer-1.4.pom
    Downloaded: http://overture.au.dk/artifactory/remote-repos/org/apache/maven/doxia/doxia-site-renderer/1.4/doxia-site-renderer-1.4.pom (6 KB at 331.5 KB/sec)
    Downloading: http://overture.au.dk/artifactory/remote-repos/org/apache/maven/doxia/doxia-sitetools/1.4/doxia-sitetools-1.4.pom
    Downloaded: http://overture.au.dk/artifactory/remote-repos/org/apache/maven/doxia/doxia-sitetools/1.4/doxia-sitetools-1.4.pom (17 KB at 931.2 KB/sec)
    Downloading: http://overture.au.dk/artifactory/remote-repos/org/apache/maven/doxia/doxia-core/1.4/doxia-core-1.4.pom
    Downloaded: http://overture.au.dk/artifactory/remote-repos/org/apache/maven/doxia/doxia-core/1.4/doxia-core-1.4.pom (4 KB at 189.1 KB/sec)
    Downloading: http://overture.au.dk/artifactory/remote-repos/xerces/xercesImpl/2.9.1/xercesImpl-2.9.1.pom
    Downloaded: http://overture.au.dk/artifactory/remote-repos/xerces/xercesImpl/2.9.1/xercesImpl-2.9.1.pom (236 B at 6.4 KB/sec)
    Downloading: http://overture.au.dk/artifactory/remote-repos/org/apache/httpcomponents/httpclient/4.0.2/httpclient-4.0.2.pom
    Downloaded: http://overture.au.dk/artifactory/remote-repos/org/apache/httpcomponents/httpclient/4.0.2/httpclient-4.0.2.pom (8 KB at 215.3 KB/sec)
    Downloading: http://overture.au.dk/artifactory/remote-repos/org/apache/httpcomponents/httpcomponents-client/4.0.2/httpcomponents-client-4.0.2.pom
    Downloaded: http://overture.au.dk/artifactory/remote-repos/org/apache/httpcomponents/httpcomponents-client/4.0.2/httpcomponents-client-4.0.2.pom (9 KB at 486.4 KB/sec)
    Downloading: http://overture.au.dk/artifactory/remote-repos/org/apache/httpcomponents/project/4.1/project-4.1.pom
    Downloaded: http://overture.au.dk/artifactory/remote-repos/org/apache/httpcomponents/project/4.1/project-4.1.pom (16 KB at 432.4 KB/sec)
    Downloading: http://overture.au.dk/artifactory/remote-repos/org/apache/httpcomponents/httpcore/4.0.1/httpcore-4.0.1.pom
    Downloaded: http://overture.au.dk/artifactory/remote-repos/org/apache/httpcomponents/httpcore/4.0.1/httpcore-4.0.1.pom (5 KB at 265.2 KB/sec)
    Downloading: http://overture.au.dk/artifactory/remote-repos/org/apache/httpcomponents/httpcomponents-core/4.0.1/httpcomponents-core-4.0.1.pom
    Downloaded: http://overture.au.dk/artifactory/remote-repos/org/apache/httpcomponents/httpcomponents-core/4.0.1/httpcomponents-core-4.0.1.pom (10 KB at 480.7 KB/sec)
    Downloading: http://overture.au.dk/artifactory/remote-repos/org/apache/httpcomponents/project/4.0/project-4.0.pom
    Downloaded: http://overture.au.dk/artifactory/remote-repos/org/apache/httpcomponents/project/4.0/project-4.0.pom (7 KB at 165.5 KB/sec)
    Downloading: http://overture.au.dk/artifactory/remote-repos/commons-codec/commons-codec/1.3/commons-codec-1.3.pom
    Downloaded: http://overture.au.dk/artifactory/remote-repos/commons-codec/commons-codec/1.3/commons-codec-1.3.pom (6 KB at 205.5 KB/sec)
    Downloading: http://overture.au.dk/artifactory/remote-repos/org/apache/maven/doxia/doxia-decoration-model/1.4/doxia-decoration-model-1.4.pom
    Downloaded: http://overture.au.dk/artifactory/remote-repos/org/apache/maven/doxia/doxia-decoration-model/1.4/doxia-decoration-model-1.4.pom (3 KB at 104.5 KB/sec)
    Downloading: http://overture.au.dk/artifactory/remote-repos/org/apache/maven/doxia/doxia-module-xhtml/1.4/doxia-module-xhtml-1.4.pom
    Downloaded: http://overture.au.dk/artifactory/remote-repos/org/apache/maven/doxia/doxia-module-xhtml/1.4/doxia-module-xhtml-1.4.pom (2 KB at 56.9 KB/sec)
    Downloading: http://overture.au.dk/artifactory/remote-repos/org/apache/maven/doxia/doxia-modules/1.4/doxia-modules-1.4.pom
    Downloaded: http://overture.au.dk/artifactory/remote-repos/org/apache/maven/doxia/doxia-modules/1.4/doxia-modules-1.4.pom (3 KB at 116.4 KB/sec)
    Downloading: http://overture.au.dk/artifactory/remote-repos/org/apache/maven/doxia/doxia-module-fml/1.4/doxia-module-fml-1.4.pom
    Downloaded: http://overture.au.dk/artifactory/remote-repos/org/apache/maven/doxia/doxia-module-fml/1.4/doxia-module-fml-1.4.pom (5 KB at 167.6 KB/sec)
    Downloading: http://overture.au.dk/artifactory/remote-repos/org/apache/velocity/velocity-tools/2.0/velocity-tools-2.0.pom
    Downloaded: http://overture.au.dk/artifactory/remote-repos/org/apache/velocity/velocity-tools/2.0/velocity-tools-2.0.pom (18 KB at 538.6 KB/sec)
    Downloading: http://overture.au.dk/artifactory/remote-repos/commons-digester/commons-digester/1.8/commons-digester-1.8.pom
    Downloaded: http://overture.au.dk/artifactory/remote-repos/commons-digester/commons-digester/1.8/commons-digester-1.8.pom (7 KB at 63.9 KB/sec)
    Downloading: http://overture.au.dk/artifactory/remote-repos/commons-logging/commons-logging/1.1/commons-logging-1.1.pom
    Downloaded: http://overture.au.dk/artifactory/remote-repos/commons-logging/commons-logging/1.1/commons-logging-1.1.pom (7 KB at 232.2 KB/sec)
    Downloading: http://overture.au.dk/artifactory/remote-repos/logkit/logkit/1.0.1/logkit-1.0.1.pom
    Downloaded: http://overture.au.dk/artifactory/remote-repos/logkit/logkit/1.0.1/logkit-1.0.1.pom (147 B at 9.0 KB/sec)
    Downloading: http://overture.au.dk/artifactory/remote-repos/avalon-framework/avalon-framework/4.1.3/avalon-framework-4.1.3.pom
    Downloaded: http://overture.au.dk/artifactory/remote-repos/avalon-framework/avalon-framework/4.1.3/avalon-framework-4.1.3.pom (167 B at 10.2 KB/sec)
    Downloading: http://overture.au.dk/artifactory/remote-repos/javax/servlet/servlet-api/2.3/servlet-api-2.3.pom
    Downloaded: http://overture.au.dk/artifactory/remote-repos/javax/servlet/servlet-api/2.3/servlet-api-2.3.pom (156 B at 9.5 KB/sec)
    Downloading: http://overture.au.dk/artifactory/remote-repos/commons-chain/commons-chain/1.1/commons-chain-1.1.pom
    Downloaded: http://overture.au.dk/artifactory/remote-repos/commons-chain/commons-chain/1.1/commons-chain-1.1.pom (6 KB at 189.4 KB/sec)
    Downloading: http://overture.au.dk/artifactory/remote-repos/commons-validator/commons-validator/1.3.1/commons-validator-1.3.1.pom
    Downloaded: http://overture.au.dk/artifactory/remote-repos/commons-validator/commons-validator/1.3.1/commons-validator-1.3.1.pom (9 KB at 303.9 KB/sec)
    Downloading: http://overture.au.dk/artifactory/remote-repos/dom4j/dom4j/1.1/dom4j-1.1.pom
    Downloaded: http://overture.au.dk/artifactory/remote-repos/dom4j/dom4j/1.1/dom4j-1.1.pom (142 B at 1.5 KB/sec)
    Downloading: http://overture.au.dk/artifactory/remote-repos/sslext/sslext/1.2-0/sslext-1.2-0.pom
    Downloaded: http://overture.au.dk/artifactory/remote-repos/sslext/sslext/1.2-0/sslext-1.2-0.pom (653 B at 27.7 KB/sec)
    Downloading: http://overture.au.dk/artifactory/remote-repos/org/apache/struts/struts-core/1.3.8/struts-core-1.3.8.pom
    Downloaded: http://overture.au.dk/artifactory/remote-repos/org/apache/struts/struts-core/1.3.8/struts-core-1.3.8.pom (5 KB at 162.0 KB/sec)
    Downloading: http://overture.au.dk/artifactory/remote-repos/org/apache/struts/struts-parent/1.3.8/struts-parent-1.3.8.pom
    Downloaded: http://overture.au.dk/artifactory/remote-repos/org/apache/struts/struts-parent/1.3.8/struts-parent-1.3.8.pom (10 KB at 286.8 KB/sec)
    Downloading: http://overture.au.dk/artifactory/remote-repos/org/apache/struts/struts-master/4/struts-master-4.pom
    Downloaded: http://overture.au.dk/artifactory/remote-repos/org/apache/struts/struts-master/4/struts-master-4.pom (12 KB at 361.1 KB/sec)
    Downloading: http://overture.au.dk/artifactory/remote-repos/org/apache/apache/2/apache-2.pom
    Downloaded: http://overture.au.dk/artifactory/remote-repos/org/apache/apache/2/apache-2.pom (4 KB at 40.2 KB/sec)
    Downloading: http://overture.au.dk/artifactory/remote-repos/antlr/antlr/2.7.2/antlr-2.7.2.pom
    Downloaded: http://overture.au.dk/artifactory/remote-repos/antlr/antlr/2.7.2/antlr-2.7.2.pom (145 B at 5.9 KB/sec)
    Downloading: http://overture.au.dk/artifactory/remote-repos/org/apache/struts/struts-taglib/1.3.8/struts-taglib-1.3.8.pom
    Downloaded: http://overture.au.dk/artifactory/remote-repos/org/apache/struts/struts-taglib/1.3.8/struts-taglib-1.3.8.pom (4 KB at 107.3 KB/sec)
    Downloading: http://overture.au.dk/artifactory/remote-repos/org/apache/struts/struts-tiles/1.3.8/struts-tiles-1.3.8.pom
    Downloaded: http://overture.au.dk/artifactory/remote-repos/org/apache/struts/struts-tiles/1.3.8/struts-tiles-1.3.8.pom (3 KB at 72.7 KB/sec)
    Downloading: http://overture.au.dk/artifactory/remote-repos/org/apache/velocity/velocity/1.6.2/velocity-1.6.2.pom
    Downloaded: http://overture.au.dk/artifactory/remote-repos/org/apache/velocity/velocity/1.6.2/velocity-1.6.2.pom (11 KB at 181.9 KB/sec)
    Downloading: http://overture.au.dk/artifactory/remote-repos/org/apache/httpcomponents/httpclient/4.2.3/httpclient-4.2.3.pom
    Downloaded: http://overture.au.dk/artifactory/remote-repos/org/apache/httpcomponents/httpclient/4.2.3/httpclient-4.2.3.pom (6 KB at 137.4 KB/sec)
    Downloading: http://overture.au.dk/artifactory/remote-repos/org/apache/httpcomponents/httpcomponents-client/4.2.3/httpcomponents-client-4.2.3.pom
    Downloaded: http://overture.au.dk/artifactory/remote-repos/org/apache/httpcomponents/httpcomponents-client/4.2.3/httpcomponents-client-4.2.3.pom (15 KB at 462.8 KB/sec)
    Downloading: http://overture.au.dk/artifactory/remote-repos/org/apache/httpcomponents/project/6/project-6.pom
    Downloaded: http://overture.au.dk/artifactory/remote-repos/org/apache/httpcomponents/project/6/project-6.pom (24 KB at 1045.6 KB/sec)
    Downloading: http://overture.au.dk/artifactory/remote-repos/org/apache/httpcomponents/httpcore/4.2.2/httpcore-4.2.2.pom
    Downloaded: http://overture.au.dk/artifactory/remote-repos/org/apache/httpcomponents/httpcore/4.2.2/httpcore-4.2.2.pom (6 KB at 292.1 KB/sec)
    Downloading: http://overture.au.dk/artifactory/remote-repos/org/apache/httpcomponents/httpcomponents-core/4.2.2/httpcomponents-core-4.2.2.pom
    Downloaded: http://overture.au.dk/artifactory/remote-repos/org/apache/httpcomponents/httpcomponents-core/4.2.2/httpcomponents-core-4.2.2.pom (12 KB at 622.5 KB/sec)
    Downloading: http://overture.au.dk/artifactory/remote-repos/commons-codec/commons-codec/1.6/commons-codec-1.6.pom
    Downloaded: http://overture.au.dk/artifactory/remote-repos/commons-codec/commons-codec/1.6/commons-codec-1.6.pom (11 KB at 213.6 KB/sec)
    Downloading: http://overture.au.dk/artifactory/remote-repos/com/thoughtworks/qdox/qdox/1.12.1/qdox-1.12.1.pom
    Downloaded: http://overture.au.dk/artifactory/remote-repos/com/thoughtworks/qdox/qdox/1.12.1/qdox-1.12.1.pom (18 KB at 747.2 KB/sec)
    Downloading: http://overture.au.dk/artifactory/remote-repos/org/codehaus/plexus/plexus-archiver/2.9/plexus-archiver-2.9.pom
    Downloaded: http://overture.au.dk/artifactory/remote-repos/org/codehaus/plexus/plexus-archiver/2.9/plexus-archiver-2.9.pom (5 KB at 170.6 KB/sec)
    Downloading: http://overture.au.dk/artifactory/remote-repos/org/codehaus/plexus/plexus-utils/3.0.20/plexus-utils-3.0.20.pom
    Downloaded: http://overture.au.dk/artifactory/remote-repos/org/codehaus/plexus/plexus-utils/3.0.20/plexus-utils-3.0.20.pom (4 KB at 109.4 KB/sec)
    Downloading: http://overture.au.dk/artifactory/remote-repos/org/codehaus/plexus/plexus/3.3.1/plexus-3.3.1.pom
    Downloaded: http://overture.au.dk/artifactory/remote-repos/org/codehaus/plexus/plexus/3.3.1/plexus-3.3.1.pom (20 KB at 688.5 KB/sec)
    Downloading: http://overture.au.dk/artifactory/remote-repos/org/codehaus/plexus/plexus-io/2.4/plexus-io-2.4.pom
    Downloaded: http://overture.au.dk/artifactory/remote-repos/org/codehaus/plexus/plexus-io/2.4/plexus-io-2.4.pom (4 KB at 182.0 KB/sec)
    Downloading: http://overture.au.dk/artifactory/remote-repos/org/apache/commons/commons-compress/1.9/commons-compress-1.9.pom
    Downloaded: http://overture.au.dk/artifactory/remote-repos/org/apache/commons/commons-compress/1.9/commons-compress-1.9.pom (12 KB at 338.3 KB/sec)
    Downloading: http://overture.au.dk/artifactory/remote-repos/org/apache/commons/commons-parent/34/commons-parent-34.pom
    Downloaded: http://overture.au.dk/artifactory/remote-repos/org/apache/commons/commons-parent/34/commons-parent-34.pom (55 KB at 1400.8 KB/sec)
    Downloading: http://overture.au.dk/artifactory/remote-repos/org/apache/maven/doxia/doxia-sink-api/1.4/doxia-sink-api-1.4.jar
    Downloading: http://overture.au.dk/artifactory/remote-repos/org/apache/maven/doxia/doxia-logging-api/1.4/doxia-logging-api-1.4.jar
    Downloading: http://overture.au.dk/artifactory/remote-repos/org/apache/maven/doxia/doxia-site-renderer/1.4/doxia-site-renderer-1.4.jar
    Downloading: http://overture.au.dk/artifactory/remote-repos/org/apache/maven/doxia/doxia-core/1.4/doxia-core-1.4.jar
    Downloading: http://overture.au.dk/artifactory/remote-repos/xerces/xercesImpl/2.9.1/xercesImpl-2.9.1.jar
    Downloaded: http://overture.au.dk/artifactory/remote-repos/org/apache/maven/doxia/doxia-logging-api/1.4/doxia-logging-api-1.4.jar (12 KB at 649.8 KB/sec)
    Downloading: http://overture.au.dk/artifactory/remote-repos/org/apache/maven/doxia/doxia-decoration-model/1.4/doxia-decoration-model-1.4.jar
    Downloaded: http://overture.au.dk/artifactory/remote-repos/org/apache/maven/doxia/doxia-sink-api/1.4/doxia-sink-api-1.4.jar (11 KB at 547.1 KB/sec)
    Downloading: http://overture.au.dk/artifactory/remote-repos/org/apache/maven/doxia/doxia-module-xhtml/1.4/doxia-module-xhtml-1.4.jar
    Downloaded: http://overture.au.dk/artifactory/remote-repos/org/apache/maven/doxia/doxia-site-renderer/1.4/doxia-site-renderer-1.4.jar (52 KB at 1727.9 KB/sec)
    Downloading: http://overture.au.dk/artifactory/remote-repos/org/apache/maven/doxia/doxia-module-fml/1.4/doxia-module-fml-1.4.jar
    Downloaded: http://overture.au.dk/artifactory/remote-repos/org/apache/maven/doxia/doxia-core/1.4/doxia-core-1.4.jar (162 KB at 4473.1 KB/sec)
    Downloading: http://overture.au.dk/artifactory/remote-repos/org/apache/velocity/velocity-tools/2.0/velocity-tools-2.0.jar
    Downloaded: http://overture.au.dk/artifactory/remote-repos/org/apache/maven/doxia/doxia-module-fml/1.4/doxia-module-fml-1.4.jar (37 KB at 2052.1 KB/sec)
    Downloading: http://overture.au.dk/artifactory/remote-repos/commons-digester/commons-digester/1.8/commons-digester-1.8.jar
    Downloaded: http://overture.au.dk/artifactory/remote-repos/org/apache/maven/doxia/doxia-module-xhtml/1.4/doxia-module-xhtml-1.4.jar (16 KB at 469.6 KB/sec)
    Downloading: http://overture.au.dk/artifactory/remote-repos/commons-chain/commons-chain/1.1/commons-chain-1.1.jar
    Downloaded: http://overture.au.dk/artifactory/remote-repos/org/apache/maven/doxia/doxia-decoration-model/1.4/doxia-decoration-model-1.4.jar (60 KB at 1459.1 KB/sec)
    Downloading: http://overture.au.dk/artifactory/remote-repos/commons-validator/commons-validator/1.3.1/commons-validator-1.3.1.jar
    Downloaded: http://overture.au.dk/artifactory/remote-repos/commons-validator/commons-validator/1.3.1/commons-validator-1.3.1.jar (136 KB at 5428.0 KB/sec)
    Downloading: http://overture.au.dk/artifactory/remote-repos/dom4j/dom4j/1.1/dom4j-1.1.jar
    Downloaded: http://overture.au.dk/artifactory/remote-repos/xerces/xercesImpl/2.9.1/xercesImpl-2.9.1.jar (1201 KB at 13798.6 KB/sec)
    Downloading: http://overture.au.dk/artifactory/remote-repos/sslext/sslext/1.2-0/sslext-1.2-0.jar
    Downloaded: http://overture.au.dk/artifactory/remote-repos/commons-chain/commons-chain/1.1/commons-chain-1.1.jar (88 KB at 2253.6 KB/sec)
    Downloading: http://overture.au.dk/artifactory/remote-repos/org/apache/struts/struts-core/1.3.8/struts-core-1.3.8.jar
    Downloaded: http://overture.au.dk/artifactory/remote-repos/commons-digester/commons-digester/1.8/commons-digester-1.8.jar (141 KB at 3048.6 KB/sec)
    Downloading: http://overture.au.dk/artifactory/remote-repos/antlr/antlr/2.7.2/antlr-2.7.2.jar
    Downloaded: http://overture.au.dk/artifactory/remote-repos/sslext/sslext/1.2-0/sslext-1.2-0.jar (26 KB at 984.6 KB/sec)
    Downloading: http://overture.au.dk/artifactory/remote-repos/org/apache/struts/struts-taglib/1.3.8/struts-taglib-1.3.8.jar
    Downloaded: http://overture.au.dk/artifactory/remote-repos/org/apache/struts/struts-core/1.3.8/struts-core-1.3.8.jar (322 KB at 11471.0 KB/sec)
    Downloading: http://overture.au.dk/artifactory/remote-repos/org/apache/struts/struts-tiles/1.3.8/struts-tiles-1.3.8.jar
    Downloaded: http://overture.au.dk/artifactory/remote-repos/org/apache/velocity/velocity-tools/2.0/velocity-tools-2.0.jar (339 KB at 4512.8 KB/sec)
    Downloading: http://overture.au.dk/artifactory/remote-repos/org/apache/httpcomponents/httpclient/4.2.3/httpclient-4.2.3.jar
    Downloaded: http://overture.au.dk/artifactory/remote-repos/dom4j/dom4j/1.1/dom4j-1.1.jar (447 KB at 11155.1 KB/sec)
    Downloading: http://overture.au.dk/artifactory/remote-repos/org/apache/httpcomponents/httpcore/4.2.2/httpcore-4.2.2.jar
    Downloaded: http://overture.au.dk/artifactory/remote-repos/antlr/antlr/2.7.2/antlr-2.7.2.jar (350 KB at 10933.6 KB/sec)
    Downloading: http://overture.au.dk/artifactory/remote-repos/commons-codec/commons-codec/1.6/commons-codec-1.6.jar
    Downloaded: http://overture.au.dk/artifactory/remote-repos/org/apache/struts/struts-tiles/1.3.8/struts-tiles-1.3.8.jar (117 KB at 3158.1 KB/sec)
    Downloading: http://overture.au.dk/artifactory/remote-repos/com/thoughtworks/qdox/qdox/1.12.1/qdox-1.12.1.jar
    Downloaded: http://overture.au.dk/artifactory/remote-repos/org/apache/httpcomponents/httpcore/4.2.2/httpcore-4.2.2.jar (219 KB at 5458.3 KB/sec)
    Downloading: http://overture.au.dk/artifactory/remote-repos/org/codehaus/plexus/plexus-archiver/2.9/plexus-archiver-2.9.jar
    Downloaded: http://overture.au.dk/artifactory/remote-repos/org/apache/httpcomponents/httpclient/4.2.3/httpclient-4.2.3.jar (423 KB at 9398.2 KB/sec)
    Downloading: http://overture.au.dk/artifactory/remote-repos/org/codehaus/plexus/plexus-io/2.4/plexus-io-2.4.jar
    Downloaded: http://overture.au.dk/artifactory/remote-repos/commons-codec/commons-codec/1.6/commons-codec-1.6.jar (228 KB at 5828.6 KB/sec)
    Downloading: http://overture.au.dk/artifactory/remote-repos/org/apache/commons/commons-compress/1.9/commons-compress-1.9.jar
    Downloaded: http://overture.au.dk/artifactory/remote-repos/com/thoughtworks/qdox/qdox/1.12.1/qdox-1.12.1.jar (176 KB at 5487.6 KB/sec)
    Downloading: http://overture.au.dk/artifactory/remote-repos/org/codehaus/plexus/plexus-utils/3.0.20/plexus-utils-3.0.20.jar
    Downloaded: http://overture.au.dk/artifactory/remote-repos/org/codehaus/plexus/plexus-archiver/2.9/plexus-archiver-2.9.jar (142 KB at 3462.7 KB/sec)
    Downloaded: http://overture.au.dk/artifactory/remote-repos/org/codehaus/plexus/plexus-io/2.4/plexus-io-2.4.jar (80 KB at 1795.9 KB/sec)
    Downloaded: http://overture.au.dk/artifactory/remote-repos/org/apache/commons/commons-compress/1.9/commons-compress-1.9.jar (370 KB at 5352.9 KB/sec)
    Downloaded: http://overture.au.dk/artifactory/remote-repos/org/codehaus/plexus/plexus-utils/3.0.20/plexus-utils-3.0.20.jar (238 KB at 4024.2 KB/sec)
    Downloaded: http://overture.au.dk/artifactory/remote-repos/org/apache/struts/struts-taglib/1.3.8/struts-taglib-1.3.8.jar (246 KB at 1027.7 KB/sec)
    [INFO] Skipping javadoc generation
    [INFO] 
    [INFO] --- jacoco-maven-plugin:0.7.6.201602180812:report (jacoco-site) @ vdm2c ---
    [INFO] Analyzed bundle 'The C Code Generator' with 63 classes
    [INFO] 
    [INFO] --- maven-gpg-plugin:1.1:sign (sign-artifacts) @ vdm2c ---
    [INFO] ------------------------------------------------------------------------
    [INFO] Reactor Summary:
    [INFO] 
    [INFO] Overture VDM 2 C Translator Root .................. SUCCESS [9.897s]
    [INFO] C native root vdm2c ............................... SUCCESS [2.517s]
    [INFO] The C Code Generator VDM library sources .......... SUCCESS [13.944s]
    [INFO] Core Tools for vdm2c .............................. SUCCESS [0.728s]
    [INFO] The C Code Generator .............................. SUCCESS [2:35.181s]
    [INFO] ------------------------------------------------------------------------
    [INFO] BUILD SUCCESS
    [INFO] ------------------------------------------------------------------------
    [INFO] Total time: 3:02.610s
    [INFO] Finished at: Tue Sep 27 13:42:06 CEST 2016
    [INFO] Final Memory: 43M/744M
    [INFO] ------------------------------------------------------------------------
[INFO] Checking in modified POMs...
[INFO] Executing: /bin/sh -c cd /var/lib/jenkins/workspace/vdm2c-release && git add -- pom.xml c/pom.xml c/vdmclib/pom.xml core/pom.xml core/vdm2c/pom.xml
[INFO] Working directory: /var/lib/jenkins/workspace/vdm2c-release
[INFO] Executing: /bin/sh -c cd /var/lib/jenkins/workspace/vdm2c-release && git rev-parse --show-toplevel
[INFO] Working directory: /var/lib/jenkins/workspace/vdm2c-release
[INFO] Executing: /bin/sh -c cd /var/lib/jenkins/workspace/vdm2c-release && git status --porcelain .
[INFO] Working directory: /var/lib/jenkins/workspace/vdm2c-release
[WARNING] Ignoring unrecognized line: ?? c/pom.xml.releaseBackup
[WARNING] Ignoring unrecognized line: ?? c/vdmclib/pom.xml.releaseBackup
[WARNING] Ignoring unrecognized line: ?? core/pom.xml.releaseBackup
[WARNING] Ignoring unrecognized line: ?? core/vdm2c/pom.xml.releaseBackup
[WARNING] Ignoring unrecognized line: ?? git-set-private-key.sh
[WARNING] Ignoring unrecognized line: ?? perform-release.sh
[WARNING] Ignoring unrecognized line: ?? pom.xml.releaseBackup
[WARNING] Ignoring unrecognized line: ?? release.properties
[WARNING] Ignoring unrecognized line: ?? ssh
[INFO] Executing: /bin/sh -c cd /var/lib/jenkins/workspace/vdm2c-release && git commit --verbose -F /tmp/maven-scm-1193257544.commit pom.xml c/pom.xml c/vdmclib/pom.xml core/pom.xml core/vdm2c/pom.xml
[INFO] Working directory: /var/lib/jenkins/workspace/vdm2c-release
[INFO] Tagging release with the label Release/0.0.6...
[INFO] Executing: /bin/sh -c cd /var/lib/jenkins/workspace/vdm2c-release && git tag -F /tmp/maven-scm-547084831.commit Release/0.0.6
[INFO] Working directory: /var/lib/jenkins/workspace/vdm2c-release
[INFO] ------------------------------------------------------------------------
[INFO] Reactor Summary:
[INFO] 
[INFO] Overture VDM 2 C Translator Root .................. FAILURE [3:05.176s]
[INFO] C native root vdm2c ............................... SKIPPED
[INFO] The C Code Generator VDM library sources .......... SKIPPED
[INFO] Core Tools for vdm2c .............................. SKIPPED
[INFO] The C Code Generator .............................. SKIPPED
[INFO] ------------------------------------------------------------------------
[INFO] BUILD FAILURE
[INFO] ------------------------------------------------------------------------
[INFO] Total time: 3:05.802s
[INFO] Finished at: Tue Sep 27 13:42:06 CEST 2016
[INFO] Final Memory: 16M/212M
[INFO] ------------------------------------------------------------------------
[ERROR] Failed to execute goal org.apache.maven.plugins:maven-release-plugin:2.5:prepare (default-cli) on project root: Unable to tag SCM
[ERROR] Provider message:
[ERROR] The git-tag command failed.
[ERROR] Command output:
[ERROR] fatal: tag 'Release/0.0.6' already exists
[ERROR] -> [Help 1]
[ERROR] 
[ERROR] To see the full stack trace of the errors, re-run Maven with the -e switch.
[ERROR] Re-run Maven using the -X switch to enable full debug logging.
[ERROR] 
[ERROR] For more information about the errors and possible solutions, please read the following articles:
[ERROR] [Help 1] http://cwiki.apache.org/confluence/display/MAVEN/MojoFailureException
Build step 'Execute shell' marked build as failure
SSH: Current build result is [FAILURE], not going to run.
Started calculate disk usage of build
Finished Calculation of disk usage of build in 0 seconds
Started calculate disk usage of workspace
Finished Calculation of disk usage of workspace in 0 seconds
Finished: FAILURE