FailedConsole Output

Skipping 272 KB.. Full Log
ion_au_kel-W2ZRQHUT7O4Q5VVKCCGVMBEVXK7JY2IPO3SXT35TW4ZHY72VDGCA/DSL_SemanticAdaptation/be.uantwerpen.ansymo.semanticadaptation.testframework/target/be.uantwerpen.ansymo.semanticadaptation.testframework-1.0.0-SNAPSHOT.jar to /var/lib/jenkins/workspace/HybridCosimulation_au_kel-W2ZRQHUT7O4Q5VVKCCGVMBEVXK7JY2IPO3SXT35TW4ZHY72VDGCA/.repository/be/uantwerpen/ansymo/semanticadaptation/be.uantwerpen.ansymo.semanticadaptation.testframework/1.0.0-SNAPSHOT/be.uantwerpen.ansymo.semanticadaptation.testframework-1.0.0-SNAPSHOT.jar
[INFO] Installing /var/lib/jenkins/workspace/HybridCosimulation_au_kel-W2ZRQHUT7O4Q5VVKCCGVMBEVXK7JY2IPO3SXT35TW4ZHY72VDGCA/DSL_SemanticAdaptation/be.uantwerpen.ansymo.semanticadaptation.testframework/pom.xml to /var/lib/jenkins/workspace/HybridCosimulation_au_kel-W2ZRQHUT7O4Q5VVKCCGVMBEVXK7JY2IPO3SXT35TW4ZHY72VDGCA/.repository/be/uantwerpen/ansymo/semanticadaptation/be.uantwerpen.ansymo.semanticadaptation.testframework/1.0.0-SNAPSHOT/be.uantwerpen.ansymo.semanticadaptation.testframework-1.0.0-SNAPSHOT.pom
[INFO] Installing /var/lib/jenkins/workspace/HybridCosimulation_au_kel-W2ZRQHUT7O4Q5VVKCCGVMBEVXK7JY2IPO3SXT35TW4ZHY72VDGCA/DSL_SemanticAdaptation/be.uantwerpen.ansymo.semanticadaptation.testframework/target/p2content.xml to /var/lib/jenkins/workspace/HybridCosimulation_au_kel-W2ZRQHUT7O4Q5VVKCCGVMBEVXK7JY2IPO3SXT35TW4ZHY72VDGCA/.repository/be/uantwerpen/ansymo/semanticadaptation/be.uantwerpen.ansymo.semanticadaptation.testframework/1.0.0-SNAPSHOT/be.uantwerpen.ansymo.semanticadaptation.testframework-1.0.0-SNAPSHOT-p2metadata.xml
[INFO] Installing /var/lib/jenkins/workspace/HybridCosimulation_au_kel-W2ZRQHUT7O4Q5VVKCCGVMBEVXK7JY2IPO3SXT35TW4ZHY72VDGCA/DSL_SemanticAdaptation/be.uantwerpen.ansymo.semanticadaptation.testframework/target/p2artifacts.xml to /var/lib/jenkins/workspace/HybridCosimulation_au_kel-W2ZRQHUT7O4Q5VVKCCGVMBEVXK7JY2IPO3SXT35TW4ZHY72VDGCA/.repository/be/uantwerpen/ansymo/semanticadaptation/be.uantwerpen.ansymo.semanticadaptation.testframework/1.0.0-SNAPSHOT/be.uantwerpen.ansymo.semanticadaptation.testframework-1.0.0-SNAPSHOT-p2artifacts.xml
[INFO] 
[INFO] --- tycho-p2-plugin:1.0.0:update-local-index (default-update-local-index) @ be.uantwerpen.ansymo.semanticadaptation.testframework ---
[INFO]                                                                         
[INFO] ------------------------------------------------------------------------
[INFO] Building be.uantwerpen.ansymo.semanticadaptation Language Core 1.0.0-SNAPSHOT
[INFO] ------------------------------------------------------------------------
[INFO] 
[INFO] --- tycho-packaging-plugin:1.0.0:build-qualifier (default-build-qualifier) @ be.uantwerpen.ansymo.semanticadaptation ---
[INFO] The project's OSGi version is 1.0.0.201706290713
[INFO] 
[INFO] --- tycho-packaging-plugin:1.0.0:validate-id (default-validate-id) @ be.uantwerpen.ansymo.semanticadaptation ---
[INFO] 
[INFO] --- tycho-packaging-plugin:1.0.0:validate-version (default-validate-version) @ be.uantwerpen.ansymo.semanticadaptation ---
[INFO] 
[INFO] >>> exec-maven-plugin:1.2.1:java (default) > validate @ be.uantwerpen.ansymo.semanticadaptation >>>
[INFO] 
[INFO] --- tycho-packaging-plugin:1.0.0:build-qualifier (default-build-qualifier) @ be.uantwerpen.ansymo.semanticadaptation ---
[INFO] The project's OSGi version is 1.0.0.201706290713
[INFO] 
[INFO] --- tycho-packaging-plugin:1.0.0:validate-id (default-validate-id) @ be.uantwerpen.ansymo.semanticadaptation ---
[INFO] 
[INFO] --- tycho-packaging-plugin:1.0.0:validate-version (default-validate-version) @ be.uantwerpen.ansymo.semanticadaptation ---
[INFO] 
[INFO] <<< exec-maven-plugin:1.2.1:java (default) < validate @ be.uantwerpen.ansymo.semanticadaptation <<<
[INFO] 
[INFO] --- exec-maven-plugin:1.2.1:java (default) @ be.uantwerpen.ansymo.semanticadaptation ---
[INFO] Downloading: http://overture.au.dk/artifactory/remote-repos/org/eclipse/xtext/org.eclipse.xtext.generator/2.11.0/org.eclipse.xtext.generator-2.11.0.pom
[INFO] Downloaded: http://overture.au.dk/artifactory/remote-repos/org/eclipse/xtext/org.eclipse.xtext.generator/2.11.0/org.eclipse.xtext.generator-2.11.0.pom (7 KB at 223.0 KB/sec)
[INFO] Downloading: http://overture.au.dk/artifactory/remote-repos/org/eclipse/xtext/org.eclipse.xtext.ecore/2.11.0/org.eclipse.xtext.ecore-2.11.0.pom
[INFO] Downloaded: http://overture.au.dk/artifactory/remote-repos/org/eclipse/xtext/org.eclipse.xtext.ecore/2.11.0/org.eclipse.xtext.ecore-2.11.0.pom (5 KB at 248.5 KB/sec)
[INFO] Downloading: http://overture.au.dk/artifactory/remote-repos/org/eclipse/xtext/org.eclipse.xtext.xtext.generator/2.11.0/org.eclipse.xtext.xtext.generator-2.11.0.pom
[INFO] Downloaded: http://overture.au.dk/artifactory/remote-repos/org/eclipse/xtext/org.eclipse.xtext.xtext.generator/2.11.0/org.eclipse.xtext.xtext.generator-2.11.0.pom (8 KB at 232.6 KB/sec)
[INFO] Downloading: http://overture.au.dk/artifactory/remote-repos/org/eclipse/emf/org.eclipse.emf.codegen.ecore/maven-metadata.xml
[INFO] Downloaded: http://overture.au.dk/artifactory/remote-repos/org/eclipse/emf/org.eclipse.emf.codegen.ecore/maven-metadata.xml (773 B at 0.5 KB/sec)
[INFO] Downloading: http://overture.au.dk/artifactory/remote-repos/org/eclipse/emf/org.eclipse.emf.codegen.ecore/2.10.2-v20150123-0452/org.eclipse.emf.codegen.ecore-2.10.2-v20150123-0452.pom
[INFO] Downloaded: http://overture.au.dk/artifactory/remote-repos/org/eclipse/emf/org.eclipse.emf.codegen.ecore/2.10.2-v20150123-0452/org.eclipse.emf.codegen.ecore-2.10.2-v20150123-0452.pom (2 KB at 52.5 KB/sec)
[INFO] Downloading: http://overture.au.dk/artifactory/remote-repos/org/eclipse/emf/org.eclipse.emf.codegen.ecore/2.11.0/org.eclipse.emf.codegen.ecore-2.11.0.pom
[INFO] Downloaded: http://overture.au.dk/artifactory/remote-repos/org/eclipse/emf/org.eclipse.emf.codegen.ecore/2.11.0/org.eclipse.emf.codegen.ecore-2.11.0.pom (2 KB at 32.9 KB/sec)
[INFO] Downloading: http://overture.au.dk/artifactory/remote-repos/org/eclipse/emf/org.eclipse.emf.codegen.ecore/2.11.0-v20150123-0357/org.eclipse.emf.codegen.ecore-2.11.0-v20150123-0357.pom
[INFO] Downloaded: http://overture.au.dk/artifactory/remote-repos/org/eclipse/emf/org.eclipse.emf.codegen.ecore/2.11.0-v20150123-0357/org.eclipse.emf.codegen.ecore-2.11.0-v20150123-0357.pom (2 KB at 64.8 KB/sec)
[INFO] Downloading: http://overture.au.dk/artifactory/remote-repos/org/eclipse/emf/org.eclipse.emf.codegen.ecore/2.11.0-v20150806-0404/org.eclipse.emf.codegen.ecore-2.11.0-v20150806-0404.pom
[INFO] Downloaded: http://overture.au.dk/artifactory/remote-repos/org/eclipse/emf/org.eclipse.emf.codegen.ecore/2.11.0-v20150806-0404/org.eclipse.emf.codegen.ecore-2.11.0-v20150806-0404.pom (2 KB at 50.1 KB/sec)
[INFO] Downloading: http://overture.au.dk/artifactory/remote-repos/org/eclipse/emf/org.eclipse.emf.codegen.ecore/2.12.0/org.eclipse.emf.codegen.ecore-2.12.0.pom
[INFO] Downloaded: http://overture.au.dk/artifactory/remote-repos/org/eclipse/emf/org.eclipse.emf.codegen.ecore/2.12.0/org.eclipse.emf.codegen.ecore-2.12.0.pom (2 KB at 63.9 KB/sec)
[INFO] Downloading: http://overture.au.dk/artifactory/remote-repos/org/eclipse/emf/org.eclipse.emf.mwe.utils/1.3.20.201605261059/org.eclipse.emf.mwe.utils-1.3.20.201605261059.pom
[INFO] Downloaded: http://overture.au.dk/artifactory/remote-repos/org/eclipse/emf/org.eclipse.emf.mwe.utils/1.3.20.201605261059/org.eclipse.emf.mwe.utils-1.3.20.201605261059.pom (856 B at 49.2 KB/sec)
[INFO] Downloading: http://overture.au.dk/artifactory/remote-repos/org/eclipse/emf/org.eclipse.emf.mwe2.plugins-parent/2.9.0.201605261059/org.eclipse.emf.mwe2.plugins-parent-2.9.0.201605261059.pom
[INFO] Downloaded: http://overture.au.dk/artifactory/remote-repos/org/eclipse/emf/org.eclipse.emf.mwe2.plugins-parent/2.9.0.201605261059/org.eclipse.emf.mwe2.plugins-parent-2.9.0.201605261059.pom (4 KB at 269.5 KB/sec)
[INFO] Downloading: http://overture.au.dk/artifactory/remote-repos/org/eclipse/emf/org.eclipse.emf.mwe2.parent/2.9.0.201605261059/org.eclipse.emf.mwe2.parent-2.9.0.201605261059.pom
[INFO] Downloaded: http://overture.au.dk/artifactory/remote-repos/org/eclipse/emf/org.eclipse.emf.mwe2.parent/2.9.0.201605261059/org.eclipse.emf.mwe2.parent-2.9.0.201605261059.pom (8 KB at 415.4 KB/sec)
[INFO] Downloading: http://overture.au.dk/artifactory/remote-repos/org/eclipse/emf/org.eclipse.emf.mwe.core/maven-metadata.xml
[INFO] Downloaded: http://overture.au.dk/artifactory/remote-repos/org/eclipse/emf/org.eclipse.emf.mwe.core/maven-metadata.xml (601 B at 0.3 KB/sec)
[INFO] Downloading: http://overture.au.dk/artifactory/remote-repos/org/eclipse/emf/org.eclipse.emf.mwe.core/1.3.20.201605261059/org.eclipse.emf.mwe.core-1.3.20.201605261059.pom
[INFO] Downloaded: http://overture.au.dk/artifactory/remote-repos/org/eclipse/emf/org.eclipse.emf.mwe.core/1.3.20.201605261059/org.eclipse.emf.mwe.core-1.3.20.201605261059.pom (2 KB at 46.0 KB/sec)
[INFO] Downloading: http://overture.au.dk/artifactory/remote-repos/org/eclipse/emf/org.eclipse.emf.mwe2.runtime/maven-metadata.xml
[INFO] Downloaded: http://overture.au.dk/artifactory/remote-repos/org/eclipse/emf/org.eclipse.emf.mwe2.runtime/maven-metadata.xml (628 B at 0.3 KB/sec)
[INFO] Downloading: http://overture.au.dk/artifactory/remote-repos/org/eclipse/emf/org.eclipse.emf.mwe2.runtime/2.9.0.201605261059/org.eclipse.emf.mwe2.runtime-2.9.0.201605261059.pom
[INFO] Downloaded: http://overture.au.dk/artifactory/remote-repos/org/eclipse/emf/org.eclipse.emf.mwe2.runtime/2.9.0.201605261059/org.eclipse.emf.mwe2.runtime-2.9.0.201605261059.pom (806 B at 56.2 KB/sec)
[INFO] Downloading: http://overture.au.dk/artifactory/remote-repos/commons-cli/commons-cli/1.2/commons-cli-1.2.pom
[INFO] Downloaded: http://overture.au.dk/artifactory/remote-repos/commons-cli/commons-cli/1.2/commons-cli-1.2.pom (8 KB at 338.8 KB/sec)
[INFO] Downloading: http://overture.au.dk/artifactory/remote-repos/org/apache/commons/commons-parent/11/commons-parent-11.pom
[INFO] Downloaded: http://overture.au.dk/artifactory/remote-repos/org/apache/commons/commons-parent/11/commons-parent-11.pom (25 KB at 601.8 KB/sec)
[INFO] Downloading: http://overture.au.dk/artifactory/remote-repos/commons-logging/commons-logging/1.1.3/commons-logging-1.1.3.pom
[INFO] Downloaded: http://overture.au.dk/artifactory/remote-repos/commons-logging/commons-logging/1.1.3/commons-logging-1.1.3.pom (18 KB at 663.8 KB/sec)
[INFO] Downloading: http://overture.au.dk/artifactory/remote-repos/org/apache/commons/commons-parent/28/commons-parent-28.pom
[INFO] Downloaded: http://overture.au.dk/artifactory/remote-repos/org/apache/commons/commons-parent/28/commons-parent-28.pom (49 KB at 1255.7 KB/sec)
[INFO] Downloading: http://overture.au.dk/artifactory/remote-repos/org/eclipse/emf/org.eclipse.emf.mwe2.lib/2.9.0.201605261059/org.eclipse.emf.mwe2.lib-2.9.0.201605261059.pom
[INFO] Downloaded: http://overture.au.dk/artifactory/remote-repos/org/eclipse/emf/org.eclipse.emf.mwe2.lib/2.9.0.201605261059/org.eclipse.emf.mwe2.lib-2.9.0.201605261059.pom (819 B at 28.6 KB/sec)
[INFO] Downloading: http://overture.au.dk/artifactory/remote-repos/com/ibm/icu/icu4j/52.1/icu4j-52.1.pom
[INFO] Downloaded: http://overture.au.dk/artifactory/remote-repos/com/ibm/icu/icu4j/52.1/icu4j-52.1.pom (5 KB at 224.2 KB/sec)
[INFO] Downloading: http://overture.au.dk/artifactory/remote-repos/org/eclipse/xpand/org.eclipse.xpand/2.0.0/org.eclipse.xpand-2.0.0.pom
[INFO] Downloaded: http://overture.au.dk/artifactory/remote-repos/org/eclipse/xpand/org.eclipse.xpand/2.0.0/org.eclipse.xpand-2.0.0.pom (551 B at 35.9 KB/sec)
[INFO] Downloading: http://overture.au.dk/artifactory/remote-repos/org/eclipse/xpand/org.eclipse.xpand.parent/2.0.0/org.eclipse.xpand.parent-2.0.0.pom
[INFO] Downloaded: http://overture.au.dk/artifactory/remote-repos/org/eclipse/xpand/org.eclipse.xpand.parent/2.0.0/org.eclipse.xpand.parent-2.0.0.pom (5 KB at 350.8 KB/sec)
[INFO] Downloading: http://overture.au.dk/artifactory/remote-repos/org/eclipse/xpand/org.eclipse.xtend/2.0.0/org.eclipse.xtend-2.0.0.pom
[INFO] Downloaded: http://overture.au.dk/artifactory/remote-repos/org/eclipse/xpand/org.eclipse.xtend/2.0.0/org.eclipse.xtend-2.0.0.pom (551 B at 18.6 KB/sec)
[INFO] Downloading: http://overture.au.dk/artifactory/remote-repos/org/eclipse/emf/org.eclipse.emf.mwe2.launch/2.9.0.201605261059/org.eclipse.emf.mwe2.launch-2.9.0.201605261059.pom
[INFO] Downloaded: http://overture.au.dk/artifactory/remote-repos/org/eclipse/emf/org.eclipse.emf.mwe2.launch/2.9.0.201605261059/org.eclipse.emf.mwe2.launch-2.9.0.201605261059.pom (2 KB at 92.3 KB/sec)
[INFO] Downloading: http://overture.au.dk/artifactory/remote-repos/org/eclipse/emf/org.eclipse.emf.mwe2.language/maven-metadata.xml
[INFO] Downloaded: http://overture.au.dk/artifactory/remote-repos/org/eclipse/emf/org.eclipse.emf.mwe2.language/maven-metadata.xml (629 B at 0.4 KB/sec)
[INFO] Downloading: http://overture.au.dk/artifactory/remote-repos/org/eclipse/emf/org.eclipse.emf.mwe2.language/2.9.0.201605261059/org.eclipse.emf.mwe2.language-2.9.0.201605261059.pom
[INFO] Downloaded: http://overture.au.dk/artifactory/remote-repos/org/eclipse/emf/org.eclipse.emf.mwe2.language/2.9.0.201605261059/org.eclipse.emf.mwe2.language-2.9.0.201605261059.pom (824 B at 50.3 KB/sec)
[INFO] Downloading: http://overture.au.dk/artifactory/remote-repos/com/google/guava/guava/10.0.1/guava-10.0.1.pom
[INFO] Downloaded: http://overture.au.dk/artifactory/remote-repos/com/google/guava/guava/10.0.1/guava-10.0.1.pom (6 KB at 228.6 KB/sec)
[INFO] Downloading: http://overture.au.dk/artifactory/remote-repos/com/google/guava/guava-parent/10.0.1/guava-parent-10.0.1.pom
[INFO] Downloaded: http://overture.au.dk/artifactory/remote-repos/com/google/guava/guava-parent/10.0.1/guava-parent-10.0.1.pom (2 KB at 73.6 KB/sec)
[INFO] Downloading: http://overture.au.dk/artifactory/remote-repos/com/google/code/findbugs/jsr305/1.3.9/jsr305-1.3.9.pom
[INFO] Downloaded: http://overture.au.dk/artifactory/remote-repos/com/google/code/findbugs/jsr305/1.3.9/jsr305-1.3.9.pom (965 B at 23.6 KB/sec)
[INFO] Downloading: http://overture.au.dk/artifactory/remote-repos/com/google/guava/guava/11.0-rc1/guava-11.0-rc1.pom
[INFO] Downloaded: http://overture.au.dk/artifactory/remote-repos/com/google/guava/guava/11.0-rc1/guava-11.0-rc1.pom (6 KB at 267.2 KB/sec)
[INFO] Downloading: http://overture.au.dk/artifactory/remote-repos/com/google/guava/guava-parent/11.0-rc1/guava-parent-11.0-rc1.pom
[INFO] Downloaded: http://overture.au.dk/artifactory/remote-repos/com/google/guava/guava-parent/11.0-rc1/guava-parent-11.0-rc1.pom (2 KB at 136.8 KB/sec)
[INFO] Downloading: http://overture.au.dk/artifactory/remote-repos/com/google/guava/guava/11.0/guava-11.0.pom
[INFO] Downloaded: http://overture.au.dk/artifactory/remote-repos/com/google/guava/guava/11.0/guava-11.0.pom (6 KB at 232.2 KB/sec)
[INFO] Downloading: http://overture.au.dk/artifactory/remote-repos/com/google/guava/guava-parent/11.0/guava-parent-11.0.pom
[INFO] Downloaded: http://overture.au.dk/artifactory/remote-repos/com/google/guava/guava-parent/11.0/guava-parent-11.0.pom (2 KB at 112.4 KB/sec)
[INFO] Downloading: http://overture.au.dk/artifactory/remote-repos/com/google/guava/guava/11.0.1/guava-11.0.1.pom
[INFO] Downloaded: http://overture.au.dk/artifactory/remote-repos/com/google/guava/guava/11.0.1/guava-11.0.1.pom (6 KB at 213.7 KB/sec)
[INFO] Downloading: http://overture.au.dk/artifactory/remote-repos/com/google/guava/guava-parent/11.0.1/guava-parent-11.0.1.pom
[INFO] Downloaded: http://overture.au.dk/artifactory/remote-repos/com/google/guava/guava-parent/11.0.1/guava-parent-11.0.1.pom (2 KB at 61.7 KB/sec)
[INFO] Downloading: http://overture.au.dk/artifactory/remote-repos/com/google/guava/guava/11.0.2/guava-11.0.2.pom
[INFO] Downloaded: http://overture.au.dk/artifactory/remote-repos/com/google/guava/guava/11.0.2/guava-11.0.2.pom (6 KB at 232.3 KB/sec)
[INFO] Downloading: http://overture.au.dk/artifactory/remote-repos/com/google/guava/guava-parent/11.0.2/guava-parent-11.0.2.pom
[INFO] Downloaded: http://overture.au.dk/artifactory/remote-repos/com/google/guava/guava-parent/11.0.2/guava-parent-11.0.2.pom (2 KB at 136.6 KB/sec)
[INFO] Downloading: http://overture.au.dk/artifactory/remote-repos/com/google/guava/guava/11.0.2-atlassian-01/guava-11.0.2-atlassian-01.pom
[INFO] Downloaded: http://overture.au.dk/artifactory/remote-repos/com/google/guava/guava/11.0.2-atlassian-01/guava-11.0.2-atlassian-01.pom (7 KB at 407.4 KB/sec)
[INFO] Downloading: http://overture.au.dk/artifactory/remote-repos/com/google/guava/guava-parent/11.0.2-atlassian-01/guava-parent-11.0.2-atlassian-01.pom
[INFO] Downloaded: http://overture.au.dk/artifactory/remote-repos/com/google/guava/guava-parent/11.0.2-atlassian-01/guava-parent-11.0.2-atlassian-01.pom (3 KB at 201.8 KB/sec)
[INFO] Downloading: http://overture.au.dk/artifactory/remote-repos/com/google/guava/guava-bridge/11.0.2-atlassian-01/guava-bridge-11.0.2-atlassian-01.pom
[INFO] Downloaded: http://overture.au.dk/artifactory/remote-repos/com/google/guava/guava-bridge/11.0.2-atlassian-01/guava-bridge-11.0.2-atlassian-01.pom (2 KB at 98.1 KB/sec)
[INFO] Downloading: http://overture.au.dk/artifactory/remote-repos/org/ow2/asm/asm-all/4.2/asm-all-4.2.pom
[INFO] Downloaded: http://overture.au.dk/artifactory/remote-repos/org/ow2/asm/asm-all/4.2/asm-all-4.2.pom (2 KB at 74.0 KB/sec)
[INFO] Downloading: http://overture.au.dk/artifactory/remote-repos/org/ow2/asm/asm-parent/4.2/asm-parent-4.2.pom
[INFO] Downloaded: http://overture.au.dk/artifactory/remote-repos/org/ow2/asm/asm-parent/4.2/asm-parent-4.2.pom (6 KB at 383.2 KB/sec)
[INFO] Downloading: http://overture.au.dk/artifactory/remote-repos/com/google/guava/guava/11.0.2-atlassian-02/guava-11.0.2-atlassian-02.pom
[INFO] Downloaded: http://overture.au.dk/artifactory/remote-repos/com/google/guava/guava/11.0.2-atlassian-02/guava-11.0.2-atlassian-02.pom (7 KB at 470.0 KB/sec)
[INFO] Downloading: http://overture.au.dk/artifactory/remote-repos/com/google/guava/guava-parent/11.0.2-atlassian-02/guava-parent-11.0.2-atlassian-02.pom
[INFO] Downloaded: http://overture.au.dk/artifactory/remote-repos/com/google/guava/guava-parent/11.0.2-atlassian-02/guava-parent-11.0.2-atlassian-02.pom (3 KB at 121.5 KB/sec)
[INFO] Downloading: http://overture.au.dk/artifactory/remote-repos/com/google/guava/guava-bridge/11.0.2-atlassian-02/guava-bridge-11.0.2-atlassian-02.pom
[INFO] Downloaded: http://overture.au.dk/artifactory/remote-repos/com/google/guava/guava-bridge/11.0.2-atlassian-02/guava-bridge-11.0.2-atlassian-02.pom (2 KB at 51.2 KB/sec)
[INFO] Downloading: http://overture.au.dk/artifactory/remote-repos/com/google/guava/guava/12.0-rc1/guava-12.0-rc1.pom
[INFO] Downloaded: http://overture.au.dk/artifactory/remote-repos/com/google/guava/guava/12.0-rc1/guava-12.0-rc1.pom (6 KB at 297.1 KB/sec)
[INFO] Downloading: http://overture.au.dk/artifactory/remote-repos/com/google/guava/guava-parent/12.0-rc1/guava-parent-12.0-rc1.pom
[INFO] Downloaded: http://overture.au.dk/artifactory/remote-repos/com/google/guava/guava-parent/12.0-rc1/guava-parent-12.0-rc1.pom (2 KB at 119.7 KB/sec)
[INFO] Downloading: http://overture.au.dk/artifactory/remote-repos/com/google/guava/guava/12.0-rc2/guava-12.0-rc2.pom
[INFO] Downloaded: http://overture.au.dk/artifactory/remote-repos/com/google/guava/guava/12.0-rc2/guava-12.0-rc2.pom (6 KB at 324.6 KB/sec)
[INFO] Downloading: http://overture.au.dk/artifactory/remote-repos/com/google/guava/guava-parent/12.0-rc2/guava-parent-12.0-rc2.pom
[INFO] Downloaded: http://overture.au.dk/artifactory/remote-repos/com/google/guava/guava-parent/12.0-rc2/guava-parent-12.0-rc2.pom (3 KB at 128.3 KB/sec)
[INFO] Downloading: http://overture.au.dk/artifactory/remote-repos/com/google/guava/guava/12.0/guava-12.0.pom
[INFO] Downloaded: http://overture.au.dk/artifactory/remote-repos/com/google/guava/guava/12.0/guava-12.0.pom (6 KB at 235.9 KB/sec)
[INFO] Downloading: http://overture.au.dk/artifactory/remote-repos/com/google/guava/guava-parent/12.0/guava-parent-12.0.pom
[INFO] Downloaded: http://overture.au.dk/artifactory/remote-repos/com/google/guava/guava-parent/12.0/guava-parent-12.0.pom (3 KB at 192.5 KB/sec)
[INFO] Downloading: http://overture.au.dk/artifactory/remote-repos/com/google/guava/guava/12.0.1/guava-12.0.1.pom
[INFO] Downloaded: http://overture.au.dk/artifactory/remote-repos/com/google/guava/guava/12.0.1/guava-12.0.1.pom (6 KB at 370.8 KB/sec)
[INFO] Downloading: http://overture.au.dk/artifactory/remote-repos/com/google/guava/guava-parent/12.0.1/guava-parent-12.0.1.pom
[INFO] Downloaded: http://overture.au.dk/artifactory/remote-repos/com/google/guava/guava-parent/12.0.1/guava-parent-12.0.1.pom (3 KB at 93.7 KB/sec)
[INFO] Downloading: http://overture.au.dk/artifactory/remote-repos/com/google/guava/guava/13.0-rc1/guava-13.0-rc1.pom
[INFO] Downloaded: http://overture.au.dk/artifactory/remote-repos/com/google/guava/guava/13.0-rc1/guava-13.0-rc1.pom (6 KB at 274.9 KB/sec)
[INFO] Downloading: http://overture.au.dk/artifactory/remote-repos/com/google/guava/guava-parent/13.0-rc1/guava-parent-13.0-rc1.pom
[INFO] Downloaded: http://overture.au.dk/artifactory/remote-repos/com/google/guava/guava-parent/13.0-rc1/guava-parent-13.0-rc1.pom (3 KB at 178.4 KB/sec)
[INFO] Downloading: http://overture.au.dk/artifactory/remote-repos/com/google/guava/guava/13.0-rc2/guava-13.0-rc2.pom
[INFO] Downloaded: http://overture.au.dk/artifactory/remote-repos/com/google/guava/guava/13.0-rc2/guava-13.0-rc2.pom (6 KB at 401.7 KB/sec)
[INFO] Downloading: http://overture.au.dk/artifactory/remote-repos/com/google/guava/guava-parent/13.0-rc2/guava-parent-13.0-rc2.pom
[INFO] Downloaded: http://overture.au.dk/artifactory/remote-repos/com/google/guava/guava-parent/13.0-rc2/guava-parent-13.0-rc2.pom (3 KB at 166.5 KB/sec)
[INFO] Downloading: http://overture.au.dk/artifactory/remote-repos/com/google/guava/guava/13.0-final/guava-13.0-final.pom
[INFO] Downloaded: http://overture.au.dk/artifactory/remote-repos/com/google/guava/guava/13.0-final/guava-13.0-final.pom (6 KB at 373.2 KB/sec)
[INFO] Downloading: http://overture.au.dk/artifactory/remote-repos/com/google/guava/guava-parent/13.0-final/guava-parent-13.0-final.pom
[INFO] Downloaded: http://overture.au.dk/artifactory/remote-repos/com/google/guava/guava-parent/13.0-final/guava-parent-13.0-final.pom (3 KB at 178.5 KB/sec)
[INFO] Downloading: http://overture.au.dk/artifactory/remote-repos/com/google/guava/guava/13.0/guava-13.0.pom
[INFO] Downloaded: http://overture.au.dk/artifactory/remote-repos/com/google/guava/guava/13.0/guava-13.0.pom (6 KB at 180.0 KB/sec)
[INFO] Downloading: http://overture.au.dk/artifactory/remote-repos/com/google/guava/guava-parent/13.0/guava-parent-13.0.pom
[INFO] Downloaded: http://overture.au.dk/artifactory/remote-repos/com/google/guava/guava-parent/13.0/guava-parent-13.0.pom (3 KB at 95.9 KB/sec)
[INFO] Downloading: http://overture.au.dk/artifactory/remote-repos/com/google/guava/guava/13.0.1/guava-13.0.1.pom
[INFO] Downloaded: http://overture.au.dk/artifactory/remote-repos/com/google/guava/guava/13.0.1/guava-13.0.1.pom (6 KB at 200.8 KB/sec)
[INFO] Downloading: http://overture.au.dk/artifactory/remote-repos/com/google/guava/guava-parent/13.0.1/guava-parent-13.0.1.pom
[INFO] Downloaded: http://overture.au.dk/artifactory/remote-repos/com/google/guava/guava-parent/13.0.1/guava-parent-13.0.1.pom (3 KB at 108.5 KB/sec)
[INFO] Downloading: http://overture.au.dk/artifactory/remote-repos/com/google/guava/guava/14.0-rc1/guava-14.0-rc1.pom
[INFO] Downloaded: http://overture.au.dk/artifactory/remote-repos/com/google/guava/guava/14.0-rc1/guava-14.0-rc1.pom (6 KB at 223.3 KB/sec)
[INFO] Downloading: http://overture.au.dk/artifactory/remote-repos/com/google/guava/guava-parent/14.0-rc1/guava-parent-14.0-rc1.pom
[INFO] Downloaded: http://overture.au.dk/artifactory/remote-repos/com/google/guava/guava-parent/14.0-rc1/guava-parent-14.0-rc1.pom (3 KB at 138.7 KB/sec)
[INFO] Downloading: http://overture.au.dk/artifactory/remote-repos/com/google/guava/guava/14.0-rc2/guava-14.0-rc2.pom
[INFO] Downloaded: http://overture.au.dk/artifactory/remote-repos/com/google/guava/guava/14.0-rc2/guava-14.0-rc2.pom (6 KB at 238.7 KB/sec)
[INFO] Downloading: http://overture.au.dk/artifactory/remote-repos/com/google/guava/guava-parent/14.0-rc2/guava-parent-14.0-rc2.pom
[INFO] Downloaded: http://overture.au.dk/artifactory/remote-repos/com/google/guava/guava-parent/14.0-rc2/guava-parent-14.0-rc2.pom (3 KB at 138.7 KB/sec)
[INFO] Downloading: http://overture.au.dk/artifactory/remote-repos/com/google/guava/guava/14.0-rc3/guava-14.0-rc3.pom
[INFO] Downloaded: http://overture.au.dk/artifactory/remote-repos/com/google/guava/guava/14.0-rc3/guava-14.0-rc3.pom (6 KB at 228.3 KB/sec)
[INFO] Downloading: http://overture.au.dk/artifactory/remote-repos/com/google/guava/guava-parent/14.0-rc3/guava-parent-14.0-rc3.pom
[INFO] Downloaded: http://overture.au.dk/artifactory/remote-repos/com/google/guava/guava-parent/14.0-rc3/guava-parent-14.0-rc3.pom (3 KB at 156.1 KB/sec)
[INFO] Downloading: http://overture.au.dk/artifactory/remote-repos/org/eclipse/equinox/common/3.6.200-v20130402-1505/common-3.6.200-v20130402-1505.pom
[INFO] Downloaded: http://overture.au.dk/artifactory/remote-repos/org/eclipse/equinox/common/3.6.200-v20130402-1505/common-3.6.200-v20130402-1505.pom (837 B at 32.7 KB/sec)
[INFO] Downloading: http://overture.au.dk/artifactory/remote-repos/org/apache/maven/maven-toolchain/1.0/maven-toolchain-1.0.pom
[INFO] Downloaded: http://overture.au.dk/artifactory/remote-repos/org/apache/maven/maven-toolchain/1.0/maven-toolchain-1.0.pom (4 KB at 81.3 KB/sec)
[INFO] Downloading: http://overture.au.dk/artifactory/remote-repos/junit/junit/3.8.2/junit-3.8.2.pom
[INFO] Downloaded: http://overture.au.dk/artifactory/remote-repos/junit/junit/3.8.2/junit-3.8.2.pom (747 B at 30.4 KB/sec)
[INFO] Downloading: http://overture.au.dk/artifactory/remote-repos/org/apache/maven/maven-plugin-api/2.0/maven-plugin-api-2.0.pom
[INFO] Downloaded: http://overture.au.dk/artifactory/remote-repos/org/apache/maven/maven-plugin-api/2.0/maven-plugin-api-2.0.pom (601 B at 27.9 KB/sec)
[INFO] Downloading: http://overture.au.dk/artifactory/remote-repos/org/apache/maven/maven/2.0/maven-2.0.pom
[INFO] Downloaded: http://overture.au.dk/artifactory/remote-repos/org/apache/maven/maven/2.0/maven-2.0.pom (9 KB at 435.4 KB/sec)
[INFO] Downloading: http://overture.au.dk/artifactory/remote-repos/org/codehaus/plexus/plexus-container-default/1.0-alpha-9/plexus-container-default-1.0-alpha-9.pom
[INFO] Downloaded: http://overture.au.dk/artifactory/remote-repos/org/codehaus/plexus/plexus-container-default/1.0-alpha-9/plexus-container-default-1.0-alpha-9.pom (2 KB at 57.5 KB/sec)
[INFO] Downloading: http://overture.au.dk/artifactory/remote-repos/org/apache/commons/commons-exec/1.1/commons-exec-1.1.pom
[INFO] Downloaded: http://overture.au.dk/artifactory/remote-repos/org/apache/commons/commons-exec/1.1/commons-exec-1.1.pom (11 KB at 684.3 KB/sec)
[INFO] Downloading: http://overture.au.dk/artifactory/remote-repos/org/apache/commons/commons-parent/17/commons-parent-17.pom
[INFO] Downloaded: http://overture.au.dk/artifactory/remote-repos/org/apache/commons/commons-parent/17/commons-parent-17.pom (31 KB at 1450.2 KB/sec)
[INFO] Downloading: http://overture.au.dk/artifactory/remote-repos/org/eclipse/xtext/org.eclipse.xtext.generator/2.11.0/org.eclipse.xtext.generator-2.11.0.jar
[INFO] Downloading: http://overture.au.dk/artifactory/remote-repos/org/eclipse/xtext/org.eclipse.xtext.xtext.generator/2.11.0/org.eclipse.xtext.xtext.generator-2.11.0.jar
[INFO] Downloading: http://overture.au.dk/artifactory/remote-repos/org/eclipse/emf/org.eclipse.emf.codegen.ecore/2.12.0/org.eclipse.emf.codegen.ecore-2.12.0.jar
[INFO] Downloading: http://overture.au.dk/artifactory/remote-repos/org/eclipse/emf/org.eclipse.emf.mwe.utils/1.3.20.201605261059/org.eclipse.emf.mwe.utils-1.3.20.201605261059.jar
[INFO] Downloading: http://overture.au.dk/artifactory/remote-repos/org/eclipse/emf/org.eclipse.emf.mwe.core/1.3.20.201605261059/org.eclipse.emf.mwe.core-1.3.20.201605261059.jar
[INFO] Downloaded: http://overture.au.dk/artifactory/remote-repos/org/eclipse/emf/org.eclipse.emf.mwe.utils/1.3.20.201605261059/org.eclipse.emf.mwe.utils-1.3.20.201605261059.jar (30 KB at 950.6 KB/sec)
[INFO] Downloading: http://overture.au.dk/artifactory/remote-repos/commons-logging/commons-logging/1.1.3/commons-logging-1.1.3.jar
[INFO] Downloaded: http://overture.au.dk/artifactory/remote-repos/org/eclipse/emf/org.eclipse.emf.mwe.core/1.3.20.201605261059/org.eclipse.emf.mwe.core-1.3.20.201605261059.jar (170 KB at 2687.2 KB/sec)
[INFO] Downloading: http://overture.au.dk/artifactory/remote-repos/org/eclipse/emf/org.eclipse.emf.mwe2.lib/2.9.0.201605261059/org.eclipse.emf.mwe2.lib-2.9.0.201605261059.jar
[INFO] Downloaded: http://overture.au.dk/artifactory/remote-repos/org/eclipse/emf/org.eclipse.emf.mwe2.lib/2.9.0.201605261059/org.eclipse.emf.mwe2.lib-2.9.0.201605261059.jar (26 KB at 334.3 KB/sec)
[INFO] Downloading: http://overture.au.dk/artifactory/remote-repos/com/ibm/icu/icu4j/52.1/icu4j-52.1.jar
[INFO] Downloaded: http://overture.au.dk/artifactory/remote-repos/org/eclipse/xtext/org.eclipse.xtext.xtext.generator/2.11.0/org.eclipse.xtext.xtext.generator-2.11.0.jar (992 KB at 12092.1 KB/sec)
[INFO] Downloading: http://overture.au.dk/artifactory/remote-repos/org/eclipse/xpand/org.eclipse.xpand/2.0.0/org.eclipse.xpand-2.0.0.jar
[INFO] Downloaded: http://overture.au.dk/artifactory/remote-repos/org/eclipse/xtext/org.eclipse.xtext.generator/2.11.0/org.eclipse.xtext.generator-2.11.0.jar (846 KB at 10063.3 KB/sec)
[INFO] Downloading: http://overture.au.dk/artifactory/remote-repos/org/eclipse/xpand/org.eclipse.xtend/2.0.0/org.eclipse.xtend-2.0.0.jar
[INFO] Downloaded: http://overture.au.dk/artifactory/remote-repos/org/eclipse/emf/org.eclipse.emf.codegen.ecore/2.12.0/org.eclipse.emf.codegen.ecore-2.12.0.jar (1056 KB at 12269.5 KB/sec)
[INFO] Downloading: http://overture.au.dk/artifactory/remote-repos/org/eclipse/xtext/org.eclipse.xtext.ecore/2.11.0/org.eclipse.xtext.ecore-2.11.0.jar
[INFO] Downloaded: http://overture.au.dk/artifactory/remote-repos/commons-logging/commons-logging/1.1.3/commons-logging-1.1.3.jar (61 KB at 704.6 KB/sec)
[INFO] Downloading: http://overture.au.dk/artifactory/remote-repos/org/eclipse/emf/org.eclipse.emf.mwe2.launch/2.9.0.201605261059/org.eclipse.emf.mwe2.launch-2.9.0.201605261059.jar
[INFO] Downloaded: http://overture.au.dk/artifactory/remote-repos/org/eclipse/xtext/org.eclipse.xtext.ecore/2.11.0/org.eclipse.xtext.ecore-2.11.0.jar (16 KB at 165.9 KB/sec)
[INFO] Downloading: http://overture.au.dk/artifactory/remote-repos/org/eclipse/emf/org.eclipse.emf.mwe2.runtime/2.9.0.201605261059/org.eclipse.emf.mwe2.runtime-2.9.0.201605261059.jar
[INFO] Downloaded: http://overture.au.dk/artifactory/remote-repos/org/eclipse/emf/org.eclipse.emf.mwe2.launch/2.9.0.201605261059/org.eclipse.emf.mwe2.launch-2.9.0.201605261059.jar (16 KB at 154.7 KB/sec)
[INFO] Downloading: http://overture.au.dk/artifactory/remote-repos/org/eclipse/emf/org.eclipse.emf.mwe2.language/2.9.0.201605261059/org.eclipse.emf.mwe2.language-2.9.0.201605261059.jar
[INFO] Downloaded: http://overture.au.dk/artifactory/remote-repos/org/eclipse/emf/org.eclipse.emf.mwe2.runtime/2.9.0.201605261059/org.eclipse.emf.mwe2.runtime-2.9.0.201605261059.jar (9 KB at 67.2 KB/sec)
[INFO] Downloading: http://overture.au.dk/artifactory/remote-repos/com/google/guava/guava/14.0.1/guava-14.0.1.jar
[INFO] Downloaded: http://overture.au.dk/artifactory/remote-repos/org/eclipse/xpand/org.eclipse.xpand/2.0.0/org.eclipse.xpand-2.0.0.jar (217 KB at 1729.4 KB/sec)
[INFO] Downloading: http://overture.au.dk/artifactory/remote-repos/commons-cli/commons-cli/1.2/commons-cli-1.2.jar
[INFO] Downloaded: http://overture.au.dk/artifactory/remote-repos/org/eclipse/xpand/org.eclipse.xtend/2.0.0/org.eclipse.xtend-2.0.0.jar (507 KB at 3988.4 KB/sec)
[INFO] Downloading: http://overture.au.dk/artifactory/remote-repos/org/eclipse/equinox/common/3.6.200-v20130402-1505/common-3.6.200-v20130402-1505.jar
[INFO] Downloaded: http://overture.au.dk/artifactory/remote-repos/org/eclipse/emf/org.eclipse.emf.mwe2.language/2.9.0.201605261059/org.eclipse.emf.mwe2.language-2.9.0.201605261059.jar (185 KB at 1388.7 KB/sec)
[INFO] Downloading: http://overture.au.dk/artifactory/remote-repos/org/apache/maven/maven-toolchain/1.0/maven-toolchain-1.0.jar
[INFO] Downloaded: http://overture.au.dk/artifactory/remote-repos/org/eclipse/equinox/common/3.6.200-v20130402-1505/common-3.6.200-v20130402-1505.jar (105 KB at 723.6 KB/sec)
[INFO] Downloading: http://overture.au.dk/artifactory/remote-repos/org/codehaus/plexus/plexus-container-default/1.0-alpha-9/plexus-container-default-1.0-alpha-9.jar
[INFO] Downloaded: http://overture.au.dk/artifactory/remote-repos/org/codehaus/plexus/plexus-container-default/1.0-alpha-9/plexus-container-default-1.0-alpha-9.jar (191 KB at 1037.0 KB/sec)
[INFO] Downloading: http://overture.au.dk/artifactory/remote-repos/org/apache/commons/commons-exec/1.1/commons-exec-1.1.jar
[INFO] Downloaded: http://overture.au.dk/artifactory/remote-repos/com/google/guava/guava/14.0.1/guava-14.0.1.jar (2138 KB at 10583.2 KB/sec)
[INFO] Downloaded: http://overture.au.dk/artifactory/remote-repos/org/apache/commons/commons-exec/1.1/commons-exec-1.1.jar (52 KB at 237.6 KB/sec)
[INFO] Downloaded: http://overture.au.dk/artifactory/remote-repos/com/ibm/icu/icu4j/52.1/icu4j-52.1.jar (10222 KB at 33623.9 KB/sec)
[INFO] Downloaded: http://overture.au.dk/artifactory/remote-repos/org/apache/maven/maven-toolchain/1.0/maven-toolchain-1.0.jar (33 KB at 90.0 KB/sec)
[INFO] Downloaded: http://overture.au.dk/artifactory/remote-repos/commons-cli/commons-cli/1.2/commons-cli-1.2.jar (41 KB at 109.1 KB/sec)
0    INFO  XtextGenerator     - Initializing Xtext generator
5    INFO  StandaloneSetup    - Adding generated EPackage 'org.eclipse.xtext.common.types.TypesPackage'
45   WARN  StandaloneSetup    - Skipping conflicting project plexus at 'archive:file:/usr/share/java/plexus-classworlds2-2.5.2.jar!/' and using 'archive:file:/var/lib/jenkins/workspace/HybridCosimulation_au_kel-W2ZRQHUT7O4Q5VVKCCGVMBEVXK7JY2IPO3SXT35TW4ZHY72VDGCA/.repository/org/codehaus/plexus/plexus-utils/2.0.5/plexus-utils-2.0.5.jar!/' instead.
46   WARN  StandaloneSetup    - Skipping conflicting project maven at 'archive:file:/var/lib/jenkins/workspace/HybridCosimulation_au_kel-W2ZRQHUT7O4Q5VVKCCGVMBEVXK7JY2IPO3SXT35TW4ZHY72VDGCA/.repository/org/apache/maven/maven-settings/2.0.6/maven-settings-2.0.6.jar!/' and using 'archive:file:/var/lib/jenkins/workspace/HybridCosimulation_au_kel-W2ZRQHUT7O4Q5VVKCCGVMBEVXK7JY2IPO3SXT35TW4ZHY72VDGCA/.repository/org/apache/maven/maven-monitor/2.0.6/maven-monitor-2.0.6.jar!/' instead.
50   WARN  StandaloneSetup    - Skipping conflicting project maven at 'archive:file:/var/lib/jenkins/workspace/HybridCosimulation_au_kel-W2ZRQHUT7O4Q5VVKCCGVMBEVXK7JY2IPO3SXT35TW4ZHY72VDGCA/.repository/org/apache/maven/maven-monitor/2.0.6/maven-monitor-2.0.6.jar!/' and using 'archive:file:/var/lib/jenkins/workspace/HybridCosimulation_au_kel-W2ZRQHUT7O4Q5VVKCCGVMBEVXK7JY2IPO3SXT35TW4ZHY72VDGCA/.repository/org/apache/maven/maven-plugin-registry/2.0.6/maven-plugin-registry-2.0.6.jar!/' instead.
50   WARN  StandaloneSetup    - Skipping conflicting project maven at 'archive:file:/var/lib/jenkins/workspace/HybridCosimulation_au_kel-W2ZRQHUT7O4Q5VVKCCGVMBEVXK7JY2IPO3SXT35TW4ZHY72VDGCA/.repository/org/apache/maven/maven-plugin-registry/2.0.6/maven-plugin-registry-2.0.6.jar!/' and using 'archive:file:/var/lib/jenkins/workspace/HybridCosimulation_au_kel-W2ZRQHUT7O4Q5VVKCCGVMBEVXK7JY2IPO3SXT35TW4ZHY72VDGCA/.repository/org/apache/maven/maven-toolchain/1.0/maven-toolchain-1.0.jar!/' instead.
51   WARN  StandaloneSetup    - Skipping conflicting project maven at 'archive:file:/var/lib/jenkins/workspace/HybridCosimulation_au_kel-W2ZRQHUT7O4Q5VVKCCGVMBEVXK7JY2IPO3SXT35TW4ZHY72VDGCA/.repository/org/apache/maven/maven-toolchain/1.0/maven-toolchain-1.0.jar!/' and using 'archive:file:/var/lib/jenkins/workspace/HybridCosimulation_au_kel-W2ZRQHUT7O4Q5VVKCCGVMBEVXK7JY2IPO3SXT35TW4ZHY72VDGCA/.repository/org/apache/maven/maven-error-diagnostics/2.0.6/maven-error-diagnostics-2.0.6.jar!/' instead.
51   WARN  StandaloneSetup    - Skipping conflicting project maven at 'archive:file:/var/lib/jenkins/workspace/HybridCosimulation_au_kel-W2ZRQHUT7O4Q5VVKCCGVMBEVXK7JY2IPO3SXT35TW4ZHY72VDGCA/.repository/org/apache/maven/maven-error-diagnostics/2.0.6/maven-error-diagnostics-2.0.6.jar!/' and using 'archive:file:/var/lib/jenkins/workspace/HybridCosimulation_au_kel-W2ZRQHUT7O4Q5VVKCCGVMBEVXK7JY2IPO3SXT35TW4ZHY72VDGCA/.repository/org/apache/maven/maven-plugin-api/2.0.6/maven-plugin-api-2.0.6.jar!/' instead.
51   WARN  StandaloneSetup    - Skipping conflicting project plexus at 'archive:file:/var/lib/jenkins/workspace/HybridCosimulation_au_kel-W2ZRQHUT7O4Q5VVKCCGVMBEVXK7JY2IPO3SXT35TW4ZHY72VDGCA/.repository/org/codehaus/plexus/plexus-utils/2.0.5/plexus-utils-2.0.5.jar!/' and using 'archive:file:/var/lib/jenkins/workspace/HybridCosimulation_au_kel-W2ZRQHUT7O4Q5VVKCCGVMBEVXK7JY2IPO3SXT35TW4ZHY72VDGCA/.repository/org/codehaus/plexus/plexus-container-default/1.0-alpha-9/plexus-container-default-1.0-alpha-9.jar!/' instead.
55   WARN  StandaloneSetup    - Skipping conflicting project maven at 'archive:file:/var/lib/jenkins/workspace/HybridCosimulation_au_kel-W2ZRQHUT7O4Q5VVKCCGVMBEVXK7JY2IPO3SXT35TW4ZHY72VDGCA/.repository/org/apache/maven/maven-plugin-api/2.0.6/maven-plugin-api-2.0.6.jar!/' and using 'archive:file:/var/lib/jenkins/workspace/HybridCosimulation_au_kel-W2ZRQHUT7O4Q5VVKCCGVMBEVXK7JY2IPO3SXT35TW4ZHY72VDGCA/.repository/org/apache/maven/maven-repository-metadata/2.0.6/maven-repository-metadata-2.0.6.jar!/' instead.
55   WARN  StandaloneSetup    - Skipping conflicting project org.eclipse.equinox.common at 'archive:file:/var/lib/jenkins/workspace/HybridCosimulation_au_kel-W2ZRQHUT7O4Q5VVKCCGVMBEVXK7JY2IPO3SXT35TW4ZHY72VDGCA/.repository/org/eclipse/equinox/common/3.6.200-v20130402-1505/common-3.6.200-v20130402-1505.jar!/' and using 'archive:file:/var/lib/jenkins/workspace/HybridCosimulation_au_kel-W2ZRQHUT7O4Q5VVKCCGVMBEVXK7JY2IPO3SXT35TW4ZHY72VDGCA/.repository/org/eclipse/platform/org.eclipse.equinox.common/3.8.0/org.eclipse.equinox.common-3.8.0.jar!/' instead.
56   WARN  StandaloneSetup    - Skipping conflicting project plexus at 'archive:file:/var/lib/jenkins/workspace/HybridCosimulation_au_kel-W2ZRQHUT7O4Q5VVKCCGVMBEVXK7JY2IPO3SXT35TW4ZHY72VDGCA/.repository/org/codehaus/plexus/plexus-container-default/1.0-alpha-9/plexus-container-default-1.0-alpha-9.jar!/' and using 'archive:file:/var/lib/jenkins/workspace/HybridCosimulation_au_kel-W2ZRQHUT7O4Q5VVKCCGVMBEVXK7JY2IPO3SXT35TW4ZHY72VDGCA/.repository/org/codehaus/plexus/plexus-interactivity-api/1.0-alpha-4/plexus-interactivity-api-1.0-alpha-4.jar!/' instead.
56   WARN  StandaloneSetup    - Skipping conflicting project maven at 'archive:file:/var/lib/jenkins/workspace/HybridCosimulation_au_kel-W2ZRQHUT7O4Q5VVKCCGVMBEVXK7JY2IPO3SXT35TW4ZHY72VDGCA/.repository/org/apache/maven/maven-repository-metadata/2.0.6/maven-repository-metadata-2.0.6.jar!/' and using 'archive:file:/var/lib/jenkins/workspace/HybridCosimulation_au_kel-W2ZRQHUT7O4Q5VVKCCGVMBEVXK7JY2IPO3SXT35TW4ZHY72VDGCA/.repository/org/apache/maven/maven-model/2.0.6/maven-model-2.0.6.jar!/' instead.
57   WARN  StandaloneSetup    - Skipping conflicting project maven at 'archive:file:/var/lib/jenkins/workspace/HybridCosimulation_au_kel-W2ZRQHUT7O4Q5VVKCCGVMBEVXK7JY2IPO3SXT35TW4ZHY72VDGCA/.repository/org/apache/maven/maven-model/2.0.6/maven-model-2.0.6.jar!/' and using 'archive:file:/var/lib/jenkins/workspace/HybridCosimulation_au_kel-W2ZRQHUT7O4Q5VVKCCGVMBEVXK7JY2IPO3SXT35TW4ZHY72VDGCA/.repository/org/apache/maven/maven-core/2.0.6/maven-core-2.0.6.jar!/' instead.
57   WARN  StandaloneSetup    - Skipping conflicting project maven at 'archive:file:/var/lib/jenkins/workspace/HybridCosimulation_au_kel-W2ZRQHUT7O4Q5VVKCCGVMBEVXK7JY2IPO3SXT35TW4ZHY72VDGCA/.repository/org/apache/maven/maven-core/2.0.6/maven-core-2.0.6.jar!/' and using 'archive:file:/var/lib/jenkins/workspace/HybridCosimulation_au_kel-W2ZRQHUT7O4Q5VVKCCGVMBEVXK7JY2IPO3SXT35TW4ZHY72VDGCA/.repository/org/apache/maven/maven-project/2.0.6/maven-project-2.0.6.jar!/' instead.
58   WARN  StandaloneSetup    - Skipping conflicting project maven at 'archive:file:/var/lib/jenkins/workspace/HybridCosimulation_au_kel-W2ZRQHUT7O4Q5VVKCCGVMBEVXK7JY2IPO3SXT35TW4ZHY72VDGCA/.repository/org/apache/maven/maven-project/2.0.6/maven-project-2.0.6.jar!/' and using 'archive:file:/var/lib/jenkins/workspace/HybridCosimulation_au_kel-W2ZRQHUT7O4Q5VVKCCGVMBEVXK7JY2IPO3SXT35TW4ZHY72VDGCA/.repository/org/apache/maven/maven-artifact/2.0.6/maven-artifact-2.0.6.jar!/' instead.
59   WARN  StandaloneSetup    - Skipping conflicting project maven at 'archive:file:/var/lib/jenkins/workspace/HybridCosimulation_au_kel-W2ZRQHUT7O4Q5VVKCCGVMBEVXK7JY2IPO3SXT35TW4ZHY72VDGCA/.repository/org/apache/maven/maven-artifact/2.0.6/maven-artifact-2.0.6.jar!/' and using 'archive:file:/var/lib/jenkins/workspace/HybridCosimulation_au_kel-W2ZRQHUT7O4Q5VVKCCGVMBEVXK7JY2IPO3SXT35TW4ZHY72VDGCA/.repository/org/apache/maven/maven-plugin-descriptor/2.0.6/maven-plugin-descriptor-2.0.6.jar!/' instead.
60   WARN  StandaloneSetup    - Skipping conflicting project maven at 'archive:file:/var/lib/jenkins/workspace/HybridCosimulation_au_kel-W2ZRQHUT7O4Q5VVKCCGVMBEVXK7JY2IPO3SXT35TW4ZHY72VDGCA/.repository/org/apache/maven/maven-plugin-descriptor/2.0.6/maven-plugin-descriptor-2.0.6.jar!/' and using 'archive:file:/var/lib/jenkins/workspace/HybridCosimulation_au_kel-W2ZRQHUT7O4Q5VVKCCGVMBEVXK7JY2IPO3SXT35TW4ZHY72VDGCA/.repository/org/apache/maven/maven-profile/2.0.6/maven-profile-2.0.6.jar!/' instead.
60   WARN  StandaloneSetup    - Skipping conflicting project maven at 'archive:file:/var/lib/jenkins/workspace/HybridCosimulation_au_kel-W2ZRQHUT7O4Q5VVKCCGVMBEVXK7JY2IPO3SXT35TW4ZHY72VDGCA/.repository/org/apache/maven/maven-profile/2.0.6/maven-profile-2.0.6.jar!/' and using 'archive:file:/var/lib/jenkins/workspace/HybridCosimulation_au_kel-W2ZRQHUT7O4Q5VVKCCGVMBEVXK7JY2IPO3SXT35TW4ZHY72VDGCA/.repository/org/apache/maven/reporting/maven-reporting-api/2.0.6/maven-reporting-api-2.0.6.jar!/' instead.
62   WARN  StandaloneSetup    - Skipping conflicting project maven at 'archive:file:/var/lib/jenkins/workspace/HybridCosimulation_au_kel-W2ZRQHUT7O4Q5VVKCCGVMBEVXK7JY2IPO3SXT35TW4ZHY72VDGCA/.repository/org/apache/maven/reporting/maven-reporting-api/2.0.6/maven-reporting-api-2.0.6.jar!/' and using 'archive:file:/var/lib/jenkins/workspace/HybridCosimulation_au_kel-W2ZRQHUT7O4Q5VVKCCGVMBEVXK7JY2IPO3SXT35TW4ZHY72VDGCA/.repository/org/apache/maven/maven-plugin-parameter-documenter/2.0.6/maven-plugin-parameter-documenter-2.0.6.jar!/' instead.
62   WARN  StandaloneSetup    - Skipping conflicting project maven at 'archive:file:/var/lib/jenkins/workspace/HybridCosimulation_au_kel-W2ZRQHUT7O4Q5VVKCCGVMBEVXK7JY2IPO3SXT35TW4ZHY72VDGCA/.repository/org/apache/maven/maven-plugin-parameter-documenter/2.0.6/maven-plugin-parameter-documenter-2.0.6.jar!/' and using 'archive:file:/var/lib/jenkins/workspace/HybridCosimulation_au_kel-W2ZRQHUT7O4Q5VVKCCGVMBEVXK7JY2IPO3SXT35TW4ZHY72VDGCA/.repository/org/apache/maven/maven-artifact-manager/2.0.6/maven-artifact-manager-2.0.6.jar!/' instead.
64   INFO  StandaloneSetup    - Registering project be.uantwerpen.ansymo.semanticadaptation at 'file:/var/lib/jenkins/workspace/HybridCosimulation_au_kel-W2ZRQHUT7O4Q5VVKCCGVMBEVXK7JY2IPO3SXT35TW4ZHY72VDGCA/DSL_SemanticAdaptation/be.uantwerpen.ansymo.semanticadaptation/'
64   INFO  StandaloneSetup    - Registering project be.uantwerpen.ansymo.semanticadaptation.tests at 'file:/var/lib/jenkins/workspace/HybridCosimulation_au_kel-W2ZRQHUT7O4Q5VVKCCGVMBEVXK7JY2IPO3SXT35TW4ZHY72VDGCA/DSL_SemanticAdaptation/be.uantwerpen.ansymo.semanticadaptation.tests/'
65   INFO  StandaloneSetup    - Registering project be.uantwerpen.ansymo.semanticadaptation.ide at 'file:/var/lib/jenkins/workspace/HybridCosimulation_au_kel-W2ZRQHUT7O4Q5VVKCCGVMBEVXK7JY2IPO3SXT35TW4ZHY72VDGCA/DSL_SemanticAdaptation/be.uantwerpen.ansymo.semanticadaptation.ide/'
65   INFO  StandaloneSetup    - Registering project be.uantwerpen.ansymo.semanticadaptation.ui at 'file:/var/lib/jenkins/workspace/HybridCosimulation_au_kel-W2ZRQHUT7O4Q5VVKCCGVMBEVXK7JY2IPO3SXT35TW4ZHY72VDGCA/DSL_SemanticAdaptation/be.uantwerpen.ansymo.semanticadaptation.ui/'
65   INFO  StandaloneSetup    - Registering project be.uantwerpen.ansymo.semanticadaptation.ui.tests at 'file:/var/lib/jenkins/workspace/HybridCosimulation_au_kel-W2ZRQHUT7O4Q5VVKCCGVMBEVXK7JY2IPO3SXT35TW4ZHY72VDGCA/DSL_SemanticAdaptation/be.uantwerpen.ansymo.semanticadaptation.ui.tests/'
72   INFO  StandaloneSetup    - Using resourceSet registry. The registered Packages will not be registered in the global EPackage.Registry.INSTANCE!
265  INFO  GenModelHelper     - Registered GenModel 'http://www.eclipse.org/Xtext/Xbase/XAnnotations' from 'platform:/resource/org.eclipse.xtext.xbase/model/Xbase.genmodel'
267  INFO  GenModelHelper     - Registered GenModel 'http://www.eclipse.org/xtext/xbase/Xtype' from 'platform:/resource/org.eclipse.xtext.xbase/model/Xbase.genmodel'
276  INFO  GenModelHelper     - Registered GenModel 'http://www.eclipse.org/xtext/xbase/Xbase' from 'platform:/resource/org.eclipse.xtext.xbase/model/Xbase.genmodel'
276  INFO  GenModelHelper     - Registered GenModel 'http://www.eclipse.org/xtext/common/JavaVMTypes' from 'platform:/resource/org.eclipse.xtext.common.types/model/JavaVMTypes.genmodel'
977  INFO  AntlrToolFacade    - downloading file from 'http://download.itemis.com/antlr-generator-3.2.0-patch.jar' ...
5224 INFO  AntlrToolFacade    - finished downloading.
5237 INFO  XtextGenerator     - Generating be.uantwerpen.ansymo.semanticadaptation.SemanticAdaptation
11313 INFO  EMFGeneratorFragment2 - Generating EMF model code
11360 INFO  GenModelHelper     - Registered GenModel 'http://www.uantwerpen.be/ansymo/semanticadaptation/SemanticAdaptation' from 'platform:/resource/be.uantwerpen.ansymo.semanticadaptation/model/generated/SemanticAdaptation.genmodel'
warning(200): /var/lib/jenkins/workspace/HybridCosimulation_au_kel-W2ZRQHUT7O4Q5VVKCCGVMBEVXK7JY2IPO3SXT35TW4ZHY72VDGCA/DSL_SemanticAdaptation/be.uantwerpen.ansymo.semanticadaptation/src-gen/be/uantwerpen/ansymo/semanticadaptation/parser/antlr/internal/InternalSemanticAdaptation.g:1793:4: Decision can match input such as "'with' RULE_ID '->' RULE_ID" using multiple alternatives: 1, 2
As a result, alternative(s) 2 were disabled for that input
warning(200): /var/lib/jenkins/workspace/HybridCosimulation_au_kel-W2ZRQHUT7O4Q5VVKCCGVMBEVXK7JY2IPO3SXT35TW4ZHY72VDGCA/DSL_SemanticAdaptation/be.uantwerpen.ansymo.semanticadaptation.ide/src-gen/be/uantwerpen/ansymo/semanticadaptation/ide/contentassist/antlr/internal/InternalSemanticAdaptation.g:7418:42: Decision can match input such as "'with' RULE_ID '->' RULE_ID" using multiple alternatives: 1, 2
As a result, alternative(s) 2 were disabled for that input
21959 INFO  XtextGenerator     - Generating common infrastructure
21969 INFO  Workflow           - Done.
[INFO] 
[INFO] --- xtend-maven-plugin:2.11.0:compile (default) @ be.uantwerpen.ansymo.semanticadaptation ---
[WARNING] 
WARNING: 	SemanticAdaptationValidator.xtend - /var/lib/jenkins/workspace/HybridCosimulation_au_kel-W2ZRQHUT7O4Q5VVKCCGVMBEVXK7JY2IPO3SXT35TW4ZHY72VDGCA/DSL_SemanticAdaptation/be.uantwerpen.ansymo.semanticadaptation/src/be/uantwerpen/ansymo/semanticadaptation/validation/SemanticAdaptationValidator.xtend
15: The use of wildcard imports is deprecated.
[WARNING] 
WARNING: 	SemanticAdaptationValidator.xtend - /var/lib/jenkins/workspace/HybridCosimulation_au_kel-W2ZRQHUT7O4Q5VVKCCGVMBEVXK7JY2IPO3SXT35TW4ZHY72VDGCA/DSL_SemanticAdaptation/be.uantwerpen.ansymo.semanticadaptation/src/be/uantwerpen/ansymo/semanticadaptation/validation/SemanticAdaptationValidator.xtend
11: The import 'org.eclipse.xtext.EcoreUtil2' is never used.
[WARNING] 
WARNING: 	SemanticAdaptationValidator.xtend - /var/lib/jenkins/workspace/HybridCosimulation_au_kel-W2ZRQHUT7O4Q5VVKCCGVMBEVXK7JY2IPO3SXT35TW4ZHY72VDGCA/DSL_SemanticAdaptation/be.uantwerpen.ansymo.semanticadaptation/src/be/uantwerpen/ansymo/semanticadaptation/validation/SemanticAdaptationValidator.xtend
10: The import 'com.google.inject.Inject' is never used.
[WARNING] 
WARNING: 	SemanticAdaptationValidator.xtend - /var/lib/jenkins/workspace/HybridCosimulation_au_kel-W2ZRQHUT7O4Q5VVKCCGVMBEVXK7JY2IPO3SXT35TW4ZHY72VDGCA/DSL_SemanticAdaptation/be.uantwerpen.ansymo.semanticadaptation/src/be/uantwerpen/ansymo/semanticadaptation/validation/SemanticAdaptationValidator.xtend
14: The import 'org.eclipse.xtext.validation.ValidationMessageAcceptor' is never used.
[WARNING] 
WARNING: 	SemanticAdaptationValidator.xtend - /var/lib/jenkins/workspace/HybridCosimulation_au_kel-W2ZRQHUT7O4Q5VVKCCGVMBEVXK7JY2IPO3SXT35TW4ZHY72VDGCA/DSL_SemanticAdaptation/be.uantwerpen.ansymo.semanticadaptation/src/be/uantwerpen/ansymo/semanticadaptation/validation/SemanticAdaptationValidator.xtend
13: The import 'org.eclipse.xtext.validation.Check' is never used.
[WARNING] 
WARNING: 	SemanticAdaptationValidator.xtend - /var/lib/jenkins/workspace/HybridCosimulation_au_kel-W2ZRQHUT7O4Q5VVKCCGVMBEVXK7JY2IPO3SXT35TW4ZHY72VDGCA/DSL_SemanticAdaptation/be.uantwerpen.ansymo.semanticadaptation/src/be/uantwerpen/ansymo/semanticadaptation/validation/SemanticAdaptationValidator.xtend
12: The import 'be.uantwerpen.ansymo.semanticadaptation.interpreter.Interpreter' is never used.
[WARNING] 
WARNING: 	SemanticAdaptationValidator.xtend - /var/lib/jenkins/workspace/HybridCosimulation_au_kel-W2ZRQHUT7O4Q5VVKCCGVMBEVXK7JY2IPO3SXT35TW4ZHY72VDGCA/DSL_SemanticAdaptation/be.uantwerpen.ansymo.semanticadaptation/src/be/uantwerpen/ansymo/semanticadaptation/validation/SemanticAdaptationValidator.xtend
17: The import 'be.uantwerpen.ansymo.semanticadaptation.semanticAdaptation.SemanticAdaptationPackage$Literals' is never used.
[WARNING] 
WARNING: 	SemanticAdaptationPythonGenerator.xtend - /var/lib/jenkins/workspace/HybridCosimulation_au_kel-W2ZRQHUT7O4Q5VVKCCGVMBEVXK7JY2IPO3SXT35TW4ZHY72VDGCA/DSL_SemanticAdaptation/be.uantwerpen.ansymo.semanticadaptation/src/be/uantwerpen/ansymo/semanticadaptation/generator/SemanticAdaptationPythonGenerator.xtend
10: The use of wildcard imports is deprecated.
[WARNING] 
WARNING: 	SemanticAdaptationPythonGenerator.xtend - /var/lib/jenkins/workspace/HybridCosimulation_au_kel-W2ZRQHUT7O4Q5VVKCCGVMBEVXK7JY2IPO3SXT35TW4ZHY72VDGCA/DSL_SemanticAdaptation/be.uantwerpen.ansymo.semanticadaptation/src/be/uantwerpen/ansymo/semanticadaptation/generator/SemanticAdaptationPythonGenerator.xtend
11: The import 'org.eclipse.emf.ecore.EClass' is never used.
[WARNING] 
WARNING: 	SemanticAdaptationScopeProvider.xtend - /var/lib/jenkins/workspace/HybridCosimulation_au_kel-W2ZRQHUT7O4Q5VVKCCGVMBEVXK7JY2IPO3SXT35TW4ZHY72VDGCA/DSL_SemanticAdaptation/be.uantwerpen.ansymo.semanticadaptation/src/be/uantwerpen/ansymo/semanticadaptation/scoping/SemanticAdaptationScopeProvider.xtend
14: The use of wildcard imports is deprecated.
[WARNING] 
WARNING: 	SemanticAdaptationScopeProvider.xtend - /var/lib/jenkins/workspace/HybridCosimulation_au_kel-W2ZRQHUT7O4Q5VVKCCGVMBEVXK7JY2IPO3SXT35TW4ZHY72VDGCA/DSL_SemanticAdaptation/be.uantwerpen.ansymo.semanticadaptation/src/be/uantwerpen/ansymo/semanticadaptation/scoping/SemanticAdaptationScopeProvider.xtend
78: The operator '!=' should be replaced by '!==' when null is one of the arguments.
[WARNING] 
WARNING: 	SemanticAdaptationScopeProvider.xtend - /var/lib/jenkins/workspace/HybridCosimulation_au_kel-W2ZRQHUT7O4Q5VVKCCGVMBEVXK7JY2IPO3SXT35TW4ZHY72VDGCA/DSL_SemanticAdaptation/be.uantwerpen.ansymo.semanticadaptation/src/be/uantwerpen/ansymo/semanticadaptation/scoping/SemanticAdaptationScopeProvider.xtend
80: The operator '!=' should be replaced by '!==' when null is one of the arguments.
[WARNING] 
WARNING: 	SemanticAdaptationScopeProvider.xtend - /var/lib/jenkins/workspace/HybridCosimulation_au_kel-W2ZRQHUT7O4Q5VVKCCGVMBEVXK7JY2IPO3SXT35TW4ZHY72VDGCA/DSL_SemanticAdaptation/be.uantwerpen.ansymo.semanticadaptation/src/be/uantwerpen/ansymo/semanticadaptation/scoping/SemanticAdaptationScopeProvider.xtend
124: EList is a raw type. References to generic type EList<E> should be parameterized
[WARNING] 
WARNING: 	SemanticAdaptationScopeProvider.xtend - /var/lib/jenkins/workspace/HybridCosimulation_au_kel-W2ZRQHUT7O4Q5VVKCCGVMBEVXK7JY2IPO3SXT35TW4ZHY72VDGCA/DSL_SemanticAdaptation/be.uantwerpen.ansymo.semanticadaptation/src/be/uantwerpen/ansymo/semanticadaptation/scoping/SemanticAdaptationScopeProvider.xtend
189: The operator '!=' should be replaced by '!==' when null is one of the arguments.
[WARNING] 
WARNING: 	SemanticAdaptationScopeProvider.xtend - /var/lib/jenkins/workspace/HybridCosimulation_au_kel-W2ZRQHUT7O4Q5VVKCCGVMBEVXK7JY2IPO3SXT35TW4ZHY72VDGCA/DSL_SemanticAdaptation/be.uantwerpen.ansymo.semanticadaptation/src/be/uantwerpen/ansymo/semanticadaptation/scoping/SemanticAdaptationScopeProvider.xtend
191: EList is a raw type. References to generic type EList<E> should be parameterized
[WARNING] 
WARNING: 	SemanticAdaptationScopeProvider.xtend - /var/lib/jenkins/workspace/HybridCosimulation_au_kel-W2ZRQHUT7O4Q5VVKCCGVMBEVXK7JY2IPO3SXT35TW4ZHY72VDGCA/DSL_SemanticAdaptation/be.uantwerpen.ansymo.semanticadaptation/src/be/uantwerpen/ansymo/semanticadaptation/scoping/SemanticAdaptationScopeProvider.xtend
192: The operator '!=' should be replaced by '!==' when null is one of the arguments.
[WARNING] 
WARNING: 	SemanticAdaptationScopeProvider.xtend - /var/lib/jenkins/workspace/HybridCosimulation_au_kel-W2ZRQHUT7O4Q5VVKCCGVMBEVXK7JY2IPO3SXT35TW4ZHY72VDGCA/DSL_SemanticAdaptation/be.uantwerpen.ansymo.semanticadaptation/src/be/uantwerpen/ansymo/semanticadaptation/scoping/SemanticAdaptationScopeProvider.xtend
198: The operator '==' should be replaced by '===' when null is one of the arguments.
[WARNING] 
WARNING: 	SemanticAdaptationScopeProvider.xtend - /var/lib/jenkins/workspace/HybridCosimulation_au_kel-W2ZRQHUT7O4Q5VVKCCGVMBEVXK7JY2IPO3SXT35TW4ZHY72VDGCA/DSL_SemanticAdaptation/be.uantwerpen.ansymo.semanticadaptation/src/be/uantwerpen/ansymo/semanticadaptation/scoping/SemanticAdaptationScopeProvider.xtend
245: The operator '!=' should be replaced by '!==' when null is one of the arguments.
[WARNING] 
WARNING: 	Interpreter.xtend - /var/lib/jenkins/workspace/HybridCosimulation_au_kel-W2ZRQHUT7O4Q5VVKCCGVMBEVXK7JY2IPO3SXT35TW4ZHY72VDGCA/DSL_SemanticAdaptation/be.uantwerpen.ansymo.semanticadaptation/src/be/uantwerpen/ansymo/semanticadaptation/interpreter/Interpreter.xtend
12: The import 'java.math.BigDecimal' is never used.
[WARNING] 
WARNING: 	Interpreter.xtend - /var/lib/jenkins/workspace/HybridCosimulation_au_kel-W2ZRQHUT7O4Q5VVKCCGVMBEVXK7JY2IPO3SXT35TW4ZHY72VDGCA/DSL_SemanticAdaptation/be.uantwerpen.ansymo.semanticadaptation/src/be/uantwerpen/ansymo/semanticadaptation/interpreter/Interpreter.xtend
10: The import 'com.google.common.collect.ImmutableMap' is never used.
[WARNING] 
WARNING: 	Interpreter.xtend - /var/lib/jenkins/workspace/HybridCosimulation_au_kel-W2ZRQHUT7O4Q5VVKCCGVMBEVXK7JY2IPO3SXT35TW4ZHY72VDGCA/DSL_SemanticAdaptation/be.uantwerpen.ansymo.semanticadaptation/src/be/uantwerpen/ansymo/semanticadaptation/interpreter/Interpreter.xtend
11: The import 'com.google.common.collect.Maps' is never used.
[WARNING] 
WARNING: 	Interpreter.xtend - /var/lib/jenkins/workspace/HybridCosimulation_au_kel-W2ZRQHUT7O4Q5VVKCCGVMBEVXK7JY2IPO3SXT35TW4ZHY72VDGCA/DSL_SemanticAdaptation/be.uantwerpen.ansymo.semanticadaptation/src/be/uantwerpen/ansymo/semanticadaptation/interpreter/Interpreter.xtend
13: The import 'java.math.RoundingMode' is never used.
[INFO] 
[INFO] --- maven-resources-plugin:2.4.3:resources (default-resources) @ be.uantwerpen.ansymo.semanticadaptation ---
[INFO] Using 'UTF-8' encoding to copy filtered resources.
[INFO] skip non existing resourceDirectory /var/lib/jenkins/workspace/HybridCosimulation_au_kel-W2ZRQHUT7O4Q5VVKCCGVMBEVXK7JY2IPO3SXT35TW4ZHY72VDGCA/DSL_SemanticAdaptation/be.uantwerpen.ansymo.semanticadaptation/src/main/resources
[INFO] 
[INFO] --- tycho-compiler-plugin:1.0.0:compile (default-compile) @ be.uantwerpen.ansymo.semanticadaptation ---
[WARNING] Parameter 'useProjectSettings' is set to true, but preferences file '/var/lib/jenkins/workspace/HybridCosimulation_au_kel-W2ZRQHUT7O4Q5VVKCCGVMBEVXK7JY2IPO3SXT35TW4ZHY72VDGCA/DSL_SemanticAdaptation/be.uantwerpen.ansymo.semanticadaptation/.settings/org.eclipse.jdt.core.prefs' could not be found!
[INFO] Compiling 311 source files to /var/lib/jenkins/workspace/HybridCosimulation_au_kel-W2ZRQHUT7O4Q5VVKCCGVMBEVXK7JY2IPO3SXT35TW4ZHY72VDGCA/DSL_SemanticAdaptation/be.uantwerpen.ansymo.semanticadaptation/target/classes
[INFO] 
[INFO] --- xtend-maven-plugin:2.11.0:xtend-install-debug-info (default) @ be.uantwerpen.ansymo.semanticadaptation ---
[WARNING] Directory /var/lib/jenkins/workspace/HybridCosimulation_au_kel-W2ZRQHUT7O4Q5VVKCCGVMBEVXK7JY2IPO3SXT35TW4ZHY72VDGCA/DSL_SemanticAdaptation/be.uantwerpen.ansymo.semanticadaptation/src/main/java is empty. Can't process.
[INFO] Installing Xtend files into 14 class files as primary debug sources in: /var/lib/jenkins/workspace/HybridCosimulation_au_kel-W2ZRQHUT7O4Q5VVKCCGVMBEVXK7JY2IPO3SXT35TW4ZHY72VDGCA/DSL_SemanticAdaptation/be.uantwerpen.ansymo.semanticadaptation/target/classes
[INFO] 
[INFO] --- xtend-maven-plugin:2.11.0:testCompile (default) @ be.uantwerpen.ansymo.semanticadaptation ---
[INFO] skip compiling sources because the configured directory '[/var/lib/jenkins/workspace/HybridCosimulation_au_kel-W2ZRQHUT7O4Q5VVKCCGVMBEVXK7JY2IPO3SXT35TW4ZHY72VDGCA/DSL_SemanticAdaptation/be.uantwerpen.ansymo.semanticadaptation/src/test/java]' does not exists.
[INFO] 
[INFO] --- maven-resources-plugin:2.4.3:testResources (default-testResources) @ be.uantwerpen.ansymo.semanticadaptation ---
[INFO] Using 'UTF-8' encoding to copy filtered resources.
[INFO] skip non existing resourceDirectory /var/lib/jenkins/workspace/HybridCosimulation_au_kel-W2ZRQHUT7O4Q5VVKCCGVMBEVXK7JY2IPO3SXT35TW4ZHY72VDGCA/DSL_SemanticAdaptation/be.uantwerpen.ansymo.semanticadaptation/src/test/resources
[INFO] 
[INFO] --- xtend-maven-plugin:2.11.0:xtend-test-install-debug-info (default) @ be.uantwerpen.ansymo.semanticadaptation ---
[WARNING] Directory /var/lib/jenkins/workspace/HybridCosimulation_au_kel-W2ZRQHUT7O4Q5VVKCCGVMBEVXK7JY2IPO3SXT35TW4ZHY72VDGCA/DSL_SemanticAdaptation/be.uantwerpen.ansymo.semanticadaptation/src/test/java is empty. Can't process.
[WARNING] Directory /var/lib/jenkins/workspace/HybridCosimulation_au_kel-W2ZRQHUT7O4Q5VVKCCGVMBEVXK7JY2IPO3SXT35TW4ZHY72VDGCA/DSL_SemanticAdaptation/be.uantwerpen.ansymo.semanticadaptation/target/xtend-gen/test is empty. Can't process.
[INFO] Installing Xtend files into 0 class files as primary debug sources in: /var/lib/jenkins/workspace/HybridCosimulation_au_kel-W2ZRQHUT7O4Q5VVKCCGVMBEVXK7JY2IPO3SXT35TW4ZHY72VDGCA/DSL_SemanticAdaptation/be.uantwerpen.ansymo.semanticadaptation/target/test-classes
[INFO] 
[INFO] --- target-platform-configuration:1.0.0:target-platform (default-target-platform) @ be.uantwerpen.ansymo.semanticadaptation ---
[INFO] 
[INFO] --- tycho-packaging-plugin:1.0.0:package-plugin (default-package-plugin) @ be.uantwerpen.ansymo.semanticadaptation ---
[INFO] Building jar: /var/lib/jenkins/workspace/HybridCosimulation_au_kel-W2ZRQHUT7O4Q5VVKCCGVMBEVXK7JY2IPO3SXT35TW4ZHY72VDGCA/DSL_SemanticAdaptation/be.uantwerpen.ansymo.semanticadaptation/target/be.uantwerpen.ansymo.semanticadaptation-1.0.0-SNAPSHOT.jar
[INFO] 
[INFO] --- tycho-p2-plugin:1.0.0:p2-metadata-default (default-p2-metadata-default) @ be.uantwerpen.ansymo.semanticadaptation ---
[INFO] 
[INFO] --- maven-install-plugin:2.3.1:install (default-install) @ be.uantwerpen.ansymo.semanticadaptation ---
[INFO] Installing /var/lib/jenkins/workspace/HybridCosimulation_au_kel-W2ZRQHUT7O4Q5VVKCCGVMBEVXK7JY2IPO3SXT35TW4ZHY72VDGCA/DSL_SemanticAdaptation/be.uantwerpen.ansymo.semanticadaptation/target/be.uantwerpen.ansymo.semanticadaptation-1.0.0-SNAPSHOT.jar to /var/lib/jenkins/workspace/HybridCosimulation_au_kel-W2ZRQHUT7O4Q5VVKCCGVMBEVXK7JY2IPO3SXT35TW4ZHY72VDGCA/.repository/be/uantwerpen/ansymo/semanticadaptation/be.uantwerpen.ansymo.semanticadaptation/1.0.0-SNAPSHOT/be.uantwerpen.ansymo.semanticadaptation-1.0.0-SNAPSHOT.jar
[INFO] Installing /var/lib/jenkins/workspace/HybridCosimulation_au_kel-W2ZRQHUT7O4Q5VVKCCGVMBEVXK7JY2IPO3SXT35TW4ZHY72VDGCA/DSL_SemanticAdaptation/be.uantwerpen.ansymo.semanticadaptation/pom.xml to /var/lib/jenkins/workspace/HybridCosimulation_au_kel-W2ZRQHUT7O4Q5VVKCCGVMBEVXK7JY2IPO3SXT35TW4ZHY72VDGCA/.repository/be/uantwerpen/ansymo/semanticadaptation/be.uantwerpen.ansymo.semanticadaptation/1.0.0-SNAPSHOT/be.uantwerpen.ansymo.semanticadaptation-1.0.0-SNAPSHOT.pom
[INFO] Installing /var/lib/jenkins/workspace/HybridCosimulation_au_kel-W2ZRQHUT7O4Q5VVKCCGVMBEVXK7JY2IPO3SXT35TW4ZHY72VDGCA/DSL_SemanticAdaptation/be.uantwerpen.ansymo.semanticadaptation/target/p2content.xml to /var/lib/jenkins/workspace/HybridCosimulation_au_kel-W2ZRQHUT7O4Q5VVKCCGVMBEVXK7JY2IPO3SXT35TW4ZHY72VDGCA/.repository/be/uantwerpen/ansymo/semanticadaptation/be.uantwerpen.ansymo.semanticadaptation/1.0.0-SNAPSHOT/be.uantwerpen.ansymo.semanticadaptation-1.0.0-SNAPSHOT-p2metadata.xml
[INFO] Installing /var/lib/jenkins/workspace/HybridCosimulation_au_kel-W2ZRQHUT7O4Q5VVKCCGVMBEVXK7JY2IPO3SXT35TW4ZHY72VDGCA/DSL_SemanticAdaptation/be.uantwerpen.ansymo.semanticadaptation/target/p2artifacts.xml to /var/lib/jenkins/workspace/HybridCosimulation_au_kel-W2ZRQHUT7O4Q5VVKCCGVMBEVXK7JY2IPO3SXT35TW4ZHY72VDGCA/.repository/be/uantwerpen/ansymo/semanticadaptation/be.uantwerpen.ansymo.semanticadaptation/1.0.0-SNAPSHOT/be.uantwerpen.ansymo.semanticadaptation-1.0.0-SNAPSHOT-p2artifacts.xml
[INFO] 
[INFO] --- tycho-p2-plugin:1.0.0:update-local-index (default-update-local-index) @ be.uantwerpen.ansymo.semanticadaptation ---
[INFO]                                                                         
[INFO] ------------------------------------------------------------------------
[INFO] Building be.uantwerpen.ansymo.semanticadaptation Language Tests 1.0.0-SNAPSHOT
[INFO] ------------------------------------------------------------------------
[INFO] 
[INFO] --- tycho-packaging-plugin:1.0.0:build-qualifier (default-build-qualifier) @ be.uantwerpen.ansymo.semanticadaptation.tests ---
[INFO] The project's OSGi version is 1.0.0.201706290713
[INFO] 
[INFO] --- tycho-packaging-plugin:1.0.0:validate-id (default-validate-id) @ be.uantwerpen.ansymo.semanticadaptation.tests ---
[INFO] 
[INFO] --- tycho-packaging-plugin:1.0.0:validate-version (default-validate-version) @ be.uantwerpen.ansymo.semanticadaptation.tests ---
[INFO] 
[INFO] --- xtend-maven-plugin:2.11.0:compile (default) @ be.uantwerpen.ansymo.semanticadaptation.tests ---
[WARNING] 
WARNING: 	AbstractSemanticAdaptationTest.xtend - /var/lib/jenkins/workspace/HybridCosimulation_au_kel-W2ZRQHUT7O4Q5VVKCCGVMBEVXK7JY2IPO3SXT35TW4ZHY72VDGCA/DSL_SemanticAdaptation/be.uantwerpen.ansymo.semanticadaptation.tests/src/be/uantwerpen/ansymo/semanticadaptation/tests/AbstractSemanticAdaptationTest.xtend
64: The operator '!=' should be replaced by '!==' when null is one of the arguments.
[WARNING] 
WARNING: 	AbstractSemanticAdaptationTest.xtend - /var/lib/jenkins/workspace/HybridCosimulation_au_kel-W2ZRQHUT7O4Q5VVKCCGVMBEVXK7JY2IPO3SXT35TW4ZHY72VDGCA/DSL_SemanticAdaptation/be.uantwerpen.ansymo.semanticadaptation.tests/src/be/uantwerpen/ansymo/semanticadaptation/tests/AbstractSemanticAdaptationTest.xtend
82: Unnecessary cast from EObject to EObject
[WARNING] 
WARNING: 	BasicParserTest.xtend - /var/lib/jenkins/workspace/HybridCosimulation_au_kel-W2ZRQHUT7O4Q5VVKCCGVMBEVXK7JY2IPO3SXT35TW4ZHY72VDGCA/DSL_SemanticAdaptation/be.uantwerpen.ansymo.semanticadaptation.tests/src/be/uantwerpen/ansymo/semanticadaptation/tests/BasicParserTest.xtend
12: The import 'org.eclipse.xtext.util.Arrays' is never used.
[WARNING] 
WARNING: 	BasicParserTest.xtend - /var/lib/jenkins/workspace/HybridCosimulation_au_kel-W2ZRQHUT7O4Q5VVKCCGVMBEVXK7JY2IPO3SXT35TW4ZHY72VDGCA/DSL_SemanticAdaptation/be.uantwerpen.ansymo.semanticadaptation.tests/src/be/uantwerpen/ansymo/semanticadaptation/tests/BasicParserTest.xtend
15: The import 'org.junit.Assert.fail' is never used.
[WARNING] 
WARNING: 	SemanticAdaptationGeneratorTest.xtend - /var/lib/jenkins/workspace/HybridCosimulation_au_kel-W2ZRQHUT7O4Q5VVKCCGVMBEVXK7JY2IPO3SXT35TW4ZHY72VDGCA/DSL_SemanticAdaptation/be.uantwerpen.ansymo.semanticadaptation.tests/src/be/uantwerpen/ansymo/semanticadaptation/tests/SemanticAdaptationGeneratorTest.xtend
33: The value of the local variable f is not used
[INFO] 
[INFO] --- maven-resources-plugin:2.4.3:resources (default-resources) @ be.uantwerpen.ansymo.semanticadaptation.tests ---
[INFO] Using 'UTF-8' encoding to copy filtered resources.
[INFO] skip non existing resourceDirectory /var/lib/jenkins/workspace/HybridCosimulation_au_kel-W2ZRQHUT7O4Q5VVKCCGVMBEVXK7JY2IPO3SXT35TW4ZHY72VDGCA/DSL_SemanticAdaptation/be.uantwerpen.ansymo.semanticadaptation.tests/src/main/resources
[INFO] 
[INFO] --- tycho-compiler-plugin:1.0.0:compile (default-compile) @ be.uantwerpen.ansymo.semanticadaptation.tests ---
[WARNING] Parameter 'useProjectSettings' is set to true, but preferences file '/var/lib/jenkins/workspace/HybridCosimulation_au_kel-W2ZRQHUT7O4Q5VVKCCGVMBEVXK7JY2IPO3SXT35TW4ZHY72VDGCA/DSL_SemanticAdaptation/be.uantwerpen.ansymo.semanticadaptation.tests/.settings/org.eclipse.jdt.core.prefs' could not be found!
[INFO] Compiling 10 source files to /var/lib/jenkins/workspace/HybridCosimulation_au_kel-W2ZRQHUT7O4Q5VVKCCGVMBEVXK7JY2IPO3SXT35TW4ZHY72VDGCA/DSL_SemanticAdaptation/be.uantwerpen.ansymo.semanticadaptation.tests/target/classes
[INFO] 
[INFO] --- xtend-maven-plugin:2.11.0:xtend-install-debug-info (default) @ be.uantwerpen.ansymo.semanticadaptation.tests ---
[WARNING] Directory /var/lib/jenkins/workspace/HybridCosimulation_au_kel-W2ZRQHUT7O4Q5VVKCCGVMBEVXK7JY2IPO3SXT35TW4ZHY72VDGCA/DSL_SemanticAdaptation/be.uantwerpen.ansymo.semanticadaptation.tests/src/main/java is empty. Can't process.
[INFO] Installing Xtend files into 14 class files as primary debug sources in: /var/lib/jenkins/workspace/HybridCosimulation_au_kel-W2ZRQHUT7O4Q5VVKCCGVMBEVXK7JY2IPO3SXT35TW4ZHY72VDGCA/DSL_SemanticAdaptation/be.uantwerpen.ansymo.semanticadaptation.tests/target/classes
[INFO] 
[INFO] --- xtend-maven-plugin:2.11.0:testCompile (default) @ be.uantwerpen.ansymo.semanticadaptation.tests ---
[INFO] skip compiling sources because the configured directory '[/var/lib/jenkins/workspace/HybridCosimulation_au_kel-W2ZRQHUT7O4Q5VVKCCGVMBEVXK7JY2IPO3SXT35TW4ZHY72VDGCA/DSL_SemanticAdaptation/be.uantwerpen.ansymo.semanticadaptation.tests/src/test/java]' does not exists.
[INFO] 
[INFO] --- maven-resources-plugin:2.4.3:testResources (default-testResources) @ be.uantwerpen.ansymo.semanticadaptation.tests ---
[INFO] Using 'UTF-8' encoding to copy filtered resources.
[INFO] skip non existing resourceDirectory /var/lib/jenkins/workspace/HybridCosimulation_au_kel-W2ZRQHUT7O4Q5VVKCCGVMBEVXK7JY2IPO3SXT35TW4ZHY72VDGCA/DSL_SemanticAdaptation/be.uantwerpen.ansymo.semanticadaptation.tests/src/test/resources
[INFO] 
[INFO] --- xtend-maven-plugin:2.11.0:xtend-test-install-debug-info (default) @ be.uantwerpen.ansymo.semanticadaptation.tests ---
[WARNING] Directory /var/lib/jenkins/workspace/HybridCosimulation_au_kel-W2ZRQHUT7O4Q5VVKCCGVMBEVXK7JY2IPO3SXT35TW4ZHY72VDGCA/DSL_SemanticAdaptation/be.uantwerpen.ansymo.semanticadaptation.tests/src/test/java is empty. Can't process.
[WARNING] Directory /var/lib/jenkins/workspace/HybridCosimulation_au_kel-W2ZRQHUT7O4Q5VVKCCGVMBEVXK7JY2IPO3SXT35TW4ZHY72VDGCA/DSL_SemanticAdaptation/be.uantwerpen.ansymo.semanticadaptation.tests/target/xtend-gen/test is empty. Can't process.
[INFO] Installing Xtend files into 0 class files as primary debug sources in: /var/lib/jenkins/workspace/HybridCosimulation_au_kel-W2ZRQHUT7O4Q5VVKCCGVMBEVXK7JY2IPO3SXT35TW4ZHY72VDGCA/DSL_SemanticAdaptation/be.uantwerpen.ansymo.semanticadaptation.tests/target/test-classes
[INFO] 
[INFO] --- target-platform-configuration:1.0.0:target-platform (default-target-platform) @ be.uantwerpen.ansymo.semanticadaptation.tests ---
[INFO] 
[INFO] --- tycho-packaging-plugin:1.0.0:package-plugin (default-package-plugin) @ be.uantwerpen.ansymo.semanticadaptation.tests ---
[INFO] Building jar: /var/lib/jenkins/workspace/HybridCosimulation_au_kel-W2ZRQHUT7O4Q5VVKCCGVMBEVXK7JY2IPO3SXT35TW4ZHY72VDGCA/DSL_SemanticAdaptation/be.uantwerpen.ansymo.semanticadaptation.tests/target/be.uantwerpen.ansymo.semanticadaptation.tests-1.0.0-SNAPSHOT.jar
[INFO] 
[INFO] --- tycho-p2-plugin:1.0.0:p2-metadata-default (default-p2-metadata-default) @ be.uantwerpen.ansymo.semanticadaptation.tests ---
[INFO] 
[INFO] --- tycho-surefire-plugin:1.0.0:test (default-test) @ be.uantwerpen.ansymo.semanticadaptation.tests ---
[INFO] Expected eclipse log file: /var/lib/jenkins/workspace/HybridCosimulation_au_kel-W2ZRQHUT7O4Q5VVKCCGVMBEVXK7JY2IPO3SXT35TW4ZHY72VDGCA/DSL_SemanticAdaptation/be.uantwerpen.ansymo.semanticadaptation.tests/target/work/data/.metadata/.log
[INFO] Command line:
	[/usr/lib/jvm/java-8-oracle/jre/bin/java, -Dosgi.noShutdown=false, -Dosgi.os=linux, -Dosgi.ws=gtk, -Dosgi.arch=x86_64, -Dosgi.clean=true, -jar, /var/lib/jenkins/workspace/HybridCosimulation_au_kel-W2ZRQHUT7O4Q5VVKCCGVMBEVXK7JY2IPO3SXT35TW4ZHY72VDGCA/.repository/p2/osgi/bundle/org.eclipse.equinox.launcher/1.3.201.v20161025-1711/org.eclipse.equinox.launcher-1.3.201.v20161025-1711.jar, -data, /var/lib/jenkins/workspace/HybridCosimulation_au_kel-W2ZRQHUT7O4Q5VVKCCGVMBEVXK7JY2IPO3SXT35TW4ZHY72VDGCA/DSL_SemanticAdaptation/be.uantwerpen.ansymo.semanticadaptation.tests/target/work/data, -install, /var/lib/jenkins/workspace/HybridCosimulation_au_kel-W2ZRQHUT7O4Q5VVKCCGVMBEVXK7JY2IPO3SXT35TW4ZHY72VDGCA/DSL_SemanticAdaptation/be.uantwerpen.ansymo.semanticadaptation.tests/target/work, -configuration, /var/lib/jenkins/workspace/HybridCosimulation_au_kel-W2ZRQHUT7O4Q5VVKCCGVMBEVXK7JY2IPO3SXT35TW4ZHY72VDGCA/DSL_SemanticAdaptation/be.uantwerpen.ansymo.semanticadaptation.tests/target/work/configuration, -application, org.eclipse.tycho.surefire.osgibooter.headlesstest, -testproperties, /var/lib/jenkins/workspace/HybridCosimulation_au_kel-W2ZRQHUT7O4Q5VVKCCGVMBEVXK7JY2IPO3SXT35TW4ZHY72VDGCA/DSL_SemanticAdaptation/be.uantwerpen.ansymo.semanticadaptation.tests/target/surefire.properties]
Picked up JAVA_TOOL_OPTIONS: -Dmaven.ext.class.path="/var/lib/jenkins/workspace/HybridCosimulation_au_kel-W2ZRQHUT7O4Q5VVKCCGVMBEVXK7JY2IPO3SXT35TW4ZHY72VDGCA@tmp/withMavenc1971ac2/pipeline-maven-spy.jar" -Dorg.jenkinsci.plugins.pipeline.maven.reportsFolder="/var/lib/jenkins/workspace/HybridCosimulation_au_kel-W2ZRQHUT7O4Q5VVKCCGVMBEVXK7JY2IPO3SXT35TW4ZHY72VDGCA@tmp/withMavenc1971ac2" 

-------------------------------------------------------
 T E S T S
-------------------------------------------------------
Running be.uantwerpen.ansymo.semanticadaptation.tests.SemanticAdaptationParsingTest
Tests run: 1, Failures: 0, Errors: 0, Skipped: 0, Time elapsed: 0.739 sec - in be.uantwerpen.ansymo.semanticadaptation.tests.SemanticAdaptationParsingTest
loadModel(be.uantwerpen.ansymo.semanticadaptation.tests.SemanticAdaptationParsingTest)  Time elapsed: 0.001 sec
Running be.uantwerpen.ansymo.semanticadaptation.tests.SemanticAdaptationGeneratorTest
Tests run: 10, Failures: 0, Errors: 0, Skipped: 10, Time elapsed: 0.008 sec - in be.uantwerpen.ansymo.semanticadaptation.tests.SemanticAdaptationGeneratorTest
powerwindow_controller_delay(be.uantwerpen.ansymo.semanticadaptation.tests.SemanticAdaptationGeneratorTest) skipped
powerwindow_algebraic_loop_iteration_BASE(be.uantwerpen.ansymo.semanticadaptation.tests.SemanticAdaptationGeneratorTest) skipped
powerwindow_multi_rate(be.uantwerpen.ansymo.semanticadaptation.tests.SemanticAdaptationGeneratorTest) skipped
powerwindow_controller_delay_BASE(be.uantwerpen.ansymo.semanticadaptation.tests.SemanticAdaptationGeneratorTest) skipped
powerwindow_algebraic_loop_delay(be.uantwerpen.ansymo.semanticadaptation.tests.SemanticAdaptationGeneratorTest) skipped
powerwindow_multi_rate_BASE(be.uantwerpen.ansymo.semanticadaptation.tests.SemanticAdaptationGeneratorTest) skipped
powerwindow_model_only(be.uantwerpen.ansymo.semanticadaptation.tests.SemanticAdaptationGeneratorTest) skipped
powerwindow_algebraic_loop_delay_BASE(be.uantwerpen.ansymo.semanticadaptation.tests.SemanticAdaptationGeneratorTest) skipped
powerwindow(be.uantwerpen.ansymo.semanticadaptation.tests.SemanticAdaptationGeneratorTest) skipped
powerwindow_algebraic_loop_iteration(be.uantwerpen.ansymo.semanticadaptation.tests.SemanticAdaptationGeneratorTest) skipped
Running be.uantwerpen.ansymo.semanticadaptation.tests.SingleFolderTest
log4j:WARN No appenders could be found for logger (org.eclipse.xtext.parser.antlr.AbstractInternalAntlrParser).
log4j:WARN Please initialize the log4j system properly.
Tests run: 2, Failures: 0, Errors: 0, Skipped: 0, Time elapsed: 0.455 sec - in be.uantwerpen.ansymo.semanticadaptation.tests.SingleFolderTest
test[0 - input/single_folder_spec/window2](be.uantwerpen.ansymo.semanticadaptation.tests.SingleFolderTest)  Time elapsed: 0.343 sec
test[1 - input/single_folder_spec/window](be.uantwerpen.ansymo.semanticadaptation.tests.SingleFolderTest)  Time elapsed: 0.053 sec
Running be.uantwerpen.ansymo.semanticadaptation.tests.PowerWindowCaseStudyFolderTest
Tests run: 1, Failures: 0, Errors: 0, Skipped: 0, Time elapsed: 0.302 sec - in be.uantwerpen.ansymo.semanticadaptation.tests.PowerWindowCaseStudyFolderTest
test[0 - input/power_window_case_study](be.uantwerpen.ansymo.semanticadaptation.tests.PowerWindowCaseStudyFolderTest)  Time elapsed: 0.301 sec

Results :

Tests run: 14, Failures: 0, Errors: 0, Skipped: 10

[INFO] All tests passed!
[INFO] 
[INFO] --- maven-install-plugin:2.3.1:install (default-install) @ be.uantwerpen.ansymo.semanticadaptation.tests ---
[INFO] Installing /var/lib/jenkins/workspace/HybridCosimulation_au_kel-W2ZRQHUT7O4Q5VVKCCGVMBEVXK7JY2IPO3SXT35TW4ZHY72VDGCA/DSL_SemanticAdaptation/be.uantwerpen.ansymo.semanticadaptation.tests/target/be.uantwerpen.ansymo.semanticadaptation.tests-1.0.0-SNAPSHOT.jar to /var/lib/jenkins/workspace/HybridCosimulation_au_kel-W2ZRQHUT7O4Q5VVKCCGVMBEVXK7JY2IPO3SXT35TW4ZHY72VDGCA/.repository/be/uantwerpen/ansymo/semanticadaptation/be.uantwerpen.ansymo.semanticadaptation.tests/1.0.0-SNAPSHOT/be.uantwerpen.ansymo.semanticadaptation.tests-1.0.0-SNAPSHOT.jar
[INFO] Installing /var/lib/jenkins/workspace/HybridCosimulation_au_kel-W2ZRQHUT7O4Q5VVKCCGVMBEVXK7JY2IPO3SXT35TW4ZHY72VDGCA/DSL_SemanticAdaptation/be.uantwerpen.ansymo.semanticadaptation.tests/pom.xml to /var/lib/jenkins/workspace/HybridCosimulation_au_kel-W2ZRQHUT7O4Q5VVKCCGVMBEVXK7JY2IPO3SXT35TW4ZHY72VDGCA/.repository/be/uantwerpen/ansymo/semanticadaptation/be.uantwerpen.ansymo.semanticadaptation.tests/1.0.0-SNAPSHOT/be.uantwerpen.ansymo.semanticadaptation.tests-1.0.0-SNAPSHOT.pom
[INFO] Installing /var/lib/jenkins/workspace/HybridCosimulation_au_kel-W2ZRQHUT7O4Q5VVKCCGVMBEVXK7JY2IPO3SXT35TW4ZHY72VDGCA/DSL_SemanticAdaptation/be.uantwerpen.ansymo.semanticadaptation.tests/target/p2content.xml to /var/lib/jenkins/workspace/HybridCosimulation_au_kel-W2ZRQHUT7O4Q5VVKCCGVMBEVXK7JY2IPO3SXT35TW4ZHY72VDGCA/.repository/be/uantwerpen/ansymo/semanticadaptation/be.uantwerpen.ansymo.semanticadaptation.tests/1.0.0-SNAPSHOT/be.uantwerpen.ansymo.semanticadaptation.tests-1.0.0-SNAPSHOT-p2metadata.xml
[INFO] Installing /var/lib/jenkins/workspace/HybridCosimulation_au_kel-W2ZRQHUT7O4Q5VVKCCGVMBEVXK7JY2IPO3SXT35TW4ZHY72VDGCA/DSL_SemanticAdaptation/be.uantwerpen.ansymo.semanticadaptation.tests/target/p2artifacts.xml to /var/lib/jenkins/workspace/HybridCosimulation_au_kel-W2ZRQHUT7O4Q5VVKCCGVMBEVXK7JY2IPO3SXT35TW4ZHY72VDGCA/.repository/be/uantwerpen/ansymo/semanticadaptation/be.uantwerpen.ansymo.semanticadaptation.tests/1.0.0-SNAPSHOT/be.uantwerpen.ansymo.semanticadaptation.tests-1.0.0-SNAPSHOT-p2artifacts.xml
[INFO] 
[INFO] --- tycho-p2-plugin:1.0.0:update-local-index (default-update-local-index) @ be.uantwerpen.ansymo.semanticadaptation.tests ---
[INFO]                                                                         
[INFO] ------------------------------------------------------------------------
[INFO] Building be.uantwerpen.ansymo.semanticadaptation.ide 1.0.0-SNAPSHOT
[INFO] ------------------------------------------------------------------------
[INFO] 
[INFO] --- tycho-packaging-plugin:1.0.0:build-qualifier (default-build-qualifier) @ be.uantwerpen.ansymo.semanticadaptation.ide ---
[INFO] The project's OSGi version is 1.0.0.201706290713
[INFO] 
[INFO] --- tycho-packaging-plugin:1.0.0:validate-id (default-validate-id) @ be.uantwerpen.ansymo.semanticadaptation.ide ---
[INFO] 
[INFO] --- tycho-packaging-plugin:1.0.0:validate-version (default-validate-version) @ be.uantwerpen.ansymo.semanticadaptation.ide ---
[INFO] 
[INFO] --- maven-resources-plugin:2.4.3:resources (default-resources) @ be.uantwerpen.ansymo.semanticadaptation.ide ---
[INFO] Using 'UTF-8' encoding to copy filtered resources.
[INFO] skip non existing resourceDirectory /var/lib/jenkins/workspace/HybridCosimulation_au_kel-W2ZRQHUT7O4Q5VVKCCGVMBEVXK7JY2IPO3SXT35TW4ZHY72VDGCA/DSL_SemanticAdaptation/be.uantwerpen.ansymo.semanticadaptation.ide/src/main/resources
[INFO] 
[INFO] --- tycho-compiler-plugin:1.0.0:compile (default-compile) @ be.uantwerpen.ansymo.semanticadaptation.ide ---
[WARNING] Parameter 'useProjectSettings' is set to true, but preferences file '/var/lib/jenkins/workspace/HybridCosimulation_au_kel-W2ZRQHUT7O4Q5VVKCCGVMBEVXK7JY2IPO3SXT35TW4ZHY72VDGCA/DSL_SemanticAdaptation/be.uantwerpen.ansymo.semanticadaptation.ide/.settings/org.eclipse.jdt.core.prefs' could not be found!
[INFO] Compiling 5 source files to /var/lib/jenkins/workspace/HybridCosimulation_au_kel-W2ZRQHUT7O4Q5VVKCCGVMBEVXK7JY2IPO3SXT35TW4ZHY72VDGCA/DSL_SemanticAdaptation/be.uantwerpen.ansymo.semanticadaptation.ide/target/classes
[WARNING] Source directory /var/lib/jenkins/workspace/HybridCosimulation_au_kel-W2ZRQHUT7O4Q5VVKCCGVMBEVXK7JY2IPO3SXT35TW4ZHY72VDGCA/DSL_SemanticAdaptation/be.uantwerpen.ansymo.semanticadaptation.ide/xtend-gen does not exist
[INFO] 
[INFO] --- maven-resources-plugin:2.4.3:testResources (default-testResources) @ be.uantwerpen.ansymo.semanticadaptation.ide ---
[INFO] Using 'UTF-8' encoding to copy filtered resources.
[INFO] skip non existing resourceDirectory /var/lib/jenkins/workspace/HybridCosimulation_au_kel-W2ZRQHUT7O4Q5VVKCCGVMBEVXK7JY2IPO3SXT35TW4ZHY72VDGCA/DSL_SemanticAdaptation/be.uantwerpen.ansymo.semanticadaptation.ide/src/test/resources
[INFO] 
[INFO] --- target-platform-configuration:1.0.0:target-platform (default-target-platform) @ be.uantwerpen.ansymo.semanticadaptation.ide ---
[INFO] 
[INFO] --- tycho-packaging-plugin:1.0.0:package-plugin (default-package-plugin) @ be.uantwerpen.ansymo.semanticadaptation.ide ---
[INFO] Building jar: /var/lib/jenkins/workspace/HybridCosimulation_au_kel-W2ZRQHUT7O4Q5VVKCCGVMBEVXK7JY2IPO3SXT35TW4ZHY72VDGCA/DSL_SemanticAdaptation/be.uantwerpen.ansymo.semanticadaptation.ide/target/be.uantwerpen.ansymo.semanticadaptation.ide-1.0.0-SNAPSHOT.jar
[INFO] 
[INFO] --- tycho-p2-plugin:1.0.0:p2-metadata-default (default-p2-metadata-default) @ be.uantwerpen.ansymo.semanticadaptation.ide ---
[INFO] 
[INFO] --- maven-install-plugin:2.3.1:install (default-install) @ be.uantwerpen.ansymo.semanticadaptation.ide ---
[INFO] Installing /var/lib/jenkins/workspace/HybridCosimulation_au_kel-W2ZRQHUT7O4Q5VVKCCGVMBEVXK7JY2IPO3SXT35TW4ZHY72VDGCA/DSL_SemanticAdaptation/be.uantwerpen.ansymo.semanticadaptation.ide/target/be.uantwerpen.ansymo.semanticadaptation.ide-1.0.0-SNAPSHOT.jar to /var/lib/jenkins/workspace/HybridCosimulation_au_kel-W2ZRQHUT7O4Q5VVKCCGVMBEVXK7JY2IPO3SXT35TW4ZHY72VDGCA/.repository/be/uantwerpen/ansymo/semanticadaptation/be.uantwerpen.ansymo.semanticadaptation.ide/1.0.0-SNAPSHOT/be.uantwerpen.ansymo.semanticadaptation.ide-1.0.0-SNAPSHOT.jar
[INFO] Installing /var/lib/jenkins/workspace/HybridCosimulation_au_kel-W2ZRQHUT7O4Q5VVKCCGVMBEVXK7JY2IPO3SXT35TW4ZHY72VDGCA/DSL_SemanticAdaptation/be.uantwerpen.ansymo.semanticadaptation.ide/pom.xml to /var/lib/jenkins/workspace/HybridCosimulation_au_kel-W2ZRQHUT7O4Q5VVKCCGVMBEVXK7JY2IPO3SXT35TW4ZHY72VDGCA/.repository/be/uantwerpen/ansymo/semanticadaptation/be.uantwerpen.ansymo.semanticadaptation.ide/1.0.0-SNAPSHOT/be.uantwerpen.ansymo.semanticadaptation.ide-1.0.0-SNAPSHOT.pom
[INFO] Installing /var/lib/jenkins/workspace/HybridCosimulation_au_kel-W2ZRQHUT7O4Q5VVKCCGVMBEVXK7JY2IPO3SXT35TW4ZHY72VDGCA/DSL_SemanticAdaptation/be.uantwerpen.ansymo.semanticadaptation.ide/target/p2content.xml to /var/lib/jenkins/workspace/HybridCosimulation_au_kel-W2ZRQHUT7O4Q5VVKCCGVMBEVXK7JY2IPO3SXT35TW4ZHY72VDGCA/.repository/be/uantwerpen/ansymo/semanticadaptation/be.uantwerpen.ansymo.semanticadaptation.ide/1.0.0-SNAPSHOT/be.uantwerpen.ansymo.semanticadaptation.ide-1.0.0-SNAPSHOT-p2metadata.xml
[INFO] Installing /var/lib/jenkins/workspace/HybridCosimulation_au_kel-W2ZRQHUT7O4Q5VVKCCGVMBEVXK7JY2IPO3SXT35TW4ZHY72VDGCA/DSL_SemanticAdaptation/be.uantwerpen.ansymo.semanticadaptation.ide/target/p2artifacts.xml to /var/lib/jenkins/workspace/HybridCosimulation_au_kel-W2ZRQHUT7O4Q5VVKCCGVMBEVXK7JY2IPO3SXT35TW4ZHY72VDGCA/.repository/be/uantwerpen/ansymo/semanticadaptation/be.uantwerpen.ansymo.semanticadaptation.ide/1.0.0-SNAPSHOT/be.uantwerpen.ansymo.semanticadaptation.ide-1.0.0-SNAPSHOT-p2artifacts.xml
[INFO] 
[INFO] --- tycho-p2-plugin:1.0.0:update-local-index (default-update-local-index) @ be.uantwerpen.ansymo.semanticadaptation.ide ---
[INFO]                                                                         
[INFO] ------------------------------------------------------------------------
[INFO] Building be.uantwerpen.ansymo.semanticadaptation.ui Language UI 1.0.0-SNAPSHOT
[INFO] ------------------------------------------------------------------------
[INFO] 
[INFO] --- tycho-packaging-plugin:1.0.0:build-qualifier (default-build-qualifier) @ be.uantwerpen.ansymo.semanticadaptation.ui ---
[INFO] The project's OSGi version is 1.0.0.201706290713
[INFO] 
[INFO] --- tycho-packaging-plugin:1.0.0:validate-id (default-validate-id) @ be.uantwerpen.ansymo.semanticadaptation.ui ---
[INFO] 
[INFO] --- tycho-packaging-plugin:1.0.0:validate-version (default-validate-version) @ be.uantwerpen.ansymo.semanticadaptation.ui ---
[INFO] 
[INFO] --- xtend-maven-plugin:2.11.0:compile (default) @ be.uantwerpen.ansymo.semanticadaptation.ui ---
[INFO] 
[INFO] --- maven-resources-plugin:2.4.3:resources (default-resources) @ be.uantwerpen.ansymo.semanticadaptation.ui ---
[INFO] Using 'UTF-8' encoding to copy filtered resources.
[INFO] skip non existing resourceDirectory /var/lib/jenkins/workspace/HybridCosimulation_au_kel-W2ZRQHUT7O4Q5VVKCCGVMBEVXK7JY2IPO3SXT35TW4ZHY72VDGCA/DSL_SemanticAdaptation/be.uantwerpen.ansymo.semanticadaptation.ui/src/main/resources
[INFO] 
[INFO] --- tycho-compiler-plugin:1.0.0:compile (default-compile) @ be.uantwerpen.ansymo.semanticadaptation.ui ---
[WARNING] Parameter 'useProjectSettings' is set to true, but preferences file '/var/lib/jenkins/workspace/HybridCosimulation_au_kel-W2ZRQHUT7O4Q5VVKCCGVMBEVXK7JY2IPO3SXT35TW4ZHY72VDGCA/DSL_SemanticAdaptation/be.uantwerpen.ansymo.semanticadaptation.ui/.settings/org.eclipse.jdt.core.prefs' could not be found!
[INFO] Compiling 10 source files to /var/lib/jenkins/workspace/HybridCosimulation_au_kel-W2ZRQHUT7O4Q5VVKCCGVMBEVXK7JY2IPO3SXT35TW4ZHY72VDGCA/DSL_SemanticAdaptation/be.uantwerpen.ansymo.semanticadaptation.ui/target/classes
[INFO] 
[INFO] --- xtend-maven-plugin:2.11.0:xtend-install-debug-info (default) @ be.uantwerpen.ansymo.semanticadaptation.ui ---
[WARNING] Directory /var/lib/jenkins/workspace/HybridCosimulation_au_kel-W2ZRQHUT7O4Q5VVKCCGVMBEVXK7JY2IPO3SXT35TW4ZHY72VDGCA/DSL_SemanticAdaptation/be.uantwerpen.ansymo.semanticadaptation.ui/src/main/java is empty. Can't process.
[INFO] Installing Xtend files into 6 class files as primary debug sources in: /var/lib/jenkins/workspace/HybridCosimulation_au_kel-W2ZRQHUT7O4Q5VVKCCGVMBEVXK7JY2IPO3SXT35TW4ZHY72VDGCA/DSL_SemanticAdaptation/be.uantwerpen.ansymo.semanticadaptation.ui/target/classes
[INFO] 
[INFO] --- xtend-maven-plugin:2.11.0:testCompile (default) @ be.uantwerpen.ansymo.semanticadaptation.ui ---
[INFO] skip compiling sources because the configured directory '[/var/lib/jenkins/workspace/HybridCosimulation_au_kel-W2ZRQHUT7O4Q5VVKCCGVMBEVXK7JY2IPO3SXT35TW4ZHY72VDGCA/DSL_SemanticAdaptation/be.uantwerpen.ansymo.semanticadaptation.ui/src/test/java]' does not exists.
[INFO] 
[INFO] --- maven-resources-plugin:2.4.3:testResources (default-testResources) @ be.uantwerpen.ansymo.semanticadaptation.ui ---
[INFO] Using 'UTF-8' encoding to copy filtered resources.
[INFO] skip non existing resourceDirectory /var/lib/jenkins/workspace/HybridCosimulation_au_kel-W2ZRQHUT7O4Q5VVKCCGVMBEVXK7JY2IPO3SXT35TW4ZHY72VDGCA/DSL_SemanticAdaptation/be.uantwerpen.ansymo.semanticadaptation.ui/src/test/resources
[INFO] 
[INFO] --- xtend-maven-plugin:2.11.0:xtend-test-install-debug-info (default) @ be.uantwerpen.ansymo.semanticadaptation.ui ---
[WARNING] Directory /var/lib/jenkins/workspace/HybridCosimulation_au_kel-W2ZRQHUT7O4Q5VVKCCGVMBEVXK7JY2IPO3SXT35TW4ZHY72VDGCA/DSL_SemanticAdaptation/be.uantwerpen.ansymo.semanticadaptation.ui/src/test/java is empty. Can't process.
[WARNING] Directory /var/lib/jenkins/workspace/HybridCosimulation_au_kel-W2ZRQHUT7O4Q5VVKCCGVMBEVXK7JY2IPO3SXT35TW4ZHY72VDGCA/DSL_SemanticAdaptation/be.uantwerpen.ansymo.semanticadaptation.ui/target/xtend-gen/test is empty. Can't process.
[INFO] Installing Xtend files into 0 class files as primary debug sources in: /var/lib/jenkins/workspace/HybridCosimulation_au_kel-W2ZRQHUT7O4Q5VVKCCGVMBEVXK7JY2IPO3SXT35TW4ZHY72VDGCA/DSL_SemanticAdaptation/be.uantwerpen.ansymo.semanticadaptation.ui/target/test-classes
[INFO] 
[INFO] --- target-platform-configuration:1.0.0:target-platform (default-target-platform) @ be.uantwerpen.ansymo.semanticadaptation.ui ---
[INFO] 
[INFO] --- tycho-packaging-plugin:1.0.0:package-plugin (default-package-plugin) @ be.uantwerpen.ansymo.semanticadaptation.ui ---
[INFO] Building jar: /var/lib/jenkins/workspace/HybridCosimulation_au_kel-W2ZRQHUT7O4Q5VVKCCGVMBEVXK7JY2IPO3SXT35TW4ZHY72VDGCA/DSL_SemanticAdaptation/be.uantwerpen.ansymo.semanticadaptation.ui/target/be.uantwerpen.ansymo.semanticadaptation.ui-1.0.0-SNAPSHOT.jar
[INFO] 
[INFO] --- tycho-p2-plugin:1.0.0:p2-metadata-default (default-p2-metadata-default) @ be.uantwerpen.ansymo.semanticadaptation.ui ---
[INFO] 
[INFO] --- maven-install-plugin:2.3.1:install (default-install) @ be.uantwerpen.ansymo.semanticadaptation.ui ---
[INFO] Installing /var/lib/jenkins/workspace/HybridCosimulation_au_kel-W2ZRQHUT7O4Q5VVKCCGVMBEVXK7JY2IPO3SXT35TW4ZHY72VDGCA/DSL_SemanticAdaptation/be.uantwerpen.ansymo.semanticadaptation.ui/target/be.uantwerpen.ansymo.semanticadaptation.ui-1.0.0-SNAPSHOT.jar to /var/lib/jenkins/workspace/HybridCosimulation_au_kel-W2ZRQHUT7O4Q5VVKCCGVMBEVXK7JY2IPO3SXT35TW4ZHY72VDGCA/.repository/be/uantwerpen/ansymo/semanticadaptation/be.uantwerpen.ansymo.semanticadaptation.ui/1.0.0-SNAPSHOT/be.uantwerpen.ansymo.semanticadaptation.ui-1.0.0-SNAPSHOT.jar
[INFO] Installing /var/lib/jenkins/workspace/HybridCosimulation_au_kel-W2ZRQHUT7O4Q5VVKCCGVMBEVXK7JY2IPO3SXT35TW4ZHY72VDGCA/DSL_SemanticAdaptation/be.uantwerpen.ansymo.semanticadaptation.ui/pom.xml to /var/lib/jenkins/workspace/HybridCosimulation_au_kel-W2ZRQHUT7O4Q5VVKCCGVMBEVXK7JY2IPO3SXT35TW4ZHY72VDGCA/.repository/be/uantwerpen/ansymo/semanticadaptation/be.uantwerpen.ansymo.semanticadaptation.ui/1.0.0-SNAPSHOT/be.uantwerpen.ansymo.semanticadaptation.ui-1.0.0-SNAPSHOT.pom
[INFO] Installing /var/lib/jenkins/workspace/HybridCosimulation_au_kel-W2ZRQHUT7O4Q5VVKCCGVMBEVXK7JY2IPO3SXT35TW4ZHY72VDGCA/DSL_SemanticAdaptation/be.uantwerpen.ansymo.semanticadaptation.ui/target/p2content.xml to /var/lib/jenkins/workspace/HybridCosimulation_au_kel-W2ZRQHUT7O4Q5VVKCCGVMBEVXK7JY2IPO3SXT35TW4ZHY72VDGCA/.repository/be/uantwerpen/ansymo/semanticadaptation/be.uantwerpen.ansymo.semanticadaptation.ui/1.0.0-SNAPSHOT/be.uantwerpen.ansymo.semanticadaptation.ui-1.0.0-SNAPSHOT-p2metadata.xml
[INFO] Installing /var/lib/jenkins/workspace/HybridCosimulation_au_kel-W2ZRQHUT7O4Q5VVKCCGVMBEVXK7JY2IPO3SXT35TW4ZHY72VDGCA/DSL_SemanticAdaptation/be.uantwerpen.ansymo.semanticadaptation.ui/target/p2artifacts.xml to /var/lib/jenkins/workspace/HybridCosimulation_au_kel-W2ZRQHUT7O4Q5VVKCCGVMBEVXK7JY2IPO3SXT35TW4ZHY72VDGCA/.repository/be/uantwerpen/ansymo/semanticadaptation/be.uantwerpen.ansymo.semanticadaptation.ui/1.0.0-SNAPSHOT/be.uantwerpen.ansymo.semanticadaptation.ui-1.0.0-SNAPSHOT-p2artifacts.xml
[INFO] 
[INFO] --- tycho-p2-plugin:1.0.0:update-local-index (default-update-local-index) @ be.uantwerpen.ansymo.semanticadaptation.ui ---
[INFO]                                                                         
[INFO] ------------------------------------------------------------------------
[INFO] Building be.uantwerpen.ansymo.semanticadaptation Code Generation to C++ 1.0.0-SNAPSHOT
[INFO] ------------------------------------------------------------------------
[INFO] 
[INFO] --- tycho-packaging-plugin:1.0.0:build-qualifier (default-build-qualifier) @ be.uantwerpen.ansymo.semanticadaptation.cg.cpp ---
[INFO] The project's OSGi version is 1.0.0.201706290713
[INFO] 
[INFO] --- tycho-packaging-plugin:1.0.0:validate-id (default-validate-id) @ be.uantwerpen.ansymo.semanticadaptation.cg.cpp ---
[INFO] 
[INFO] --- tycho-packaging-plugin:1.0.0:validate-version (default-validate-version) @ be.uantwerpen.ansymo.semanticadaptation.cg.cpp ---
[INFO] 
[INFO] --- xtend-maven-plugin:2.11.0:compile (default) @ be.uantwerpen.ansymo.semanticadaptation.cg.cpp ---
[WARNING] 
WARNING: 	RulesConditionSwitch.xtend - /var/lib/jenkins/workspace/HybridCosimulation_au_kel-W2ZRQHUT7O4Q5VVKCCGVMBEVXK7JY2IPO3SXT35TW4ZHY72VDGCA/DSL_SemanticAdaptation/be.uantwerpen.ansymo.semanticadaptation.cg.cpp/src/be/uantwerpen/ansymo/semanticadaptation/cg/cpp/generation/RulesConditionSwitch.xtend
35: The import 'be.uantwerpen.ansymo.semanticadaptation.cg.cpp.exceptions.TypeException' is never used.
[WARNING] 
WARNING: 	CppGenerator.xtend - /var/lib/jenkins/workspace/HybridCosimulation_au_kel-W2ZRQHUT7O4Q5VVKCCGVMBEVXK7JY2IPO3SXT35TW4ZHY72VDGCA/DSL_SemanticAdaptation/be.uantwerpen.ansymo.semanticadaptation.cg.cpp/src/be/uantwerpen/ansymo/semanticadaptation/cg/cpp/generation/CppGenerator.xtend
27: The import 'be.uantwerpen.ansymo.semanticadaptation.cg.cpp.data.RulesBlockResult' is never used.
[INFO] 
[INFO] --- maven-resources-plugin:2.4.3:resources (default-resources) @ be.uantwerpen.ansymo.semanticadaptation.cg.cpp ---
[INFO] Using 'UTF-8' encoding to copy filtered resources.
[INFO] skip non existing resourceDirectory /var/lib/jenkins/workspace/HybridCosimulation_au_kel-W2ZRQHUT7O4Q5VVKCCGVMBEVXK7JY2IPO3SXT35TW4ZHY72VDGCA/DSL_SemanticAdaptation/be.uantwerpen.ansymo.semanticadaptation.cg.cpp/src/main/resources
[INFO] 
[INFO] --- tycho-compiler-plugin:1.0.0:compile (default-compile) @ be.uantwerpen.ansymo.semanticadaptation.cg.cpp ---
[WARNING] Parameter 'useProjectSettings' is set to true, but preferences file '/var/lib/jenkins/workspace/HybridCosimulation_au_kel-W2ZRQHUT7O4Q5VVKCCGVMBEVXK7JY2IPO3SXT35TW4ZHY72VDGCA/DSL_SemanticAdaptation/be.uantwerpen.ansymo.semanticadaptation.cg.cpp/.settings/org.eclipse.jdt.core.prefs' could not be found!
[INFO] Compiling 28 source files to /var/lib/jenkins/workspace/HybridCosimulation_au_kel-W2ZRQHUT7O4Q5VVKCCGVMBEVXK7JY2IPO3SXT35TW4ZHY72VDGCA/DSL_SemanticAdaptation/be.uantwerpen.ansymo.semanticadaptation.cg.cpp/target/classes
[WARNING] Source directory /var/lib/jenkins/workspace/HybridCosimulation_au_kel-W2ZRQHUT7O4Q5VVKCCGVMBEVXK7JY2IPO3SXT35TW4ZHY72VDGCA/DSL_SemanticAdaptation/be.uantwerpen.ansymo.semanticadaptation.cg.cpp/src-gen does not exist
[INFO] 
[INFO] --- xtend-maven-plugin:2.11.0:xtend-install-debug-info (default) @ be.uantwerpen.ansymo.semanticadaptation.cg.cpp ---
[WARNING] Directory /var/lib/jenkins/workspace/HybridCosimulation_au_kel-W2ZRQHUT7O4Q5VVKCCGVMBEVXK7JY2IPO3SXT35TW4ZHY72VDGCA/DSL_SemanticAdaptation/be.uantwerpen.ansymo.semanticadaptation.cg.cpp/src/main/java is empty. Can't process.
[WARNING] Directory /var/lib/jenkins/workspace/HybridCosimulation_au_kel-W2ZRQHUT7O4Q5VVKCCGVMBEVXK7JY2IPO3SXT35TW4ZHY72VDGCA/DSL_SemanticAdaptation/be.uantwerpen.ansymo.semanticadaptation.cg.cpp/src-gen is empty. Can't process.
[INFO] Installing Xtend files into 21 class files as primary debug sources in: /var/lib/jenkins/workspace/HybridCosimulation_au_kel-W2ZRQHUT7O4Q5VVKCCGVMBEVXK7JY2IPO3SXT35TW4ZHY72VDGCA/DSL_SemanticAdaptation/be.uantwerpen.ansymo.semanticadaptation.cg.cpp/target/classes
[INFO] 
[INFO] --- xtend-maven-plugin:2.11.0:testCompile (default) @ be.uantwerpen.ansymo.semanticadaptation.cg.cpp ---
[INFO] skip compiling sources because the configured directory '[/var/lib/jenkins/workspace/HybridCosimulation_au_kel-W2ZRQHUT7O4Q5VVKCCGVMBEVXK7JY2IPO3SXT35TW4ZHY72VDGCA/DSL_SemanticAdaptation/be.uantwerpen.ansymo.semanticadaptation.cg.cpp/src/test/java]' does not exists.
[INFO] 
[INFO] --- maven-resources-plugin:2.4.3:testResources (default-testResources) @ be.uantwerpen.ansymo.semanticadaptation.cg.cpp ---
[INFO] Using 'UTF-8' encoding to copy filtered resources.
[INFO] skip non existing resourceDirectory /var/lib/jenkins/workspace/HybridCosimulation_au_kel-W2ZRQHUT7O4Q5VVKCCGVMBEVXK7JY2IPO3SXT35TW4ZHY72VDGCA/DSL_SemanticAdaptation/be.uantwerpen.ansymo.semanticadaptation.cg.cpp/src/test/resources
[INFO] 
[INFO] --- xtend-maven-plugin:2.11.0:xtend-test-install-debug-info (default) @ be.uantwerpen.ansymo.semanticadaptation.cg.cpp ---
[WARNING] Directory /var/lib/jenkins/workspace/HybridCosimulation_au_kel-W2ZRQHUT7O4Q5VVKCCGVMBEVXK7JY2IPO3SXT35TW4ZHY72VDGCA/DSL_SemanticAdaptation/be.uantwerpen.ansymo.semanticadaptation.cg.cpp/src/test/java is empty. Can't process.
[WARNING] Directory /var/lib/jenkins/workspace/HybridCosimulation_au_kel-W2ZRQHUT7O4Q5VVKCCGVMBEVXK7JY2IPO3SXT35TW4ZHY72VDGCA/DSL_SemanticAdaptation/be.uantwerpen.ansymo.semanticadaptation.cg.cpp/target/xtend-gen/test is empty. Can't process.
[INFO] Installing Xtend files into 0 class files as primary debug sources in: /var/lib/jenkins/workspace/HybridCosimulation_au_kel-W2ZRQHUT7O4Q5VVKCCGVMBEVXK7JY2IPO3SXT35TW4ZHY72VDGCA/DSL_SemanticAdaptation/be.uantwerpen.ansymo.semanticadaptation.cg.cpp/target/test-classes
[INFO] 
[INFO] --- target-platform-configuration:1.0.0:target-platform (default-target-platform) @ be.uantwerpen.ansymo.semanticadaptation.cg.cpp ---
[INFO] 
[INFO] --- tycho-packaging-plugin:1.0.0:package-plugin (default-package-plugin) @ be.uantwerpen.ansymo.semanticadaptation.cg.cpp ---
[INFO] Building jar: /var/lib/jenkins/workspace/HybridCosimulation_au_kel-W2ZRQHUT7O4Q5VVKCCGVMBEVXK7JY2IPO3SXT35TW4ZHY72VDGCA/DSL_SemanticAdaptation/be.uantwerpen.ansymo.semanticadaptation.cg.cpp/target/be.uantwerpen.ansymo.semanticadaptation.cg.cpp-1.0.0-SNAPSHOT.jar
[INFO] 
[INFO] --- tycho-p2-plugin:1.0.0:p2-metadata-default (default-p2-metadata-default) @ be.uantwerpen.ansymo.semanticadaptation.cg.cpp ---
[INFO] 
[INFO] --- maven-install-plugin:2.3.1:install (default-install) @ be.uantwerpen.ansymo.semanticadaptation.cg.cpp ---
[INFO] Installing /var/lib/jenkins/workspace/HybridCosimulation_au_kel-W2ZRQHUT7O4Q5VVKCCGVMBEVXK7JY2IPO3SXT35TW4ZHY72VDGCA/DSL_SemanticAdaptation/be.uantwerpen.ansymo.semanticadaptation.cg.cpp/target/be.uantwerpen.ansymo.semanticadaptation.cg.cpp-1.0.0-SNAPSHOT.jar to /var/lib/jenkins/workspace/HybridCosimulation_au_kel-W2ZRQHUT7O4Q5VVKCCGVMBEVXK7JY2IPO3SXT35TW4ZHY72VDGCA/.repository/be/uantwerpen/ansymo/semanticadaptation/be.uantwerpen.ansymo.semanticadaptation.cg.cpp/1.0.0-SNAPSHOT/be.uantwerpen.ansymo.semanticadaptation.cg.cpp-1.0.0-SNAPSHOT.jar
[INFO] Installing /var/lib/jenkins/workspace/HybridCosimulation_au_kel-W2ZRQHUT7O4Q5VVKCCGVMBEVXK7JY2IPO3SXT35TW4ZHY72VDGCA/DSL_SemanticAdaptation/be.uantwerpen.ansymo.semanticadaptation.cg.cpp/pom.xml to /var/lib/jenkins/workspace/HybridCosimulation_au_kel-W2ZRQHUT7O4Q5VVKCCGVMBEVXK7JY2IPO3SXT35TW4ZHY72VDGCA/.repository/be/uantwerpen/ansymo/semanticadaptation/be.uantwerpen.ansymo.semanticadaptation.cg.cpp/1.0.0-SNAPSHOT/be.uantwerpen.ansymo.semanticadaptation.cg.cpp-1.0.0-SNAPSHOT.pom
[INFO] Installing /var/lib/jenkins/workspace/HybridCosimulation_au_kel-W2ZRQHUT7O4Q5VVKCCGVMBEVXK7JY2IPO3SXT35TW4ZHY72VDGCA/DSL_SemanticAdaptation/be.uantwerpen.ansymo.semanticadaptation.cg.cpp/target/p2content.xml to /var/lib/jenkins/workspace/HybridCosimulation_au_kel-W2ZRQHUT7O4Q5VVKCCGVMBEVXK7JY2IPO3SXT35TW4ZHY72VDGCA/.repository/be/uantwerpen/ansymo/semanticadaptation/be.uantwerpen.ansymo.semanticadaptation.cg.cpp/1.0.0-SNAPSHOT/be.uantwerpen.ansymo.semanticadaptation.cg.cpp-1.0.0-SNAPSHOT-p2metadata.xml
[INFO] Installing /var/lib/jenkins/workspace/HybridCosimulation_au_kel-W2ZRQHUT7O4Q5VVKCCGVMBEVXK7JY2IPO3SXT35TW4ZHY72VDGCA/DSL_SemanticAdaptation/be.uantwerpen.ansymo.semanticadaptation.cg.cpp/target/p2artifacts.xml to /var/lib/jenkins/workspace/HybridCosimulation_au_kel-W2ZRQHUT7O4Q5VVKCCGVMBEVXK7JY2IPO3SXT35TW4ZHY72VDGCA/.repository/be/uantwerpen/ansymo/semanticadaptation/be.uantwerpen.ansymo.semanticadaptation.cg.cpp/1.0.0-SNAPSHOT/be.uantwerpen.ansymo.semanticadaptation.cg.cpp-1.0.0-SNAPSHOT-p2artifacts.xml
[INFO] 
[INFO] --- tycho-p2-plugin:1.0.0:update-local-index (default-update-local-index) @ be.uantwerpen.ansymo.semanticadaptation.cg.cpp ---
[INFO]                                                                         
[INFO] ------------------------------------------------------------------------
[INFO] Building be.uantwerpen.ansymo.semanticadaptation Code Generation to C++ Tests 1.0.0-SNAPSHOT
[INFO] ------------------------------------------------------------------------
[INFO] 
[INFO] --- tycho-packaging-plugin:1.0.0:build-qualifier (default-build-qualifier) @ be.uantwerpen.ansymo.semanticadaptation.cg.cpp.tests ---
[INFO] The project's OSGi version is 1.0.0.201706290713
[INFO] 
[INFO] --- tycho-packaging-plugin:1.0.0:validate-id (default-validate-id) @ be.uantwerpen.ansymo.semanticadaptation.cg.cpp.tests ---
[INFO] 
[INFO] --- tycho-packaging-plugin:1.0.0:validate-version (default-validate-version) @ be.uantwerpen.ansymo.semanticadaptation.cg.cpp.tests ---
[INFO] 
[INFO] --- xtend-maven-plugin:2.11.0:compile (default) @ be.uantwerpen.ansymo.semanticadaptation.cg.cpp.tests ---
[WARNING] 
WARNING: 	CgCppBasicTest.xtend - /var/lib/jenkins/workspace/HybridCosimulation_au_kel-W2ZRQHUT7O4Q5VVKCCGVMBEVXK7JY2IPO3SXT35TW4ZHY72VDGCA/DSL_SemanticAdaptation/be.uantwerpen.ansymo.semanticadaptation.cg.cpp.tests/src/be/uantwerpen/ansymo/semanticadaptation/cg/cpp/tests/CgCppBasicTest.xtend
85: The value of the local variable error is not used
[INFO] 
[INFO] --- maven-resources-plugin:2.4.3:resources (default-resources) @ be.uantwerpen.ansymo.semanticadaptation.cg.cpp.tests ---
[INFO] Using 'UTF-8' encoding to copy filtered resources.
[INFO] skip non existing resourceDirectory /var/lib/jenkins/workspace/HybridCosimulation_au_kel-W2ZRQHUT7O4Q5VVKCCGVMBEVXK7JY2IPO3SXT35TW4ZHY72VDGCA/DSL_SemanticAdaptation/be.uantwerpen.ansymo.semanticadaptation.cg.cpp.tests/src/main/resources
[INFO] 
[INFO] --- tycho-compiler-plugin:1.0.0:compile (default-compile) @ be.uantwerpen.ansymo.semanticadaptation.cg.cpp.tests ---
[WARNING] Parameter 'useProjectSettings' is set to true, but preferences file '/var/lib/jenkins/workspace/HybridCosimulation_au_kel-W2ZRQHUT7O4Q5VVKCCGVMBEVXK7JY2IPO3SXT35TW4ZHY72VDGCA/DSL_SemanticAdaptation/be.uantwerpen.ansymo.semanticadaptation.cg.cpp.tests/.settings/org.eclipse.jdt.core.prefs' could not be found!
[INFO] Compiling 2 source files to /var/lib/jenkins/workspace/HybridCosimulation_au_kel-W2ZRQHUT7O4Q5VVKCCGVMBEVXK7JY2IPO3SXT35TW4ZHY72VDGCA/DSL_SemanticAdaptation/be.uantwerpen.ansymo.semanticadaptation.cg.cpp.tests/target/classes
[WARNING] Source directory /var/lib/jenkins/workspace/HybridCosimulation_au_kel-W2ZRQHUT7O4Q5VVKCCGVMBEVXK7JY2IPO3SXT35TW4ZHY72VDGCA/DSL_SemanticAdaptation/be.uantwerpen.ansymo.semanticadaptation.cg.cpp.tests/src-gen does not exist
[INFO] 
[INFO] --- xtend-maven-plugin:2.11.0:xtend-install-debug-info (default) @ be.uantwerpen.ansymo.semanticadaptation.cg.cpp.tests ---
[WARNING] Directory /var/lib/jenkins/workspace/HybridCosimulation_au_kel-W2ZRQHUT7O4Q5VVKCCGVMBEVXK7JY2IPO3SXT35TW4ZHY72VDGCA/DSL_SemanticAdaptation/be.uantwerpen.ansymo.semanticadaptation.cg.cpp.tests/src/main/java is empty. Can't process.
[WARNING] Directory /var/lib/jenkins/workspace/HybridCosimulation_au_kel-W2ZRQHUT7O4Q5VVKCCGVMBEVXK7JY2IPO3SXT35TW4ZHY72VDGCA/DSL_SemanticAdaptation/be.uantwerpen.ansymo.semanticadaptation.cg.cpp.tests/src-gen is empty. Can't process.
[INFO] Installing Xtend files into 2 class files as primary debug sources in: /var/lib/jenkins/workspace/HybridCosimulation_au_kel-W2ZRQHUT7O4Q5VVKCCGVMBEVXK7JY2IPO3SXT35TW4ZHY72VDGCA/DSL_SemanticAdaptation/be.uantwerpen.ansymo.semanticadaptation.cg.cpp.tests/target/classes
[INFO] 
[INFO] --- xtend-maven-plugin:2.11.0:testCompile (default) @ be.uantwerpen.ansymo.semanticadaptation.cg.cpp.tests ---
[INFO] skip compiling sources because the configured directory '[/var/lib/jenkins/workspace/HybridCosimulation_au_kel-W2ZRQHUT7O4Q5VVKCCGVMBEVXK7JY2IPO3SXT35TW4ZHY72VDGCA/DSL_SemanticAdaptation/be.uantwerpen.ansymo.semanticadaptation.cg.cpp.tests/src/test/java]' does not exists.
[INFO] 
[INFO] --- maven-resources-plugin:2.4.3:testResources (default-testResources) @ be.uantwerpen.ansymo.semanticadaptation.cg.cpp.tests ---
[INFO] Using 'UTF-8' encoding to copy filtered resources.
[INFO] skip non existing resourceDirectory /var/lib/jenkins/workspace/HybridCosimulation_au_kel-W2ZRQHUT7O4Q5VVKCCGVMBEVXK7JY2IPO3SXT35TW4ZHY72VDGCA/DSL_SemanticAdaptation/be.uantwerpen.ansymo.semanticadaptation.cg.cpp.tests/src/test/resources
[INFO] 
[INFO] --- xtend-maven-plugin:2.11.0:xtend-test-install-debug-info (default) @ be.uantwerpen.ansymo.semanticadaptation.cg.cpp.tests ---
[WARNING] Directory /var/lib/jenkins/workspace/HybridCosimulation_au_kel-W2ZRQHUT7O4Q5VVKCCGVMBEVXK7JY2IPO3SXT35TW4ZHY72VDGCA/DSL_SemanticAdaptation/be.uantwerpen.ansymo.semanticadaptation.cg.cpp.tests/src/test/java is empty. Can't process.
[WARNING] Directory /var/lib/jenkins/workspace/HybridCosimulation_au_kel-W2ZRQHUT7O4Q5VVKCCGVMBEVXK7JY2IPO3SXT35TW4ZHY72VDGCA/DSL_SemanticAdaptation/be.uantwerpen.ansymo.semanticadaptation.cg.cpp.tests/target/xtend-gen/test is empty. Can't process.
[INFO] Installing Xtend files into 0 class files as primary debug sources in: /var/lib/jenkins/workspace/HybridCosimulation_au_kel-W2ZRQHUT7O4Q5VVKCCGVMBEVXK7JY2IPO3SXT35TW4ZHY72VDGCA/DSL_SemanticAdaptation/be.uantwerpen.ansymo.semanticadaptation.cg.cpp.tests/target/test-classes
[INFO] 
[INFO] --- target-platform-configuration:1.0.0:target-platform (default-target-platform) @ be.uantwerpen.ansymo.semanticadaptation.cg.cpp.tests ---
[INFO] 
[INFO] --- tycho-packaging-plugin:1.0.0:package-plugin (default-package-plugin) @ be.uantwerpen.ansymo.semanticadaptation.cg.cpp.tests ---
[INFO] Building jar: /var/lib/jenkins/workspace/HybridCosimulation_au_kel-W2ZRQHUT7O4Q5VVKCCGVMBEVXK7JY2IPO3SXT35TW4ZHY72VDGCA/DSL_SemanticAdaptation/be.uantwerpen.ansymo.semanticadaptation.cg.cpp.tests/target/be.uantwerpen.ansymo.semanticadaptation.cg.cpp.tests-1.0.0-SNAPSHOT.jar
[INFO] 
[INFO] --- tycho-p2-plugin:1.0.0:p2-metadata-default (default-p2-metadata-default) @ be.uantwerpen.ansymo.semanticadaptation.cg.cpp.tests ---
[INFO] 
[INFO] --- tycho-surefire-plugin:1.0.0:test (default-test) @ be.uantwerpen.ansymo.semanticadaptation.cg.cpp.tests ---
[INFO] Expected eclipse log file: /var/lib/jenkins/workspace/HybridCosimulation_au_kel-W2ZRQHUT7O4Q5VVKCCGVMBEVXK7JY2IPO3SXT35TW4ZHY72VDGCA/DSL_SemanticAdaptation/be.uantwerpen.ansymo.semanticadaptation.cg.cpp.tests/target/work/data/.metadata/.log
[INFO] Command line:
	[/usr/lib/jvm/java-8-oracle/jre/bin/java, -Dosgi.noShutdown=false, -Dosgi.os=linux, -Dosgi.ws=gtk, -Dosgi.arch=x86_64, -Dosgi.clean=true, -jar, /var/lib/jenkins/workspace/HybridCosimulation_au_kel-W2ZRQHUT7O4Q5VVKCCGVMBEVXK7JY2IPO3SXT35TW4ZHY72VDGCA/.repository/p2/osgi/bundle/org.eclipse.equinox.launcher/1.3.201.v20161025-1711/org.eclipse.equinox.launcher-1.3.201.v20161025-1711.jar, -data, /var/lib/jenkins/workspace/HybridCosimulation_au_kel-W2ZRQHUT7O4Q5VVKCCGVMBEVXK7JY2IPO3SXT35TW4ZHY72VDGCA/DSL_SemanticAdaptation/be.uantwerpen.ansymo.semanticadaptation.cg.cpp.tests/target/work/data, -install, /var/lib/jenkins/workspace/HybridCosimulation_au_kel-W2ZRQHUT7O4Q5VVKCCGVMBEVXK7JY2IPO3SXT35TW4ZHY72VDGCA/DSL_SemanticAdaptation/be.uantwerpen.ansymo.semanticadaptation.cg.cpp.tests/target/work, -configuration, /var/lib/jenkins/workspace/HybridCosimulation_au_kel-W2ZRQHUT7O4Q5VVKCCGVMBEVXK7JY2IPO3SXT35TW4ZHY72VDGCA/DSL_SemanticAdaptation/be.uantwerpen.ansymo.semanticadaptation.cg.cpp.tests/target/work/configuration, -application, org.eclipse.tycho.surefire.osgibooter.headlesstest, -testproperties, /var/lib/jenkins/workspace/HybridCosimulation_au_kel-W2ZRQHUT7O4Q5VVKCCGVMBEVXK7JY2IPO3SXT35TW4ZHY72VDGCA/DSL_SemanticAdaptation/be.uantwerpen.ansymo.semanticadaptation.cg.cpp.tests/target/surefire.properties]
Picked up JAVA_TOOL_OPTIONS: -Dmaven.ext.class.path="/var/lib/jenkins/workspace/HybridCosimulation_au_kel-W2ZRQHUT7O4Q5VVKCCGVMBEVXK7JY2IPO3SXT35TW4ZHY72VDGCA@tmp/withMavenc1971ac2/pipeline-maven-spy.jar" -Dorg.jenkinsci.plugins.pipeline.maven.reportsFolder="/var/lib/jenkins/workspace/HybridCosimulation_au_kel-W2ZRQHUT7O4Q5VVKCCGVMBEVXK7JY2IPO3SXT35TW4ZHY72VDGCA@tmp/withMavenc1971ac2" 

-------------------------------------------------------
 T E S T S
-------------------------------------------------------
Running be.uantwerpen.ansymo.semanticadaptation.cg.cpp.tests.CgCppBasicTest
Rootdir: /var/lib/jenkins/workspace/HybridCosimulation_au_kel-W2ZRQHUT7O4Q5VVKCCGVMBEVXK7JY2IPO3SXT35TW4ZHY72VDGCA/DSL_SemanticAdaptation/be.uantwerpen.ansymo.semanticadaptation.cg.cpp.tests/generated/powerwindow
log4j:WARN No appenders could be found for logger (org.eclipse.xtext.parser.antlr.AbstractInternalAntlrParser).
log4j:WARN Please initialize the log4j system properly.
Stored file: generated/powerwindow/sources/Fmu.cpp
Stored file: generated/powerwindow/sources/WindowSA.cpp
Stored file: generated/powerwindow/sources/WindowSA.h
Stored file: generated/powerwindow/modelDescription.xml
Stored file: generated/powerwindow/sources/main.cpp
Copied file to: generated/powerwindow/resources/Window.fmu
Stored file: generated/powerwindow/CMakeLists.txt
Stored file: generated/powerwindow/msys-toolchain.cmake
Rootdir: /var/lib/jenkins/workspace/HybridCosimulation_au_kel-W2ZRQHUT7O4Q5VVKCCGVMBEVXK7JY2IPO3SXT35TW4ZHY72VDGCA/DSL_SemanticAdaptation/be.uantwerpen.ansymo.semanticadaptation.cg.cpp.tests/generated/lazy
Stored file: generated/lazy/sources/Fmu.cpp
Stored file: generated/lazy/sources/Lazy_sa.cpp
Stored file: generated/lazy/sources/Lazy_sa.h
Stored file: generated/lazy/modelDescription.xml
Stored file: generated/lazy/sources/main.cpp
Copied file to: generated/lazy/resources/Controller.fmu
Stored file: generated/lazy/CMakeLists.txt
Stored file: generated/lazy/msys-toolchain.cmake
Tests run: 3, Failures: 0, Errors: 2, Skipped: 1, Time elapsed: 1.425 sec <<< FAILURE! - in be.uantwerpen.ansymo.semanticadaptation.cg.cpp.tests.CgCppBasicTest
window_sa_canonical_new(be.uantwerpen.ansymo.semanticadaptation.cg.cpp.tests.CgCppBasicTest)  Time elapsed: 0.729 sec  <<< ERROR!
java.lang.NullPointerException: in is null
	at java.util.zip.ZipInputStream.<init>(ZipInputStream.java:101)
	at java.util.zip.ZipInputStream.<init>(ZipInputStream.java:80)
	at java.util.jar.JarInputStream.<init>(JarInputStream.java:76)
	at java.util.jar.JarInputStream.<init>(JarInputStream.java:62)
	at be.uantwerpen.ansymo.semanticadaptation.cg.cpp.generation.BuildUtilities.copyNativeLibFiles(BuildUtilities.java:32)
	at be.uantwerpen.ansymo.semanticadaptation.cg.cpp.tests.CgCppBasicTest.__parseNoErrors(CgCppBasicTest.xtend:160)
	at be.uantwerpen.ansymo.semanticadaptation.cg.cpp.tests.CgCppBasicTest.window_sa_canonical_new(CgCppBasicTest.xtend:45)

window_sa_canonical(be.uantwerpen.ansymo.semanticadaptation.cg.cpp.tests.CgCppBasicTest) skipped
lazy_sa_canonical(be.uantwerpen.ansymo.semanticadaptation.cg.cpp.tests.CgCppBasicTest)  Time elapsed: 0.077 sec  <<< ERROR!
java.lang.NullPointerException: in is null
	at java.util.zip.ZipInputStream.<init>(ZipInputStream.java:101)
	at java.util.zip.ZipInputStream.<init>(ZipInputStream.java:80)
	at java.util.jar.JarInputStream.<init>(JarInputStream.java:76)
	at java.util.jar.JarInputStream.<init>(JarInputStream.java:62)
	at be.uantwerpen.ansymo.semanticadaptation.cg.cpp.generation.BuildUtilities.copyNativeLibFiles(BuildUtilities.java:32)
	at be.uantwerpen.ansymo.semanticadaptation.cg.cpp.tests.CgCppBasicTest.__parseNoErrors(CgCppBasicTest.xtend:160)
	at be.uantwerpen.ansymo.semanticadaptation.cg.cpp.tests.CgCppBasicTest.lazy_sa_canonical(CgCppBasicTest.xtend:49)

Running be.uantwerpen.ansymo.semanticadaptation.cg.cpp.tests.CgCppAutoTest
Tests run: 1, Failures: 0, Errors: 0, Skipped: 1, Time elapsed: 0.005 sec - in be.uantwerpen.ansymo.semanticadaptation.cg.cpp.tests.CgCppAutoTest
allSemanticAdaptations[0](be.uantwerpen.ansymo.semanticadaptation.cg.cpp.tests.CgCppAutoTest) skipped

Results :

Tests in error: 
  CgCppBasicTest.window_sa_canonical_new:45->__parseNoErrors:160 » NullPointer i...
  CgCppBasicTest.lazy_sa_canonical:49->__parseNoErrors:160 » NullPointer in is n...

Tests run: 4, Failures: 0, Errors: 2, Skipped: 2

[INFO] ------------------------------------------------------------------------
[INFO] Reactor Summary:
[INFO] 
[INFO] parent ............................................. SUCCESS [  1.397 s]
[INFO] be.uantwerpen.ansymo.semanticadaptation Testframework SUCCESS [ 52.324 s]
[INFO] be.uantwerpen.ansymo.semanticadaptation Language Core SUCCESS [ 38.943 s]
[INFO] be.uantwerpen.ansymo.semanticadaptation Language Tests SUCCESS [  7.659 s]
[INFO] be.uantwerpen.ansymo.semanticadaptation.ide ........ SUCCESS [  0.950 s]
[INFO] be.uantwerpen.ansymo.semanticadaptation.ui Language UI SUCCESS [  3.431 s]
[INFO] be.uantwerpen.ansymo.semanticadaptation Code Generation to C++ SUCCESS [  3.000 s]
[INFO] be.uantwerpen.ansymo.semanticadaptation Code Generation to C++ Tests FAILURE [  6.651 s]
[INFO] ------------------------------------------------------------------------
[INFO] BUILD FAILURE
[INFO] ------------------------------------------------------------------------
[INFO] Total time: 05:00 min
[INFO] Finished at: 2017-06-29T09:18:50+02:00
[INFO] Final Memory: 221M/942M
[INFO] ------------------------------------------------------------------------
[jenkins-maven-event-spy] INFO generated /var/lib/jenkins/workspace/HybridCosimulation_au_kel-W2ZRQHUT7O4Q5VVKCCGVMBEVXK7JY2IPO3SXT35TW4ZHY72VDGCA@tmp/withMavenc1971ac2/maven-spy-20170629-091348-839.log
[ERROR] Failed to execute goal org.eclipse.tycho:tycho-surefire-plugin:1.0.0:test (default-test) on project be.uantwerpen.ansymo.semanticadaptation.cg.cpp.tests: There are test failures.
[ERROR] 
[ERROR] Please refer to /var/lib/jenkins/workspace/HybridCosimulation_au_kel-W2ZRQHUT7O4Q5VVKCCGVMBEVXK7JY2IPO3SXT35TW4ZHY72VDGCA/DSL_SemanticAdaptation/be.uantwerpen.ansymo.semanticadaptation.cg.cpp.tests/target/surefire-reports for the individual test results.
[ERROR] -> [Help 1]
[ERROR] 
[ERROR] To see the full stack trace of the errors, re-run Maven with the -e switch.
[ERROR] Re-run Maven using the -X switch to enable full debug logging.
[ERROR] 
[ERROR] For more information about the errors and possible solutions, please read the following articles:
[ERROR] [Help 1] http://cwiki.apache.org/confluence/display/MAVEN/MojoFailureException
[ERROR] 
[ERROR] After correcting the problems, you can resume the build with the command
[ERROR]   mvn <goals> -rf :be.uantwerpen.ansymo.semanticadaptation.cg.cpp.tests
[Pipeline] }
[withMaven] Archive artifact DSL_SemanticAdaptation/pom.xml under be/uantwerpen/ansymo/semanticadaptation/parent/1.0.0-SNAPSHOT/parent-1.0.0-SNAPSHOT.pom
[withMaven] Archive artifact DSL_SemanticAdaptation/be.uantwerpen.ansymo.semanticadaptation.testframework/pom.xml under be/uantwerpen/ansymo/semanticadaptation/be.uantwerpen.ansymo.semanticadaptation.testframework/1.0.0-SNAPSHOT/be.uantwerpen.ansymo.semanticadaptation.testframework-1.0.0-SNAPSHOT.pom
[withMaven] Archive artifact DSL_SemanticAdaptation/be.uantwerpen.ansymo.semanticadaptation.testframework/target/be.uantwerpen.ansymo.semanticadaptation.testframework-1.0.0-SNAPSHOT.jar under be/uantwerpen/ansymo/semanticadaptation/be.uantwerpen.ansymo.semanticadaptation.testframework/1.0.0-SNAPSHOT/be.uantwerpen.ansymo.semanticadaptation.testframework-1.0.0-SNAPSHOT.jar
[withMaven] Archive artifact DSL_SemanticAdaptation/be.uantwerpen.ansymo.semanticadaptation/pom.xml under be/uantwerpen/ansymo/semanticadaptation/be.uantwerpen.ansymo.semanticadaptation/1.0.0-SNAPSHOT/be.uantwerpen.ansymo.semanticadaptation-1.0.0-SNAPSHOT.pom
[withMaven] Archive artifact DSL_SemanticAdaptation/be.uantwerpen.ansymo.semanticadaptation/target/be.uantwerpen.ansymo.semanticadaptation-1.0.0-SNAPSHOT.jar under be/uantwerpen/ansymo/semanticadaptation/be.uantwerpen.ansymo.semanticadaptation/1.0.0-SNAPSHOT/be.uantwerpen.ansymo.semanticadaptation-1.0.0-SNAPSHOT.jar
[withMaven] Archive artifact DSL_SemanticAdaptation/be.uantwerpen.ansymo.semanticadaptation.tests/pom.xml under be/uantwerpen/ansymo/semanticadaptation/be.uantwerpen.ansymo.semanticadaptation.tests/1.0.0-SNAPSHOT/be.uantwerpen.ansymo.semanticadaptation.tests-1.0.0-SNAPSHOT.pom
[withMaven] Archive artifact DSL_SemanticAdaptation/be.uantwerpen.ansymo.semanticadaptation.tests/target/be.uantwerpen.ansymo.semanticadaptation.tests-1.0.0-SNAPSHOT.jar under be/uantwerpen/ansymo/semanticadaptation/be.uantwerpen.ansymo.semanticadaptation.tests/1.0.0-SNAPSHOT/be.uantwerpen.ansymo.semanticadaptation.tests-1.0.0-SNAPSHOT.jar
[withMaven] Archive artifact DSL_SemanticAdaptation/be.uantwerpen.ansymo.semanticadaptation.ide/pom.xml under be/uantwerpen/ansymo/semanticadaptation/be.uantwerpen.ansymo.semanticadaptation.ide/1.0.0-SNAPSHOT/be.uantwerpen.ansymo.semanticadaptation.ide-1.0.0-SNAPSHOT.pom
[withMaven] Archive artifact DSL_SemanticAdaptation/be.uantwerpen.ansymo.semanticadaptation.ide/target/be.uantwerpen.ansymo.semanticadaptation.ide-1.0.0-SNAPSHOT.jar under be/uantwerpen/ansymo/semanticadaptation/be.uantwerpen.ansymo.semanticadaptation.ide/1.0.0-SNAPSHOT/be.uantwerpen.ansymo.semanticadaptation.ide-1.0.0-SNAPSHOT.jar
[withMaven] Archive artifact DSL_SemanticAdaptation/be.uantwerpen.ansymo.semanticadaptation.ui/pom.xml under be/uantwerpen/ansymo/semanticadaptation/be.uantwerpen.ansymo.semanticadaptation.ui/1.0.0-SNAPSHOT/be.uantwerpen.ansymo.semanticadaptation.ui-1.0.0-SNAPSHOT.pom
[withMaven] Archive artifact DSL_SemanticAdaptation/be.uantwerpen.ansymo.semanticadaptation.ui/target/be.uantwerpen.ansymo.semanticadaptation.ui-1.0.0-SNAPSHOT.jar under be/uantwerpen/ansymo/semanticadaptation/be.uantwerpen.ansymo.semanticadaptation.ui/1.0.0-SNAPSHOT/be.uantwerpen.ansymo.semanticadaptation.ui-1.0.0-SNAPSHOT.jar
[withMaven] Archive artifact DSL_SemanticAdaptation/be.uantwerpen.ansymo.semanticadaptation.cg.cpp/pom.xml under be/uantwerpen/ansymo/semanticadaptation/be.uantwerpen.ansymo.semanticadaptation.cg.cpp/1.0.0-SNAPSHOT/be.uantwerpen.ansymo.semanticadaptation.cg.cpp-1.0.0-SNAPSHOT.pom
[withMaven] Archive artifact DSL_SemanticAdaptation/be.uantwerpen.ansymo.semanticadaptation.cg.cpp/target/be.uantwerpen.ansymo.semanticadaptation.cg.cpp-1.0.0-SNAPSHOT.jar under be/uantwerpen/ansymo/semanticadaptation/be.uantwerpen.ansymo.semanticadaptation.cg.cpp/1.0.0-SNAPSHOT/be.uantwerpen.ansymo.semanticadaptation.cg.cpp-1.0.0-SNAPSHOT.jar
[withMaven] Archive artifact DSL_SemanticAdaptation/be.uantwerpen.ansymo.semanticadaptation.testframework/target/p2content.xml under be/uantwerpen/ansymo/semanticadaptation/be.uantwerpen.ansymo.semanticadaptation.testframework/1.0.0-SNAPSHOT/be.uantwerpen.ansymo.semanticadaptation.testframework-1.0.0-SNAPSHOT-p2metadata.xml
[withMaven] Archive artifact DSL_SemanticAdaptation/be.uantwerpen.ansymo.semanticadaptation.testframework/target/p2artifacts.xml under be/uantwerpen/ansymo/semanticadaptation/be.uantwerpen.ansymo.semanticadaptation.testframework/1.0.0-SNAPSHOT/be.uantwerpen.ansymo.semanticadaptation.testframework-1.0.0-SNAPSHOT-p2artifacts.xml
[withMaven] Archive artifact DSL_SemanticAdaptation/be.uantwerpen.ansymo.semanticadaptation/target/p2content.xml under be/uantwerpen/ansymo/semanticadaptation/be.uantwerpen.ansymo.semanticadaptation/1.0.0-SNAPSHOT/be.uantwerpen.ansymo.semanticadaptation-1.0.0-SNAPSHOT-p2metadata.xml
[withMaven] Archive artifact DSL_SemanticAdaptation/be.uantwerpen.ansymo.semanticadaptation/target/p2artifacts.xml under be/uantwerpen/ansymo/semanticadaptation/be.uantwerpen.ansymo.semanticadaptation/1.0.0-SNAPSHOT/be.uantwerpen.ansymo.semanticadaptation-1.0.0-SNAPSHOT-p2artifacts.xml
[withMaven] Archive artifact DSL_SemanticAdaptation/be.uantwerpen.ansymo.semanticadaptation.tests/target/p2content.xml under be/uantwerpen/ansymo/semanticadaptation/be.uantwerpen.ansymo.semanticadaptation.tests/1.0.0-SNAPSHOT/be.uantwerpen.ansymo.semanticadaptation.tests-1.0.0-SNAPSHOT-p2metadata.xml
[withMaven] Archive artifact DSL_SemanticAdaptation/be.uantwerpen.ansymo.semanticadaptation.tests/target/p2artifacts.xml under be/uantwerpen/ansymo/semanticadaptation/be.uantwerpen.ansymo.semanticadaptation.tests/1.0.0-SNAPSHOT/be.uantwerpen.ansymo.semanticadaptation.tests-1.0.0-SNAPSHOT-p2artifacts.xml
[withMaven] Archive artifact DSL_SemanticAdaptation/be.uantwerpen.ansymo.semanticadaptation.ide/target/p2content.xml under be/uantwerpen/ansymo/semanticadaptation/be.uantwerpen.ansymo.semanticadaptation.ide/1.0.0-SNAPSHOT/be.uantwerpen.ansymo.semanticadaptation.ide-1.0.0-SNAPSHOT-p2metadata.xml
[withMaven] Archive artifact DSL_SemanticAdaptation/be.uantwerpen.ansymo.semanticadaptation.ide/target/p2artifacts.xml under be/uantwerpen/ansymo/semanticadaptation/be.uantwerpen.ansymo.semanticadaptation.ide/1.0.0-SNAPSHOT/be.uantwerpen.ansymo.semanticadaptation.ide-1.0.0-SNAPSHOT-p2artifacts.xml
[withMaven] Archive artifact DSL_SemanticAdaptation/be.uantwerpen.ansymo.semanticadaptation.ui/target/p2content.xml under be/uantwerpen/ansymo/semanticadaptation/be.uantwerpen.ansymo.semanticadaptation.ui/1.0.0-SNAPSHOT/be.uantwerpen.ansymo.semanticadaptation.ui-1.0.0-SNAPSHOT-p2metadata.xml
[withMaven] Archive artifact DSL_SemanticAdaptation/be.uantwerpen.ansymo.semanticadaptation.ui/target/p2artifacts.xml under be/uantwerpen/ansymo/semanticadaptation/be.uantwerpen.ansymo.semanticadaptation.ui/1.0.0-SNAPSHOT/be.uantwerpen.ansymo.semanticadaptation.ui-1.0.0-SNAPSHOT-p2artifacts.xml
[withMaven] Archive artifact DSL_SemanticAdaptation/be.uantwerpen.ansymo.semanticadaptation.cg.cpp/target/p2content.xml under be/uantwerpen/ansymo/semanticadaptation/be.uantwerpen.ansymo.semanticadaptation.cg.cpp/1.0.0-SNAPSHOT/be.uantwerpen.ansymo.semanticadaptation.cg.cpp-1.0.0-SNAPSHOT-p2metadata.xml
[withMaven] Archive artifact DSL_SemanticAdaptation/be.uantwerpen.ansymo.semanticadaptation.cg.cpp/target/p2artifacts.xml under be/uantwerpen/ansymo/semanticadaptation/be.uantwerpen.ansymo.semanticadaptation.cg.cpp/1.0.0-SNAPSHOT/be.uantwerpen.ansymo.semanticadaptation.cg.cpp-1.0.0-SNAPSHOT-p2artifacts.xml
[TASKS] Scanning folder '/var/lib/jenkins/workspace/HybridCosimulation_au_kel-W2ZRQHUT7O4Q5VVKCCGVMBEVXK7JY2IPO3SXT35TW4ZHY72VDGCA' for files matching the pattern '**/*.java' - excludes: null
[TASKS] Found 406 files to scan for tasks
[TASKS] Found 29 open tasks.
[Pipeline] // withMaven
[Pipeline] }
[Pipeline] // stage
[Pipeline] stage
[Pipeline] { (Reporting)
[Pipeline] emailextrecipients
[Pipeline] emailext
An attempt to send an e-mail to empty list of recipients, ignored.
[Pipeline] }
[Pipeline] // stage
[Pipeline] }
[Pipeline] // node
[Pipeline] End of Pipeline
ERROR: script returned exit code 1
Finished: FAILURE