FailedConsole Output

Branch indexing
 > /usr/bin/git rev-parse --is-inside-work-tree # timeout=10
Setting origin to http://msdl.uantwerpen.be/git/claudio/HybridCosimulation.git
 > /usr/bin/git config remote.origin.url http://msdl.uantwerpen.be/git/claudio/HybridCosimulation.git # timeout=10
Fetching origin...
Fetching upstream changes from origin
 > /usr/bin/git --version # timeout=10
 > /usr/bin/git fetch --tags --progress origin +refs/heads/*:refs/remotes/origin/*
Seen branch in repository origin/development
Seen branch in repository origin/master
Seen 2 remote branches
Obtained Jenkinsfile from c08b82bbf0f60feda597d033d81e15f1fa385be3
[Pipeline] node
Running on Jenkins in /var/lib/jenkins/workspace/ridCosimulation_development-7CHFDKZ477AWP5WGVIV7ZEYJ7TBQYODTBA2CXNIBOFPOTJGJR3PQ
[Pipeline] {
[Pipeline] stage (Checkout)
Using the ‘stage’ step without a block argument is deprecated
Entering stage Checkout
Proceeding
[Pipeline] checkout
 > /usr/bin/git rev-parse --is-inside-work-tree # timeout=10
Fetching changes from the remote Git repository
 > /usr/bin/git config remote.origin.url http://msdl.uantwerpen.be/git/claudio/HybridCosimulation.git # timeout=10
Fetching without tags
Fetching upstream changes from http://msdl.uantwerpen.be/git/claudio/HybridCosimulation.git
 > /usr/bin/git --version # timeout=10
 > /usr/bin/git fetch --no-tags --progress http://msdl.uantwerpen.be/git/claudio/HybridCosimulation.git +refs/heads/*:refs/remotes/origin/*
Checking out Revision c08b82bbf0f60feda597d033d81e15f1fa385be3 (development)
 > /usr/bin/git config core.sparsecheckout # timeout=10
 > /usr/bin/git checkout -f c08b82bbf0f60feda597d033d81e15f1fa385be3
Commit message: "fmus array now stores the path, and corrected a bug related to loading the fmu from the path."
 > /usr/bin/git rev-list bb0c9cb6f3369c9b892863903a473727b375a6fe # timeout=10
[Pipeline] sh
[ridCosimulation_development-7CHFDKZ477AWP5WGVIV7ZEYJ7TBQYODTBA2CXNIBOFPOTJGJR3PQ] Running shell script
+ git submodule update --init --recursive
[Pipeline] stage
[Pipeline] { (Clean)
[Pipeline] withMaven
[withMaven] Options: []
[withMaven] Available options: 
[withMaven] use JDK installation provided by the build agent
$ /bin/sh -c "which mvn"
[withMaven] use Maven installation provided by the build agent with executable /usr/bin/mvn
[withMaven] use Maven settings provided on the build agent '/var/lib/jenkins/internal-resources/settings.xml' 
[withMaven] use Maven global settings provided by the Jenkins global configuration on the build agent '/var/lib/jenkins/internal-resources/settings.xml' 
[Pipeline] {
[Pipeline] sh
[ridCosimulation_development-7CHFDKZ477AWP5WGVIV7ZEYJ7TBQYODTBA2CXNIBOFPOTJGJR3PQ] Running shell script
+ mvn clean -Dtycho.mode=maven -fn -f DSL_SemanticAdaptation/pom.xml
----- withMaven Wrapper script -----
Picked up JAVA_TOOL_OPTIONS: -Dmaven.ext.class.path="/var/lib/jenkins/workspace/ridCosimulation_development-7CHFDKZ477AWP5WGVIV7ZEYJ7TBQYODTBA2CXNIBOFPOTJGJR3PQ@tmp/withMaven585a264d/pipeline-maven-spy.jar" -Dorg.jenkinsci.plugins.pipeline.maven.reportsFolder="/var/lib/jenkins/workspace/ridCosimulation_development-7CHFDKZ477AWP5WGVIV7ZEYJ7TBQYODTBA2CXNIBOFPOTJGJR3PQ@tmp/withMaven585a264d" 
Apache Maven 3.3.9
Maven home: /usr/share/maven
Java version: 1.8.0_121, vendor: Oracle Corporation
Java home: /usr/lib/jvm/java-8-oracle/jre
Default locale: en_GB, platform encoding: UTF-8
OS name: "linux", version: "4.4.0-78-generic", arch: "amd64", family: "unix"
[jenkins-maven-event-spy] INFO generate /var/lib/jenkins/workspace/ridCosimulation_development-7CHFDKZ477AWP5WGVIV7ZEYJ7TBQYODTBA2CXNIBOFPOTJGJR3PQ@tmp/withMaven585a264d/maven-spy-20180805-232519-1173931980599850160482.log.tmp ...
[INFO] Scanning for projects...
[INFO] ------------------------------------------------------------------------
[INFO] Reactor Build Order:
[INFO] 
[INFO] Semantics Adaptation Root
[INFO] be.uantwerpen.ansymo.semanticadaptation Testframework
[INFO] be.uantwerpen.ansymo.semanticadaptation Language Core
[INFO] be.uantwerpen.ansymo.semanticadaptation Logger
[INFO] be.uantwerpen.ansymo.semanticadaptation Code Generator
[INFO] be.uantwerpen.ansymo.semanticadaptation Language Tests
[INFO] be.uantwerpen.ansymo.semanticadaptation.ide
[INFO] be.uantwerpen.ansymo.semanticadaptation.ui Language UI
[INFO] be.uantwerpen.ansymo.semanticadaptation Code Generation to C++
[INFO] be.uantwerpen.ansymo.semanticadaptation Canonical Generator
[INFO] be.uantwerpen.ansymo.semanticadaptation Code Generation to C++ Tests
[INFO] be.uantwerpen.ansymo.semanticadaptation Canonical Tests
[INFO] Feature
[INFO] Core
[INFO] Semantics Adaptation IDE Eclipse repository
[INFO]                                                                         
[INFO] ------------------------------------------------------------------------
[INFO] Building Semantics Adaptation Root 1.0.0-SNAPSHOT
[INFO] ------------------------------------------------------------------------
[INFO] 
[INFO] --- maven-clean-plugin:2.5:clean (default-clean) @ parent ---
[INFO]                                                                         
[INFO] ------------------------------------------------------------------------
[INFO] Building be.uantwerpen.ansymo.semanticadaptation Testframework 1.0.0-SNAPSHOT
[INFO] ------------------------------------------------------------------------
[INFO] 
[INFO] --- maven-clean-plugin:2.5:clean (default-clean) @ be.uantwerpen.ansymo.semanticadaptation.testframework ---
[INFO] Deleting /var/lib/jenkins/workspace/ridCosimulation_development-7CHFDKZ477AWP5WGVIV7ZEYJ7TBQYODTBA2CXNIBOFPOTJGJR3PQ/DSL_SemanticAdaptation/be.uantwerpen.ansymo.semanticadaptation.testframework/target
[INFO]                                                                         
[INFO] ------------------------------------------------------------------------
[INFO] Building be.uantwerpen.ansymo.semanticadaptation Language Core 1.0.0-SNAPSHOT
[INFO] ------------------------------------------------------------------------
[INFO] 
[INFO] --- maven-clean-plugin:2.5:clean (default-clean) @ be.uantwerpen.ansymo.semanticadaptation ---
[INFO] 
[INFO] --- maven-clean-plugin:2.5:clean (gen-clean) @ be.uantwerpen.ansymo.semanticadaptation ---
[INFO]                                                                         
[INFO] ------------------------------------------------------------------------
[INFO] Building be.uantwerpen.ansymo.semanticadaptation Logger 1.0.0-SNAPSHOT
[INFO] ------------------------------------------------------------------------
[INFO] 
[INFO] --- maven-clean-plugin:2.5:clean (default-clean) @ be.uantwerpen.ansymo.semanticadaptation.log ---
[INFO] Deleting /var/lib/jenkins/workspace/ridCosimulation_development-7CHFDKZ477AWP5WGVIV7ZEYJ7TBQYODTBA2CXNIBOFPOTJGJR3PQ/DSL_SemanticAdaptation/be.uantwerpen.ansymo.semanticadaptation.log/target
[INFO]                                                                         
[INFO] ------------------------------------------------------------------------
[INFO] Building be.uantwerpen.ansymo.semanticadaptation Code Generator 1.0.0-SNAPSHOT
[INFO] ------------------------------------------------------------------------
[INFO] 
[INFO] --- maven-clean-plugin:2.5:clean (default-clean) @ be.uantwerpen.ansymo.semanticadaptation.cg.chain ---
[INFO]                                                                         
[INFO] ------------------------------------------------------------------------
[INFO] Building be.uantwerpen.ansymo.semanticadaptation Language Tests 1.0.0-SNAPSHOT
[INFO] ------------------------------------------------------------------------
[INFO] 
[INFO] --- maven-clean-plugin:2.5:clean (default-clean) @ be.uantwerpen.ansymo.semanticadaptation.tests ---
[INFO] 
[INFO] --- maven-clean-plugin:2.5:clean (gen-clean) @ be.uantwerpen.ansymo.semanticadaptation.tests ---
[INFO]                                                                         
[INFO] ------------------------------------------------------------------------
[INFO] Building be.uantwerpen.ansymo.semanticadaptation.ide 1.0.0-SNAPSHOT
[INFO] ------------------------------------------------------------------------
[INFO] 
[INFO] --- maven-clean-plugin:2.5:clean (default-clean) @ be.uantwerpen.ansymo.semanticadaptation.ide ---
[INFO]                                                                         
[INFO] ------------------------------------------------------------------------
[INFO] Building be.uantwerpen.ansymo.semanticadaptation.ui Language UI 1.0.0-SNAPSHOT
[INFO] ------------------------------------------------------------------------
[INFO] 
[INFO] --- maven-clean-plugin:2.5:clean (default-clean) @ be.uantwerpen.ansymo.semanticadaptation.ui ---
[INFO] 
[INFO] --- maven-clean-plugin:2.5:clean (gen-clean) @ be.uantwerpen.ansymo.semanticadaptation.ui ---
[INFO]                                                                         
[INFO] ------------------------------------------------------------------------
[INFO] Building be.uantwerpen.ansymo.semanticadaptation Code Generation to C++ 1.0.0-SNAPSHOT
[INFO] ------------------------------------------------------------------------
[INFO] 
[INFO] --- maven-clean-plugin:2.5:clean (default-clean) @ be.uantwerpen.ansymo.semanticadaptation.cg.cpp ---
[INFO]                                                                         
[INFO] ------------------------------------------------------------------------
[INFO] Building be.uantwerpen.ansymo.semanticadaptation Canonical Generator 1.0.0-SNAPSHOT
[INFO] ------------------------------------------------------------------------
[INFO] 
[INFO] --- maven-clean-plugin:2.5:clean (default-clean) @ be.uantwerpen.ansymo.semanticadaptation.cg.canonical ---
[INFO]                                                                         
[INFO] ------------------------------------------------------------------------
[INFO] Building be.uantwerpen.ansymo.semanticadaptation Code Generation to C++ Tests 1.0.0-SNAPSHOT
[INFO] ------------------------------------------------------------------------
[INFO] 
[INFO] --- maven-clean-plugin:2.5:clean (default-clean) @ be.uantwerpen.ansymo.semanticadaptation.cg.cpp.tests ---
[INFO] 
[INFO] --- maven-clean-plugin:2.5:clean (gen-clean) @ be.uantwerpen.ansymo.semanticadaptation.cg.cpp.tests ---
[INFO]                                                                         
[INFO] ------------------------------------------------------------------------
[INFO] Building be.uantwerpen.ansymo.semanticadaptation Canonical Tests 1.0.0-SNAPSHOT
[INFO] ------------------------------------------------------------------------
[INFO] 
[INFO] --- maven-clean-plugin:2.5:clean (default-clean) @ be.uantwerpen.ansymo.semanticadaptation.cg.canonical.tests ---
[INFO] 
[INFO] --- maven-clean-plugin:2.5:clean (gen-clean) @ be.uantwerpen.ansymo.semanticadaptation.cg.canonical.tests ---
[INFO]                                                                         
[INFO] ------------------------------------------------------------------------
[INFO] Building Feature 1.0.0-SNAPSHOT
[INFO] ------------------------------------------------------------------------
[INFO] 
[INFO] --- maven-clean-plugin:2.5:clean (default-clean) @ be.uantwerpen.ansymo.semanticadaptation.features ---
[INFO]                                                                         
[INFO] ------------------------------------------------------------------------
[INFO] Building Core 1.0.0-SNAPSHOT
[INFO] ------------------------------------------------------------------------
[INFO] 
[INFO] --- maven-clean-plugin:2.5:clean (default-clean) @ be.uantwerpen.ansymo.semanticadaptation.features.core ---
[INFO]                                                                         
[INFO] ------------------------------------------------------------------------
[INFO] Building Semantics Adaptation IDE Eclipse repository 1.0.0-SNAPSHOT
[INFO] ------------------------------------------------------------------------
[INFO] 
[INFO] --- maven-clean-plugin:2.5:clean (default-clean) @ be.uantwerpen.ansymo.semanticadaptation.repository ---
[INFO] ------------------------------------------------------------------------
[INFO] Reactor Summary:
[INFO] 
[INFO] Semantics Adaptation Root .......................... SUCCESS [  0.167 s]
[INFO] be.uantwerpen.ansymo.semanticadaptation Testframework SUCCESS [  0.014 s]
[INFO] be.uantwerpen.ansymo.semanticadaptation Language Core SUCCESS [  0.008 s]
[INFO] be.uantwerpen.ansymo.semanticadaptation Logger ..... SUCCESS [  0.006 s]
[INFO] be.uantwerpen.ansymo.semanticadaptation Code Generator SUCCESS [  0.003 s]
[INFO] be.uantwerpen.ansymo.semanticadaptation Language Tests SUCCESS [  0.004 s]
[INFO] be.uantwerpen.ansymo.semanticadaptation.ide ........ SUCCESS [  0.002 s]
[INFO] be.uantwerpen.ansymo.semanticadaptation.ui Language UI SUCCESS [  0.004 s]
[INFO] be.uantwerpen.ansymo.semanticadaptation Code Generation to C++ SUCCESS [  0.003 s]
[INFO] be.uantwerpen.ansymo.semanticadaptation Canonical Generator SUCCESS [  0.002 s]
[INFO] be.uantwerpen.ansymo.semanticadaptation Code Generation to C++ Tests SUCCESS [  0.004 s]
[INFO] be.uantwerpen.ansymo.semanticadaptation Canonical Tests SUCCESS [  0.004 s]
[INFO] Feature ............................................ SUCCESS [  0.002 s]
[INFO] Core ............................................... SUCCESS [  0.002 s]
[INFO] Semantics Adaptation IDE Eclipse repository ........ SUCCESS [  0.002 s]
[INFO] ------------------------------------------------------------------------
[INFO] BUILD SUCCESS
[INFO] ------------------------------------------------------------------------
[INFO] Total time: 2.255 s
[INFO] Finished at: 2018-08-05T23:25:21+02:00
[INFO] Final Memory: 16M/291M
[INFO] ------------------------------------------------------------------------
[jenkins-maven-event-spy] INFO generated /var/lib/jenkins/workspace/ridCosimulation_development-7CHFDKZ477AWP5WGVIV7ZEYJ7TBQYODTBA2CXNIBOFPOTJGJR3PQ@tmp/withMaven585a264d/maven-spy-20180805-232519-1173931980599850160482.log
[Pipeline] }
[withMaven] artifactsPublisher - Archive artifact DSL_SemanticAdaptation/pom.xml under be/uantwerpen/ansymo/semanticadaptation/parent/1.0.0-SNAPSHOT/parent-1.0.0-SNAPSHOT.pom
[withMaven] artifactsPublisher - Archive artifact DSL_SemanticAdaptation/be.uantwerpen.ansymo.semanticadaptation.testframework/pom.xml under be/uantwerpen/ansymo/semanticadaptation/be.uantwerpen.ansymo.semanticadaptation.testframework/1.0.0-SNAPSHOT/be.uantwerpen.ansymo.semanticadaptation.testframework-1.0.0-SNAPSHOT.pom
[withMaven] artifactsPublisher - Archive artifact DSL_SemanticAdaptation/be.uantwerpen.ansymo.semanticadaptation/pom.xml under be/uantwerpen/ansymo/semanticadaptation/be.uantwerpen.ansymo.semanticadaptation/1.0.0-SNAPSHOT/be.uantwerpen.ansymo.semanticadaptation-1.0.0-SNAPSHOT.pom
[withMaven] artifactsPublisher - Archive artifact DSL_SemanticAdaptation/be.uantwerpen.ansymo.semanticadaptation.log/pom.xml under be/uantwerpen/ansymo/semanticadaptation/be.uantwerpen.ansymo.semanticadaptation.log/1.0.0-SNAPSHOT/be.uantwerpen.ansymo.semanticadaptation.log-1.0.0-SNAPSHOT.pom
[withMaven] artifactsPublisher - Archive artifact DSL_SemanticAdaptation/be.uantwerpen.ansymo.semanticadaptation.cg.chain/pom.xml under be/uantwerpen/ansymo/semanticadaptation/be.uantwerpen.ansymo.semanticadaptation.cg.chain/1.0.0-SNAPSHOT/be.uantwerpen.ansymo.semanticadaptation.cg.chain-1.0.0-SNAPSHOT.pom
[withMaven] artifactsPublisher - Archive artifact DSL_SemanticAdaptation/be.uantwerpen.ansymo.semanticadaptation.tests/pom.xml under be/uantwerpen/ansymo/semanticadaptation/be.uantwerpen.ansymo.semanticadaptation.tests/1.0.0-SNAPSHOT/be.uantwerpen.ansymo.semanticadaptation.tests-1.0.0-SNAPSHOT.pom
[withMaven] artifactsPublisher - Archive artifact DSL_SemanticAdaptation/be.uantwerpen.ansymo.semanticadaptation.ide/pom.xml under be/uantwerpen/ansymo/semanticadaptation/be.uantwerpen.ansymo.semanticadaptation.ide/1.0.0-SNAPSHOT/be.uantwerpen.ansymo.semanticadaptation.ide-1.0.0-SNAPSHOT.pom
[withMaven] artifactsPublisher - Archive artifact DSL_SemanticAdaptation/be.uantwerpen.ansymo.semanticadaptation.ui/pom.xml under be/uantwerpen/ansymo/semanticadaptation/be.uantwerpen.ansymo.semanticadaptation.ui/1.0.0-SNAPSHOT/be.uantwerpen.ansymo.semanticadaptation.ui-1.0.0-SNAPSHOT.pom
[withMaven] artifactsPublisher - Archive artifact DSL_SemanticAdaptation/be.uantwerpen.ansymo.semanticadaptation.cg.cpp/pom.xml under be/uantwerpen/ansymo/semanticadaptation/be.uantwerpen.ansymo.semanticadaptation.cg.cpp/1.0.0-SNAPSHOT/be.uantwerpen.ansymo.semanticadaptation.cg.cpp-1.0.0-SNAPSHOT.pom
[withMaven] artifactsPublisher - Archive artifact DSL_SemanticAdaptation/be.uantwerpen.ansymo.semanticadaptation.cg.canonical/pom.xml under be/uantwerpen/ansymo/semanticadaptation/be.uantwerpen.ansymo.semanticadaptation.cg.canonical/1.0.0-SNAPSHOT/be.uantwerpen.ansymo.semanticadaptation.cg.canonical-1.0.0-SNAPSHOT.pom
[withMaven] artifactsPublisher - Archive artifact DSL_SemanticAdaptation/be.uantwerpen.ansymo.semanticadaptation.cg.cpp.tests/pom.xml under be/uantwerpen/ansymo/semanticadaptation/be.uantwerpen.ansymo.semanticadaptation.cg.cpp.tests/1.0.0-SNAPSHOT/be.uantwerpen.ansymo.semanticadaptation.cg.cpp.tests-1.0.0-SNAPSHOT.pom
[withMaven] artifactsPublisher - Archive artifact DSL_SemanticAdaptation/be.uantwerpen.ansymo.semanticadaptation.cg.canonical.tests/pom.xml under be/uantwerpen/ansymo/semanticadaptation/be.uantwerpen.ansymo.semanticadaptation.cg.canonical.tests/1.0.0-SNAPSHOT/be.uantwerpen.ansymo.semanticadaptation.cg.canonical.tests-1.0.0-SNAPSHOT.pom
[withMaven] artifactsPublisher - Archive artifact DSL_SemanticAdaptation/features/pom.xml under be/uantwerpen/ansymo/semanticadaptation/be.uantwerpen.ansymo.semanticadaptation.features/1.0.0-SNAPSHOT/be.uantwerpen.ansymo.semanticadaptation.features-1.0.0-SNAPSHOT.pom
[withMaven] artifactsPublisher - Archive artifact DSL_SemanticAdaptation/features/core/pom.xml under be/uantwerpen/ansymo/semanticadaptation/features/be.uantwerpen.ansymo.semanticadaptation.features.core/1.0.0-SNAPSHOT/be.uantwerpen.ansymo.semanticadaptation.features.core-1.0.0-SNAPSHOT.pom
[withMaven] artifactsPublisher - Archive artifact DSL_SemanticAdaptation/repository/pom.xml under be/uantwerpen/ansymo/semanticadaptation/be.uantwerpen.ansymo.semanticadaptation.repository/1.0.0-SNAPSHOT/be.uantwerpen.ansymo.semanticadaptation.repository-1.0.0-SNAPSHOT.pom
[TASKS] Scanning folder '/var/lib/jenkins/workspace/ridCosimulation_development-7CHFDKZ477AWP5WGVIV7ZEYJ7TBQYODTBA2CXNIBOFPOTJGJR3PQ' for files matching the pattern '**/*.java' - excludes: null
[TASKS] Found 30 files to scan for tasks
[TASKS] Found 2 open tasks.
Skipping warnings blame since pipelines do not have an SCM link.%n
[TASKS] Computing warning deltas based on reference build #18
[Pipeline] // withMaven
[Pipeline] }
[Pipeline] // stage
[Pipeline] stage
[Pipeline] { (Package install)
[Pipeline] withMaven
[withMaven] Options: []
[withMaven] Available options: 
[withMaven] use JDK installation provided by the build agent
$ /bin/sh -c "which mvn"
[withMaven] use Maven installation provided by the build agent with executable /usr/bin/mvn
[withMaven] use Maven settings provided on the build agent '/var/lib/jenkins/internal-resources/settings.xml' 
[withMaven] use Maven global settings provided by the Jenkins global configuration on the build agent '/var/lib/jenkins/internal-resources/settings.xml' 
[Pipeline] {
[Pipeline] sh
[ridCosimulation_development-7CHFDKZ477AWP5WGVIV7ZEYJ7TBQYODTBA2CXNIBOFPOTJGJR3PQ] Running shell script
+ mvn install -f DSL_SemanticAdaptation/pom.xml
----- withMaven Wrapper script -----
Picked up JAVA_TOOL_OPTIONS: -Dmaven.ext.class.path="/var/lib/jenkins/workspace/ridCosimulation_development-7CHFDKZ477AWP5WGVIV7ZEYJ7TBQYODTBA2CXNIBOFPOTJGJR3PQ@tmp/withMaven0a630b02/pipeline-maven-spy.jar" -Dorg.jenkinsci.plugins.pipeline.maven.reportsFolder="/var/lib/jenkins/workspace/ridCosimulation_development-7CHFDKZ477AWP5WGVIV7ZEYJ7TBQYODTBA2CXNIBOFPOTJGJR3PQ@tmp/withMaven0a630b02" 
Apache Maven 3.3.9
Maven home: /usr/share/maven
Java version: 1.8.0_121, vendor: Oracle Corporation
Java home: /usr/lib/jvm/java-8-oracle/jre
Default locale: en_GB, platform encoding: UTF-8
OS name: "linux", version: "4.4.0-78-generic", arch: "amd64", family: "unix"
[jenkins-maven-event-spy] INFO generate /var/lib/jenkins/workspace/ridCosimulation_development-7CHFDKZ477AWP5WGVIV7ZEYJ7TBQYODTBA2CXNIBOFPOTJGJR3PQ@tmp/withMaven0a630b02/maven-spy-20180805-232523-1692726283726308106146.log.tmp ...
[INFO] Scanning for projects...
[INFO] Computing target platform for MavenProject: be.uantwerpen.ansymo.semanticadaptation:be.uantwerpen.ansymo.semanticadaptation.testframework:1.0.0-SNAPSHOT @ /var/lib/jenkins/workspace/ridCosimulation_development-7CHFDKZ477AWP5WGVIV7ZEYJ7TBQYODTBA2CXNIBOFPOTJGJR3PQ/DSL_SemanticAdaptation/be.uantwerpen.ansymo.semanticadaptation.testframework/pom.xml
[INFO] Fetching p2.index from http://download.eclipse.org/releases/neon/
[INFO] Adding repository http://download.eclipse.org/releases/neon
[INFO] Fetching p2.index from http://download.eclipse.org/technology/epp/packages/neon/
[INFO] Fetching p2.index from http://download.eclipse.org/technology/epp/packages/neon/
[INFO] Fetching p2.index from http://download.eclipse.org/releases/neon/201705151400/
[INFO] Fetching p2.index from http://download.eclipse.org/releases/neon/201705151400/
[INFO] Fetching p2.index from http://download.eclipse.org/releases/neon/201703141400/
[INFO] Fetching p2.index from http://download.eclipse.org/releases/neon/201703141400/
[INFO] Fetching p2.index from http://download.eclipse.org/releases/neon/201703231000/
[INFO] Fetching p2.index from http://download.eclipse.org/releases/neon/201703231000/
[INFO] Fetching p2.index from http://download.eclipse.org/releases/neon/201606221000/
[INFO] Fetching p2.index from http://download.eclipse.org/releases/neon/201606221000/
[INFO] Fetching p2.index from http://download.eclipse.org/releases/neon/201609281000/
[INFO] Fetching p2.index from http://download.eclipse.org/releases/neon/201610111000/
[INFO] Fetching p2.index from http://download.eclipse.org/releases/neon/201610111000/
[INFO] Fetching p2.index from http://download.eclipse.org/releases/neon/201612211000/
[INFO] Fetching p2.index from http://download.eclipse.org/releases/neon/201612211000/
[INFO] Fetching p2.index from http://download.eclipse.org/modeling/tmf/xtext/updates/releases/2.14.0/
[INFO] Adding repository http://download.eclipse.org/modeling/tmf/xtext/updates/releases/2.14.0
[INFO] Resolving dependencies of MavenProject: be.uantwerpen.ansymo.semanticadaptation:be.uantwerpen.ansymo.semanticadaptation.testframework:1.0.0-SNAPSHOT @ /var/lib/jenkins/workspace/ridCosimulation_development-7CHFDKZ477AWP5WGVIV7ZEYJ7TBQYODTBA2CXNIBOFPOTJGJR3PQ/DSL_SemanticAdaptation/be.uantwerpen.ansymo.semanticadaptation.testframework/pom.xml
[INFO] Resolving class path of MavenProject: be.uantwerpen.ansymo.semanticadaptation:be.uantwerpen.ansymo.semanticadaptation.testframework:1.0.0-SNAPSHOT @ /var/lib/jenkins/workspace/ridCosimulation_development-7CHFDKZ477AWP5WGVIV7ZEYJ7TBQYODTBA2CXNIBOFPOTJGJR3PQ/DSL_SemanticAdaptation/be.uantwerpen.ansymo.semanticadaptation.testframework/pom.xml
[INFO] Computing target platform for MavenProject: be.uantwerpen.ansymo.semanticadaptation:be.uantwerpen.ansymo.semanticadaptation:1.0.0-SNAPSHOT @ /var/lib/jenkins/workspace/ridCosimulation_development-7CHFDKZ477AWP5WGVIV7ZEYJ7TBQYODTBA2CXNIBOFPOTJGJR3PQ/DSL_SemanticAdaptation/be.uantwerpen.ansymo.semanticadaptation/pom.xml
[INFO] Resolving dependencies of MavenProject: be.uantwerpen.ansymo.semanticadaptation:be.uantwerpen.ansymo.semanticadaptation:1.0.0-SNAPSHOT @ /var/lib/jenkins/workspace/ridCosimulation_development-7CHFDKZ477AWP5WGVIV7ZEYJ7TBQYODTBA2CXNIBOFPOTJGJR3PQ/DSL_SemanticAdaptation/be.uantwerpen.ansymo.semanticadaptation/pom.xml
[INFO] Resolving class path of MavenProject: be.uantwerpen.ansymo.semanticadaptation:be.uantwerpen.ansymo.semanticadaptation:1.0.0-SNAPSHOT @ /var/lib/jenkins/workspace/ridCosimulation_development-7CHFDKZ477AWP5WGVIV7ZEYJ7TBQYODTBA2CXNIBOFPOTJGJR3PQ/DSL_SemanticAdaptation/be.uantwerpen.ansymo.semanticadaptation/pom.xml
[INFO] Computing target platform for MavenProject: be.uantwerpen.ansymo.semanticadaptation:be.uantwerpen.ansymo.semanticadaptation.log:1.0.0-SNAPSHOT @ /var/lib/jenkins/workspace/ridCosimulation_development-7CHFDKZ477AWP5WGVIV7ZEYJ7TBQYODTBA2CXNIBOFPOTJGJR3PQ/DSL_SemanticAdaptation/be.uantwerpen.ansymo.semanticadaptation.log/pom.xml
[INFO] Resolving dependencies of MavenProject: be.uantwerpen.ansymo.semanticadaptation:be.uantwerpen.ansymo.semanticadaptation.log:1.0.0-SNAPSHOT @ /var/lib/jenkins/workspace/ridCosimulation_development-7CHFDKZ477AWP5WGVIV7ZEYJ7TBQYODTBA2CXNIBOFPOTJGJR3PQ/DSL_SemanticAdaptation/be.uantwerpen.ansymo.semanticadaptation.log/pom.xml
[INFO] Resolving class path of MavenProject: be.uantwerpen.ansymo.semanticadaptation:be.uantwerpen.ansymo.semanticadaptation.log:1.0.0-SNAPSHOT @ /var/lib/jenkins/workspace/ridCosimulation_development-7CHFDKZ477AWP5WGVIV7ZEYJ7TBQYODTBA2CXNIBOFPOTJGJR3PQ/DSL_SemanticAdaptation/be.uantwerpen.ansymo.semanticadaptation.log/pom.xml
[INFO] Computing target platform for MavenProject: be.uantwerpen.ansymo.semanticadaptation:be.uantwerpen.ansymo.semanticadaptation.cg.chain:1.0.0-SNAPSHOT @ /var/lib/jenkins/workspace/ridCosimulation_development-7CHFDKZ477AWP5WGVIV7ZEYJ7TBQYODTBA2CXNIBOFPOTJGJR3PQ/DSL_SemanticAdaptation/be.uantwerpen.ansymo.semanticadaptation.cg.chain/pom.xml
[INFO] Resolving dependencies of MavenProject: be.uantwerpen.ansymo.semanticadaptation:be.uantwerpen.ansymo.semanticadaptation.cg.chain:1.0.0-SNAPSHOT @ /var/lib/jenkins/workspace/ridCosimulation_development-7CHFDKZ477AWP5WGVIV7ZEYJ7TBQYODTBA2CXNIBOFPOTJGJR3PQ/DSL_SemanticAdaptation/be.uantwerpen.ansymo.semanticadaptation.cg.chain/pom.xml
[INFO] Resolving class path of MavenProject: be.uantwerpen.ansymo.semanticadaptation:be.uantwerpen.ansymo.semanticadaptation.cg.chain:1.0.0-SNAPSHOT @ /var/lib/jenkins/workspace/ridCosimulation_development-7CHFDKZ477AWP5WGVIV7ZEYJ7TBQYODTBA2CXNIBOFPOTJGJR3PQ/DSL_SemanticAdaptation/be.uantwerpen.ansymo.semanticadaptation.cg.chain/pom.xml
[INFO] Computing target platform for MavenProject: be.uantwerpen.ansymo.semanticadaptation:be.uantwerpen.ansymo.semanticadaptation.tests:1.0.0-SNAPSHOT @ /var/lib/jenkins/workspace/ridCosimulation_development-7CHFDKZ477AWP5WGVIV7ZEYJ7TBQYODTBA2CXNIBOFPOTJGJR3PQ/DSL_SemanticAdaptation/be.uantwerpen.ansymo.semanticadaptation.tests/pom.xml
[INFO] Resolving dependencies of MavenProject: be.uantwerpen.ansymo.semanticadaptation:be.uantwerpen.ansymo.semanticadaptation.tests:1.0.0-SNAPSHOT @ /var/lib/jenkins/workspace/ridCosimulation_development-7CHFDKZ477AWP5WGVIV7ZEYJ7TBQYODTBA2CXNIBOFPOTJGJR3PQ/DSL_SemanticAdaptation/be.uantwerpen.ansymo.semanticadaptation.tests/pom.xml
[INFO] Resolving class path of MavenProject: be.uantwerpen.ansymo.semanticadaptation:be.uantwerpen.ansymo.semanticadaptation.tests:1.0.0-SNAPSHOT @ /var/lib/jenkins/workspace/ridCosimulation_development-7CHFDKZ477AWP5WGVIV7ZEYJ7TBQYODTBA2CXNIBOFPOTJGJR3PQ/DSL_SemanticAdaptation/be.uantwerpen.ansymo.semanticadaptation.tests/pom.xml
[INFO] Computing target platform for MavenProject: be.uantwerpen.ansymo.semanticadaptation:be.uantwerpen.ansymo.semanticadaptation.ide:1.0.0-SNAPSHOT @ /var/lib/jenkins/workspace/ridCosimulation_development-7CHFDKZ477AWP5WGVIV7ZEYJ7TBQYODTBA2CXNIBOFPOTJGJR3PQ/DSL_SemanticAdaptation/be.uantwerpen.ansymo.semanticadaptation.ide/pom.xml
[INFO] Resolving dependencies of MavenProject: be.uantwerpen.ansymo.semanticadaptation:be.uantwerpen.ansymo.semanticadaptation.ide:1.0.0-SNAPSHOT @ /var/lib/jenkins/workspace/ridCosimulation_development-7CHFDKZ477AWP5WGVIV7ZEYJ7TBQYODTBA2CXNIBOFPOTJGJR3PQ/DSL_SemanticAdaptation/be.uantwerpen.ansymo.semanticadaptation.ide/pom.xml
[INFO] Resolving class path of MavenProject: be.uantwerpen.ansymo.semanticadaptation:be.uantwerpen.ansymo.semanticadaptation.ide:1.0.0-SNAPSHOT @ /var/lib/jenkins/workspace/ridCosimulation_development-7CHFDKZ477AWP5WGVIV7ZEYJ7TBQYODTBA2CXNIBOFPOTJGJR3PQ/DSL_SemanticAdaptation/be.uantwerpen.ansymo.semanticadaptation.ide/pom.xml
[INFO] Computing target platform for MavenProject: be.uantwerpen.ansymo.semanticadaptation:be.uantwerpen.ansymo.semanticadaptation.ui:1.0.0-SNAPSHOT @ /var/lib/jenkins/workspace/ridCosimulation_development-7CHFDKZ477AWP5WGVIV7ZEYJ7TBQYODTBA2CXNIBOFPOTJGJR3PQ/DSL_SemanticAdaptation/be.uantwerpen.ansymo.semanticadaptation.ui/pom.xml
[INFO] Resolving dependencies of MavenProject: be.uantwerpen.ansymo.semanticadaptation:be.uantwerpen.ansymo.semanticadaptation.ui:1.0.0-SNAPSHOT @ /var/lib/jenkins/workspace/ridCosimulation_development-7CHFDKZ477AWP5WGVIV7ZEYJ7TBQYODTBA2CXNIBOFPOTJGJR3PQ/DSL_SemanticAdaptation/be.uantwerpen.ansymo.semanticadaptation.ui/pom.xml
[INFO] Resolving class path of MavenProject: be.uantwerpen.ansymo.semanticadaptation:be.uantwerpen.ansymo.semanticadaptation.ui:1.0.0-SNAPSHOT @ /var/lib/jenkins/workspace/ridCosimulation_development-7CHFDKZ477AWP5WGVIV7ZEYJ7TBQYODTBA2CXNIBOFPOTJGJR3PQ/DSL_SemanticAdaptation/be.uantwerpen.ansymo.semanticadaptation.ui/pom.xml
[INFO] Computing target platform for MavenProject: be.uantwerpen.ansymo.semanticadaptation:be.uantwerpen.ansymo.semanticadaptation.cg.cpp:1.0.0-SNAPSHOT @ /var/lib/jenkins/workspace/ridCosimulation_development-7CHFDKZ477AWP5WGVIV7ZEYJ7TBQYODTBA2CXNIBOFPOTJGJR3PQ/DSL_SemanticAdaptation/be.uantwerpen.ansymo.semanticadaptation.cg.cpp/pom.xml
[INFO] Resolving dependencies of MavenProject: be.uantwerpen.ansymo.semanticadaptation:be.uantwerpen.ansymo.semanticadaptation.cg.cpp:1.0.0-SNAPSHOT @ /var/lib/jenkins/workspace/ridCosimulation_development-7CHFDKZ477AWP5WGVIV7ZEYJ7TBQYODTBA2CXNIBOFPOTJGJR3PQ/DSL_SemanticAdaptation/be.uantwerpen.ansymo.semanticadaptation.cg.cpp/pom.xml
[INFO] Resolving class path of MavenProject: be.uantwerpen.ansymo.semanticadaptation:be.uantwerpen.ansymo.semanticadaptation.cg.cpp:1.0.0-SNAPSHOT @ /var/lib/jenkins/workspace/ridCosimulation_development-7CHFDKZ477AWP5WGVIV7ZEYJ7TBQYODTBA2CXNIBOFPOTJGJR3PQ/DSL_SemanticAdaptation/be.uantwerpen.ansymo.semanticadaptation.cg.cpp/pom.xml
[INFO] Computing target platform for MavenProject: be.uantwerpen.ansymo.semanticadaptation:be.uantwerpen.ansymo.semanticadaptation.cg.canonical:1.0.0-SNAPSHOT @ /var/lib/jenkins/workspace/ridCosimulation_development-7CHFDKZ477AWP5WGVIV7ZEYJ7TBQYODTBA2CXNIBOFPOTJGJR3PQ/DSL_SemanticAdaptation/be.uantwerpen.ansymo.semanticadaptation.cg.canonical/pom.xml
[INFO] Resolving dependencies of MavenProject: be.uantwerpen.ansymo.semanticadaptation:be.uantwerpen.ansymo.semanticadaptation.cg.canonical:1.0.0-SNAPSHOT @ /var/lib/jenkins/workspace/ridCosimulation_development-7CHFDKZ477AWP5WGVIV7ZEYJ7TBQYODTBA2CXNIBOFPOTJGJR3PQ/DSL_SemanticAdaptation/be.uantwerpen.ansymo.semanticadaptation.cg.canonical/pom.xml
[INFO] Resolving class path of MavenProject: be.uantwerpen.ansymo.semanticadaptation:be.uantwerpen.ansymo.semanticadaptation.cg.canonical:1.0.0-SNAPSHOT @ /var/lib/jenkins/workspace/ridCosimulation_development-7CHFDKZ477AWP5WGVIV7ZEYJ7TBQYODTBA2CXNIBOFPOTJGJR3PQ/DSL_SemanticAdaptation/be.uantwerpen.ansymo.semanticadaptation.cg.canonical/pom.xml
[INFO] Computing target platform for MavenProject: be.uantwerpen.ansymo.semanticadaptation:be.uantwerpen.ansymo.semanticadaptation.cg.cpp.tests:1.0.0-SNAPSHOT @ /var/lib/jenkins/workspace/ridCosimulation_development-7CHFDKZ477AWP5WGVIV7ZEYJ7TBQYODTBA2CXNIBOFPOTJGJR3PQ/DSL_SemanticAdaptation/be.uantwerpen.ansymo.semanticadaptation.cg.cpp.tests/pom.xml
[INFO] Resolving dependencies of MavenProject: be.uantwerpen.ansymo.semanticadaptation:be.uantwerpen.ansymo.semanticadaptation.cg.cpp.tests:1.0.0-SNAPSHOT @ /var/lib/jenkins/workspace/ridCosimulation_development-7CHFDKZ477AWP5WGVIV7ZEYJ7TBQYODTBA2CXNIBOFPOTJGJR3PQ/DSL_SemanticAdaptation/be.uantwerpen.ansymo.semanticadaptation.cg.cpp.tests/pom.xml
[INFO] Resolving class path of MavenProject: be.uantwerpen.ansymo.semanticadaptation:be.uantwerpen.ansymo.semanticadaptation.cg.cpp.tests:1.0.0-SNAPSHOT @ /var/lib/jenkins/workspace/ridCosimulation_development-7CHFDKZ477AWP5WGVIV7ZEYJ7TBQYODTBA2CXNIBOFPOTJGJR3PQ/DSL_SemanticAdaptation/be.uantwerpen.ansymo.semanticadaptation.cg.cpp.tests/pom.xml
[INFO] Computing target platform for MavenProject: be.uantwerpen.ansymo.semanticadaptation:be.uantwerpen.ansymo.semanticadaptation.cg.canonical.tests:1.0.0-SNAPSHOT @ /var/lib/jenkins/workspace/ridCosimulation_development-7CHFDKZ477AWP5WGVIV7ZEYJ7TBQYODTBA2CXNIBOFPOTJGJR3PQ/DSL_SemanticAdaptation/be.uantwerpen.ansymo.semanticadaptation.cg.canonical.tests/pom.xml
[INFO] Resolving dependencies of MavenProject: be.uantwerpen.ansymo.semanticadaptation:be.uantwerpen.ansymo.semanticadaptation.cg.canonical.tests:1.0.0-SNAPSHOT @ /var/lib/jenkins/workspace/ridCosimulation_development-7CHFDKZ477AWP5WGVIV7ZEYJ7TBQYODTBA2CXNIBOFPOTJGJR3PQ/DSL_SemanticAdaptation/be.uantwerpen.ansymo.semanticadaptation.cg.canonical.tests/pom.xml
[INFO] Resolving class path of MavenProject: be.uantwerpen.ansymo.semanticadaptation:be.uantwerpen.ansymo.semanticadaptation.cg.canonical.tests:1.0.0-SNAPSHOT @ /var/lib/jenkins/workspace/ridCosimulation_development-7CHFDKZ477AWP5WGVIV7ZEYJ7TBQYODTBA2CXNIBOFPOTJGJR3PQ/DSL_SemanticAdaptation/be.uantwerpen.ansymo.semanticadaptation.cg.canonical.tests/pom.xml
[INFO] Computing target platform for MavenProject: be.uantwerpen.ansymo.semanticadaptation.features:be.uantwerpen.ansymo.semanticadaptation.features.core:1.0.0-SNAPSHOT @ /var/lib/jenkins/workspace/ridCosimulation_development-7CHFDKZ477AWP5WGVIV7ZEYJ7TBQYODTBA2CXNIBOFPOTJGJR3PQ/DSL_SemanticAdaptation/features/core/pom.xml
[INFO] Resolving dependencies of MavenProject: be.uantwerpen.ansymo.semanticadaptation.features:be.uantwerpen.ansymo.semanticadaptation.features.core:1.0.0-SNAPSHOT @ /var/lib/jenkins/workspace/ridCosimulation_development-7CHFDKZ477AWP5WGVIV7ZEYJ7TBQYODTBA2CXNIBOFPOTJGJR3PQ/DSL_SemanticAdaptation/features/core/pom.xml
[INFO] Resolving class path of MavenProject: be.uantwerpen.ansymo.semanticadaptation.features:be.uantwerpen.ansymo.semanticadaptation.features.core:1.0.0-SNAPSHOT @ /var/lib/jenkins/workspace/ridCosimulation_development-7CHFDKZ477AWP5WGVIV7ZEYJ7TBQYODTBA2CXNIBOFPOTJGJR3PQ/DSL_SemanticAdaptation/features/core/pom.xml
[INFO] Computing target platform for MavenProject: be.uantwerpen.ansymo.semanticadaptation:be.uantwerpen.ansymo.semanticadaptation.repository:1.0.0-SNAPSHOT @ /var/lib/jenkins/workspace/ridCosimulation_development-7CHFDKZ477AWP5WGVIV7ZEYJ7TBQYODTBA2CXNIBOFPOTJGJR3PQ/DSL_SemanticAdaptation/repository/pom.xml
[INFO] Resolving dependencies of MavenProject: be.uantwerpen.ansymo.semanticadaptation:be.uantwerpen.ansymo.semanticadaptation.repository:1.0.0-SNAPSHOT @ /var/lib/jenkins/workspace/ridCosimulation_development-7CHFDKZ477AWP5WGVIV7ZEYJ7TBQYODTBA2CXNIBOFPOTJGJR3PQ/DSL_SemanticAdaptation/repository/pom.xml
[INFO] Resolving class path of MavenProject: be.uantwerpen.ansymo.semanticadaptation:be.uantwerpen.ansymo.semanticadaptation.repository:1.0.0-SNAPSHOT @ /var/lib/jenkins/workspace/ridCosimulation_development-7CHFDKZ477AWP5WGVIV7ZEYJ7TBQYODTBA2CXNIBOFPOTJGJR3PQ/DSL_SemanticAdaptation/repository/pom.xml
[INFO] ------------------------------------------------------------------------
[INFO] Reactor Build Order:
[INFO] 
[INFO] Semantics Adaptation Root
[INFO] be.uantwerpen.ansymo.semanticadaptation Testframework
[INFO] be.uantwerpen.ansymo.semanticadaptation Logger
[INFO] be.uantwerpen.ansymo.semanticadaptation Language Core
[INFO] be.uantwerpen.ansymo.semanticadaptation Canonical Generator
[INFO] be.uantwerpen.ansymo.semanticadaptation Code Generation to C++
[INFO] be.uantwerpen.ansymo.semanticadaptation Code Generator
[INFO] be.uantwerpen.ansymo.semanticadaptation Language Tests
[INFO] be.uantwerpen.ansymo.semanticadaptation.ide
[INFO] be.uantwerpen.ansymo.semanticadaptation.ui Language UI
[INFO] be.uantwerpen.ansymo.semanticadaptation Code Generation to C++ Tests
[INFO] be.uantwerpen.ansymo.semanticadaptation Canonical Tests
[INFO] Feature
[INFO] Core
[INFO] Semantics Adaptation IDE Eclipse repository
[INFO]                                                                         
[INFO] ------------------------------------------------------------------------
[INFO] Building Semantics Adaptation Root 1.0.0-SNAPSHOT
[INFO] ------------------------------------------------------------------------
[INFO] 
[INFO] --- maven-javadoc-plugin:2.9:jar (attach-javadocs) @ parent ---
[INFO] Skipping javadoc generation
[INFO] 
[INFO] --- maven-install-plugin:2.5.2:install (default-install) @ parent ---
[INFO] Installing /var/lib/jenkins/workspace/ridCosimulation_development-7CHFDKZ477AWP5WGVIV7ZEYJ7TBQYODTBA2CXNIBOFPOTJGJR3PQ/DSL_SemanticAdaptation/pom.xml to /var/lib/jenkins/workspace/ridCosimulation_development-7CHFDKZ477AWP5WGVIV7ZEYJ7TBQYODTBA2CXNIBOFPOTJGJR3PQ/.repository/be/uantwerpen/ansymo/semanticadaptation/parent/1.0.0-SNAPSHOT/parent-1.0.0-SNAPSHOT.pom
[INFO]                                                                         
[INFO] ------------------------------------------------------------------------
[INFO] Building be.uantwerpen.ansymo.semanticadaptation Testframework 1.0.0-SNAPSHOT
[INFO] ------------------------------------------------------------------------
[INFO] 
[INFO] --- tycho-packaging-plugin:1.0.0:build-qualifier (default-build-qualifier) @ be.uantwerpen.ansymo.semanticadaptation.testframework ---
[INFO] The project's OSGi version is 1.0.0.201808052125
[INFO] 
[INFO] --- tycho-packaging-plugin:1.0.0:validate-id (default-validate-id) @ be.uantwerpen.ansymo.semanticadaptation.testframework ---
[INFO] 
[INFO] --- tycho-packaging-plugin:1.0.0:validate-version (default-validate-version) @ be.uantwerpen.ansymo.semanticadaptation.testframework ---
[INFO] 
[INFO] --- xtend-maven-plugin:2.14.0:compile (default) @ be.uantwerpen.ansymo.semanticadaptation.testframework ---
[WARNING] Compilation of stubs had errors.
[INFO] 
[INFO] --- maven-resources-plugin:2.4.3:resources (default-resources) @ be.uantwerpen.ansymo.semanticadaptation.testframework ---
[INFO] Using 'UTF-8' encoding to copy filtered resources.
[INFO] skip non existing resourceDirectory /var/lib/jenkins/workspace/ridCosimulation_development-7CHFDKZ477AWP5WGVIV7ZEYJ7TBQYODTBA2CXNIBOFPOTJGJR3PQ/DSL_SemanticAdaptation/be.uantwerpen.ansymo.semanticadaptation.testframework/src/main/resources
[INFO] 
[INFO] --- tycho-compiler-plugin:1.0.0:compile (default-compile) @ be.uantwerpen.ansymo.semanticadaptation.testframework ---
[WARNING] Parameter 'useProjectSettings' is set to true, but preferences file '/var/lib/jenkins/workspace/ridCosimulation_development-7CHFDKZ477AWP5WGVIV7ZEYJ7TBQYODTBA2CXNIBOFPOTJGJR3PQ/DSL_SemanticAdaptation/be.uantwerpen.ansymo.semanticadaptation.testframework/.settings/org.eclipse.jdt.core.prefs' could not be found!
[INFO] Compiling 4 source files to /var/lib/jenkins/workspace/ridCosimulation_development-7CHFDKZ477AWP5WGVIV7ZEYJ7TBQYODTBA2CXNIBOFPOTJGJR3PQ/DSL_SemanticAdaptation/be.uantwerpen.ansymo.semanticadaptation.testframework/target/classes
[WARNING] Source directory /var/lib/jenkins/workspace/ridCosimulation_development-7CHFDKZ477AWP5WGVIV7ZEYJ7TBQYODTBA2CXNIBOFPOTJGJR3PQ/DSL_SemanticAdaptation/be.uantwerpen.ansymo.semanticadaptation.testframework/src-gen does not exist
[INFO] 
[INFO] --- xtend-maven-plugin:2.14.0:xtend-install-debug-info (default) @ be.uantwerpen.ansymo.semanticadaptation.testframework ---
[WARNING] Directory /var/lib/jenkins/workspace/ridCosimulation_development-7CHFDKZ477AWP5WGVIV7ZEYJ7TBQYODTBA2CXNIBOFPOTJGJR3PQ/DSL_SemanticAdaptation/be.uantwerpen.ansymo.semanticadaptation.testframework/src/main/java is empty. Can't process.
[WARNING] Directory /var/lib/jenkins/workspace/ridCosimulation_development-7CHFDKZ477AWP5WGVIV7ZEYJ7TBQYODTBA2CXNIBOFPOTJGJR3PQ/DSL_SemanticAdaptation/be.uantwerpen.ansymo.semanticadaptation.testframework/src-gen is empty. Can't process.
[INFO] Installing Xtend files into 1 class files as primary debug sources in: /var/lib/jenkins/workspace/ridCosimulation_development-7CHFDKZ477AWP5WGVIV7ZEYJ7TBQYODTBA2CXNIBOFPOTJGJR3PQ/DSL_SemanticAdaptation/be.uantwerpen.ansymo.semanticadaptation.testframework/target/classes
[INFO] 
[INFO] --- xtend-maven-plugin:2.14.0:testCompile (default) @ be.uantwerpen.ansymo.semanticadaptation.testframework ---
[INFO] skip compiling sources because the configured directory '[/var/lib/jenkins/workspace/ridCosimulation_development-7CHFDKZ477AWP5WGVIV7ZEYJ7TBQYODTBA2CXNIBOFPOTJGJR3PQ/DSL_SemanticAdaptation/be.uantwerpen.ansymo.semanticadaptation.testframework/src/test/java]' does not exist.
[INFO] 
[INFO] --- maven-resources-plugin:2.4.3:testResources (default-testResources) @ be.uantwerpen.ansymo.semanticadaptation.testframework ---
[INFO] Using 'UTF-8' encoding to copy filtered resources.
[INFO] skip non existing resourceDirectory /var/lib/jenkins/workspace/ridCosimulation_development-7CHFDKZ477AWP5WGVIV7ZEYJ7TBQYODTBA2CXNIBOFPOTJGJR3PQ/DSL_SemanticAdaptation/be.uantwerpen.ansymo.semanticadaptation.testframework/src/test/resources
[INFO] 
[INFO] --- xtend-maven-plugin:2.14.0:xtend-test-install-debug-info (default) @ be.uantwerpen.ansymo.semanticadaptation.testframework ---
[WARNING] Directory /var/lib/jenkins/workspace/ridCosimulation_development-7CHFDKZ477AWP5WGVIV7ZEYJ7TBQYODTBA2CXNIBOFPOTJGJR3PQ/DSL_SemanticAdaptation/be.uantwerpen.ansymo.semanticadaptation.testframework/src/test/java is empty. Can't process.
[WARNING] Directory /var/lib/jenkins/workspace/ridCosimulation_development-7CHFDKZ477AWP5WGVIV7ZEYJ7TBQYODTBA2CXNIBOFPOTJGJR3PQ/DSL_SemanticAdaptation/be.uantwerpen.ansymo.semanticadaptation.testframework/target/xtend-gen/test is empty. Can't process.
[INFO] Installing Xtend files into 0 class files as primary debug sources in: /var/lib/jenkins/workspace/ridCosimulation_development-7CHFDKZ477AWP5WGVIV7ZEYJ7TBQYODTBA2CXNIBOFPOTJGJR3PQ/DSL_SemanticAdaptation/be.uantwerpen.ansymo.semanticadaptation.testframework/target/test-classes
[INFO] 
[INFO] --- target-platform-configuration:1.0.0:target-platform (default-target-platform) @ be.uantwerpen.ansymo.semanticadaptation.testframework ---
[INFO] 
[INFO] --- tycho-packaging-plugin:1.0.0:package-plugin (default-package-plugin) @ be.uantwerpen.ansymo.semanticadaptation.testframework ---
[INFO] Building jar: /var/lib/jenkins/workspace/ridCosimulation_development-7CHFDKZ477AWP5WGVIV7ZEYJ7TBQYODTBA2CXNIBOFPOTJGJR3PQ/DSL_SemanticAdaptation/be.uantwerpen.ansymo.semanticadaptation.testframework/target/be.uantwerpen.ansymo.semanticadaptation.testframework-1.0.0-SNAPSHOT.jar
[INFO] 
[INFO] --- tycho-p2-plugin:1.0.0:p2-metadata-default (default-p2-metadata-default) @ be.uantwerpen.ansymo.semanticadaptation.testframework ---
[INFO] 
[INFO] --- maven-javadoc-plugin:2.9:jar (attach-javadocs) @ be.uantwerpen.ansymo.semanticadaptation.testframework ---
[INFO] Skipping javadoc generation
[INFO] 
[INFO] --- maven-install-plugin:2.3.1:install (default-install) @ be.uantwerpen.ansymo.semanticadaptation.testframework ---
[INFO] Installing /var/lib/jenkins/workspace/ridCosimulation_development-7CHFDKZ477AWP5WGVIV7ZEYJ7TBQYODTBA2CXNIBOFPOTJGJR3PQ/DSL_SemanticAdaptation/be.uantwerpen.ansymo.semanticadaptation.testframework/target/be.uantwerpen.ansymo.semanticadaptation.testframework-1.0.0-SNAPSHOT.jar to /var/lib/jenkins/workspace/ridCosimulation_development-7CHFDKZ477AWP5WGVIV7ZEYJ7TBQYODTBA2CXNIBOFPOTJGJR3PQ/.repository/be/uantwerpen/ansymo/semanticadaptation/be.uantwerpen.ansymo.semanticadaptation.testframework/1.0.0-SNAPSHOT/be.uantwerpen.ansymo.semanticadaptation.testframework-1.0.0-SNAPSHOT.jar
[INFO] Installing /var/lib/jenkins/workspace/ridCosimulation_development-7CHFDKZ477AWP5WGVIV7ZEYJ7TBQYODTBA2CXNIBOFPOTJGJR3PQ/DSL_SemanticAdaptation/be.uantwerpen.ansymo.semanticadaptation.testframework/pom.xml to /var/lib/jenkins/workspace/ridCosimulation_development-7CHFDKZ477AWP5WGVIV7ZEYJ7TBQYODTBA2CXNIBOFPOTJGJR3PQ/.repository/be/uantwerpen/ansymo/semanticadaptation/be.uantwerpen.ansymo.semanticadaptation.testframework/1.0.0-SNAPSHOT/be.uantwerpen.ansymo.semanticadaptation.testframework-1.0.0-SNAPSHOT.pom
[INFO] Installing /var/lib/jenkins/workspace/ridCosimulation_development-7CHFDKZ477AWP5WGVIV7ZEYJ7TBQYODTBA2CXNIBOFPOTJGJR3PQ/DSL_SemanticAdaptation/be.uantwerpen.ansymo.semanticadaptation.testframework/target/p2content.xml to /var/lib/jenkins/workspace/ridCosimulation_development-7CHFDKZ477AWP5WGVIV7ZEYJ7TBQYODTBA2CXNIBOFPOTJGJR3PQ/.repository/be/uantwerpen/ansymo/semanticadaptation/be.uantwerpen.ansymo.semanticadaptation.testframework/1.0.0-SNAPSHOT/be.uantwerpen.ansymo.semanticadaptation.testframework-1.0.0-SNAPSHOT-p2metadata.xml
[INFO] Installing /var/lib/jenkins/workspace/ridCosimulation_development-7CHFDKZ477AWP5WGVIV7ZEYJ7TBQYODTBA2CXNIBOFPOTJGJR3PQ/DSL_SemanticAdaptation/be.uantwerpen.ansymo.semanticadaptation.testframework/target/p2artifacts.xml to /var/lib/jenkins/workspace/ridCosimulation_development-7CHFDKZ477AWP5WGVIV7ZEYJ7TBQYODTBA2CXNIBOFPOTJGJR3PQ/.repository/be/uantwerpen/ansymo/semanticadaptation/be.uantwerpen.ansymo.semanticadaptation.testframework/1.0.0-SNAPSHOT/be.uantwerpen.ansymo.semanticadaptation.testframework-1.0.0-SNAPSHOT-p2artifacts.xml
[INFO] 
[INFO] --- tycho-p2-plugin:1.0.0:update-local-index (default-update-local-index) @ be.uantwerpen.ansymo.semanticadaptation.testframework ---
[INFO]                                                                         
[INFO] ------------------------------------------------------------------------
[INFO] Building be.uantwerpen.ansymo.semanticadaptation Logger 1.0.0-SNAPSHOT
[INFO] ------------------------------------------------------------------------
[INFO] 
[INFO] --- tycho-packaging-plugin:1.0.0:build-qualifier (default-build-qualifier) @ be.uantwerpen.ansymo.semanticadaptation.log ---
[INFO] The project's OSGi version is 1.0.0.201808052125
[INFO] 
[INFO] --- tycho-packaging-plugin:1.0.0:validate-id (default-validate-id) @ be.uantwerpen.ansymo.semanticadaptation.log ---
[INFO] 
[INFO] --- tycho-packaging-plugin:1.0.0:validate-version (default-validate-version) @ be.uantwerpen.ansymo.semanticadaptation.log ---
[INFO] 
[INFO] --- xtend-maven-plugin:2.14.0:compile (default) @ be.uantwerpen.ansymo.semanticadaptation.log ---
[WARNING] Compilation of stubs had errors.
[WARNING] 
WARNING: 	Log.xtend - /var/lib/jenkins/workspace/ridCosimulation_development-7CHFDKZ477AWP5WGVIV7ZEYJ7TBQYODTBA2CXNIBOFPOTJGJR3PQ/DSL_SemanticAdaptation/be.uantwerpen.ansymo.semanticadaptation.log/src/be/uantwerpen/ansymo/semanticadaptation/log/Log.xtend
14: The private modifier is unnecessary on field logger
[INFO] 
[INFO] --- maven-resources-plugin:2.4.3:resources (default-resources) @ be.uantwerpen.ansymo.semanticadaptation.log ---
[INFO] Using 'UTF-8' encoding to copy filtered resources.
[INFO] skip non existing resourceDirectory /var/lib/jenkins/workspace/ridCosimulation_development-7CHFDKZ477AWP5WGVIV7ZEYJ7TBQYODTBA2CXNIBOFPOTJGJR3PQ/DSL_SemanticAdaptation/be.uantwerpen.ansymo.semanticadaptation.log/src/main/resources
[INFO] 
[INFO] --- tycho-compiler-plugin:1.0.0:compile (default-compile) @ be.uantwerpen.ansymo.semanticadaptation.log ---
[WARNING] Parameter 'useProjectSettings' is set to true, but preferences file '/var/lib/jenkins/workspace/ridCosimulation_development-7CHFDKZ477AWP5WGVIV7ZEYJ7TBQYODTBA2CXNIBOFPOTJGJR3PQ/DSL_SemanticAdaptation/be.uantwerpen.ansymo.semanticadaptation.log/.settings/org.eclipse.jdt.core.prefs' could not be found!
[INFO] Compiling 1 source file to /var/lib/jenkins/workspace/ridCosimulation_development-7CHFDKZ477AWP5WGVIV7ZEYJ7TBQYODTBA2CXNIBOFPOTJGJR3PQ/DSL_SemanticAdaptation/be.uantwerpen.ansymo.semanticadaptation.log/target/classes
[WARNING] Source directory /var/lib/jenkins/workspace/ridCosimulation_development-7CHFDKZ477AWP5WGVIV7ZEYJ7TBQYODTBA2CXNIBOFPOTJGJR3PQ/DSL_SemanticAdaptation/be.uantwerpen.ansymo.semanticadaptation.log/src-gen does not exist
[INFO] 
[INFO] --- xtend-maven-plugin:2.14.0:xtend-install-debug-info (default) @ be.uantwerpen.ansymo.semanticadaptation.log ---
[WARNING] Directory /var/lib/jenkins/workspace/ridCosimulation_development-7CHFDKZ477AWP5WGVIV7ZEYJ7TBQYODTBA2CXNIBOFPOTJGJR3PQ/DSL_SemanticAdaptation/be.uantwerpen.ansymo.semanticadaptation.log/src/main/java is empty. Can't process.
[WARNING] Directory /var/lib/jenkins/workspace/ridCosimulation_development-7CHFDKZ477AWP5WGVIV7ZEYJ7TBQYODTBA2CXNIBOFPOTJGJR3PQ/DSL_SemanticAdaptation/be.uantwerpen.ansymo.semanticadaptation.log/src-gen is empty. Can't process.
[INFO] Installing Xtend files into 1 class files as primary debug sources in: /var/lib/jenkins/workspace/ridCosimulation_development-7CHFDKZ477AWP5WGVIV7ZEYJ7TBQYODTBA2CXNIBOFPOTJGJR3PQ/DSL_SemanticAdaptation/be.uantwerpen.ansymo.semanticadaptation.log/target/classes
[INFO] 
[INFO] --- xtend-maven-plugin:2.14.0:testCompile (default) @ be.uantwerpen.ansymo.semanticadaptation.log ---
[INFO] skip compiling sources because the configured directory '[/var/lib/jenkins/workspace/ridCosimulation_development-7CHFDKZ477AWP5WGVIV7ZEYJ7TBQYODTBA2CXNIBOFPOTJGJR3PQ/DSL_SemanticAdaptation/be.uantwerpen.ansymo.semanticadaptation.log/src/test/java]' does not exist.
[INFO] 
[INFO] --- maven-resources-plugin:2.4.3:testResources (default-testResources) @ be.uantwerpen.ansymo.semanticadaptation.log ---
[INFO] Using 'UTF-8' encoding to copy filtered resources.
[INFO] skip non existing resourceDirectory /var/lib/jenkins/workspace/ridCosimulation_development-7CHFDKZ477AWP5WGVIV7ZEYJ7TBQYODTBA2CXNIBOFPOTJGJR3PQ/DSL_SemanticAdaptation/be.uantwerpen.ansymo.semanticadaptation.log/src/test/resources
[INFO] 
[INFO] --- xtend-maven-plugin:2.14.0:xtend-test-install-debug-info (default) @ be.uantwerpen.ansymo.semanticadaptation.log ---
[WARNING] Directory /var/lib/jenkins/workspace/ridCosimulation_development-7CHFDKZ477AWP5WGVIV7ZEYJ7TBQYODTBA2CXNIBOFPOTJGJR3PQ/DSL_SemanticAdaptation/be.uantwerpen.ansymo.semanticadaptation.log/src/test/java is empty. Can't process.
[WARNING] Directory /var/lib/jenkins/workspace/ridCosimulation_development-7CHFDKZ477AWP5WGVIV7ZEYJ7TBQYODTBA2CXNIBOFPOTJGJR3PQ/DSL_SemanticAdaptation/be.uantwerpen.ansymo.semanticadaptation.log/target/xtend-gen/test is empty. Can't process.
[INFO] Installing Xtend files into 0 class files as primary debug sources in: /var/lib/jenkins/workspace/ridCosimulation_development-7CHFDKZ477AWP5WGVIV7ZEYJ7TBQYODTBA2CXNIBOFPOTJGJR3PQ/DSL_SemanticAdaptation/be.uantwerpen.ansymo.semanticadaptation.log/target/test-classes
[INFO] 
[INFO] --- target-platform-configuration:1.0.0:target-platform (default-target-platform) @ be.uantwerpen.ansymo.semanticadaptation.log ---
[INFO] 
[INFO] --- tycho-packaging-plugin:1.0.0:package-plugin (default-package-plugin) @ be.uantwerpen.ansymo.semanticadaptation.log ---
[INFO] Building jar: /var/lib/jenkins/workspace/ridCosimulation_development-7CHFDKZ477AWP5WGVIV7ZEYJ7TBQYODTBA2CXNIBOFPOTJGJR3PQ/DSL_SemanticAdaptation/be.uantwerpen.ansymo.semanticadaptation.log/target/be.uantwerpen.ansymo.semanticadaptation.log-1.0.0-SNAPSHOT.jar
[INFO] 
[INFO] --- tycho-p2-plugin:1.0.0:p2-metadata-default (default-p2-metadata-default) @ be.uantwerpen.ansymo.semanticadaptation.log ---
[INFO] 
[INFO] --- maven-javadoc-plugin:2.9:jar (attach-javadocs) @ be.uantwerpen.ansymo.semanticadaptation.log ---
[INFO] Skipping javadoc generation
[INFO] 
[INFO] --- maven-install-plugin:2.3.1:install (default-install) @ be.uantwerpen.ansymo.semanticadaptation.log ---
[INFO] Installing /var/lib/jenkins/workspace/ridCosimulation_development-7CHFDKZ477AWP5WGVIV7ZEYJ7TBQYODTBA2CXNIBOFPOTJGJR3PQ/DSL_SemanticAdaptation/be.uantwerpen.ansymo.semanticadaptation.log/target/be.uantwerpen.ansymo.semanticadaptation.log-1.0.0-SNAPSHOT.jar to /var/lib/jenkins/workspace/ridCosimulation_development-7CHFDKZ477AWP5WGVIV7ZEYJ7TBQYODTBA2CXNIBOFPOTJGJR3PQ/.repository/be/uantwerpen/ansymo/semanticadaptation/be.uantwerpen.ansymo.semanticadaptation.log/1.0.0-SNAPSHOT/be.uantwerpen.ansymo.semanticadaptation.log-1.0.0-SNAPSHOT.jar
[INFO] Installing /var/lib/jenkins/workspace/ridCosimulation_development-7CHFDKZ477AWP5WGVIV7ZEYJ7TBQYODTBA2CXNIBOFPOTJGJR3PQ/DSL_SemanticAdaptation/be.uantwerpen.ansymo.semanticadaptation.log/pom.xml to /var/lib/jenkins/workspace/ridCosimulation_development-7CHFDKZ477AWP5WGVIV7ZEYJ7TBQYODTBA2CXNIBOFPOTJGJR3PQ/.repository/be/uantwerpen/ansymo/semanticadaptation/be.uantwerpen.ansymo.semanticadaptation.log/1.0.0-SNAPSHOT/be.uantwerpen.ansymo.semanticadaptation.log-1.0.0-SNAPSHOT.pom
[INFO] Installing /var/lib/jenkins/workspace/ridCosimulation_development-7CHFDKZ477AWP5WGVIV7ZEYJ7TBQYODTBA2CXNIBOFPOTJGJR3PQ/DSL_SemanticAdaptation/be.uantwerpen.ansymo.semanticadaptation.log/target/p2content.xml to /var/lib/jenkins/workspace/ridCosimulation_development-7CHFDKZ477AWP5WGVIV7ZEYJ7TBQYODTBA2CXNIBOFPOTJGJR3PQ/.repository/be/uantwerpen/ansymo/semanticadaptation/be.uantwerpen.ansymo.semanticadaptation.log/1.0.0-SNAPSHOT/be.uantwerpen.ansymo.semanticadaptation.log-1.0.0-SNAPSHOT-p2metadata.xml
[INFO] Installing /var/lib/jenkins/workspace/ridCosimulation_development-7CHFDKZ477AWP5WGVIV7ZEYJ7TBQYODTBA2CXNIBOFPOTJGJR3PQ/DSL_SemanticAdaptation/be.uantwerpen.ansymo.semanticadaptation.log/target/p2artifacts.xml to /var/lib/jenkins/workspace/ridCosimulation_development-7CHFDKZ477AWP5WGVIV7ZEYJ7TBQYODTBA2CXNIBOFPOTJGJR3PQ/.repository/be/uantwerpen/ansymo/semanticadaptation/be.uantwerpen.ansymo.semanticadaptation.log/1.0.0-SNAPSHOT/be.uantwerpen.ansymo.semanticadaptation.log-1.0.0-SNAPSHOT-p2artifacts.xml
[INFO] 
[INFO] --- tycho-p2-plugin:1.0.0:update-local-index (default-update-local-index) @ be.uantwerpen.ansymo.semanticadaptation.log ---
[INFO]                                                                         
[INFO] ------------------------------------------------------------------------
[INFO] Building be.uantwerpen.ansymo.semanticadaptation Language Core 1.0.0-SNAPSHOT
[INFO] ------------------------------------------------------------------------
[INFO] 
[INFO] --- tycho-packaging-plugin:1.0.0:build-qualifier (default-build-qualifier) @ be.uantwerpen.ansymo.semanticadaptation ---
[INFO] The project's OSGi version is 1.0.0.201808052125
[INFO] 
[INFO] --- tycho-packaging-plugin:1.0.0:validate-id (default-validate-id) @ be.uantwerpen.ansymo.semanticadaptation ---
[INFO] 
[INFO] --- tycho-packaging-plugin:1.0.0:validate-version (default-validate-version) @ be.uantwerpen.ansymo.semanticadaptation ---
[INFO] 
[INFO] >>> exec-maven-plugin:1.2.1:java (default) > validate @ be.uantwerpen.ansymo.semanticadaptation >>>
[INFO] 
[INFO] --- tycho-packaging-plugin:1.0.0:build-qualifier (default-build-qualifier) @ be.uantwerpen.ansymo.semanticadaptation ---
[INFO] The project's OSGi version is 1.0.0.201808052125
[INFO] 
[INFO] --- tycho-packaging-plugin:1.0.0:validate-id (default-validate-id) @ be.uantwerpen.ansymo.semanticadaptation ---
[INFO] 
[INFO] --- tycho-packaging-plugin:1.0.0:validate-version (default-validate-version) @ be.uantwerpen.ansymo.semanticadaptation ---
[INFO] 
[INFO] <<< exec-maven-plugin:1.2.1:java (default) < validate @ be.uantwerpen.ansymo.semanticadaptation <<<
[INFO] 
[INFO] --- exec-maven-plugin:1.2.1:java (default) @ be.uantwerpen.ansymo.semanticadaptation ---
[INFO] ------------------------------------------------------------------------
[INFO] Reactor Summary:
[INFO] 
[INFO] Semantics Adaptation Root .......................... SUCCESS [  0.446 s]
[INFO] be.uantwerpen.ansymo.semanticadaptation Testframework SUCCESS [  5.968 s]
[INFO] be.uantwerpen.ansymo.semanticadaptation Logger ..... SUCCESS [  0.696 s]
[INFO] be.uantwerpen.ansymo.semanticadaptation Language Core FAILURE [  0.081 s]
[INFO] be.uantwerpen.ansymo.semanticadaptation Canonical Generator SKIPPED
[INFO] be.uantwerpen.ansymo.semanticadaptation Code Generation to C++ SKIPPED
[INFO] be.uantwerpen.ansymo.semanticadaptation Code Generator SKIPPED
[INFO] be.uantwerpen.ansymo.semanticadaptation Language Tests SKIPPED
[INFO] be.uantwerpen.ansymo.semanticadaptation.ide ........ SKIPPED
[INFO] be.uantwerpen.ansymo.semanticadaptation.ui Language UI SKIPPED
[INFO] be.uantwerpen.ansymo.semanticadaptation Code Generation to C++ Tests SKIPPED
[INFO] be.uantwerpen.ansymo.semanticadaptation Canonical Tests SKIPPED
[INFO] Feature ............................................ SKIPPED
[INFO] Core ............................................... SKIPPED
[INFO] Semantics Adaptation IDE Eclipse repository ........ SKIPPED
[INFO] ------------------------------------------------------------------------
[INFO] BUILD FAILURE
[INFO] ------------------------------------------------------------------------
[INFO] Total time: 51.726 s
[INFO] Finished at: 2018-08-05T23:26:15+02:00
[INFO] Final Memory: 144M/827M
[INFO] ------------------------------------------------------------------------
[jenkins-maven-event-spy] INFO generated /var/lib/jenkins/workspace/ridCosimulation_development-7CHFDKZ477AWP5WGVIV7ZEYJ7TBQYODTBA2CXNIBOFPOTJGJR3PQ@tmp/withMaven0a630b02/maven-spy-20180805-232523-1692726283726308106146.log
[ERROR] Failed to execute goal org.codehaus.mojo:exec-maven-plugin:1.2.1:java (default) on project be.uantwerpen.ansymo.semanticadaptation: Execution default of goal org.codehaus.mojo:exec-maven-plugin:1.2.1:java failed: Plugin org.codehaus.mojo:exec-maven-plugin:1.2.1 or one of its dependencies could not be resolved: Failed to collect dependencies for org.codehaus.mojo:exec-maven-plugin:jar:1.2.1 (): Could not resolve version conflict among [org.codehaus.mojo:exec-maven-plugin:jar:1.2.1 -> org.eclipse.xtext:org.eclipse.xtext.generator:jar:2.14.0 -> org.eclipse.xtext:org.eclipse.xtext.xtext.generator:jar:2.14.0 -> org.eclipse.emf:org.eclipse.emf.mwe.utils:jar:1.3.21.201705291010 -> org.eclipse.emf:org.eclipse.emf.mwe.core:jar:[1.3.21.201705291010,1.3.21.201705291010] -> org.eclipse.emf:org.eclipse.emf.mwe2.runtime:jar:[2.9.1.201705291010,2.9.1.201705291010], org.codehaus.mojo:exec-maven-plugin:jar:1.2.1 -> org.eclipse.xtext:org.eclipse.xtext.generator:jar:2.14.0 -> org.eclipse.xtext:org.eclipse.xtext.xtext.generator:jar:2.14.0 -> org.eclipse.emf:org.eclipse.emf.mwe2.lib:jar:2.9.1.201705291010 -> org.eclipse.emf:org.eclipse.emf.mwe2.runtime:jar:[2.9.1.201705291010,2.9.1.201705291010], org.codehaus.mojo:exec-maven-plugin:jar:1.2.1 -> org.eclipse.emf:org.eclipse.emf.mwe2.launch:jar:2.9.0.201605261059 -> org.eclipse.emf:org.eclipse.emf.mwe2.runtime:jar:[2.9.0.201605261059,2.9.0.201605261059], org.codehaus.mojo:exec-maven-plugin:jar:1.2.1 -> org.eclipse.emf:org.eclipse.emf.mwe2.launch:jar:2.9.0.201605261059 -> org.eclipse.emf:org.eclipse.emf.mwe2.language:jar:[2.9.0.201605261059,2.9.0.201605261059] -> org.eclipse.emf:org.eclipse.emf.mwe2.runtime:jar:[2.9.0.201605261059,2.9.0.201605261059]] -> [Help 1]
[ERROR] 
[ERROR] To see the full stack trace of the errors, re-run Maven with the -e switch.
[ERROR] Re-run Maven using the -X switch to enable full debug logging.
[ERROR] 
[ERROR] For more information about the errors and possible solutions, please read the following articles:
[ERROR] [Help 1] http://cwiki.apache.org/confluence/display/MAVEN/PluginResolutionException
[ERROR] 
[ERROR] After correcting the problems, you can resume the build with the command
[ERROR]   mvn <goals> -rf :be.uantwerpen.ansymo.semanticadaptation
[Pipeline] }
[withMaven] artifactsPublisher - Archive artifact DSL_SemanticAdaptation/pom.xml under be/uantwerpen/ansymo/semanticadaptation/parent/1.0.0-SNAPSHOT/parent-1.0.0-SNAPSHOT.pom
[withMaven] artifactsPublisher - Archive artifact DSL_SemanticAdaptation/be.uantwerpen.ansymo.semanticadaptation.testframework/pom.xml under be/uantwerpen/ansymo/semanticadaptation/be.uantwerpen.ansymo.semanticadaptation.testframework/1.0.0-SNAPSHOT/be.uantwerpen.ansymo.semanticadaptation.testframework-1.0.0-SNAPSHOT.pom
[withMaven] artifactsPublisher - Archive artifact DSL_SemanticAdaptation/be.uantwerpen.ansymo.semanticadaptation.testframework/target/be.uantwerpen.ansymo.semanticadaptation.testframework-1.0.0-SNAPSHOT.jar under be/uantwerpen/ansymo/semanticadaptation/be.uantwerpen.ansymo.semanticadaptation.testframework/1.0.0-SNAPSHOT/be.uantwerpen.ansymo.semanticadaptation.testframework-1.0.0-SNAPSHOT.jar
[withMaven] artifactsPublisher - Archive artifact DSL_SemanticAdaptation/be.uantwerpen.ansymo.semanticadaptation.log/pom.xml under be/uantwerpen/ansymo/semanticadaptation/be.uantwerpen.ansymo.semanticadaptation.log/1.0.0-SNAPSHOT/be.uantwerpen.ansymo.semanticadaptation.log-1.0.0-SNAPSHOT.pom
[withMaven] artifactsPublisher - Archive artifact DSL_SemanticAdaptation/be.uantwerpen.ansymo.semanticadaptation.log/target/be.uantwerpen.ansymo.semanticadaptation.log-1.0.0-SNAPSHOT.jar under be/uantwerpen/ansymo/semanticadaptation/be.uantwerpen.ansymo.semanticadaptation.log/1.0.0-SNAPSHOT/be.uantwerpen.ansymo.semanticadaptation.log-1.0.0-SNAPSHOT.jar
[withMaven] artifactsPublisher - Archive artifact DSL_SemanticAdaptation/be.uantwerpen.ansymo.semanticadaptation.testframework/target/p2content.xml under be/uantwerpen/ansymo/semanticadaptation/be.uantwerpen.ansymo.semanticadaptation.testframework/1.0.0-SNAPSHOT/be.uantwerpen.ansymo.semanticadaptation.testframework-1.0.0-SNAPSHOT-p2metadata.xml
[withMaven] artifactsPublisher - Archive artifact DSL_SemanticAdaptation/be.uantwerpen.ansymo.semanticadaptation.testframework/target/p2artifacts.xml under be/uantwerpen/ansymo/semanticadaptation/be.uantwerpen.ansymo.semanticadaptation.testframework/1.0.0-SNAPSHOT/be.uantwerpen.ansymo.semanticadaptation.testframework-1.0.0-SNAPSHOT-p2artifacts.xml
[withMaven] artifactsPublisher - Archive artifact DSL_SemanticAdaptation/be.uantwerpen.ansymo.semanticadaptation.log/target/p2content.xml under be/uantwerpen/ansymo/semanticadaptation/be.uantwerpen.ansymo.semanticadaptation.log/1.0.0-SNAPSHOT/be.uantwerpen.ansymo.semanticadaptation.log-1.0.0-SNAPSHOT-p2metadata.xml
[withMaven] artifactsPublisher - Archive artifact DSL_SemanticAdaptation/be.uantwerpen.ansymo.semanticadaptation.log/target/p2artifacts.xml under be/uantwerpen/ansymo/semanticadaptation/be.uantwerpen.ansymo.semanticadaptation.log/1.0.0-SNAPSHOT/be.uantwerpen.ansymo.semanticadaptation.log-1.0.0-SNAPSHOT-p2artifacts.xml
[TASKS] Scanning folder '/var/lib/jenkins/workspace/ridCosimulation_development-7CHFDKZ477AWP5WGVIV7ZEYJ7TBQYODTBA2CXNIBOFPOTJGJR3PQ' for files matching the pattern '**/*.java' - excludes: null
[TASKS] Found 32 files to scan for tasks
[TASKS] Found 2 open tasks.
Skipping warnings blame since pipelines do not have an SCM link.%n
[TASKS] Computing warning deltas based on reference build #18
[Pipeline] // withMaven
[Pipeline] }
[Pipeline] // stage
[Pipeline] stage
[Pipeline] { (Reporting)
[Pipeline] emailextrecipients
Not sending mail to user cla.gms@gmail.com with no permission to view HybridCosimulation » development #36[Pipeline] emailext
An attempt to send an e-mail to empty list of recipients, ignored.
[Pipeline] }
[Pipeline] // stage
[Pipeline] }
[Pipeline] // node
[Pipeline] End of Pipeline
ERROR: script returned exit code 1
Finished: FAILURE