FailedConsole Output

Started by GitHub push by lausdahl
Building remotely on jenkinscrosscompiler (Xcompile) in workspace /home/jenkins/builds/workspace/into-cps-public-coe-test-fmus
 > /usr/bin/git rev-parse --is-inside-work-tree # timeout=10
Fetching changes from the remote Git repository
 > /usr/bin/git config remote.origin.url https://github.com/into-cps/public-coe-test-fmus.git # timeout=10
Fetching upstream changes from https://github.com/into-cps/public-coe-test-fmus.git
 > /usr/bin/git --version # timeout=10
 > /usr/bin/git -c core.askpass=true fetch --tags --progress https://github.com/into-cps/public-coe-test-fmus.git +refs/heads/development:refs/remotes/origin/development
 > /usr/bin/git rev-parse refs/remotes/origin/development^{commit} # timeout=10
 > /usr/bin/git rev-parse refs/remotes/origin/refs/heads/development^{commit} # timeout=10
Checking out Revision 8fbcf65bbf5d99a689ff81c71c560e492b8d889b (refs/remotes/origin/development)
 > /usr/bin/git config core.sparsecheckout # timeout=10
 > /usr/bin/git checkout -f 8fbcf65bbf5d99a689ff81c71c560e492b8d889b
 > /usr/bin/git rev-list 50e11398850c71f4ff3487a1a54c4653083ed063 # timeout=10
[into-cps-public-coe-test-fmus] $ /bin/sh -xe /tmp/hudson2330077771232834504.sh
+ pwd
/home/jenkins/builds/workspace/into-cps-public-coe-test-fmus
+ git submodule update --init
+ ./xcompile.sh
Folder is ./cascading-watertank1-20sim
Cleadning old builds ...
Compiling using CMake and make
Building Darwin 64 .dylib
-- Compiler..
-- Compiler..GNUGNU
-- Checking whether C compiler has -isysroot
-- Checking whether C compiler has -isysroot - yes
-- Checking whether C compiler supports OSX deployment target flag
-- Checking whether C compiler supports OSX deployment target flag - yes
-- Checking whether CXX compiler has -isysroot
-- Checking whether CXX compiler has -isysroot - no
-- Checking whether CXX compiler supports OSX deployment target flag
-- Checking whether CXX compiler supports OSX deployment target flag - no
-- Performing Test COMPILER_SUPPORTS_CXX11
-- Performing Test COMPILER_SUPPORTS_CXX11 - Success
-- Performing Test COMPILER_SUPPORTS_CXX0X
-- Performing Test COMPILER_SUPPORTS_CXX0X - Success
-- Static linking with libstdc++.a in 
-- Configuring done
-- Generating done
-- Build files have been written to: /home/jenkins/builds/workspace/into-cps-public-coe-test-fmus/cascading-watertank1-20sim/build/darwin64
make: Entering directory `/home/jenkins/builds/workspace/into-cps-public-coe-test-fmus/cascading-watertank1-20sim/build/darwin64'
/usr/bin/cmake -H/home/jenkins/builds/workspace/into-cps-public-coe-test-fmus/cascading-watertank1-20sim -B/home/jenkins/builds/workspace/into-cps-public-coe-test-fmus/cascading-watertank1-20sim/build/darwin64 --check-build-system CMakeFiles/Makefile.cmake 0
/usr/bin/cmake -E cmake_progress_start /home/jenkins/builds/workspace/into-cps-public-coe-test-fmus/cascading-watertank1-20sim/build/darwin64/CMakeFiles /home/jenkins/builds/workspace/into-cps-public-coe-test-fmus/cascading-watertank1-20sim/build/darwin64/CMakeFiles/progress.marks
make -f CMakeFiles/Makefile2 all
make[1]: Entering directory `/home/jenkins/builds/workspace/into-cps-public-coe-test-fmus/cascading-watertank1-20sim/build/darwin64'
make -f CMakeFiles/cascading-watertank1-20sim.dir/build.make CMakeFiles/cascading-watertank1-20sim.dir/depend
make[2]: Entering directory `/home/jenkins/builds/workspace/into-cps-public-coe-test-fmus/cascading-watertank1-20sim/build/darwin64'
cd /home/jenkins/builds/workspace/into-cps-public-coe-test-fmus/cascading-watertank1-20sim/build/darwin64 && /usr/bin/cmake -E cmake_depends "Unix Makefiles" /home/jenkins/builds/workspace/into-cps-public-coe-test-fmus/cascading-watertank1-20sim /home/jenkins/builds/workspace/into-cps-public-coe-test-fmus/cascading-watertank1-20sim /home/jenkins/builds/workspace/into-cps-public-coe-test-fmus/cascading-watertank1-20sim/build/darwin64 /home/jenkins/builds/workspace/into-cps-public-coe-test-fmus/cascading-watertank1-20sim/build/darwin64 /home/jenkins/builds/workspace/into-cps-public-coe-test-fmus/cascading-watertank1-20sim/build/darwin64/CMakeFiles/cascading-watertank1-20sim.dir/DependInfo.cmake --color=
Scanning dependencies of target cascading-watertank1-20sim
make[2]: Leaving directory `/home/jenkins/builds/workspace/into-cps-public-coe-test-fmus/cascading-watertank1-20sim/build/darwin64'
make -f CMakeFiles/cascading-watertank1-20sim.dir/build.make CMakeFiles/cascading-watertank1-20sim.dir/build
make[2]: Entering directory `/home/jenkins/builds/workspace/into-cps-public-coe-test-fmus/cascading-watertank1-20sim/build/darwin64'
/usr/bin/cmake -E cmake_progress_report /home/jenkins/builds/workspace/into-cps-public-coe-test-fmus/cascading-watertank1-20sim/build/darwin64/CMakeFiles 1
[ 11%] Building C object CMakeFiles/cascading-watertank1-20sim.dir/sources/fmi2Functions.c.o
/var/lib/osxcross/target/bin/x86_64-apple-darwin15-gcc  -Dcascading_watertank1_20sim_EXPORTS -fmessage-length=0 -std=c11 -isysroot /var/lib/osxcross/target/SDK/MacOSX10.11.sdk -I/home/jenkins/builds/workspace/into-cps-public-coe-test-fmus/cascading-watertank1-20sim/build/darwin64 -I/home/jenkins/builds/workspace/into-cps-public-coe-test-fmus/cascading-watertank1-20sim -I/home/jenkins/builds/workspace/into-cps-public-coe-test-fmus/cascading-watertank1-20sim/sources -I/home/jenkins/builds/workspace/into-cps-public-coe-test-fmus/cascading-watertank1-20sim/../includes/fmi -I/home/jenkins/builds/workspace/into-cps-public-coe-test-fmus/cascading-watertank1-20sim/../includes/templates    -o CMakeFiles/cascading-watertank1-20sim.dir/sources/fmi2Functions.c.o   -c /home/jenkins/builds/workspace/into-cps-public-coe-test-fmus/cascading-watertank1-20sim/sources/fmi2Functions.c
In file included from /home/jenkins/builds/workspace/into-cps-public-coe-test-fmus/cascading-watertank1-20sim/sources/fmi2Functions.c:20:0:
/home/jenkins/builds/workspace/into-cps-public-coe-test-fmus/cascading-watertank1-20sim/sources/fmi2Functions.c: In function 'fmi2Instantiate':
/home/jenkins/builds/workspace/into-cps-public-coe-test-fmus/cascading-watertank1-20sim/sources/fmiGUID.h:1:18: error: 'MODEL_GUID' undeclared (first use in this function)
 #define FMI_GUID MODEL_GUID
                  ^
/home/jenkins/builds/workspace/into-cps-public-coe-test-fmus/cascading-watertank1-20sim/sources/fmi2Functions.c:182:23: note: in expansion of macro 'FMI_GUID'
  if( strncmp(fmuGUID, FMI_GUID, strlen(fmuGUID)) != 0 )
                       ^
/home/jenkins/builds/workspace/into-cps-public-coe-test-fmus/cascading-watertank1-20sim/sources/fmiGUID.h:1:18: note: each undeclared identifier is reported only once for each function it appears in
 #define FMI_GUID MODEL_GUID
                  ^
/home/jenkins/builds/workspace/into-cps-public-coe-test-fmus/cascading-watertank1-20sim/sources/fmi2Functions.c:182:23: note: in expansion of macro 'FMI_GUID'
  if( strncmp(fmuGUID, FMI_GUID, strlen(fmuGUID)) != 0 )
                       ^
make[2]: *** [CMakeFiles/cascading-watertank1-20sim.dir/sources/fmi2Functions.c.o] Error 1
make[2]: Leaving directory `/home/jenkins/builds/workspace/into-cps-public-coe-test-fmus/cascading-watertank1-20sim/build/darwin64'
make[1]: *** [CMakeFiles/cascading-watertank1-20sim.dir/all] Error 2
make[1]: Leaving directory `/home/jenkins/builds/workspace/into-cps-public-coe-test-fmus/cascading-watertank1-20sim/build/darwin64'
make: *** [all] Error 2
make: Leaving directory `/home/jenkins/builds/workspace/into-cps-public-coe-test-fmus/cascading-watertank1-20sim/build/darwin64'
Build step 'Execute shell' marked build as failure
SSH: Current build result is [FAILURE], not going to run.
Started calculate disk usage of build
Finished Calculation of disk usage of build in 0 seconds
Started calculate disk usage of workspace
Finished Calculation of disk usage of workspace in 0 seconds
Finished: FAILURE