FailedConsole Output

Started by GitHub push by lausdahl
Building remotely on jenkinscrosscompiler (Xcompile) in workspace /home/jenkins/builds/workspace/into-cps-public-coe-test-fmus
 > /usr/bin/git rev-parse --is-inside-work-tree # timeout=10
Fetching changes from the remote Git repository
 > /usr/bin/git config remote.origin.url https://github.com/into-cps/public-coe-test-fmus.git # timeout=10
Fetching upstream changes from https://github.com/into-cps/public-coe-test-fmus.git
 > /usr/bin/git --version # timeout=10
 > /usr/bin/git -c core.askpass=true fetch --tags --progress https://github.com/into-cps/public-coe-test-fmus.git +refs/heads/development:refs/remotes/origin/development
 > /usr/bin/git rev-parse refs/remotes/origin/development^{commit} # timeout=10
 > /usr/bin/git rev-parse refs/remotes/origin/refs/heads/development^{commit} # timeout=10
Checking out Revision fdb900006056844a336276d066a10e6fadc885cb (refs/remotes/origin/development)
 > /usr/bin/git config core.sparsecheckout # timeout=10
 > /usr/bin/git checkout -f fdb900006056844a336276d066a10e6fadc885cb
 > /usr/bin/git rev-list 75fdc9abfe770eabfd4201766060a088ed9349f5 # timeout=10
[into-cps-public-coe-test-fmus] $ /bin/sh -xe /tmp/hudson2433808196575179292.sh
+ pwd
/home/jenkins/builds/workspace/into-cps-public-coe-test-fmus
+ git submodule update --init
+ ./xcompile.sh
Folder is ./cascading-watertank1-20sim
Cleadning old builds ...
Compiling using CMake and make
Building Darwin 64 .dylib
-- Compiler..
-- Compiler..GNUGNU
-- Checking whether C compiler has -isysroot
-- Checking whether C compiler has -isysroot - yes
-- Checking whether C compiler supports OSX deployment target flag
-- Checking whether C compiler supports OSX deployment target flag - yes
-- Checking whether CXX compiler has -isysroot
-- Checking whether CXX compiler has -isysroot - no
-- Checking whether CXX compiler supports OSX deployment target flag
-- Checking whether CXX compiler supports OSX deployment target flag - no
-- Performing Test COMPILER_SUPPORTS_CXX11
-- Performing Test COMPILER_SUPPORTS_CXX11 - Success
-- Performing Test COMPILER_SUPPORTS_CXX0X
-- Performing Test COMPILER_SUPPORTS_CXX0X - Success
-- Static linking with libstdc++.a in 
-- Configuring done
-- Generating done
-- Build files have been written to: /home/jenkins/builds/workspace/into-cps-public-coe-test-fmus/cascading-watertank1-20sim/build/darwin64
make: Entering directory `/home/jenkins/builds/workspace/into-cps-public-coe-test-fmus/cascading-watertank1-20sim/build/darwin64'
/usr/bin/cmake -H/home/jenkins/builds/workspace/into-cps-public-coe-test-fmus/cascading-watertank1-20sim -B/home/jenkins/builds/workspace/into-cps-public-coe-test-fmus/cascading-watertank1-20sim/build/darwin64 --check-build-system CMakeFiles/Makefile.cmake 0
/usr/bin/cmake -E cmake_progress_start /home/jenkins/builds/workspace/into-cps-public-coe-test-fmus/cascading-watertank1-20sim/build/darwin64/CMakeFiles /home/jenkins/builds/workspace/into-cps-public-coe-test-fmus/cascading-watertank1-20sim/build/darwin64/CMakeFiles/progress.marks
make -f CMakeFiles/Makefile2 all
make[1]: Entering directory `/home/jenkins/builds/workspace/into-cps-public-coe-test-fmus/cascading-watertank1-20sim/build/darwin64'
make -f CMakeFiles/cascading-watertank1-20sim.dir/build.make CMakeFiles/cascading-watertank1-20sim.dir/depend
make[2]: Entering directory `/home/jenkins/builds/workspace/into-cps-public-coe-test-fmus/cascading-watertank1-20sim/build/darwin64'
cd /home/jenkins/builds/workspace/into-cps-public-coe-test-fmus/cascading-watertank1-20sim/build/darwin64 && /usr/bin/cmake -E cmake_depends "Unix Makefiles" /home/jenkins/builds/workspace/into-cps-public-coe-test-fmus/cascading-watertank1-20sim /home/jenkins/builds/workspace/into-cps-public-coe-test-fmus/cascading-watertank1-20sim /home/jenkins/builds/workspace/into-cps-public-coe-test-fmus/cascading-watertank1-20sim/build/darwin64 /home/jenkins/builds/workspace/into-cps-public-coe-test-fmus/cascading-watertank1-20sim/build/darwin64 /home/jenkins/builds/workspace/into-cps-public-coe-test-fmus/cascading-watertank1-20sim/build/darwin64/CMakeFiles/cascading-watertank1-20sim.dir/DependInfo.cmake --color=
Scanning dependencies of target cascading-watertank1-20sim
make[2]: Leaving directory `/home/jenkins/builds/workspace/into-cps-public-coe-test-fmus/cascading-watertank1-20sim/build/darwin64'
make -f CMakeFiles/cascading-watertank1-20sim.dir/build.make CMakeFiles/cascading-watertank1-20sim.dir/build
make[2]: Entering directory `/home/jenkins/builds/workspace/into-cps-public-coe-test-fmus/cascading-watertank1-20sim/build/darwin64'
/usr/bin/cmake -E cmake_progress_report /home/jenkins/builds/workspace/into-cps-public-coe-test-fmus/cascading-watertank1-20sim/build/darwin64/CMakeFiles 1
/usr/bin/cmake -E cmake_progress_report /home/jenkins/builds/workspace/into-cps-public-coe-test-fmus/cascading-watertank1-20sim/build/darwin64/CMakeFiles 2
/usr/bin/cmake -E cmake_progress_report /home/jenkins/builds/workspace/into-cps-public-coe-test-fmus/cascading-watertank1-20sim/build/darwin64/CMakeFiles 3
/usr/bin/cmake -E cmake_progress_report /home/jenkins/builds/workspace/into-cps-public-coe-test-fmus/cascading-watertank1-20sim/build/darwin64/CMakeFiles 4
[ 11%] Building C object CMakeFiles/cascading-watertank1-20sim.dir/sources/xxmodel.c.o
/var/lib/osxcross/target/bin/x86_64-apple-darwin15-gcc  -Dcascading_watertank1_20sim_EXPORTS -fmessage-length=0 -std=c11 -isysroot /var/lib/osxcross/target/SDK/MacOSX10.11.sdk -I/home/jenkins/builds/workspace/into-cps-public-coe-test-fmus/cascading-watertank1-20sim/build/darwin64 -I/home/jenkins/builds/workspace/into-cps-public-coe-test-fmus/cascading-watertank1-20sim -I/home/jenkins/builds/workspace/into-cps-public-coe-test-fmus/cascading-watertank1-20sim/sources -I/home/jenkins/builds/workspace/into-cps-public-coe-test-fmus/cascading-watertank1-20sim/../includes/fmi -I/home/jenkins/builds/workspace/into-cps-public-coe-test-fmus/cascading-watertank1-20sim/../includes/templates    -o CMakeFiles/cascading-watertank1-20sim.dir/sources/xxmodel.c.o   -c /home/jenkins/builds/workspace/into-cps-public-coe-test-fmus/cascading-watertank1-20sim/sources/xxmodel.c
[ 33%] [ 22%] [ 44%] Building C object CMakeFiles/cascading-watertank1-20sim.dir/sources/xxfuncs.c.o
/var/lib/osxcross/target/bin/x86_64-apple-darwin15-gcc  -Dcascading_watertank1_20sim_EXPORTS -fmessage-length=0 -std=c11 -isysroot /var/lib/osxcross/target/SDK/MacOSX10.11.sdk -I/home/jenkins/builds/workspace/into-cps-public-coe-test-fmus/cascading-watertank1-20sim/build/darwin64 -I/home/jenkins/builds/workspace/into-cps-public-coe-test-fmus/cascading-watertank1-20sim -I/home/jenkins/builds/workspace/into-cps-public-coe-test-fmus/cascading-watertank1-20sim/sources -I/home/jenkins/builds/workspace/into-cps-public-coe-test-fmus/cascading-watertank1-20sim/../includes/fmi -I/home/jenkins/builds/workspace/into-cps-public-coe-test-fmus/cascading-watertank1-20sim/../includes/templates    -o CMakeFiles/cascading-watertank1-20sim.dir/sources/xxfuncs.c.o   -c /home/jenkins/builds/workspace/into-cps-public-coe-test-fmus/cascading-watertank1-20sim/sources/xxfuncs.c
Building C object CMakeFiles/cascading-watertank1-20sim.dir/sources/fmi2Functions.c.o
/var/lib/osxcross/target/bin/x86_64-apple-darwin15-gcc  -Dcascading_watertank1_20sim_EXPORTS -fmessage-length=0 -std=c11 -isysroot /var/lib/osxcross/target/SDK/MacOSX10.11.sdk -I/home/jenkins/builds/workspace/into-cps-public-coe-test-fmus/cascading-watertank1-20sim/build/darwin64 -I/home/jenkins/builds/workspace/into-cps-public-coe-test-fmus/cascading-watertank1-20sim -I/home/jenkins/builds/workspace/into-cps-public-coe-test-fmus/cascading-watertank1-20sim/sources -I/home/jenkins/builds/workspace/into-cps-public-coe-test-fmus/cascading-watertank1-20sim/../includes/fmi -I/home/jenkins/builds/workspace/into-cps-public-coe-test-fmus/cascading-watertank1-20sim/../includes/templates    -o CMakeFiles/cascading-watertank1-20sim.dir/sources/fmi2Functions.c.o   -c /home/jenkins/builds/workspace/into-cps-public-coe-test-fmus/cascading-watertank1-20sim/sources/fmi2Functions.c
Building C object CMakeFiles/cascading-watertank1-20sim.dir/sources/xxinteg.c.o
/var/lib/osxcross/target/bin/x86_64-apple-darwin15-gcc  -Dcascading_watertank1_20sim_EXPORTS -fmessage-length=0 -std=c11 -isysroot /var/lib/osxcross/target/SDK/MacOSX10.11.sdk -I/home/jenkins/builds/workspace/into-cps-public-coe-test-fmus/cascading-watertank1-20sim/build/darwin64 -I/home/jenkins/builds/workspace/into-cps-public-coe-test-fmus/cascading-watertank1-20sim -I/home/jenkins/builds/workspace/into-cps-public-coe-test-fmus/cascading-watertank1-20sim/sources -I/home/jenkins/builds/workspace/into-cps-public-coe-test-fmus/cascading-watertank1-20sim/../includes/fmi -I/home/jenkins/builds/workspace/into-cps-public-coe-test-fmus/cascading-watertank1-20sim/../includes/templates    -o CMakeFiles/cascading-watertank1-20sim.dir/sources/xxinteg.c.o   -c /home/jenkins/builds/workspace/into-cps-public-coe-test-fmus/cascading-watertank1-20sim/sources/xxinteg.c
/usr/bin/cmake -E cmake_progress_report /home/jenkins/builds/workspace/into-cps-public-coe-test-fmus/cascading-watertank1-20sim/build/darwin64/CMakeFiles 5
/usr/bin/cmake -E cmake_progress_report /home/jenkins/builds/workspace/into-cps-public-coe-test-fmus/cascading-watertank1-20sim/build/darwin64/CMakeFiles 6
[ 55%] [ 66%] Building C object CMakeFiles/cascading-watertank1-20sim.dir/sources/xxinverse.c.o
/var/lib/osxcross/target/bin/x86_64-apple-darwin15-gcc  -Dcascading_watertank1_20sim_EXPORTS -fmessage-length=0 -std=c11 -isysroot /var/lib/osxcross/target/SDK/MacOSX10.11.sdk -I/home/jenkins/builds/workspace/into-cps-public-coe-test-fmus/cascading-watertank1-20sim/build/darwin64 -I/home/jenkins/builds/workspace/into-cps-public-coe-test-fmus/cascading-watertank1-20sim -I/home/jenkins/builds/workspace/into-cps-public-coe-test-fmus/cascading-watertank1-20sim/sources -I/home/jenkins/builds/workspace/into-cps-public-coe-test-fmus/cascading-watertank1-20sim/../includes/fmi -I/home/jenkins/builds/workspace/into-cps-public-coe-test-fmus/cascading-watertank1-20sim/../includes/templates    -o CMakeFiles/cascading-watertank1-20sim.dir/sources/xxinverse.c.o   -c /home/jenkins/builds/workspace/into-cps-public-coe-test-fmus/cascading-watertank1-20sim/sources/xxinverse.c
/usr/bin/cmake -E cmake_progress_report /home/jenkins/builds/workspace/into-cps-public-coe-test-fmus/cascading-watertank1-20sim/build/darwin64/CMakeFiles 7
/usr/bin/cmake -E cmake_progress_report /home/jenkins/builds/workspace/into-cps-public-coe-test-fmus/cascading-watertank1-20sim/build/darwin64/CMakeFiles 8
[ 77%] Building C object CMakeFiles/cascading-watertank1-20sim.dir/sources/xxmatrix.c.o
[ 88%] /var/lib/osxcross/target/bin/x86_64-apple-darwin15-gcc  -Dcascading_watertank1_20sim_EXPORTS -fmessage-length=0 -std=c11 -isysroot /var/lib/osxcross/target/SDK/MacOSX10.11.sdk -I/home/jenkins/builds/workspace/into-cps-public-coe-test-fmus/cascading-watertank1-20sim/build/darwin64 -I/home/jenkins/builds/workspace/into-cps-public-coe-test-fmus/cascading-watertank1-20sim -I/home/jenkins/builds/workspace/into-cps-public-coe-test-fmus/cascading-watertank1-20sim/sources -I/home/jenkins/builds/workspace/into-cps-public-coe-test-fmus/cascading-watertank1-20sim/../includes/fmi -I/home/jenkins/builds/workspace/into-cps-public-coe-test-fmus/cascading-watertank1-20sim/../includes/templates    -o CMakeFiles/cascading-watertank1-20sim.dir/sources/xxmatrix.c.o   -c /home/jenkins/builds/workspace/into-cps-public-coe-test-fmus/cascading-watertank1-20sim/sources/xxmatrix.c
/usr/bin/cmake -E cmake_progress_report /home/jenkins/builds/workspace/into-cps-public-coe-test-fmus/cascading-watertank1-20sim/build/darwin64/CMakeFiles 9
Building C object CMakeFiles/cascading-watertank1-20sim.dir/sources/motionprofiles.c.o
/var/lib/osxcross/target/bin/x86_64-apple-darwin15-gcc  -Dcascading_watertank1_20sim_EXPORTS -fmessage-length=0 -std=c11 -isysroot /var/lib/osxcross/target/SDK/MacOSX10.11.sdk -I/home/jenkins/builds/workspace/into-cps-public-coe-test-fmus/cascading-watertank1-20sim/build/darwin64 -I/home/jenkins/builds/workspace/into-cps-public-coe-test-fmus/cascading-watertank1-20sim -I/home/jenkins/builds/workspace/into-cps-public-coe-test-fmus/cascading-watertank1-20sim/sources -I/home/jenkins/builds/workspace/into-cps-public-coe-test-fmus/cascading-watertank1-20sim/../includes/fmi -I/home/jenkins/builds/workspace/into-cps-public-coe-test-fmus/cascading-watertank1-20sim/../includes/templates    -o CMakeFiles/cascading-watertank1-20sim.dir/sources/motionprofiles.c.o   -c /home/jenkins/builds/workspace/into-cps-public-coe-test-fmus/cascading-watertank1-20sim/sources/motionprofiles.c
[100%] Building C object CMakeFiles/cascading-watertank1-20sim.dir/sources/EulerAngles.c.o
/var/lib/osxcross/target/bin/x86_64-apple-darwin15-gcc  -Dcascading_watertank1_20sim_EXPORTS -fmessage-length=0 -std=c11 -isysroot /var/lib/osxcross/target/SDK/MacOSX10.11.sdk -I/home/jenkins/builds/workspace/into-cps-public-coe-test-fmus/cascading-watertank1-20sim/build/darwin64 -I/home/jenkins/builds/workspace/into-cps-public-coe-test-fmus/cascading-watertank1-20sim -I/home/jenkins/builds/workspace/into-cps-public-coe-test-fmus/cascading-watertank1-20sim/sources -I/home/jenkins/builds/workspace/into-cps-public-coe-test-fmus/cascading-watertank1-20sim/../includes/fmi -I/home/jenkins/builds/workspace/into-cps-public-coe-test-fmus/cascading-watertank1-20sim/../includes/templates    -o CMakeFiles/cascading-watertank1-20sim.dir/sources/EulerAngles.c.o   -c /home/jenkins/builds/workspace/into-cps-public-coe-test-fmus/cascading-watertank1-20sim/sources/EulerAngles.c
Building C object CMakeFiles/cascading-watertank1-20sim.dir/sources/xxsubmod.c.o
/var/lib/osxcross/target/bin/x86_64-apple-darwin15-gcc  -Dcascading_watertank1_20sim_EXPORTS -fmessage-length=0 -std=c11 -isysroot /var/lib/osxcross/target/SDK/MacOSX10.11.sdk -I/home/jenkins/builds/workspace/into-cps-public-coe-test-fmus/cascading-watertank1-20sim/build/darwin64 -I/home/jenkins/builds/workspace/into-cps-public-coe-test-fmus/cascading-watertank1-20sim -I/home/jenkins/builds/workspace/into-cps-public-coe-test-fmus/cascading-watertank1-20sim/sources -I/home/jenkins/builds/workspace/into-cps-public-coe-test-fmus/cascading-watertank1-20sim/../includes/fmi -I/home/jenkins/builds/workspace/into-cps-public-coe-test-fmus/cascading-watertank1-20sim/../includes/templates    -o CMakeFiles/cascading-watertank1-20sim.dir/sources/xxsubmod.c.o   -c /home/jenkins/builds/workspace/into-cps-public-coe-test-fmus/cascading-watertank1-20sim/sources/xxsubmod.c
Linking C shared library cascading-watertank1-20sim.dylib
/usr/bin/cmake -E cmake_link_script CMakeFiles/cascading-watertank1-20sim.dir/link.txt --verbose=1
/var/lib/osxcross/target/bin/x86_64-apple-darwin15-gcc   -fmessage-length=0 -std=c11 -isysroot /var/lib/osxcross/target/SDK/MacOSX10.11.sdk -dynamiclib -Wl,-headerpad_max_install_names  -o cascading-watertank1-20sim.dylib -install_name /home/jenkins/builds/workspace/into-cps-public-coe-test-fmus/cascading-watertank1-20sim/build/darwin64/cascading-watertank1-20sim.dylib CMakeFiles/cascading-watertank1-20sim.dir/sources/fmi2Functions.c.o CMakeFiles/cascading-watertank1-20sim.dir/sources/xxfuncs.c.o CMakeFiles/cascading-watertank1-20sim.dir/sources/xxmodel.c.o CMakeFiles/cascading-watertank1-20sim.dir/sources/xxinteg.c.o CMakeFiles/cascading-watertank1-20sim.dir/sources/xxinverse.c.o CMakeFiles/cascading-watertank1-20sim.dir/sources/xxmatrix.c.o CMakeFiles/cascading-watertank1-20sim.dir/sources/motionprofiles.c.o CMakeFiles/cascading-watertank1-20sim.dir/sources/EulerAngles.c.o CMakeFiles/cascading-watertank1-20sim.dir/sources/xxsubmod.c.o -lpthread 
make[2]: Leaving directory `/home/jenkins/builds/workspace/into-cps-public-coe-test-fmus/cascading-watertank1-20sim/build/darwin64'
/usr/bin/cmake -E cmake_progress_report /home/jenkins/builds/workspace/into-cps-public-coe-test-fmus/cascading-watertank1-20sim/build/darwin64/CMakeFiles  1 2 3 4 5 6 7 8 9
[100%] Built target cascading-watertank1-20sim
make[1]: Leaving directory `/home/jenkins/builds/workspace/into-cps-public-coe-test-fmus/cascading-watertank1-20sim/build/darwin64'
/usr/bin/cmake -E cmake_progress_start /home/jenkins/builds/workspace/into-cps-public-coe-test-fmus/cascading-watertank1-20sim/build/darwin64/CMakeFiles 0
make: Leaving directory `/home/jenkins/builds/workspace/into-cps-public-coe-test-fmus/cascading-watertank1-20sim/build/darwin64'
Building Linux x64 .so
-- The C compiler identification is GNU 4.8.4
-- The CXX compiler identification is GNU 4.8.4
-- Check for working C compiler: /usr/bin/cc
-- Check for working C compiler: /usr/bin/cc -- works
-- Detecting C compiler ABI info
-- Detecting C compiler ABI info - done
-- Detecting C compile features
-- Detecting C compile features - done
-- Check for working CXX compiler: /usr/bin/c++
-- Check for working CXX compiler: /usr/bin/c++ -- works
-- Detecting CXX compiler ABI info
-- Detecting CXX compiler ABI info - done
-- Detecting CXX compile features
-- Detecting CXX compile features - done
-- Performing Test COMPILER_SUPPORTS_CXX11
-- Performing Test COMPILER_SUPPORTS_CXX11 - Success
-- Performing Test COMPILER_SUPPORTS_CXX0X
-- Performing Test COMPILER_SUPPORTS_CXX0X - Success
-- Static linking with libstdc++.a in /usr/lib/gcc/x86_64-linux-gnu/4.8/libstdc++.a
-- Configuring done
-- Generating done
-- Build files have been written to: /home/jenkins/builds/workspace/into-cps-public-coe-test-fmus/cascading-watertank1-20sim/build/linux64
make: Entering directory `/home/jenkins/builds/workspace/into-cps-public-coe-test-fmus/cascading-watertank1-20sim/build/linux64'
/usr/bin/cmake -H/home/jenkins/builds/workspace/into-cps-public-coe-test-fmus/cascading-watertank1-20sim -B/home/jenkins/builds/workspace/into-cps-public-coe-test-fmus/cascading-watertank1-20sim/build/linux64 --check-build-system CMakeFiles/Makefile.cmake 0
/usr/bin/cmake -E cmake_progress_start /home/jenkins/builds/workspace/into-cps-public-coe-test-fmus/cascading-watertank1-20sim/build/linux64/CMakeFiles /home/jenkins/builds/workspace/into-cps-public-coe-test-fmus/cascading-watertank1-20sim/build/linux64/CMakeFiles/progress.marks
make -f CMakeFiles/Makefile2 all
make[1]: Entering directory `/home/jenkins/builds/workspace/into-cps-public-coe-test-fmus/cascading-watertank1-20sim/build/linux64'
make -f CMakeFiles/cascading-watertank1-20sim.dir/build.make CMakeFiles/cascading-watertank1-20sim.dir/depend
make[2]: Entering directory `/home/jenkins/builds/workspace/into-cps-public-coe-test-fmus/cascading-watertank1-20sim/build/linux64'
cd /home/jenkins/builds/workspace/into-cps-public-coe-test-fmus/cascading-watertank1-20sim/build/linux64 && /usr/bin/cmake -E cmake_depends "Unix Makefiles" /home/jenkins/builds/workspace/into-cps-public-coe-test-fmus/cascading-watertank1-20sim /home/jenkins/builds/workspace/into-cps-public-coe-test-fmus/cascading-watertank1-20sim /home/jenkins/builds/workspace/into-cps-public-coe-test-fmus/cascading-watertank1-20sim/build/linux64 /home/jenkins/builds/workspace/into-cps-public-coe-test-fmus/cascading-watertank1-20sim/build/linux64 /home/jenkins/builds/workspace/into-cps-public-coe-test-fmus/cascading-watertank1-20sim/build/linux64/CMakeFiles/cascading-watertank1-20sim.dir/DependInfo.cmake --color=
Scanning dependencies of target cascading-watertank1-20sim
make[2]: Leaving directory `/home/jenkins/builds/workspace/into-cps-public-coe-test-fmus/cascading-watertank1-20sim/build/linux64'
make -f CMakeFiles/cascading-watertank1-20sim.dir/build.make CMakeFiles/cascading-watertank1-20sim.dir/build
make[2]: Entering directory `/home/jenkins/builds/workspace/into-cps-public-coe-test-fmus/cascading-watertank1-20sim/build/linux64'
/usr/bin/cmake -E cmake_progress_report /home/jenkins/builds/workspace/into-cps-public-coe-test-fmus/cascading-watertank1-20sim/build/linux64/CMakeFiles 1
/usr/bin/cmake -E cmake_progress_report /home/jenkins/builds/workspace/into-cps-public-coe-test-fmus/cascading-watertank1-20sim/build/linux64/CMakeFiles 2
/usr/bin/cmake -E cmake_progress_report /home/jenkins/builds/workspace/into-cps-public-coe-test-fmus/cascading-watertank1-20sim/build/linux64/CMakeFiles 3
[ 11%] [ 22%] /usr/bin/cmake -E cmake_progress_report /home/jenkins/builds/workspace/into-cps-public-coe-test-fmus/cascading-watertank1-20sim/build/linux64/CMakeFiles 4
[ 33%] [ 44%] Building C object CMakeFiles/cascading-watertank1-20sim.dir/sources/fmi2Functions.c.o
/usr/bin/cc  -Dcascading_watertank1_20sim_EXPORTS -fmessage-length=0 -std=c11 -fPIC -I/home/jenkins/builds/workspace/into-cps-public-coe-test-fmus/cascading-watertank1-20sim/build/linux64 -I/home/jenkins/builds/workspace/into-cps-public-coe-test-fmus/cascading-watertank1-20sim -I/home/jenkins/builds/workspace/into-cps-public-coe-test-fmus/cascading-watertank1-20sim/sources -I/home/jenkins/builds/workspace/into-cps-public-coe-test-fmus/cascading-watertank1-20sim/../includes/fmi -I/home/jenkins/builds/workspace/into-cps-public-coe-test-fmus/cascading-watertank1-20sim/../includes/templates    -o CMakeFiles/cascading-watertank1-20sim.dir/sources/fmi2Functions.c.o   -c /home/jenkins/builds/workspace/into-cps-public-coe-test-fmus/cascading-watertank1-20sim/sources/fmi2Functions.c
Building C object CMakeFiles/cascading-watertank1-20sim.dir/sources/xxfuncs.c.o
/usr/bin/cc  -Dcascading_watertank1_20sim_EXPORTS -fmessage-length=0 -std=c11 -fPIC -I/home/jenkins/builds/workspace/into-cps-public-coe-test-fmus/cascading-watertank1-20sim/build/linux64 -I/home/jenkins/builds/workspace/into-cps-public-coe-test-fmus/cascading-watertank1-20sim -I/home/jenkins/builds/workspace/into-cps-public-coe-test-fmus/cascading-watertank1-20sim/sources -I/home/jenkins/builds/workspace/into-cps-public-coe-test-fmus/cascading-watertank1-20sim/../includes/fmi -I/home/jenkins/builds/workspace/into-cps-public-coe-test-fmus/cascading-watertank1-20sim/../includes/templates    -o CMakeFiles/cascading-watertank1-20sim.dir/sources/xxfuncs.c.o   -c /home/jenkins/builds/workspace/into-cps-public-coe-test-fmus/cascading-watertank1-20sim/sources/xxfuncs.c
Building C object CMakeFiles/cascading-watertank1-20sim.dir/sources/xxmodel.c.o
/usr/bin/cc  -Dcascading_watertank1_20sim_EXPORTS -fmessage-length=0 -std=c11 -fPIC -I/home/jenkins/builds/workspace/into-cps-public-coe-test-fmus/cascading-watertank1-20sim/build/linux64 -I/home/jenkins/builds/workspace/into-cps-public-coe-test-fmus/cascading-watertank1-20sim -I/home/jenkins/builds/workspace/into-cps-public-coe-test-fmus/cascading-watertank1-20sim/sources -I/home/jenkins/builds/workspace/into-cps-public-coe-test-fmus/cascading-watertank1-20sim/../includes/fmi -I/home/jenkins/builds/workspace/into-cps-public-coe-test-fmus/cascading-watertank1-20sim/../includes/templates    -o CMakeFiles/cascading-watertank1-20sim.dir/sources/xxmodel.c.o   -c /home/jenkins/builds/workspace/into-cps-public-coe-test-fmus/cascading-watertank1-20sim/sources/xxmodel.c
Building C object CMakeFiles/cascading-watertank1-20sim.dir/sources/xxinteg.c.o
/usr/bin/cc  -Dcascading_watertank1_20sim_EXPORTS -fmessage-length=0 -std=c11 -fPIC -I/home/jenkins/builds/workspace/into-cps-public-coe-test-fmus/cascading-watertank1-20sim/build/linux64 -I/home/jenkins/builds/workspace/into-cps-public-coe-test-fmus/cascading-watertank1-20sim -I/home/jenkins/builds/workspace/into-cps-public-coe-test-fmus/cascading-watertank1-20sim/sources -I/home/jenkins/builds/workspace/into-cps-public-coe-test-fmus/cascading-watertank1-20sim/../includes/fmi -I/home/jenkins/builds/workspace/into-cps-public-coe-test-fmus/cascading-watertank1-20sim/../includes/templates    -o CMakeFiles/cascading-watertank1-20sim.dir/sources/xxinteg.c.o   -c /home/jenkins/builds/workspace/into-cps-public-coe-test-fmus/cascading-watertank1-20sim/sources/xxinteg.c
/usr/bin/cmake -E cmake_progress_report /home/jenkins/builds/workspace/into-cps-public-coe-test-fmus/cascading-watertank1-20sim/build/linux64/CMakeFiles 5
[ 55%] /usr/bin/cmake -E cmake_progress_report /home/jenkins/builds/workspace/into-cps-public-coe-test-fmus/cascading-watertank1-20sim/build/linux64/CMakeFiles 6
Building C object CMakeFiles/cascading-watertank1-20sim.dir/sources/xxinverse.c.o
/usr/bin/cc  -Dcascading_watertank1_20sim_EXPORTS -fmessage-length=0 -std=c11 -fPIC -I/home/jenkins/builds/workspace/into-cps-public-coe-test-fmus/cascading-watertank1-20sim/build/linux64 -I/home/jenkins/builds/workspace/into-cps-public-coe-test-fmus/cascading-watertank1-20sim -I/home/jenkins/builds/workspace/into-cps-public-coe-test-fmus/cascading-watertank1-20sim/sources -I/home/jenkins/builds/workspace/into-cps-public-coe-test-fmus/cascading-watertank1-20sim/../includes/fmi -I/home/jenkins/builds/workspace/into-cps-public-coe-test-fmus/cascading-watertank1-20sim/../includes/templates    -o CMakeFiles/cascading-watertank1-20sim.dir/sources/xxinverse.c.o   -c /home/jenkins/builds/workspace/into-cps-public-coe-test-fmus/cascading-watertank1-20sim/sources/xxinverse.c
/usr/bin/cmake -E cmake_progress_report /home/jenkins/builds/workspace/into-cps-public-coe-test-fmus/cascading-watertank1-20sim/build/linux64/CMakeFiles 7
/usr/bin/cmake -E cmake_progress_report /home/jenkins/builds/workspace/into-cps-public-coe-test-fmus/cascading-watertank1-20sim/build/linux64/CMakeFiles 8
[ 66%] [ 77%] [ 88%] Building C object CMakeFiles/cascading-watertank1-20sim.dir/sources/EulerAngles.c.o
/usr/bin/cc  -Dcascading_watertank1_20sim_EXPORTS -fmessage-length=0 -std=c11 -fPIC -I/home/jenkins/builds/workspace/into-cps-public-coe-test-fmus/cascading-watertank1-20sim/build/linux64 -I/home/jenkins/builds/workspace/into-cps-public-coe-test-fmus/cascading-watertank1-20sim -I/home/jenkins/builds/workspace/into-cps-public-coe-test-fmus/cascading-watertank1-20sim/sources -I/home/jenkins/builds/workspace/into-cps-public-coe-test-fmus/cascading-watertank1-20sim/../includes/fmi -I/home/jenkins/builds/workspace/into-cps-public-coe-test-fmus/cascading-watertank1-20sim/../includes/templates    -o CMakeFiles/cascading-watertank1-20sim.dir/sources/EulerAngles.c.o   -c /home/jenkins/builds/workspace/into-cps-public-coe-test-fmus/cascading-watertank1-20sim/sources/EulerAngles.c
/usr/bin/cmake -E cmake_progress_report /home/jenkins/builds/workspace/into-cps-public-coe-test-fmus/cascading-watertank1-20sim/build/linux64/CMakeFiles 9
Building C object CMakeFiles/cascading-watertank1-20sim.dir/sources/motionprofiles.c.o
/usr/bin/cc  -Dcascading_watertank1_20sim_EXPORTS -fmessage-length=0 -std=c11 -fPIC -I/home/jenkins/builds/workspace/into-cps-public-coe-test-fmus/cascading-watertank1-20sim/build/linux64 -I/home/jenkins/builds/workspace/into-cps-public-coe-test-fmus/cascading-watertank1-20sim -I/home/jenkins/builds/workspace/into-cps-public-coe-test-fmus/cascading-watertank1-20sim/sources -I/home/jenkins/builds/workspace/into-cps-public-coe-test-fmus/cascading-watertank1-20sim/../includes/fmi -I/home/jenkins/builds/workspace/into-cps-public-coe-test-fmus/cascading-watertank1-20sim/../includes/templates    -o CMakeFiles/cascading-watertank1-20sim.dir/sources/motionprofiles.c.o   -c /home/jenkins/builds/workspace/into-cps-public-coe-test-fmus/cascading-watertank1-20sim/sources/motionprofiles.c
[100%] Building C object CMakeFiles/cascading-watertank1-20sim.dir/sources/xxmatrix.c.o
/usr/bin/cc  -Dcascading_watertank1_20sim_EXPORTS -fmessage-length=0 -std=c11 -fPIC -I/home/jenkins/builds/workspace/into-cps-public-coe-test-fmus/cascading-watertank1-20sim/build/linux64 -I/home/jenkins/builds/workspace/into-cps-public-coe-test-fmus/cascading-watertank1-20sim -I/home/jenkins/builds/workspace/into-cps-public-coe-test-fmus/cascading-watertank1-20sim/sources -I/home/jenkins/builds/workspace/into-cps-public-coe-test-fmus/cascading-watertank1-20sim/../includes/fmi -I/home/jenkins/builds/workspace/into-cps-public-coe-test-fmus/cascading-watertank1-20sim/../includes/templates    -o CMakeFiles/cascading-watertank1-20sim.dir/sources/xxmatrix.c.o   -c /home/jenkins/builds/workspace/into-cps-public-coe-test-fmus/cascading-watertank1-20sim/sources/xxmatrix.c
Building C object CMakeFiles/cascading-watertank1-20sim.dir/sources/xxsubmod.c.o
/usr/bin/cc  -Dcascading_watertank1_20sim_EXPORTS -fmessage-length=0 -std=c11 -fPIC -I/home/jenkins/builds/workspace/into-cps-public-coe-test-fmus/cascading-watertank1-20sim/build/linux64 -I/home/jenkins/builds/workspace/into-cps-public-coe-test-fmus/cascading-watertank1-20sim -I/home/jenkins/builds/workspace/into-cps-public-coe-test-fmus/cascading-watertank1-20sim/sources -I/home/jenkins/builds/workspace/into-cps-public-coe-test-fmus/cascading-watertank1-20sim/../includes/fmi -I/home/jenkins/builds/workspace/into-cps-public-coe-test-fmus/cascading-watertank1-20sim/../includes/templates    -o CMakeFiles/cascading-watertank1-20sim.dir/sources/xxsubmod.c.o   -c /home/jenkins/builds/workspace/into-cps-public-coe-test-fmus/cascading-watertank1-20sim/sources/xxsubmod.c
Linking C shared library cascading-watertank1-20sim.so
/usr/bin/cmake -E cmake_link_script CMakeFiles/cascading-watertank1-20sim.dir/link.txt --verbose=1
/usr/bin/cc  -fPIC  -fmessage-length=0 -std=c11 -fPIC  -shared -Wl,-soname,cascading-watertank1-20sim.so -o cascading-watertank1-20sim.so CMakeFiles/cascading-watertank1-20sim.dir/sources/fmi2Functions.c.o CMakeFiles/cascading-watertank1-20sim.dir/sources/xxfuncs.c.o CMakeFiles/cascading-watertank1-20sim.dir/sources/xxmodel.c.o CMakeFiles/cascading-watertank1-20sim.dir/sources/xxinteg.c.o CMakeFiles/cascading-watertank1-20sim.dir/sources/xxinverse.c.o CMakeFiles/cascading-watertank1-20sim.dir/sources/xxmatrix.c.o CMakeFiles/cascading-watertank1-20sim.dir/sources/motionprofiles.c.o CMakeFiles/cascading-watertank1-20sim.dir/sources/EulerAngles.c.o CMakeFiles/cascading-watertank1-20sim.dir/sources/xxsubmod.c.o -Wl,-Bstatic -lstdc++ -lpthread -Wl,-Bdynamic 
make[2]: Leaving directory `/home/jenkins/builds/workspace/into-cps-public-coe-test-fmus/cascading-watertank1-20sim/build/linux64'
/usr/bin/cmake -E cmake_progress_report /home/jenkins/builds/workspace/into-cps-public-coe-test-fmus/cascading-watertank1-20sim/build/linux64/CMakeFiles  1 2 3 4 5 6 7 8 9
[100%] Built target cascading-watertank1-20sim
make[1]: Leaving directory `/home/jenkins/builds/workspace/into-cps-public-coe-test-fmus/cascading-watertank1-20sim/build/linux64'
/usr/bin/cmake -E cmake_progress_start /home/jenkins/builds/workspace/into-cps-public-coe-test-fmus/cascading-watertank1-20sim/build/linux64/CMakeFiles 0
make: Leaving directory `/home/jenkins/builds/workspace/into-cps-public-coe-test-fmus/cascading-watertank1-20sim/build/linux64'
Building Linux x32 .so
-- The C compiler identification is GNU 4.8.4
-- The CXX compiler identification is GNU 4.8.4
-- Check for working C compiler: /usr/bin/cc
-- Check for working C compiler: /usr/bin/cc -- works
-- Detecting C compiler ABI info
-- Detecting C compiler ABI info - done
-- Detecting C compile features
-- Detecting C compile features - done
-- Check for working CXX compiler: /usr/bin/c++
-- Check for working CXX compiler: /usr/bin/c++ -- works
-- Detecting CXX compiler ABI info
-- Detecting CXX compiler ABI info - done
-- Detecting CXX compile features
-- Detecting CXX compile features - done
-- Performing Test COMPILER_SUPPORTS_CXX11
-- Performing Test COMPILER_SUPPORTS_CXX11 - Success
-- Performing Test COMPILER_SUPPORTS_CXX0X
-- Performing Test COMPILER_SUPPORTS_CXX0X - Success
-- Static linking with libstdc++.a in /usr/lib/gcc/x86_64-linux-gnu/4.8/libstdc++.a
-- Configuring done
-- Generating done
CMake Warning:
  Manually-specified variables were not used by the project:

    CFLAGS
    LINK_FLAGS


-- Build files have been written to: /home/jenkins/builds/workspace/into-cps-public-coe-test-fmus/cascading-watertank1-20sim/build/linux32
make: Entering directory `/home/jenkins/builds/workspace/into-cps-public-coe-test-fmus/cascading-watertank1-20sim/build/linux32'
/usr/bin/cmake -H/home/jenkins/builds/workspace/into-cps-public-coe-test-fmus/cascading-watertank1-20sim -B/home/jenkins/builds/workspace/into-cps-public-coe-test-fmus/cascading-watertank1-20sim/build/linux32 --check-build-system CMakeFiles/Makefile.cmake 0
/usr/bin/cmake -E cmake_progress_start /home/jenkins/builds/workspace/into-cps-public-coe-test-fmus/cascading-watertank1-20sim/build/linux32/CMakeFiles /home/jenkins/builds/workspace/into-cps-public-coe-test-fmus/cascading-watertank1-20sim/build/linux32/CMakeFiles/progress.marks
make -f CMakeFiles/Makefile2 all
make[1]: Entering directory `/home/jenkins/builds/workspace/into-cps-public-coe-test-fmus/cascading-watertank1-20sim/build/linux32'
make -f CMakeFiles/cascading-watertank1-20sim.dir/build.make CMakeFiles/cascading-watertank1-20sim.dir/depend
make[2]: Entering directory `/home/jenkins/builds/workspace/into-cps-public-coe-test-fmus/cascading-watertank1-20sim/build/linux32'
cd /home/jenkins/builds/workspace/into-cps-public-coe-test-fmus/cascading-watertank1-20sim/build/linux32 && /usr/bin/cmake -E cmake_depends "Unix Makefiles" /home/jenkins/builds/workspace/into-cps-public-coe-test-fmus/cascading-watertank1-20sim /home/jenkins/builds/workspace/into-cps-public-coe-test-fmus/cascading-watertank1-20sim /home/jenkins/builds/workspace/into-cps-public-coe-test-fmus/cascading-watertank1-20sim/build/linux32 /home/jenkins/builds/workspace/into-cps-public-coe-test-fmus/cascading-watertank1-20sim/build/linux32 /home/jenkins/builds/workspace/into-cps-public-coe-test-fmus/cascading-watertank1-20sim/build/linux32/CMakeFiles/cascading-watertank1-20sim.dir/DependInfo.cmake --color=
Scanning dependencies of target cascading-watertank1-20sim
make[2]: Leaving directory `/home/jenkins/builds/workspace/into-cps-public-coe-test-fmus/cascading-watertank1-20sim/build/linux32'
make -f CMakeFiles/cascading-watertank1-20sim.dir/build.make CMakeFiles/cascading-watertank1-20sim.dir/build
make[2]: Entering directory `/home/jenkins/builds/workspace/into-cps-public-coe-test-fmus/cascading-watertank1-20sim/build/linux32'
/usr/bin/cmake -E cmake_progress_report /home/jenkins/builds/workspace/into-cps-public-coe-test-fmus/cascading-watertank1-20sim/build/linux32/CMakeFiles 1
/usr/bin/cmake -E cmake_progress_report /home/jenkins/builds/workspace/into-cps-public-coe-test-fmus/cascading-watertank1-20sim/build/linux32/CMakeFiles 2
/usr/bin/cmake -E cmake_progress_report /home/jenkins/builds/workspace/into-cps-public-coe-test-fmus/cascading-watertank1-20sim/build/linux32/CMakeFiles 3
/usr/bin/cmake -E cmake_progress_report /home/jenkins/builds/workspace/into-cps-public-coe-test-fmus/cascading-watertank1-20sim/build/linux32/CMakeFiles 4
[ 11%] [ 22%] [ 33%] [ 44%] Building C object CMakeFiles/cascading-watertank1-20sim.dir/sources/fmi2Functions.c.o
Building C object CMakeFiles/cascading-watertank1-20sim.dir/sources/xxinteg.c.o
/usr/bin/cc  -Dcascading_watertank1_20sim_EXPORTS -fmessage-length=0 -std=c11 -fPIC -I/home/jenkins/builds/workspace/into-cps-public-coe-test-fmus/cascading-watertank1-20sim/build/linux32 -I/home/jenkins/builds/workspace/into-cps-public-coe-test-fmus/cascading-watertank1-20sim -I/home/jenkins/builds/workspace/into-cps-public-coe-test-fmus/cascading-watertank1-20sim/sources -I/home/jenkins/builds/workspace/into-cps-public-coe-test-fmus/cascading-watertank1-20sim/../includes/fmi -I/home/jenkins/builds/workspace/into-cps-public-coe-test-fmus/cascading-watertank1-20sim/../includes/templates    -o CMakeFiles/cascading-watertank1-20sim.dir/sources/xxinteg.c.o   -c /home/jenkins/builds/workspace/into-cps-public-coe-test-fmus/cascading-watertank1-20sim/sources/xxinteg.c
Building C object CMakeFiles/cascading-watertank1-20sim.dir/sources/xxmodel.c.o
/usr/bin/cc  -Dcascading_watertank1_20sim_EXPORTS -fmessage-length=0 -std=c11 -fPIC -I/home/jenkins/builds/workspace/into-cps-public-coe-test-fmus/cascading-watertank1-20sim/build/linux32 -I/home/jenkins/builds/workspace/into-cps-public-coe-test-fmus/cascading-watertank1-20sim -I/home/jenkins/builds/workspace/into-cps-public-coe-test-fmus/cascading-watertank1-20sim/sources -I/home/jenkins/builds/workspace/into-cps-public-coe-test-fmus/cascading-watertank1-20sim/../includes/fmi -I/home/jenkins/builds/workspace/into-cps-public-coe-test-fmus/cascading-watertank1-20sim/../includes/templates    -o CMakeFiles/cascading-watertank1-20sim.dir/sources/xxmodel.c.o   -c /home/jenkins/builds/workspace/into-cps-public-coe-test-fmus/cascading-watertank1-20sim/sources/xxmodel.c
/usr/bin/cc  -Dcascading_watertank1_20sim_EXPORTS -fmessage-length=0 -std=c11 -fPIC -I/home/jenkins/builds/workspace/into-cps-public-coe-test-fmus/cascading-watertank1-20sim/build/linux32 -I/home/jenkins/builds/workspace/into-cps-public-coe-test-fmus/cascading-watertank1-20sim -I/home/jenkins/builds/workspace/into-cps-public-coe-test-fmus/cascading-watertank1-20sim/sources -I/home/jenkins/builds/workspace/into-cps-public-coe-test-fmus/cascading-watertank1-20sim/../includes/fmi -I/home/jenkins/builds/workspace/into-cps-public-coe-test-fmus/cascading-watertank1-20sim/../includes/templates    -o CMakeFiles/cascading-watertank1-20sim.dir/sources/fmi2Functions.c.o   -c /home/jenkins/builds/workspace/into-cps-public-coe-test-fmus/cascading-watertank1-20sim/sources/fmi2Functions.c
Building C object CMakeFiles/cascading-watertank1-20sim.dir/sources/xxfuncs.c.o
/usr/bin/cc  -Dcascading_watertank1_20sim_EXPORTS -fmessage-length=0 -std=c11 -fPIC -I/home/jenkins/builds/workspace/into-cps-public-coe-test-fmus/cascading-watertank1-20sim/build/linux32 -I/home/jenkins/builds/workspace/into-cps-public-coe-test-fmus/cascading-watertank1-20sim -I/home/jenkins/builds/workspace/into-cps-public-coe-test-fmus/cascading-watertank1-20sim/sources -I/home/jenkins/builds/workspace/into-cps-public-coe-test-fmus/cascading-watertank1-20sim/../includes/fmi -I/home/jenkins/builds/workspace/into-cps-public-coe-test-fmus/cascading-watertank1-20sim/../includes/templates    -o CMakeFiles/cascading-watertank1-20sim.dir/sources/xxfuncs.c.o   -c /home/jenkins/builds/workspace/into-cps-public-coe-test-fmus/cascading-watertank1-20sim/sources/xxfuncs.c
/usr/bin/cmake -E cmake_progress_report /home/jenkins/builds/workspace/into-cps-public-coe-test-fmus/cascading-watertank1-20sim/build/linux32/CMakeFiles 5
/usr/bin/cmake -E cmake_progress_report /home/jenkins/builds/workspace/into-cps-public-coe-test-fmus/cascading-watertank1-20sim/build/linux32/CMakeFiles 6
[ 55%] /usr/bin/cmake -E cmake_progress_report /home/jenkins/builds/workspace/into-cps-public-coe-test-fmus/cascading-watertank1-20sim/build/linux32/CMakeFiles 7
[ 66%] [ 77%] Building C object CMakeFiles/cascading-watertank1-20sim.dir/sources/motionprofiles.c.o
/usr/bin/cc  -Dcascading_watertank1_20sim_EXPORTS -fmessage-length=0 -std=c11 -fPIC -I/home/jenkins/builds/workspace/into-cps-public-coe-test-fmus/cascading-watertank1-20sim/build/linux32 -I/home/jenkins/builds/workspace/into-cps-public-coe-test-fmus/cascading-watertank1-20sim -I/home/jenkins/builds/workspace/into-cps-public-coe-test-fmus/cascading-watertank1-20sim/sources -I/home/jenkins/builds/workspace/into-cps-public-coe-test-fmus/cascading-watertank1-20sim/../includes/fmi -I/home/jenkins/builds/workspace/into-cps-public-coe-test-fmus/cascading-watertank1-20sim/../includes/templates    -o CMakeFiles/cascading-watertank1-20sim.dir/sources/motionprofiles.c.o   -c /home/jenkins/builds/workspace/into-cps-public-coe-test-fmus/cascading-watertank1-20sim/sources/motionprofiles.c
/usr/bin/cmake -E cmake_progress_report /home/jenkins/builds/workspace/into-cps-public-coe-test-fmus/cascading-watertank1-20sim/build/linux32/CMakeFiles 8
Building C object CMakeFiles/cascading-watertank1-20sim.dir/sources/xxinverse.c.o
/usr/bin/cc  -Dcascading_watertank1_20sim_EXPORTS -fmessage-length=0 -std=c11 -fPIC -I/home/jenkins/builds/workspace/into-cps-public-coe-test-fmus/cascading-watertank1-20sim/build/linux32 -I/home/jenkins/builds/workspace/into-cps-public-coe-test-fmus/cascading-watertank1-20sim -I/home/jenkins/builds/workspace/into-cps-public-coe-test-fmus/cascading-watertank1-20sim/sources -I/home/jenkins/builds/workspace/into-cps-public-coe-test-fmus/cascading-watertank1-20sim/../includes/fmi -I/home/jenkins/builds/workspace/into-cps-public-coe-test-fmus/cascading-watertank1-20sim/../includes/templates    -o CMakeFiles/cascading-watertank1-20sim.dir/sources/xxinverse.c.o   -c /home/jenkins/builds/workspace/into-cps-public-coe-test-fmus/cascading-watertank1-20sim/sources/xxinverse.c
Building C object CMakeFiles/cascading-watertank1-20sim.dir/sources/xxmatrix.c.o
/usr/bin/cc  -Dcascading_watertank1_20sim_EXPORTS -fmessage-length=0 -std=c11 -fPIC -I/home/jenkins/builds/workspace/into-cps-public-coe-test-fmus/cascading-watertank1-20sim/build/linux32 -I/home/jenkins/builds/workspace/into-cps-public-coe-test-fmus/cascading-watertank1-20sim -I/home/jenkins/builds/workspace/into-cps-public-coe-test-fmus/cascading-watertank1-20sim/sources -I/home/jenkins/builds/workspace/into-cps-public-coe-test-fmus/cascading-watertank1-20sim/../includes/fmi -I/home/jenkins/builds/workspace/into-cps-public-coe-test-fmus/cascading-watertank1-20sim/../includes/templates    -o CMakeFiles/cascading-watertank1-20sim.dir/sources/xxmatrix.c.o   -c /home/jenkins/builds/workspace/into-cps-public-coe-test-fmus/cascading-watertank1-20sim/sources/xxmatrix.c
/usr/bin/cmake -E cmake_progress_report /home/jenkins/builds/workspace/into-cps-public-coe-test-fmus/cascading-watertank1-20sim/build/linux32/CMakeFiles 9
[ 88%] [100%] Building C object CMakeFiles/cascading-watertank1-20sim.dir/sources/EulerAngles.c.o
Building C object CMakeFiles/cascading-watertank1-20sim.dir/sources/xxsubmod.c.o
/usr/bin/cc  -Dcascading_watertank1_20sim_EXPORTS -fmessage-length=0 -std=c11 -fPIC -I/home/jenkins/builds/workspace/into-cps-public-coe-test-fmus/cascading-watertank1-20sim/build/linux32 -I/home/jenkins/builds/workspace/into-cps-public-coe-test-fmus/cascading-watertank1-20sim -I/home/jenkins/builds/workspace/into-cps-public-coe-test-fmus/cascading-watertank1-20sim/sources -I/home/jenkins/builds/workspace/into-cps-public-coe-test-fmus/cascading-watertank1-20sim/../includes/fmi -I/home/jenkins/builds/workspace/into-cps-public-coe-test-fmus/cascading-watertank1-20sim/../includes/templates    -o CMakeFiles/cascading-watertank1-20sim.dir/sources/xxsubmod.c.o   -c /home/jenkins/builds/workspace/into-cps-public-coe-test-fmus/cascading-watertank1-20sim/sources/xxsubmod.c
/usr/bin/cc  -Dcascading_watertank1_20sim_EXPORTS -fmessage-length=0 -std=c11 -fPIC -I/home/jenkins/builds/workspace/into-cps-public-coe-test-fmus/cascading-watertank1-20sim/build/linux32 -I/home/jenkins/builds/workspace/into-cps-public-coe-test-fmus/cascading-watertank1-20sim -I/home/jenkins/builds/workspace/into-cps-public-coe-test-fmus/cascading-watertank1-20sim/sources -I/home/jenkins/builds/workspace/into-cps-public-coe-test-fmus/cascading-watertank1-20sim/../includes/fmi -I/home/jenkins/builds/workspace/into-cps-public-coe-test-fmus/cascading-watertank1-20sim/../includes/templates    -o CMakeFiles/cascading-watertank1-20sim.dir/sources/EulerAngles.c.o   -c /home/jenkins/builds/workspace/into-cps-public-coe-test-fmus/cascading-watertank1-20sim/sources/EulerAngles.c
Linking C shared library cascading-watertank1-20sim.so
/usr/bin/cmake -E cmake_link_script CMakeFiles/cascading-watertank1-20sim.dir/link.txt --verbose=1
/usr/bin/cc  -fPIC  -fmessage-length=0 -std=c11 -fPIC  -shared -Wl,-soname,cascading-watertank1-20sim.so -o cascading-watertank1-20sim.so CMakeFiles/cascading-watertank1-20sim.dir/sources/fmi2Functions.c.o CMakeFiles/cascading-watertank1-20sim.dir/sources/xxfuncs.c.o CMakeFiles/cascading-watertank1-20sim.dir/sources/xxmodel.c.o CMakeFiles/cascading-watertank1-20sim.dir/sources/xxinteg.c.o CMakeFiles/cascading-watertank1-20sim.dir/sources/xxinverse.c.o CMakeFiles/cascading-watertank1-20sim.dir/sources/xxmatrix.c.o CMakeFiles/cascading-watertank1-20sim.dir/sources/motionprofiles.c.o CMakeFiles/cascading-watertank1-20sim.dir/sources/EulerAngles.c.o CMakeFiles/cascading-watertank1-20sim.dir/sources/xxsubmod.c.o -Wl,-Bstatic -lstdc++ -lpthread -Wl,-Bdynamic 
make[2]: Leaving directory `/home/jenkins/builds/workspace/into-cps-public-coe-test-fmus/cascading-watertank1-20sim/build/linux32'
/usr/bin/cmake -E cmake_progress_report /home/jenkins/builds/workspace/into-cps-public-coe-test-fmus/cascading-watertank1-20sim/build/linux32/CMakeFiles  1 2 3 4 5 6 7 8 9
[100%] Built target cascading-watertank1-20sim
make[1]: Leaving directory `/home/jenkins/builds/workspace/into-cps-public-coe-test-fmus/cascading-watertank1-20sim/build/linux32'
/usr/bin/cmake -E cmake_progress_start /home/jenkins/builds/workspace/into-cps-public-coe-test-fmus/cascading-watertank1-20sim/build/linux32/CMakeFiles 0
make: Leaving directory `/home/jenkins/builds/workspace/into-cps-public-coe-test-fmus/cascading-watertank1-20sim/build/linux32'
Building Win64 .dll
-- The C compiler identification is GNU 4.8.2
-- The CXX compiler identification is GNU 4.8.2
-- Check for working C compiler: /usr/bin/x86_64-w64-mingw32-gcc
-- Check for working C compiler: /usr/bin/x86_64-w64-mingw32-gcc -- works
-- Detecting C compiler ABI info
-- Detecting C compiler ABI info - done
-- Detecting C compile features
-- Detecting C compile features - done
-- Check for working CXX compiler: /usr/bin/x86_64-w64-mingw32-g++
-- Check for working CXX compiler: /usr/bin/x86_64-w64-mingw32-g++ -- works
-- Detecting CXX compiler ABI info
-- Detecting CXX compiler ABI info - done
-- Detecting CXX compile features
-- Detecting CXX compile features - done
-- Performing Test COMPILER_SUPPORTS_CXX11
-- Performing Test COMPILER_SUPPORTS_CXX11 - Success
-- Performing Test COMPILER_SUPPORTS_CXX0X
-- Performing Test COMPILER_SUPPORTS_CXX0X - Success
-- Static linking with libstdc++.a in /usr/lib/gcc/x86_64-w64-mingw32/4.8/libstdc++.a
-- Configuring done
-- Generating done
-- Build files have been written to: /home/jenkins/builds/workspace/into-cps-public-coe-test-fmus/cascading-watertank1-20sim/build/win64
make: Entering directory `/home/jenkins/builds/workspace/into-cps-public-coe-test-fmus/cascading-watertank1-20sim/build/win64'
/usr/bin/cmake -H/home/jenkins/builds/workspace/into-cps-public-coe-test-fmus/cascading-watertank1-20sim -B/home/jenkins/builds/workspace/into-cps-public-coe-test-fmus/cascading-watertank1-20sim/build/win64 --check-build-system CMakeFiles/Makefile.cmake 0
/usr/bin/cmake -E cmake_progress_start /home/jenkins/builds/workspace/into-cps-public-coe-test-fmus/cascading-watertank1-20sim/build/win64/CMakeFiles /home/jenkins/builds/workspace/into-cps-public-coe-test-fmus/cascading-watertank1-20sim/build/win64/CMakeFiles/progress.marks
make -f CMakeFiles/Makefile2 all
make[1]: Entering directory `/home/jenkins/builds/workspace/into-cps-public-coe-test-fmus/cascading-watertank1-20sim/build/win64'
make -f CMakeFiles/cascading-watertank1-20sim.dir/build.make CMakeFiles/cascading-watertank1-20sim.dir/depend
make[2]: Entering directory `/home/jenkins/builds/workspace/into-cps-public-coe-test-fmus/cascading-watertank1-20sim/build/win64'
cd /home/jenkins/builds/workspace/into-cps-public-coe-test-fmus/cascading-watertank1-20sim/build/win64 && /usr/bin/cmake -E cmake_depends "Unix Makefiles" /home/jenkins/builds/workspace/into-cps-public-coe-test-fmus/cascading-watertank1-20sim /home/jenkins/builds/workspace/into-cps-public-coe-test-fmus/cascading-watertank1-20sim /home/jenkins/builds/workspace/into-cps-public-coe-test-fmus/cascading-watertank1-20sim/build/win64 /home/jenkins/builds/workspace/into-cps-public-coe-test-fmus/cascading-watertank1-20sim/build/win64 /home/jenkins/builds/workspace/into-cps-public-coe-test-fmus/cascading-watertank1-20sim/build/win64/CMakeFiles/cascading-watertank1-20sim.dir/DependInfo.cmake --color=
Scanning dependencies of target cascading-watertank1-20sim
make[2]: Leaving directory `/home/jenkins/builds/workspace/into-cps-public-coe-test-fmus/cascading-watertank1-20sim/build/win64'
make -f CMakeFiles/cascading-watertank1-20sim.dir/build.make CMakeFiles/cascading-watertank1-20sim.dir/build
make[2]: Entering directory `/home/jenkins/builds/workspace/into-cps-public-coe-test-fmus/cascading-watertank1-20sim/build/win64'
/usr/bin/cmake -E cmake_progress_report /home/jenkins/builds/workspace/into-cps-public-coe-test-fmus/cascading-watertank1-20sim/build/win64/CMakeFiles 1
/usr/bin/cmake -E cmake_progress_report /home/jenkins/builds/workspace/into-cps-public-coe-test-fmus/cascading-watertank1-20sim/build/win64/CMakeFiles 2
/usr/bin/cmake -E cmake_progress_report /home/jenkins/builds/workspace/into-cps-public-coe-test-fmus/cascading-watertank1-20sim/build/win64/CMakeFiles 3
[ 11%] /usr/bin/cmake -E cmake_progress_report /home/jenkins/builds/workspace/into-cps-public-coe-test-fmus/cascading-watertank1-20sim/build/win64/CMakeFiles 4
[ 22%] [ 33%] [ 44%] Building C object CMakeFiles/cascading-watertank1-20sim.dir/sources/xxfuncs.c.obj
Building C object CMakeFiles/cascading-watertank1-20sim.dir/sources/xxinteg.c.obj
/usr/bin/x86_64-w64-mingw32-gcc  -Dcascading_watertank1_20sim_EXPORTS -fmessage-length=0 -std=c11 @CMakeFiles/cascading-watertank1-20sim.dir/includes_C.rsp   -o CMakeFiles/cascading-watertank1-20sim.dir/sources/xxinteg.c.obj   -c /home/jenkins/builds/workspace/into-cps-public-coe-test-fmus/cascading-watertank1-20sim/sources/xxinteg.c
/usr/bin/x86_64-w64-mingw32-gcc  -Dcascading_watertank1_20sim_EXPORTS -fmessage-length=0 -std=c11 @CMakeFiles/cascading-watertank1-20sim.dir/includes_C.rsp   -o CMakeFiles/cascading-watertank1-20sim.dir/sources/xxfuncs.c.obj   -c /home/jenkins/builds/workspace/into-cps-public-coe-test-fmus/cascading-watertank1-20sim/sources/xxfuncs.c
Building C object CMakeFiles/cascading-watertank1-20sim.dir/sources/xxmodel.c.obj
/usr/bin/x86_64-w64-mingw32-gcc  -Dcascading_watertank1_20sim_EXPORTS -fmessage-length=0 -std=c11 @CMakeFiles/cascading-watertank1-20sim.dir/includes_C.rsp   -o CMakeFiles/cascading-watertank1-20sim.dir/sources/xxmodel.c.obj   -c /home/jenkins/builds/workspace/into-cps-public-coe-test-fmus/cascading-watertank1-20sim/sources/xxmodel.c
Building C object CMakeFiles/cascading-watertank1-20sim.dir/sources/fmi2Functions.c.obj
/usr/bin/x86_64-w64-mingw32-gcc  -Dcascading_watertank1_20sim_EXPORTS -fmessage-length=0 -std=c11 @CMakeFiles/cascading-watertank1-20sim.dir/includes_C.rsp   -o CMakeFiles/cascading-watertank1-20sim.dir/sources/fmi2Functions.c.obj   -c /home/jenkins/builds/workspace/into-cps-public-coe-test-fmus/cascading-watertank1-20sim/sources/fmi2Functions.c
/usr/bin/cmake -E cmake_progress_report /home/jenkins/builds/workspace/into-cps-public-coe-test-fmus/cascading-watertank1-20sim/build/win64/CMakeFiles 5
[ 55%] /usr/bin/cmake -E cmake_progress_report /home/jenkins/builds/workspace/into-cps-public-coe-test-fmus/cascading-watertank1-20sim/build/win64/CMakeFiles 6
Building C object CMakeFiles/cascading-watertank1-20sim.dir/sources/xxinverse.c.obj
[ 66%] /usr/bin/x86_64-w64-mingw32-gcc  -Dcascading_watertank1_20sim_EXPORTS -fmessage-length=0 -std=c11 @CMakeFiles/cascading-watertank1-20sim.dir/includes_C.rsp   -o CMakeFiles/cascading-watertank1-20sim.dir/sources/xxinverse.c.obj   -c /home/jenkins/builds/workspace/into-cps-public-coe-test-fmus/cascading-watertank1-20sim/sources/xxinverse.c
/usr/bin/cmake -E cmake_progress_report /home/jenkins/builds/workspace/into-cps-public-coe-test-fmus/cascading-watertank1-20sim/build/win64/CMakeFiles 7
[ 77%] Building C object CMakeFiles/cascading-watertank1-20sim.dir/sources/xxmatrix.c.obj
/usr/bin/x86_64-w64-mingw32-gcc  -Dcascading_watertank1_20sim_EXPORTS -fmessage-length=0 -std=c11 @CMakeFiles/cascading-watertank1-20sim.dir/includes_C.rsp   -o CMakeFiles/cascading-watertank1-20sim.dir/sources/xxmatrix.c.obj   -c /home/jenkins/builds/workspace/into-cps-public-coe-test-fmus/cascading-watertank1-20sim/sources/xxmatrix.c
Building C object CMakeFiles/cascading-watertank1-20sim.dir/sources/motionprofiles.c.obj
/usr/bin/x86_64-w64-mingw32-gcc  -Dcascading_watertank1_20sim_EXPORTS -fmessage-length=0 -std=c11 @CMakeFiles/cascading-watertank1-20sim.dir/includes_C.rsp   -o CMakeFiles/cascading-watertank1-20sim.dir/sources/motionprofiles.c.obj   -c /home/jenkins/builds/workspace/into-cps-public-coe-test-fmus/cascading-watertank1-20sim/sources/motionprofiles.c
/usr/bin/cmake -E cmake_progress_report /home/jenkins/builds/workspace/into-cps-public-coe-test-fmus/cascading-watertank1-20sim/build/win64/CMakeFiles 8
/usr/bin/cmake -E cmake_progress_report /home/jenkins/builds/workspace/into-cps-public-coe-test-fmus/cascading-watertank1-20sim/build/win64/CMakeFiles 9
[ 88%] Building C object CMakeFiles/cascading-watertank1-20sim.dir/sources/xxsubmod.c.obj
/usr/bin/x86_64-w64-mingw32-gcc  -Dcascading_watertank1_20sim_EXPORTS -fmessage-length=0 -std=c11 @CMakeFiles/cascading-watertank1-20sim.dir/includes_C.rsp   -o CMakeFiles/cascading-watertank1-20sim.dir/sources/xxsubmod.c.obj   -c /home/jenkins/builds/workspace/into-cps-public-coe-test-fmus/cascading-watertank1-20sim/sources/xxsubmod.c
[100%] Building C object CMakeFiles/cascading-watertank1-20sim.dir/sources/EulerAngles.c.obj
/usr/bin/x86_64-w64-mingw32-gcc  -Dcascading_watertank1_20sim_EXPORTS -fmessage-length=0 -std=c11 @CMakeFiles/cascading-watertank1-20sim.dir/includes_C.rsp   -o CMakeFiles/cascading-watertank1-20sim.dir/sources/EulerAngles.c.obj   -c /home/jenkins/builds/workspace/into-cps-public-coe-test-fmus/cascading-watertank1-20sim/sources/EulerAngles.c
Linking C shared library cascading-watertank1-20sim.dll
/usr/bin/cmake -E cmake_link_script CMakeFiles/cascading-watertank1-20sim.dir/link.txt --verbose=1
/usr/bin/cmake -E remove -f CMakeFiles/cascading-watertank1-20sim.dir/objects.a
/usr/bin/x86_64-w64-mingw32-ar cr CMakeFiles/cascading-watertank1-20sim.dir/objects.a @CMakeFiles/cascading-watertank1-20sim.dir/objects1.rsp
/usr/bin/x86_64-w64-mingw32-gcc    -fmessage-length=0 -std=c11  -static-libstdc++ -static-libgcc -shared -o cascading-watertank1-20sim.dll -Wl,--out-implib,libcascading-watertank1-20sim.dll.a -Wl,--major-image-version,0,--minor-image-version,0 -Wl,--whole-archive CMakeFiles/cascading-watertank1-20sim.dir/objects.a -Wl,--no-whole-archive @CMakeFiles/cascading-watertank1-20sim.dir/linklibs.rsp
make[2]: Leaving directory `/home/jenkins/builds/workspace/into-cps-public-coe-test-fmus/cascading-watertank1-20sim/build/win64'
/usr/bin/cmake -E cmake_progress_report /home/jenkins/builds/workspace/into-cps-public-coe-test-fmus/cascading-watertank1-20sim/build/win64/CMakeFiles  1 2 3 4 5 6 7 8 9
[100%] Built target cascading-watertank1-20sim
make[1]: Leaving directory `/home/jenkins/builds/workspace/into-cps-public-coe-test-fmus/cascading-watertank1-20sim/build/win64'
/usr/bin/cmake -E cmake_progress_start /home/jenkins/builds/workspace/into-cps-public-coe-test-fmus/cascading-watertank1-20sim/build/win64/CMakeFiles 0
make: Leaving directory `/home/jenkins/builds/workspace/into-cps-public-coe-test-fmus/cascading-watertank1-20sim/build/win64'
Building Win32 .dll
-- The C compiler identification is GNU 4.8.2
-- The CXX compiler identification is GNU 4.8.2
-- Check for working C compiler: /usr/bin/i686-w64-mingw32-gcc
-- Check for working C compiler: /usr/bin/i686-w64-mingw32-gcc -- works
-- Detecting C compiler ABI info
-- Detecting C compiler ABI info - done
-- Detecting C compile features
-- Detecting C compile features - done
-- Check for working CXX compiler: /usr/bin/i686-w64-mingw32-g++
-- Check for working CXX compiler: /usr/bin/i686-w64-mingw32-g++ -- works
-- Detecting CXX compiler ABI info
-- Detecting CXX compiler ABI info - done
-- Detecting CXX compile features
-- Detecting CXX compile features - done
-- Performing Test COMPILER_SUPPORTS_CXX11
-- Performing Test COMPILER_SUPPORTS_CXX11 - Success
-- Performing Test COMPILER_SUPPORTS_CXX0X
-- Performing Test COMPILER_SUPPORTS_CXX0X - Success
-- Static linking with libstdc++.a in /usr/lib/gcc/i686-w64-mingw32/4.8/libstdc++.a
-- Configuring done
-- Generating done
-- Build files have been written to: /home/jenkins/builds/workspace/into-cps-public-coe-test-fmus/cascading-watertank1-20sim/build/win32
make: Entering directory `/home/jenkins/builds/workspace/into-cps-public-coe-test-fmus/cascading-watertank1-20sim/build/win32'
/usr/bin/cmake -H/home/jenkins/builds/workspace/into-cps-public-coe-test-fmus/cascading-watertank1-20sim -B/home/jenkins/builds/workspace/into-cps-public-coe-test-fmus/cascading-watertank1-20sim/build/win32 --check-build-system CMakeFiles/Makefile.cmake 0
/usr/bin/cmake -E cmake_progress_start /home/jenkins/builds/workspace/into-cps-public-coe-test-fmus/cascading-watertank1-20sim/build/win32/CMakeFiles /home/jenkins/builds/workspace/into-cps-public-coe-test-fmus/cascading-watertank1-20sim/build/win32/CMakeFiles/progress.marks
make -f CMakeFiles/Makefile2 all
make[1]: Entering directory `/home/jenkins/builds/workspace/into-cps-public-coe-test-fmus/cascading-watertank1-20sim/build/win32'
make -f CMakeFiles/cascading-watertank1-20sim.dir/build.make CMakeFiles/cascading-watertank1-20sim.dir/depend
make[2]: Entering directory `/home/jenkins/builds/workspace/into-cps-public-coe-test-fmus/cascading-watertank1-20sim/build/win32'
cd /home/jenkins/builds/workspace/into-cps-public-coe-test-fmus/cascading-watertank1-20sim/build/win32 && /usr/bin/cmake -E cmake_depends "Unix Makefiles" /home/jenkins/builds/workspace/into-cps-public-coe-test-fmus/cascading-watertank1-20sim /home/jenkins/builds/workspace/into-cps-public-coe-test-fmus/cascading-watertank1-20sim /home/jenkins/builds/workspace/into-cps-public-coe-test-fmus/cascading-watertank1-20sim/build/win32 /home/jenkins/builds/workspace/into-cps-public-coe-test-fmus/cascading-watertank1-20sim/build/win32 /home/jenkins/builds/workspace/into-cps-public-coe-test-fmus/cascading-watertank1-20sim/build/win32/CMakeFiles/cascading-watertank1-20sim.dir/DependInfo.cmake --color=
Scanning dependencies of target cascading-watertank1-20sim
make[2]: Leaving directory `/home/jenkins/builds/workspace/into-cps-public-coe-test-fmus/cascading-watertank1-20sim/build/win32'
make -f CMakeFiles/cascading-watertank1-20sim.dir/build.make CMakeFiles/cascading-watertank1-20sim.dir/build
make[2]: Entering directory `/home/jenkins/builds/workspace/into-cps-public-coe-test-fmus/cascading-watertank1-20sim/build/win32'
/usr/bin/cmake -E cmake_progress_report /home/jenkins/builds/workspace/into-cps-public-coe-test-fmus/cascading-watertank1-20sim/build/win32/CMakeFiles 1
/usr/bin/cmake -E cmake_progress_report /home/jenkins/builds/workspace/into-cps-public-coe-test-fmus/cascading-watertank1-20sim/build/win32/CMakeFiles 2
/usr/bin/cmake -E cmake_progress_report /home/jenkins/builds/workspace/into-cps-public-coe-test-fmus/cascading-watertank1-20sim/build/win32/CMakeFiles 3
/usr/bin/cmake -E cmake_progress_report /home/jenkins/builds/workspace/into-cps-public-coe-test-fmus/cascading-watertank1-20sim/build/win32/CMakeFiles 4
[ 11%] [ 22%] [ 33%] [ 44%] Building C object CMakeFiles/cascading-watertank1-20sim.dir/sources/fmi2Functions.c.obj
/usr/bin/i686-w64-mingw32-gcc  -Dcascading_watertank1_20sim_EXPORTS -fmessage-length=0 -std=c11 @CMakeFiles/cascading-watertank1-20sim.dir/includes_C.rsp   -o CMakeFiles/cascading-watertank1-20sim.dir/sources/fmi2Functions.c.obj   -c /home/jenkins/builds/workspace/into-cps-public-coe-test-fmus/cascading-watertank1-20sim/sources/fmi2Functions.c
Building C object CMakeFiles/cascading-watertank1-20sim.dir/sources/xxfuncs.c.obj
Building C object CMakeFiles/cascading-watertank1-20sim.dir/sources/xxmodel.c.obj
Building C object CMakeFiles/cascading-watertank1-20sim.dir/sources/xxinteg.c.obj
/usr/bin/i686-w64-mingw32-gcc  -Dcascading_watertank1_20sim_EXPORTS -fmessage-length=0 -std=c11 @CMakeFiles/cascading-watertank1-20sim.dir/includes_C.rsp   -o CMakeFiles/cascading-watertank1-20sim.dir/sources/xxfuncs.c.obj   -c /home/jenkins/builds/workspace/into-cps-public-coe-test-fmus/cascading-watertank1-20sim/sources/xxfuncs.c
/usr/bin/i686-w64-mingw32-gcc  -Dcascading_watertank1_20sim_EXPORTS -fmessage-length=0 -std=c11 @CMakeFiles/cascading-watertank1-20sim.dir/includes_C.rsp   -o CMakeFiles/cascading-watertank1-20sim.dir/sources/xxmodel.c.obj   -c /home/jenkins/builds/workspace/into-cps-public-coe-test-fmus/cascading-watertank1-20sim/sources/xxmodel.c
/usr/bin/i686-w64-mingw32-gcc  -Dcascading_watertank1_20sim_EXPORTS -fmessage-length=0 -std=c11 @CMakeFiles/cascading-watertank1-20sim.dir/includes_C.rsp   -o CMakeFiles/cascading-watertank1-20sim.dir/sources/xxinteg.c.obj   -c /home/jenkins/builds/workspace/into-cps-public-coe-test-fmus/cascading-watertank1-20sim/sources/xxinteg.c
/usr/bin/cmake -E cmake_progress_report /home/jenkins/builds/workspace/into-cps-public-coe-test-fmus/cascading-watertank1-20sim/build/win32/CMakeFiles 5
/usr/bin/cmake -E cmake_progress_report /home/jenkins/builds/workspace/into-cps-public-coe-test-fmus/cascading-watertank1-20sim/build/win32/CMakeFiles 6
/usr/bin/cmake -E cmake_progress_report /home/jenkins/builds/workspace/into-cps-public-coe-test-fmus/cascading-watertank1-20sim/build/win32/CMakeFiles 7
[ 55%] [ 66%] [ 77%] /usr/bin/cmake -E cmake_progress_report /home/jenkins/builds/workspace/into-cps-public-coe-test-fmus/cascading-watertank1-20sim/build/win32/CMakeFiles 8
Building C object CMakeFiles/cascading-watertank1-20sim.dir/sources/xxmatrix.c.obj
/usr/bin/i686-w64-mingw32-gcc  -Dcascading_watertank1_20sim_EXPORTS -fmessage-length=0 -std=c11 @CMakeFiles/cascading-watertank1-20sim.dir/includes_C.rsp   -o CMakeFiles/cascading-watertank1-20sim.dir/sources/xxmatrix.c.obj   -c /home/jenkins/builds/workspace/into-cps-public-coe-test-fmus/cascading-watertank1-20sim/sources/xxmatrix.c
Building C object CMakeFiles/cascading-watertank1-20sim.dir/sources/xxinverse.c.obj
Building C object CMakeFiles/cascading-watertank1-20sim.dir/sources/motionprofiles.c.obj
[ 88%] /usr/bin/i686-w64-mingw32-gcc  -Dcascading_watertank1_20sim_EXPORTS -fmessage-length=0 -std=c11 @CMakeFiles/cascading-watertank1-20sim.dir/includes_C.rsp   -o CMakeFiles/cascading-watertank1-20sim.dir/sources/motionprofiles.c.obj   -c /home/jenkins/builds/workspace/into-cps-public-coe-test-fmus/cascading-watertank1-20sim/sources/motionprofiles.c
/usr/bin/i686-w64-mingw32-gcc  -Dcascading_watertank1_20sim_EXPORTS -fmessage-length=0 -std=c11 @CMakeFiles/cascading-watertank1-20sim.dir/includes_C.rsp   -o CMakeFiles/cascading-watertank1-20sim.dir/sources/xxinverse.c.obj   -c /home/jenkins/builds/workspace/into-cps-public-coe-test-fmus/cascading-watertank1-20sim/sources/xxinverse.c
/usr/bin/cmake -E cmake_progress_report /home/jenkins/builds/workspace/into-cps-public-coe-test-fmus/cascading-watertank1-20sim/build/win32/CMakeFiles 9
Building C object CMakeFiles/cascading-watertank1-20sim.dir/sources/EulerAngles.c.obj
/usr/bin/i686-w64-mingw32-gcc  -Dcascading_watertank1_20sim_EXPORTS -fmessage-length=0 -std=c11 @CMakeFiles/cascading-watertank1-20sim.dir/includes_C.rsp   -o CMakeFiles/cascading-watertank1-20sim.dir/sources/EulerAngles.c.obj   -c /home/jenkins/builds/workspace/into-cps-public-coe-test-fmus/cascading-watertank1-20sim/sources/EulerAngles.c
[100%] Building C object CMakeFiles/cascading-watertank1-20sim.dir/sources/xxsubmod.c.obj
/usr/bin/i686-w64-mingw32-gcc  -Dcascading_watertank1_20sim_EXPORTS -fmessage-length=0 -std=c11 @CMakeFiles/cascading-watertank1-20sim.dir/includes_C.rsp   -o CMakeFiles/cascading-watertank1-20sim.dir/sources/xxsubmod.c.obj   -c /home/jenkins/builds/workspace/into-cps-public-coe-test-fmus/cascading-watertank1-20sim/sources/xxsubmod.c
Linking C shared library cascading-watertank1-20sim.dll
/usr/bin/cmake -E cmake_link_script CMakeFiles/cascading-watertank1-20sim.dir/link.txt --verbose=1
/usr/bin/cmake -E remove -f CMakeFiles/cascading-watertank1-20sim.dir/objects.a
/usr/bin/i686-w64-mingw32-ar cr CMakeFiles/cascading-watertank1-20sim.dir/objects.a @CMakeFiles/cascading-watertank1-20sim.dir/objects1.rsp
/usr/bin/i686-w64-mingw32-gcc    -fmessage-length=0 -std=c11  -static-libstdc++ -static-libgcc -shared -o cascading-watertank1-20sim.dll -Wl,--out-implib,libcascading-watertank1-20sim.dll.a -Wl,--major-image-version,0,--minor-image-version,0 -Wl,--whole-archive CMakeFiles/cascading-watertank1-20sim.dir/objects.a -Wl,--no-whole-archive @CMakeFiles/cascading-watertank1-20sim.dir/linklibs.rsp
make[2]: Leaving directory `/home/jenkins/builds/workspace/into-cps-public-coe-test-fmus/cascading-watertank1-20sim/build/win32'
/usr/bin/cmake -E cmake_progress_report /home/jenkins/builds/workspace/into-cps-public-coe-test-fmus/cascading-watertank1-20sim/build/win32/CMakeFiles  1 2 3 4 5 6 7 8 9
[100%] Built target cascading-watertank1-20sim
make[1]: Leaving directory `/home/jenkins/builds/workspace/into-cps-public-coe-test-fmus/cascading-watertank1-20sim/build/win32'
/usr/bin/cmake -E cmake_progress_start /home/jenkins/builds/workspace/into-cps-public-coe-test-fmus/cascading-watertank1-20sim/build/win32/CMakeFiles 0
make: Leaving directory `/home/jenkins/builds/workspace/into-cps-public-coe-test-fmus/cascading-watertank1-20sim/build/win32'
Copying files...
Zipping...
  adding: sources/ (stored 0%)
  adding: sources/motionprofiles.h (deflated 50%)
  adding: sources/fmiGUID.h (stored 0%)
  adding: sources/ModelConfiguration.xml (deflated 83%)
  adding: sources/fmi2Functions.c (deflated 76%)
  adding: sources/xxfuncs.c (deflated 52%)
  adding: sources/xxmodel.h (deflated 63%)
  adding: sources/xxmodel.c (deflated 70%)
  adding: sources/xxinteg.c (deflated 82%)
  adding: sources/xxmatrix.h (deflated 48%)
  adding: sources/xxinteg.h (deflated 62%)
  adding: sources/xxinverse.c (deflated 48%)
  adding: sources/xxmatrix.c (deflated 48%)
  adding: sources/fmi2FunctionTypes.h (deflated 73%)
  adding: sources/EulerAngles.h (deflated 63%)
  adding: sources/guid.txt (stored 0%)
  adding: sources/fmi2TypesPlatform.h (deflated 62%)
  adding: sources/xxfuncs.h (deflated 50%)
  adding: sources/motionprofiles.c (deflated 50%)
  adding: sources/xxtypes.h (deflated 55%)
  adding: sources/GUID.xml (deflated 12%)
  adding: sources/xxsubmod.h (deflated 52%)
  adding: sources/tokens.xml (deflated 84%)
  adding: sources/EulerAngles.c (deflated 63%)
  adding: sources/variables.txt (deflated 42%)
  adding: sources/xxsubmod.c (deflated 64%)
  adding: sources/fmi2Functions.h (deflated 74%)
  adding: binaries/ (stored 0%)
  adding: binaries/linux32/ (stored 0%)
  adding: binaries/linux32/cascading-watertank1-20sim.so (deflated 69%)
  adding: binaries/win32/ (stored 0%)
  adding: binaries/win32/cascading-watertank1-20sim.dll (deflated 66%)
  adding: binaries/linux64/ (stored 0%)
  adding: binaries/linux64/cascading-watertank1-20sim.so (deflated 69%)
  adding: binaries/win64/ (stored 0%)
  adding: binaries/win64/cascading-watertank1-20sim.dll (deflated 68%)
  adding: binaries/darwin64/ (stored 0%)
  adding: binaries/darwin64/cascading-watertank1-20sim.dylib (deflated 85%)
  adding: resources/ (stored 0%)
  adding: modelDescription.xml (deflated 87%)
Folder is ./watertankcontroller-overture
Cleadning old builds ...
Overture tool wrapper
--2016-07-19 09:03:51--  http://overture.au.dk/into-cps/vdm-tool-wrapper/development/latest/vdm-tool-wrapper.zip
Resolving overture.au.dk (overture.au.dk)... 10.29.0.40
Connecting to overture.au.dk (overture.au.dk)|10.29.0.40|:80... connected.
HTTP request sent, awaiting response... 200 OK
Length: 30474087 (29M) [application/zip]
Saving to: ‘vdm-tool-wrapper.zip’

     0K .......... .......... .......... .......... ..........  0% 3.27M 9s
    50K .......... .......... .......... .......... ..........  0% 12.5M 6s
   100K .......... .......... .......... .......... ..........  0%  241M 4s
   150K .......... .......... .......... .......... ..........  0%  118M 3s
   200K .......... .......... .......... .......... ..........  0% 64.2M 2s
   250K .......... .......... .......... .......... ..........  1% 50.1M 2s
   300K .......... .......... .......... .......... ..........  1% 73.9M 2s
   350K .......... .......... .......... .......... ..........  1% 53.1M 2s
   400K .......... .......... .......... .......... ..........  1% 38.9M 2s
   450K .......... .......... .......... .......... ..........  1% 53.2M 1s
   500K .......... .......... .......... .......... ..........  1% 43.4M 1s
   550K .......... .......... .......... .......... ..........  2% 50.7M 1s
   600K .......... .......... .......... .......... ..........  2% 63.9M 1s
   650K .......... .......... .......... .......... ..........  2% 3.29M 2s
   700K .......... .......... .......... .......... ..........  2%  107M 2s
   750K .......... .......... .......... .......... ..........  2%  181M 2s
   800K .......... .......... .......... .......... ..........  2%  108M 1s
   850K .......... .......... .......... .......... ..........  3%  221M 1s
   900K .......... .......... .......... .......... ..........  3%  135M 1s
   950K .......... .......... .......... .......... ..........  3%  122M 1s
  1000K .......... .......... .......... .......... ..........  3% 99.5M 1s
  1050K .......... .......... .......... .......... ..........  3% 80.6M 1s
  1100K .......... .......... .......... .......... ..........  3% 95.1M 1s
  1150K .......... .......... .......... .......... ..........  4%  113M 1s
  1200K .......... .......... .......... .......... ..........  4% 80.4M 1s
  1250K .......... .......... .......... .......... ..........  4% 79.9M 1s
  1300K .......... .......... .......... .......... ..........  4% 69.2M 1s
  1350K .......... .......... .......... .......... ..........  4%  129M 1s
  1400K .......... .......... .......... .......... ..........  4% 71.2M 1s
  1450K .......... .......... .......... .......... ..........  5% 66.4M 1s
  1500K .......... .......... .......... .......... ..........  5% 87.5M 1s
  1550K .......... .......... .......... .......... ..........  5%  102M 1s
  1600K .......... .......... .......... .......... ..........  5%  125M 1s
  1650K .......... .......... .......... .......... ..........  5%  123M 1s
  1700K .......... .......... .......... .......... ..........  5%  135M 1s
  1750K .......... .......... .......... .......... ..........  6%  102M 1s
  1800K .......... .......... .......... .......... ..........  6% 95.8M 1s
  1850K .......... .......... .......... .......... ..........  6%  113M 1s
  1900K .......... .......... .......... .......... ..........  6% 98.6M 1s
  1950K .......... .......... .......... .......... ..........  6% 91.0M 1s
  2000K .......... .......... .......... .......... ..........  6% 93.2M 1s
  2050K .......... .......... .......... .......... ..........  7%  109M 1s
  2100K .......... .......... .......... .......... ..........  7% 92.0M 1s
  2150K .......... .......... .......... .......... ..........  7%  127M 1s
  2200K .......... .......... .......... .......... ..........  7%  120M 1s
  2250K .......... .......... .......... .......... ..........  7%  201M 1s
  2300K .......... .......... .......... .......... ..........  7%  195M 1s
  2350K .......... .......... .......... .......... ..........  8%  221M 1s
  2400K .......... .......... .......... .......... ..........  8%  161M 1s
  2450K .......... .......... .......... .......... ..........  8%  211M 1s
  2500K .......... .......... .......... .......... ..........  8%  236M 1s
  2550K .......... .......... .......... .......... ..........  8%  219M 1s
  2600K .......... .......... .......... .......... ..........  8%  178M 1s
  2650K .......... .......... .......... .......... ..........  9%  213M 1s
  2700K .......... .......... .......... .......... ..........  9%  228M 1s
  2750K .......... .......... .......... .......... ..........  9%  214M 1s
  2800K .......... .......... .......... .......... ..........  9%  157M 1s
  2850K .......... .......... .......... .......... ..........  9%  219M 1s
  2900K .......... .......... .......... .......... ..........  9%  222M 1s
  2950K .......... .......... .......... .......... .......... 10%  229M 1s
  3000K .......... .......... .......... .......... .......... 10% 5.38M 1s
  3050K .......... .......... .......... .......... .......... 10%  244M 1s
  3100K .......... .......... .......... .......... .......... 10%  184M 1s
  3150K .......... .......... .......... .......... .......... 10%  151M 1s
  3200K .......... .......... .......... .......... .......... 10%  200M 1s
  3250K .......... .......... .......... .......... .......... 11%  251M 1s
  3300K .......... .......... .......... .......... .......... 11%  232M 1s
  3350K .......... .......... .......... .......... .......... 11%  252M 1s
  3400K .......... .......... .......... .......... .......... 11% 13.5M 1s
  3450K .......... .......... .......... .......... .......... 11% 6.19M 1s
  3500K .......... .......... .......... .......... .......... 11%  244M 1s
  3550K .......... .......... .......... .......... .......... 12%  251M 1s
  3600K .......... .......... .......... .......... .......... 12%  122M 1s
  3650K .......... .......... .......... .......... .......... 12% 12.7M 1s
  3700K .......... .......... .......... .......... .......... 12%  184M 1s
  3750K .......... .......... .......... .......... .......... 12% 56.9M 1s
  3800K .......... .......... .......... .......... .......... 12%  219M 1s
  3850K .......... .......... .......... .......... .......... 13% 99.3M 1s
  3900K .......... .......... .......... .......... .......... 13% 70.5M 1s
  3950K .......... .......... .......... .......... .......... 13%  240M 1s
  4000K .......... .......... .......... .......... .......... 13% 82.5M 1s
  4050K .......... .......... .......... .......... .......... 13% 94.7M 1s
  4100K .......... .......... .......... .......... .......... 13%  227M 1s
  4150K .......... .......... .......... .......... .......... 14% 92.7M 1s
  4200K .......... .......... .......... .......... .......... 14%  100M 1s
  4250K .......... .......... .......... .......... .......... 14% 80.1M 1s
  4300K .......... .......... .......... .......... .......... 14% 84.0M 1s
  4350K .......... .......... .......... .......... .......... 14% 40.4M 1s
  4400K .......... .......... .......... .......... .......... 14% 24.3M 1s
  4450K .......... .......... .......... .......... .......... 15% 24.9M 1s
  4500K .......... .......... .......... .......... .......... 15% 19.3M 1s
  4550K .......... .......... .......... .......... .......... 15% 61.3M 1s
  4600K .......... .......... .......... .......... .......... 15%  220M 1s
  4650K .......... .......... .......... .......... .......... 15%  180M 1s
  4700K .......... .......... .......... .......... .......... 15%  151M 1s
  4750K .......... .......... .......... .......... .......... 16%  181M 1s
  4800K .......... .......... .......... .......... .......... 16%  150M 1s
  4850K .......... .......... .......... .......... .......... 16%  175M 1s
  4900K .......... .......... .......... .......... .......... 16%  145M 1s
  4950K .......... .......... .......... .......... .......... 16% 93.4M 1s
  5000K .......... .......... .......... .......... .......... 16%  147M 1s
  5050K .......... .......... .......... .......... .......... 17% 38.3M 1s
  5100K .......... .......... .......... .......... .......... 17% 97.0M 1s
  5150K .......... .......... .......... .......... .......... 17% 97.4M 1s
  5200K .......... .......... .......... .......... .......... 17% 96.3M 1s
  5250K .......... .......... .......... .......... .......... 17% 30.0M 1s
  5300K .......... .......... .......... .......... .......... 17% 39.4M 1s
  5350K .......... .......... .......... .......... .......... 18% 6.31M 1s
  5400K .......... .......... .......... .......... .......... 18% 8.96M 1s
  5450K .......... .......... .......... .......... .......... 18% 9.55M 1s
  5500K .......... .......... .......... .......... .......... 18% 14.3M 1s
  5550K .......... .......... .......... .......... .......... 18% 21.7M 1s
  5600K .......... .......... .......... .......... .......... 18% 23.8M 1s
  5650K .......... .......... .......... .......... .......... 19% 70.6M 1s
  5700K .......... .......... .......... .......... .......... 19%  179M 1s
  5750K .......... .......... .......... .......... .......... 19% 19.0M 1s
  5800K .......... .......... .......... .......... .......... 19% 72.4M 1s
  5850K .......... .......... .......... .......... .......... 19%  175M 1s
  5900K .......... .......... .......... .......... .......... 19%  157M 1s
  5950K .......... .......... .......... .......... .......... 20%  184M 1s
  6000K .......... .......... .......... .......... .......... 20%  162M 1s
  6050K .......... .......... .......... .......... .......... 20%  172M 1s
  6100K .......... .......... .......... .......... .......... 20%  171M 1s
  6150K .......... .......... .......... .......... .......... 20% 22.4M 1s
  6200K .......... .......... .......... .......... .......... 21%  117M 1s
  6250K .......... .......... .......... .......... .......... 21%  104M 1s
  6300K .......... .......... .......... .......... .......... 21% 95.1M 1s
  6350K .......... .......... .......... .......... .......... 21%  113M 1s
  6400K .......... .......... .......... .......... .......... 21%  114M 1s
  6450K .......... .......... .......... .......... .......... 21%  104M 1s
  6500K .......... .......... .......... .......... .......... 22%  129M 1s
  6550K .......... .......... .......... .......... .......... 22%  124M 1s
  6600K .......... .......... .......... .......... .......... 22%  119M 1s
  6650K .......... .......... .......... .......... .......... 22% 73.2M 1s
  6700K .......... .......... .......... .......... .......... 22%  121M 1s
  6750K .......... .......... .......... .......... .......... 22%  120M 1s
  6800K .......... .......... .......... .......... .......... 23%  111M 1s
  6850K .......... .......... .......... .......... .......... 23%  111M 1s
  6900K .......... .......... .......... .......... .......... 23%  123M 0s
  6950K .......... .......... .......... .......... .......... 23%  109M 0s
  7000K .......... .......... .......... .......... .......... 23%  129M 0s
  7050K .......... .......... .......... .......... .......... 23%  110M 0s
  7100K .......... .......... .......... .......... .......... 24%  116M 0s
  7150K .......... .......... .......... .......... .......... 24%  117M 0s
  7200K .......... .......... .......... .......... .......... 24%  116M 0s
  7250K .......... .......... .......... .......... .......... 24% 82.2M 0s
  7300K .......... .......... .......... .......... .......... 24%  107M 0s
  7350K .......... .......... .......... .......... .......... 24%  142M 0s
  7400K .......... .......... .......... .......... .......... 25%  129M 0s
  7450K .......... .......... .......... .......... .......... 25%  114M 0s
  7500K .......... .......... .......... .......... .......... 25%  128M 0s
  7550K .......... .......... .......... .......... .......... 25%  135M 0s
  7600K .......... .......... .......... .......... .......... 25%  127M 0s
  7650K .......... .......... .......... .......... .......... 25%  108M 0s
  7700K .......... .......... .......... .......... .......... 26%  128M 0s
  7750K .......... .......... .......... .......... .......... 26%  109M 0s
  7800K .......... .......... .......... .......... .......... 26%  131M 0s
  7850K .......... .......... .......... .......... .......... 26%  117M 0s
  7900K .......... .......... .......... .......... .......... 26%  123M 0s
  7950K .......... .......... .......... .......... .......... 26%  140M 0s
  8000K .......... .......... .......... .......... .......... 27%  118M 0s
  8050K .......... .......... .......... .......... .......... 27%  109M 0s
  8100K .......... .......... .......... .......... .......... 27%  131M 0s
  8150K .......... .......... .......... .......... .......... 27%  124M 0s
  8200K .......... .......... .......... .......... .......... 27%  132M 0s
  8250K .......... .......... .......... .......... .......... 27%  116M 0s
  8300K .......... .......... .......... .......... .......... 28%  133M 0s
  8350K .......... .......... .......... .......... .......... 28%  106M 0s
  8400K .......... .......... .......... .......... .......... 28%  134M 0s
  8450K .......... .......... .......... .......... .......... 28%  111M 0s
  8500K .......... .......... .......... .......... .......... 28%  128M 0s
  8550K .......... .......... .......... .......... .......... 28%  140M 0s
  8600K .......... .......... .......... .......... .......... 29%  132M 0s
  8650K .......... .......... .......... .......... .......... 29%  115M 0s
  8700K .......... .......... .......... .......... .......... 29%  116M 0s
  8750K .......... .......... .......... .......... .......... 29%  121M 0s
  8800K .......... .......... .......... .......... .......... 29%  133M 0s
  8850K .......... .......... .......... .......... .......... 29%  109M 0s
  8900K .......... .......... .......... .......... .......... 30%  142M 0s
  8950K .......... .......... .......... .......... .......... 30%  135M 0s
  9000K .......... .......... .......... .......... .......... 30%  140M 0s
  9050K .......... .......... .......... .......... .......... 30%  111M 0s
  9100K .......... .......... .......... .......... .......... 30%  142M 0s
  9150K .......... .......... .......... .......... .......... 30%  131M 0s
  9200K .......... .......... .......... .......... .......... 31%  117M 0s
  9250K .......... .......... .......... .......... .......... 31%  115M 0s
  9300K .......... .......... .......... .......... .......... 31% 2.18M 0s
  9350K .......... .......... .......... .......... .......... 31% 91.7M 0s
  9400K .......... .......... .......... .......... .......... 31%  144M 0s
  9450K .......... .......... .......... .......... .......... 31% 66.1M 0s
  9500K .......... .......... .......... .......... .......... 32% 50.1M 0s
  9550K .......... .......... .......... .......... .......... 32% 32.4M 0s
  9600K .......... .......... .......... .......... .......... 32% 35.5M 0s
  9650K .......... .......... .......... .......... .......... 32% 25.1M 0s
  9700K .......... .......... .......... .......... .......... 32% 45.4M 0s
  9750K .......... .......... .......... .......... .......... 32% 37.2M 0s
  9800K .......... .......... .......... .......... .......... 33% 40.6M 0s
  9850K .......... .......... .......... .......... .......... 33% 39.9M 0s
  9900K .......... .......... .......... .......... .......... 33% 36.0M 0s
  9950K .......... .......... .......... .......... .......... 33% 30.0M 0s
 10000K .......... .......... .......... .......... .......... 33% 38.4M 0s
 10050K .......... .......... .......... .......... .......... 33% 28.6M 0s
 10100K .......... .......... .......... .......... .......... 34% 33.5M 0s
 10150K .......... .......... .......... .......... .......... 34% 38.4M 0s
 10200K .......... .......... .......... .......... .......... 34% 31.6M 0s
 10250K .......... .......... .......... .......... .......... 34% 28.9M 0s
 10300K .......... .......... .......... .......... .......... 34% 38.1M 0s
 10350K .......... .......... .......... .......... .......... 34% 48.8M 0s
 10400K .......... .......... .......... .......... .......... 35% 36.9M 0s
 10450K .......... .......... .......... .......... .......... 35% 45.3M 0s
 10500K .......... .......... .......... .......... .......... 35% 30.2M 0s
 10550K .......... .......... .......... .......... .......... 35% 29.5M 0s
 10600K .......... .......... .......... .......... .......... 35% 26.0M 0s
 10650K .......... .......... .......... .......... .......... 35%  127M 0s
 10700K .......... .......... .......... .......... .......... 36%  260M 0s
 10750K .......... .......... .......... .......... .......... 36%  257M 0s
 10800K .......... .......... .......... .......... .......... 36%  246M 0s
 10850K .......... .......... .......... .......... .......... 36%  181M 0s
 10900K .......... .......... .......... .......... .......... 36%  266M 0s
 10950K .......... .......... .......... .......... .......... 36%  266M 0s
 11000K .......... .......... .......... .......... .......... 37%  273M 0s
 11050K .......... .......... .......... .......... .......... 37%  217M 0s
 11100K .......... .......... .......... .......... .......... 37%  281M 0s
 11150K .......... .......... .......... .......... .......... 37%  235M 0s
 11200K .......... .......... .......... .......... .......... 37%  269M 0s
 11250K .......... .......... .......... .......... .......... 37%  210M 0s
 11300K .......... .......... .......... .......... .......... 38%  267M 0s
 11350K .......... .......... .......... .......... .......... 38% 37.2M 0s
 11400K .......... .......... .......... .......... .......... 38% 37.0M 0s
 11450K .......... .......... .......... .......... .......... 38% 32.0M 0s
 11500K .......... .......... .......... .......... .......... 38% 38.9M 0s
 11550K .......... .......... .......... .......... .......... 38% 10.9M 0s
 11600K .......... .......... .......... .......... .......... 39%  261M 0s
 11650K .......... .......... .......... .......... .......... 39%  260M 0s
 11700K .......... .......... .......... .......... .......... 39%  267M 0s
 11750K .......... .......... .......... .......... .......... 39%  285M 0s
 11800K .......... .......... .......... .......... .......... 39%  259M 0s
 11850K .......... .......... .......... .......... .......... 39%  243M 0s
 11900K .......... .......... .......... .......... .......... 40%  274M 0s
 11950K .......... .......... .......... .......... .......... 40%  274M 0s
 12000K .......... .......... .......... .......... .......... 40%  275M 0s
 12050K .......... .......... .......... .......... .......... 40%  241M 0s
 12100K .......... .......... .......... .......... .......... 40%  206M 0s
 12150K .......... .......... .......... .......... .......... 40%  243M 0s
 12200K .......... .......... .......... .......... .......... 41%  272M 0s
 12250K .......... .......... .......... .......... .......... 41%  233M 0s
 12300K .......... .......... .......... .......... .......... 41%  282M 0s
 12350K .......... .......... .......... .......... .......... 41%  268M 0s
 12400K .......... .......... .......... .......... .......... 41%  276M 0s
 12450K .......... .......... .......... .......... .......... 42%  260M 0s
 12500K .......... .......... .......... .......... .......... 42%  302M 0s
 12550K .......... .......... .......... .......... .......... 42%  299M 0s
 12600K .......... .......... .......... .......... .......... 42%  303M 0s
 12650K .......... .......... .......... .......... .......... 42%  267M 0s
 12700K .......... .......... .......... .......... .......... 42%  296M 0s
 12750K .......... .......... .......... .......... .......... 43%  299M 0s
 12800K .......... .......... .......... .......... .......... 43%  283M 0s
 12850K .......... .......... .......... .......... .......... 43%  253M 0s
 12900K .......... .......... .......... .......... .......... 43%  304M 0s
 12950K .......... .......... .......... .......... .......... 43%  315M 0s
 13000K .......... .......... .......... .......... .......... 43%  338M 0s
 13050K .......... .......... .......... .......... .......... 44%  260M 0s
 13100K .......... .......... .......... .......... .......... 44%  319M 0s
 13150K .......... .......... .......... .......... .......... 44%  279M 0s
 13200K .......... .......... .......... .......... .......... 44%  299M 0s
 13250K .......... .......... .......... .......... .......... 44%  269M 0s
 13300K .......... .......... .......... .......... .......... 44% 55.8M 0s
 13350K .......... .......... .......... .......... .......... 45% 43.7M 0s
 13400K .......... .......... .......... .......... .......... 45% 42.6M 0s
 13450K .......... .......... .......... .......... .......... 45% 36.1M 0s
 13500K .......... .......... .......... .......... .......... 45% 40.1M 0s
 13550K .......... .......... .......... .......... .......... 45% 42.4M 0s
 13600K .......... .......... .......... .......... .......... 45% 41.5M 0s
 13650K .......... .......... .......... .......... .......... 46% 33.6M 0s
 13700K .......... .......... .......... .......... .......... 46%  166M 0s
 13750K .......... .......... .......... .......... .......... 46%  286M 0s
 13800K .......... .......... .......... .......... .......... 46%  307M 0s
 13850K .......... .......... .......... .......... .......... 46%  253M 0s
 13900K .......... .......... .......... .......... .......... 46%  287M 0s
 13950K .......... .......... .......... .......... .......... 47%  301M 0s
 14000K .......... .......... .......... .......... .......... 47%  305M 0s
 14050K .......... .......... .......... .......... .......... 47%  276M 0s
 14100K .......... .......... .......... .......... .......... 47%  317M 0s
 14150K .......... .......... .......... .......... .......... 47%  294M 0s
 14200K .......... .......... .......... .......... .......... 47%  307M 0s
 14250K .......... .......... .......... .......... .......... 48%  267M 0s
 14300K .......... .......... .......... .......... .......... 48%  157M 0s
 14350K .......... .......... .......... .......... .......... 48%  264M 0s
 14400K .......... .......... .......... .......... .......... 48%  311M 0s
 14450K .......... .......... .......... .......... .......... 48%  270M 0s
 14500K .......... .......... .......... .......... .......... 48%  316M 0s
 14550K .......... .......... .......... .......... .......... 49%  271M 0s
 14600K .......... .......... .......... .......... .......... 49%  309M 0s
 14650K .......... .......... .......... .......... .......... 49% 3.06M 0s
 14700K .......... .......... .......... .......... .......... 49% 43.6M 0s
 14750K .......... .......... .......... .......... .......... 49% 44.0M 0s
 14800K .......... .......... .......... .......... .......... 49% 44.9M 0s
 14850K .......... .......... .......... .......... .......... 50% 39.4M 0s
 14900K .......... .......... .......... .......... .......... 50% 46.9M 0s
 14950K .......... .......... .......... .......... .......... 50% 8.73M 0s
 15000K .......... .......... .......... .......... .......... 50% 10.1M 0s
 15050K .......... .......... .......... .......... .......... 50% 51.8M 0s
 15100K .......... .......... .......... .......... .......... 50%  319M 0s
 15150K .......... .......... .......... .......... .......... 51%  335M 0s
 15200K .......... .......... .......... .......... .......... 51%  347M 0s
 15250K .......... .......... .......... .......... .......... 51%  289M 0s
 15300K .......... .......... .......... .......... .......... 51%  336M 0s
 15350K .......... .......... .......... .......... .......... 51%  350M 0s
 15400K .......... .......... .......... .......... .......... 51%  343M 0s
 15450K .......... .......... .......... .......... .......... 52%  304M 0s
 15500K .......... .......... .......... .......... .......... 52%  342M 0s
 15550K .......... .......... .......... .......... .......... 52%  325M 0s
 15600K .......... .......... .......... .......... .......... 52%  356M 0s
 15650K .......... .......... .......... .......... .......... 52%  306M 0s
 15700K .......... .......... .......... .......... .......... 52%  347M 0s
 15750K .......... .......... .......... .......... .......... 53%  335M 0s
 15800K .......... .......... .......... .......... .......... 53%  110M 0s
 15850K .......... .......... .......... .......... .......... 53% 43.6M 0s
 15900K .......... .......... .......... .......... .......... 53% 51.2M 0s
 15950K .......... .......... .......... .......... .......... 53% 52.1M 0s
 16000K .......... .......... .......... .......... .......... 53% 51.0M 0s
 16050K .......... .......... .......... .......... .......... 54% 43.5M 0s
 16100K .......... .......... .......... .......... .......... 54%  172M 0s
 16150K .......... .......... .......... .......... .......... 54%  320M 0s
 16200K .......... .......... .......... .......... .......... 54%  319M 0s
 16250K .......... .......... .......... .......... .......... 54%  299M 0s
 16300K .......... .......... .......... .......... .......... 54%  327M 0s
 16350K .......... .......... .......... .......... .......... 55%  324M 0s
 16400K .......... .......... .......... .......... .......... 55%  336M 0s
 16450K .......... .......... .......... .......... .......... 55%  294M 0s
 16500K .......... .......... .......... .......... .......... 55%  318M 0s
 16550K .......... .......... .......... .......... .......... 55%  358M 0s
 16600K .......... .......... .......... .......... .......... 55%  334M 0s
 16650K .......... .......... .......... .......... .......... 56%  286M 0s
 16700K .......... .......... .......... .......... .......... 56%  350M 0s
 16750K .......... .......... .......... .......... .......... 56%  324M 0s
 16800K .......... .......... .......... .......... .......... 56%  358M 0s
 16850K .......... .......... .......... .......... .......... 56%  279M 0s
 16900K .......... .......... .......... .......... .......... 56%  323M 0s
 16950K .......... .......... .......... .......... .......... 57%  300M 0s
 17000K .......... .......... .......... .......... .......... 57%  342M 0s
 17050K .......... .......... .......... .......... .......... 57%  299M 0s
 17100K .......... .......... .......... .......... .......... 57%  311M 0s
 17150K .......... .......... .......... .......... .......... 57%  345M 0s
 17200K .......... .......... .......... .......... .......... 57%  362M 0s
 17250K .......... .......... .......... .......... .......... 58%  286M 0s
 17300K .......... .......... .......... .......... .......... 58%  358M 0s
 17350K .......... .......... .......... .......... .......... 58%  343M 0s
 17400K .......... .......... .......... .......... .......... 58%  349M 0s
 17450K .......... .......... .......... .......... .......... 58%  314M 0s
 17500K .......... .......... .......... .......... .......... 58%  341M 0s
 17550K .......... .......... .......... .......... .......... 59%  314M 0s
 17600K .......... .......... .......... .......... .......... 59%  360M 0s
 17650K .......... .......... .......... .......... .......... 59% 4.81M 0s
 17700K .......... .......... .......... .......... .......... 59% 25.7M 0s
 17750K .......... .......... .......... .......... .......... 59% 25.0M 0s
 17800K .......... .......... .......... .......... .......... 59% 3.55M 0s
 17850K .......... .......... .......... .......... .......... 60% 2.29M 0s
 17900K .......... .......... .......... .......... .......... 60%  174M 0s
 17950K .......... .......... .......... .......... .......... 60%  162M 0s
 18000K .......... .......... .......... .......... .......... 60%  164M 0s
 18050K .......... .......... .......... .......... .......... 60%  158M 0s
 18100K .......... .......... .......... .......... .......... 60%  173M 0s
 18150K .......... .......... .......... .......... .......... 61%  190M 0s
 18200K .......... .......... .......... .......... .......... 61%  196M 0s
 18250K .......... .......... .......... .......... .......... 61% 5.15M 0s
 18300K .......... .......... .......... .......... .......... 61%  196M 0s
 18350K .......... .......... .......... .......... .......... 61%  184M 0s
 18400K .......... .......... .......... .......... .......... 61%  179M 0s
 18450K .......... .......... .......... .......... .......... 62%  153M 0s
 18500K .......... .......... .......... .......... .......... 62%  178M 0s
 18550K .......... .......... .......... .......... .......... 62%  183M 0s
 18600K .......... .......... .......... .......... .......... 62%  183M 0s
 18650K .......... .......... .......... .......... .......... 62%  143M 0s
 18700K .......... .......... .......... .......... .......... 63%  189M 0s
 18750K .......... .......... .......... .......... .......... 63%  195M 0s
 18800K .......... .......... .......... .......... .......... 63%  186M 0s
 18850K .......... .......... .......... .......... .......... 63%  167M 0s
 18900K .......... .......... .......... .......... .......... 63%  204M 0s
 18950K .......... .......... .......... .......... .......... 63%  192M 0s
 19000K .......... .......... .......... .......... .......... 64%  196M 0s
 19050K .......... .......... .......... .......... .......... 64%  164M 0s
 19100K .......... .......... .......... .......... .......... 64%  206M 0s
 19150K .......... .......... .......... .......... .......... 64%  195M 0s
 19200K .......... .......... .......... .......... .......... 64%  194M 0s
 19250K .......... .......... .......... .......... .......... 64%  155M 0s
 19300K .......... .......... .......... .......... .......... 65%  196M 0s
 19350K .......... .......... .......... .......... .......... 65%  190M 0s
 19400K .......... .......... .......... .......... .......... 65%  186M 0s
 19450K .......... .......... .......... .......... .......... 65%  173M 0s
 19500K .......... .......... .......... .......... .......... 65%  196M 0s
 19550K .......... .......... .......... .......... .......... 65%  199M 0s
 19600K .......... .......... .......... .......... .......... 66%  200M 0s
 19650K .......... .......... .......... .......... .......... 66%  139M 0s
 19700K .......... .......... .......... .......... .......... 66%  188M 0s
 19750K .......... .......... .......... .......... .......... 66% 5.35M 0s
 19800K .......... .......... .......... .......... .......... 66% 21.7M 0s
 19850K .......... .......... .......... .......... .......... 66%  184M 0s
 19900K .......... .......... .......... .......... .......... 67%  159M 0s
 19950K .......... .......... .......... .......... .......... 67%  194M 0s
 20000K .......... .......... .......... .......... .......... 67%  198M 0s
 20050K .......... .......... .......... .......... .......... 67%  166M 0s
 20100K .......... .......... .......... .......... .......... 67%  203M 0s
 20150K .......... .......... .......... .......... .......... 67%  197M 0s
 20200K .......... .......... .......... .......... .......... 68%  164M 0s
 20250K .......... .......... .......... .......... .......... 68%  179M 0s
 20300K .......... .......... .......... .......... .......... 68%  208M 0s
 20350K .......... .......... .......... .......... .......... 68%  168M 0s
 20400K .......... .......... .......... .......... .......... 68%  193M 0s
 20450K .......... .......... .......... .......... .......... 68%  171M 0s
 20500K .......... .......... .......... .......... .......... 69%  114M 0s
 20550K .......... .......... .......... .......... .......... 69%  119M 0s
 20600K .......... .......... .......... .......... .......... 69%  117M 0s
 20650K .......... .......... .......... .......... .......... 69%  111M 0s
 20700K .......... .......... .......... .......... .......... 69% 5.17M 0s
 20750K .......... .......... .......... .......... .......... 69% 8.40M 0s
 20800K .......... .......... .......... .......... .......... 70% 32.1M 0s
 20850K .......... .......... .......... .......... .......... 70% 34.7M 0s
 20900K .......... .......... .......... .......... .......... 70% 50.2M 0s
 20950K .......... .......... .......... .......... .......... 70% 45.5M 0s
 21000K .......... .......... .......... .......... .......... 70% 26.8M 0s
 21050K .......... .......... .......... .......... .......... 70% 41.3M 0s
 21100K .......... .......... .......... .......... .......... 71% 28.5M 0s
 21150K .......... .......... .......... .......... .......... 71% 31.7M 0s
 21200K .......... .......... .......... .......... .......... 71% 54.5M 0s
 21250K .......... .......... .......... .......... .......... 71% 29.8M 0s
 21300K .......... .......... .......... .......... .......... 71% 18.6M 0s
 21350K .......... .......... .......... .......... .......... 71% 42.4M 0s
 21400K .......... .......... .......... .......... .......... 72% 56.8M 0s
 21450K .......... .......... .......... .......... .......... 72% 47.1M 0s
 21500K .......... .......... .......... .......... .......... 72% 33.8M 0s
 21550K .......... .......... .......... .......... .......... 72% 72.5M 0s
 21600K .......... .......... .......... .......... .......... 72% 30.7M 0s
 21650K .......... .......... .......... .......... .......... 72% 41.9M 0s
 21700K .......... .......... .......... .......... .......... 73% 51.8M 0s
 21750K .......... .......... .......... .......... .......... 73% 47.7M 0s
 21800K .......... .......... .......... .......... .......... 73% 32.1M 0s
 21850K .......... .......... .......... .......... .......... 73% 70.9M 0s
 21900K .......... .......... .......... .......... .......... 73% 4.69M 0s
 21950K .......... .......... .......... .......... .......... 73% 31.6M 0s
 22000K .......... .......... .......... .......... .......... 74% 39.2M 0s
 22050K .......... .......... .......... .......... .......... 74% 41.4M 0s
 22100K .......... .......... .......... .......... .......... 74% 42.4M 0s
 22150K .......... .......... .......... .......... .......... 74% 36.0M 0s
 22200K .......... .......... .......... .......... .......... 74% 39.8M 0s
 22250K .......... .......... .......... .......... .......... 74% 42.6M 0s
 22300K .......... .......... .......... .......... .......... 75% 40.6M 0s
 22350K .......... .......... .......... .......... .......... 75% 44.2M 0s
 22400K .......... .......... .......... .......... .......... 75%  251M 0s
 22450K .......... .......... .......... .......... .......... 75%  239M 0s
 22500K .......... .......... .......... .......... .......... 75%  214M 0s
 22550K .......... .......... .......... .......... .......... 75%  216M 0s
 22600K .......... .......... .......... .......... .......... 76%  254M 0s
 22650K .......... .......... .......... .......... .......... 76%  278M 0s
 22700K .......... .......... .......... .......... .......... 76%  261M 0s
 22750K .......... .......... .......... .......... .......... 76%  208M 0s
 22800K .......... .......... .......... .......... .......... 76%  248M 0s
 22850K .......... .......... .......... .......... .......... 76%  247M 0s
 22900K .......... .......... .......... .......... .......... 77%  262M 0s
 22950K .......... .......... .......... .......... .......... 77%  124M 0s
 23000K .......... .......... .......... .......... .......... 77%  215M 0s
 23050K .......... .......... .......... .......... .......... 77%  246M 0s
 23100K .......... .......... .......... .......... .......... 77%  147M 0s
 23150K .......... .......... .......... .......... .......... 77%  180M 0s
 23200K .......... .......... .......... .......... .......... 78%  258M 0s
 23250K .......... .......... .......... .......... .......... 78%  197M 0s
 23300K .......... .......... .......... .......... .......... 78%  218M 0s
 23350K .......... .......... .......... .......... .......... 78%  209M 0s
 23400K .......... .......... .......... .......... .......... 78%  225M 0s
 23450K .......... .......... .......... .......... .......... 78%  217M 0s
 23500K .......... .......... .......... .......... .......... 79%  226M 0s
 23550K .......... .......... .......... .......... .......... 79%  177M 0s
 23600K .......... .......... .......... .......... .......... 79%  204M 0s
 23650K .......... .......... .......... .......... .......... 79%  274M 0s
 23700K .......... .......... .......... .......... .......... 79%  218M 0s
 23750K .......... .......... .......... .......... .......... 79%  205M 0s
 23800K .......... .......... .......... .......... .......... 80% 5.10M 0s
 23850K .......... .......... .......... .......... .......... 80% 5.82M 0s
 23900K .......... .......... .......... .......... .......... 80% 25.8M 0s
 23950K .......... .......... .......... .......... .......... 80% 22.5M 0s
 24000K .......... .......... .......... .......... .......... 80% 25.8M 0s
 24050K .......... .......... .......... .......... .......... 80% 27.0M 0s
 24100K .......... .......... .......... .......... .......... 81% 28.9M 0s
 24150K .......... .......... .......... .......... .......... 81% 47.4M 0s
 24200K .......... .......... .......... .......... .......... 81%  175M 0s
 24250K .......... .......... .......... .......... .......... 81%  166M 0s
 24300K .......... .......... .......... .......... .......... 81% 4.34M 0s
 24350K .......... .......... .......... .......... .......... 81% 25.3M 0s
 24400K .......... .......... .......... .......... .......... 82% 32.5M 0s
 24450K .......... .......... .......... .......... .......... 82% 32.7M 0s
 24500K .......... .......... .......... .......... .......... 82% 31.0M 0s
 24550K .......... .......... .......... .......... .......... 82% 28.8M 0s
 24600K .......... .......... .......... .......... .......... 82% 31.5M 0s
 24650K .......... .......... .......... .......... .......... 82% 56.8M 0s
 24700K .......... .......... .......... .......... .......... 83%  189M 0s
 24750K .......... .......... .......... .......... .......... 83%  164M 0s
 24800K .......... .......... .......... .......... .......... 83%  105M 0s
 24850K .......... .......... .......... .......... .......... 83%  187M 0s
 24900K .......... .......... .......... .......... .......... 83%  195M 0s
 24950K .......... .......... .......... .......... .......... 84%  168M 0s
 25000K .......... .......... .......... .......... .......... 84%  178M 0s
 25050K .......... .......... .......... .......... .......... 84%  162M 0s
 25100K .......... .......... .......... .......... .......... 84%  191M 0s
 25150K .......... .......... .......... .......... .......... 84%  154M 0s
 25200K .......... .......... .......... .......... .......... 84%  179M 0s
 25250K .......... .......... .......... .......... .......... 85%  179M 0s
 25300K .......... .......... .......... .......... .......... 85%  208M 0s
 25350K .......... .......... .......... .......... .......... 85%  172M 0s
 25400K .......... .......... .......... .......... .......... 85%  189M 0s
 25450K .......... .......... .......... .......... .......... 85%  204M 0s
 25500K .......... .......... .......... .......... .......... 85%  208M 0s
 25550K .......... .......... .......... .......... .......... 86%  175M 0s
 25600K .......... .......... .......... .......... .......... 86%  219M 0s
 25650K .......... .......... .......... .......... .......... 86%  201M 0s
 25700K .......... .......... .......... .......... .......... 86%  190M 0s
 25750K .......... .......... .......... .......... .......... 86%  166M 0s
 25800K .......... .......... .......... .......... .......... 86%  261M 0s
 25850K .......... .......... .......... .......... .......... 87% 66.4M 0s
 25900K .......... .......... .......... .......... .......... 87% 35.9M 0s
 25950K .......... .......... .......... .......... .......... 87% 29.8M 0s
 26000K .......... .......... .......... .......... .......... 87% 35.3M 0s
 26050K .......... .......... .......... .......... .......... 87% 37.3M 0s
 26100K .......... .......... .......... .......... .......... 87% 37.4M 0s
 26150K .......... .......... .......... .......... .......... 88% 32.7M 0s
 26200K .......... .......... .......... .......... .......... 88% 57.4M 0s
 26250K .......... .......... .......... .......... .......... 88%  314M 0s
 26300K .......... .......... .......... .......... .......... 88%  330M 0s
 26350K .......... .......... .......... .......... .......... 88%  252M 0s
 26400K .......... .......... .......... .......... .......... 88%  307M 0s
 26450K .......... .......... .......... .......... .......... 89%  302M 0s
 26500K .......... .......... .......... .......... .......... 89%  308M 0s
 26550K .......... .......... .......... .......... .......... 89%  277M 0s
 26600K .......... .......... .......... .......... .......... 89%  339M 0s
 26650K .......... .......... .......... .......... .......... 89%  296M 0s
 26700K .......... .......... .......... .......... .......... 89%  305M 0s
 26750K .......... .......... .......... .......... .......... 90%  284M 0s
 26800K .......... .......... .......... .......... .......... 90%  347M 0s
 26850K .......... .......... .......... .......... .......... 90%  265M 0s
 26900K .......... .......... .......... .......... .......... 90%  284M 0s
 26950K .......... .......... .......... .......... .......... 90%  283M 0s
 27000K .......... .......... .......... .......... .......... 90%  328M 0s
 27050K .......... .......... .......... .......... .......... 91%  301M 0s
 27100K .......... .......... .......... .......... .......... 91%  283M 0s
 27150K .......... .......... .......... .......... .......... 91%  267M 0s
 27200K .......... .......... .......... .......... .......... 91%  230M 0s
 27250K .......... .......... .......... .......... .......... 91%  230M 0s
 27300K .......... .......... .......... .......... .......... 91%  219M 0s
 27350K .......... .......... .......... .......... .......... 92%  191M 0s
 27400K .......... .......... .......... .......... .......... 92%  216M 0s
 27450K .......... .......... .......... .......... .......... 92% 82.8M 0s
 27500K .......... .......... .......... .......... .......... 92% 13.3M 0s
 27550K .......... .......... .......... .......... .......... 92% 9.06M 0s
 27600K .......... .......... .......... .......... .......... 92% 39.0M 0s
 27650K .......... .......... .......... .......... .......... 93% 41.9M 0s
 27700K .......... .......... .......... .......... .......... 93% 43.0M 0s
 27750K .......... .......... .......... .......... .......... 93% 36.3M 0s
 27800K .......... .......... .......... .......... .......... 93% 42.9M 0s
 27850K .......... .......... .......... .......... .......... 93% 43.1M 0s
 27900K .......... .......... .......... .......... .......... 93% 40.2M 0s
 27950K .......... .......... .......... .......... .......... 94% 59.0M 0s
 28000K .......... .......... .......... .......... .......... 94%  244M 0s
 28050K .......... .......... .......... .......... .......... 94%  127M 0s
 28100K .......... .......... .......... .......... .......... 94%  259M 0s
 28150K .......... .......... .......... .......... .......... 94%  212M 0s
 28200K .......... .......... .......... .......... .......... 94%  252M 0s
 28250K .......... .......... .......... .......... .......... 95%  259M 0s
 28300K .......... .......... .......... .......... .......... 95%  262M 0s
 28350K .......... .......... .......... .......... .......... 95%  225M 0s
 28400K .......... .......... .......... .......... .......... 95%  257M 0s
 28450K .......... .......... .......... .......... .......... 95%  265M 0s
 28500K .......... .......... .......... .......... .......... 95%  132M 0s
 28550K .......... .......... .......... .......... .......... 96%  217M 0s
 28600K .......... .......... .......... .......... .......... 96%  224M 0s
 28650K .......... .......... .......... .......... .......... 96%  250M 0s
 28700K .......... .......... .......... .......... .......... 96%  248M 0s
 28750K .......... .......... .......... .......... .......... 96%  160M 0s
 28800K .......... .......... .......... .......... .......... 96%  250M 0s
 28850K .......... .......... .......... .......... .......... 97%  277M 0s
 28900K .......... .......... .......... .......... .......... 97%  266M 0s
 28950K .......... .......... .......... .......... .......... 97%  231M 0s
 29000K .......... .......... .......... .......... .......... 97%  206M 0s
 29050K .......... .......... .......... .......... .......... 97%  280M 0s
 29100K .......... .......... .......... .......... .......... 97%  275M 0s
 29150K .......... .......... .......... .......... .......... 98%  236M 0s
 29200K .......... .......... .......... .......... .......... 98%  214M 0s
 29250K .......... .......... .......... .......... .......... 98%  273M 0s
 29300K .......... .......... .......... .......... .......... 98%  284M 0s
 29350K .......... .......... .......... .......... .......... 98%  230M 0s
 29400K .......... .......... .......... .......... .......... 98%  281M 0s
 29450K .......... .......... .......... .......... .......... 99%  286M 0s
 29500K .......... .......... .......... .......... .......... 99%  278M 0s
 29550K .......... .......... .......... .......... .......... 99%  227M 0s
 29600K .......... .......... .......... .......... .......... 99% 96.4M 0s
 29650K .......... .......... .......... .......... .......... 99% 45.0M 0s
 29700K .......... .......... .......... .......... .......... 99% 43.4M 0s
 29750K .........                                             100% 24.9M=0.6s

2016-07-19 09:03:51 (51.8 MB/s) - ‘vdm-tool-wrapper.zip’ saved [30474087/30474087]

Archive:  vdm-tool-wrapper.zip
  Length      Date    Time    Name
---------  ---------- -----   ----
        0  2016-07-11 11:38   vdm-tool-wrapper/
        0  2016-02-25 09:37   vdm-tool-wrapper/binaries/
        0  2016-02-24 23:52   vdm-tool-wrapper/binaries/darwin64/
  5352992  2016-06-30 14:42   vdm-tool-wrapper/binaries/darwin64/vdm-tool-wrapper.dylib
        0  2016-02-24 23:52   vdm-tool-wrapper/binaries/win32/
 11841051  2016-06-30 14:42   vdm-tool-wrapper/binaries/win32/vdm-tool-wrapper.dll
        0  2016-02-24 23:52   vdm-tool-wrapper/binaries/linux64/
  5373802  2016-06-30 14:42   vdm-tool-wrapper/binaries/linux64/vdm-tool-wrapper.so
        0  2016-02-24 23:52   vdm-tool-wrapper/binaries/win64/
 14685852  2016-06-30 14:42   vdm-tool-wrapper/binaries/win64/vdm-tool-wrapper.dll
      340  2016-06-30 14:42   vdm-tool-wrapper/binaries/git-info.txt
        0  2016-02-24 23:52   vdm-tool-wrapper/binaries/linux32/
  4942780  2016-06-30 14:42   vdm-tool-wrapper/binaries/linux32/vdm-tool-wrapper.so
        0  2016-07-11 11:38   vdm-tool-wrapper/resources/
      160  2016-07-11 11:38   vdm-tool-wrapper/resources/git-info-interpreter.txt
 20353073  2016-07-11 11:38   vdm-tool-wrapper/resources/fmi-interpreter-0.0.3-SNAPSHOT-jar-with-dependencies.jar
       76  2016-07-11 11:38   vdm-tool-wrapper/resources/config.txt
     2530  2016-07-11 11:38   vdm-tool-wrapper/modelDescription.xml
---------                     -------
 62552656                     18 files
Archive:  vdm-tool-wrapper.zip
  inflating: ./watertankcontroller-overture/resources/config.txt  
Archive:  vdm-tool-wrapper.zip
  inflating: ./watertankcontroller-overture/resources/fmi-interpreter-0.0.3-SNAPSHOT-jar-with-dependencies.jar  
Archive:  vdm-tool-wrapper.zip
  inflating: ./watertankcontroller-overture/build/darwin64/vdm-tool-wrapper.dylib  
Archive:  vdm-tool-wrapper.zip
  inflating: ./watertankcontroller-overture/build/win32/vdm-tool-wrapper.dll  
Archive:  vdm-tool-wrapper.zip
  inflating: ./watertankcontroller-overture/build/win64/vdm-tool-wrapper.dll  
Archive:  vdm-tool-wrapper.zip
  inflating: ./watertankcontroller-overture/build/linux32/vdm-tool-wrapper.so  
Archive:  vdm-tool-wrapper.zip
  inflating: ./watertankcontroller-overture/build/linux64/vdm-tool-wrapper.so  
Copying files...
Zipping...
  adding: sources/ (stored 0%)
  adding: sources/IO.vdmrt (deflated 56%)
  adding: sources/ValveActuator.vdmrt (deflated 42%)
  adding: sources/System.vdmrt (deflated 45%)
  adding: sources/Controller.vdmrt (deflated 50%)
  adding: sources/contract.csc (deflated 42%)
  adding: sources/LevelSensor.vdmrt (deflated 41%)
  adding: sources/World.vdmrt (deflated 35%)
  adding: sources/modelDescription.xml (deflated 71%)
  adding: sources/vdm.link (deflated 52%)
  adding: binaries/ (stored 0%)
  adding: binaries/linux32/ (stored 0%)
  adding: binaries/linux32/watertankcontroller-overture.so (deflated 73%)
  adding: binaries/win32/ (stored 0%)
  adding: binaries/win32/watertankcontroller-overture.dll (deflated 71%)
  adding: binaries/linux64/ (stored 0%)
  adding: binaries/linux64/watertankcontroller-overture.so (deflated 75%)
  adding: binaries/win64/ (stored 0%)
  adding: binaries/win64/watertankcontroller-overture.dll (deflated 75%)
  adding: binaries/darwin64/ (stored 0%)
  adding: binaries/darwin64/watertankcontroller-overture.dylib (deflated 79%)
  adding: resources/ (stored 0%)
  adding: resources/fmi-interpreter-0.0.1-SNAPSHOT-jar-with-dependencies.jar (deflated 3%)
  adding: resources/config.txt (deflated 5%)
  adding: resources/fmi-interpreter-0.0.3-SNAPSHOT-jar-with-dependencies.jar (deflated 4%)
  adding: modelDescription.xml (deflated 66%)
Folder is ./rollback-test
Cleadning old builds ...
Compiling using CMake and make
Building Darwin 64 .dylib
-- Compiler..
-- Compiler..GNUGNU
-- Checking whether C compiler has -isysroot
-- Checking whether C compiler has -isysroot - yes
-- Checking whether C compiler supports OSX deployment target flag
-- Checking whether C compiler supports OSX deployment target flag - yes
-- Checking whether CXX compiler has -isysroot
-- Checking whether CXX compiler has -isysroot - no
-- Checking whether CXX compiler supports OSX deployment target flag
-- Checking whether CXX compiler supports OSX deployment target flag - no
-- Performing Test COMPILER_SUPPORTS_CXX11
-- Performing Test COMPILER_SUPPORTS_CXX11 - Success
-- Performing Test COMPILER_SUPPORTS_CXX0X
-- Performing Test COMPILER_SUPPORTS_CXX0X - Success
-- Static linking with libstdc++.a in 
-- Configuring done
-- Generating done
-- Build files have been written to: /home/jenkins/builds/workspace/into-cps-public-coe-test-fmus/rollback-test/build/darwin64
make: Entering directory `/home/jenkins/builds/workspace/into-cps-public-coe-test-fmus/rollback-test/build/darwin64'
/usr/bin/cmake -H/home/jenkins/builds/workspace/into-cps-public-coe-test-fmus/rollback-test -B/home/jenkins/builds/workspace/into-cps-public-coe-test-fmus/rollback-test/build/darwin64 --check-build-system CMakeFiles/Makefile.cmake 0
/usr/bin/cmake -E cmake_progress_start /home/jenkins/builds/workspace/into-cps-public-coe-test-fmus/rollback-test/build/darwin64/CMakeFiles /home/jenkins/builds/workspace/into-cps-public-coe-test-fmus/rollback-test/build/darwin64/CMakeFiles/progress.marks
make -f CMakeFiles/Makefile2 all
make[1]: Entering directory `/home/jenkins/builds/workspace/into-cps-public-coe-test-fmus/rollback-test/build/darwin64'
make -f CMakeFiles/rollback-test.dir/build.make CMakeFiles/rollback-test.dir/depend
make[2]: Entering directory `/home/jenkins/builds/workspace/into-cps-public-coe-test-fmus/rollback-test/build/darwin64'
cd /home/jenkins/builds/workspace/into-cps-public-coe-test-fmus/rollback-test/build/darwin64 && /usr/bin/cmake -E cmake_depends "Unix Makefiles" /home/jenkins/builds/workspace/into-cps-public-coe-test-fmus/rollback-test /home/jenkins/builds/workspace/into-cps-public-coe-test-fmus/rollback-test /home/jenkins/builds/workspace/into-cps-public-coe-test-fmus/rollback-test/build/darwin64 /home/jenkins/builds/workspace/into-cps-public-coe-test-fmus/rollback-test/build/darwin64 /home/jenkins/builds/workspace/into-cps-public-coe-test-fmus/rollback-test/build/darwin64/CMakeFiles/rollback-test.dir/DependInfo.cmake --color=
Scanning dependencies of target rollback-test
make[2]: Leaving directory `/home/jenkins/builds/workspace/into-cps-public-coe-test-fmus/rollback-test/build/darwin64'
make -f CMakeFiles/rollback-test.dir/build.make CMakeFiles/rollback-test.dir/build
make[2]: Entering directory `/home/jenkins/builds/workspace/into-cps-public-coe-test-fmus/rollback-test/build/darwin64'
/usr/bin/cmake -E cmake_progress_report /home/jenkins/builds/workspace/into-cps-public-coe-test-fmus/rollback-test/build/darwin64/CMakeFiles 1
[100%] Building CXX object CMakeFiles/rollback-test.dir/sources/fmu.cpp.o
/var/lib/osxcross/target/bin/x86_64-apple-darwin15-g++   -DFMI_COSIMULATION -DGUID1=\"{ddd}\" -DLIBXML_STATIC -Drollback_test_EXPORTS -std=c++11 -fmessage-length=0 -std=c11 -I/home/jenkins/builds/workspace/into-cps-public-coe-test-fmus/rollback-test/build/darwin64 -I/home/jenkins/builds/workspace/into-cps-public-coe-test-fmus/rollback-test -I/home/jenkins/builds/workspace/into-cps-public-coe-test-fmus/rollback-test/sources -I/home/jenkins/builds/workspace/into-cps-public-coe-test-fmus/rollback-test/../includes/fmi    -o CMakeFiles/rollback-test.dir/sources/fmu.cpp.o -c /home/jenkins/builds/workspace/into-cps-public-coe-test-fmus/rollback-test/sources/fmu.cpp
cc1plus: warning: command line option '-std=c11' is valid for C/ObjC but not for C++
Linking CXX shared library rollback-test.dylib
/usr/bin/cmake -E cmake_link_script CMakeFiles/rollback-test.dir/link.txt --verbose=1
/var/lib/osxcross/target/bin/x86_64-apple-darwin15-g++   -std=c++11 -fmessage-length=0 -std=c11 -dynamiclib -Wl,-headerpad_max_install_names  -o rollback-test.dylib -install_name /home/jenkins/builds/workspace/into-cps-public-coe-test-fmus/rollback-test/build/darwin64/rollback-test.dylib CMakeFiles/rollback-test.dir/sources/fmu.cpp.o -lpthread 
make[2]: Leaving directory `/home/jenkins/builds/workspace/into-cps-public-coe-test-fmus/rollback-test/build/darwin64'
/usr/bin/cmake -E cmake_progress_report /home/jenkins/builds/workspace/into-cps-public-coe-test-fmus/rollback-test/build/darwin64/CMakeFiles  1
[100%] Built target rollback-test
make[1]: Leaving directory `/home/jenkins/builds/workspace/into-cps-public-coe-test-fmus/rollback-test/build/darwin64'
/usr/bin/cmake -E cmake_progress_start /home/jenkins/builds/workspace/into-cps-public-coe-test-fmus/rollback-test/build/darwin64/CMakeFiles 0
make: Leaving directory `/home/jenkins/builds/workspace/into-cps-public-coe-test-fmus/rollback-test/build/darwin64'
Building Linux x64 .so
-- The C compiler identification is GNU 4.8.4
-- The CXX compiler identification is GNU 4.8.4
-- Check for working C compiler: /usr/bin/cc
-- Check for working C compiler: /usr/bin/cc -- works
-- Detecting C compiler ABI info
-- Detecting C compiler ABI info - done
-- Detecting C compile features
-- Detecting C compile features - done
-- Check for working CXX compiler: /usr/bin/c++
-- Check for working CXX compiler: /usr/bin/c++ -- works
-- Detecting CXX compiler ABI info
-- Detecting CXX compiler ABI info - done
-- Detecting CXX compile features
-- Detecting CXX compile features - done
-- Performing Test COMPILER_SUPPORTS_CXX11
-- Performing Test COMPILER_SUPPORTS_CXX11 - Success
-- Performing Test COMPILER_SUPPORTS_CXX0X
-- Performing Test COMPILER_SUPPORTS_CXX0X - Success
-- Static linking with libstdc++.a in /usr/lib/gcc/x86_64-linux-gnu/4.8/libstdc++.a
-- Configuring done
-- Generating done
-- Build files have been written to: /home/jenkins/builds/workspace/into-cps-public-coe-test-fmus/rollback-test/build/linux64
make: Entering directory `/home/jenkins/builds/workspace/into-cps-public-coe-test-fmus/rollback-test/build/linux64'
/usr/bin/cmake -H/home/jenkins/builds/workspace/into-cps-public-coe-test-fmus/rollback-test -B/home/jenkins/builds/workspace/into-cps-public-coe-test-fmus/rollback-test/build/linux64 --check-build-system CMakeFiles/Makefile.cmake 0
/usr/bin/cmake -E cmake_progress_start /home/jenkins/builds/workspace/into-cps-public-coe-test-fmus/rollback-test/build/linux64/CMakeFiles /home/jenkins/builds/workspace/into-cps-public-coe-test-fmus/rollback-test/build/linux64/CMakeFiles/progress.marks
make -f CMakeFiles/Makefile2 all
make[1]: Entering directory `/home/jenkins/builds/workspace/into-cps-public-coe-test-fmus/rollback-test/build/linux64'
make -f CMakeFiles/rollback-test.dir/build.make CMakeFiles/rollback-test.dir/depend
make[2]: Entering directory `/home/jenkins/builds/workspace/into-cps-public-coe-test-fmus/rollback-test/build/linux64'
cd /home/jenkins/builds/workspace/into-cps-public-coe-test-fmus/rollback-test/build/linux64 && /usr/bin/cmake -E cmake_depends "Unix Makefiles" /home/jenkins/builds/workspace/into-cps-public-coe-test-fmus/rollback-test /home/jenkins/builds/workspace/into-cps-public-coe-test-fmus/rollback-test /home/jenkins/builds/workspace/into-cps-public-coe-test-fmus/rollback-test/build/linux64 /home/jenkins/builds/workspace/into-cps-public-coe-test-fmus/rollback-test/build/linux64 /home/jenkins/builds/workspace/into-cps-public-coe-test-fmus/rollback-test/build/linux64/CMakeFiles/rollback-test.dir/DependInfo.cmake --color=
Scanning dependencies of target rollback-test
make[2]: Leaving directory `/home/jenkins/builds/workspace/into-cps-public-coe-test-fmus/rollback-test/build/linux64'
make -f CMakeFiles/rollback-test.dir/build.make CMakeFiles/rollback-test.dir/build
make[2]: Entering directory `/home/jenkins/builds/workspace/into-cps-public-coe-test-fmus/rollback-test/build/linux64'
/usr/bin/cmake -E cmake_progress_report /home/jenkins/builds/workspace/into-cps-public-coe-test-fmus/rollback-test/build/linux64/CMakeFiles 1
[100%] Building CXX object CMakeFiles/rollback-test.dir/sources/fmu.cpp.o
/usr/bin/c++   -DFMI_COSIMULATION -DGUID1=\"{ddd}\" -DLIBXML_STATIC -Drollback_test_EXPORTS -std=c++11 -fmessage-length=0 -std=c11 -fPIC -I/home/jenkins/builds/workspace/into-cps-public-coe-test-fmus/rollback-test/build/linux64 -I/home/jenkins/builds/workspace/into-cps-public-coe-test-fmus/rollback-test -I/home/jenkins/builds/workspace/into-cps-public-coe-test-fmus/rollback-test/sources -I/home/jenkins/builds/workspace/into-cps-public-coe-test-fmus/rollback-test/../includes/fmi    -o CMakeFiles/rollback-test.dir/sources/fmu.cpp.o -c /home/jenkins/builds/workspace/into-cps-public-coe-test-fmus/rollback-test/sources/fmu.cpp
cc1plus: warning: command line option ‘-std=c11’ is valid for C/ObjC but not for C++ [enabled by default]
Linking CXX shared library rollback-test.so
/usr/bin/cmake -E cmake_link_script CMakeFiles/rollback-test.dir/link.txt --verbose=1
/usr/bin/c++  -fPIC  -std=c++11 -fmessage-length=0 -std=c11 -fPIC  -shared -Wl,-soname,rollback-test.so -o rollback-test.so CMakeFiles/rollback-test.dir/sources/fmu.cpp.o -Wl,-Bstatic -lstdc++ -lpthread -Wl,-Bdynamic 
/usr/bin/ld: /usr/lib/gcc/x86_64-linux-gnu/4.8/../../../x86_64-linux-gnu/libpthread.a(unwind.o): relocation R_X86_64_32 against `.rodata.str1.8' can not be used when making a shared object; recompile with -fPIC
/usr/lib/gcc/x86_64-linux-gnu/4.8/../../../x86_64-linux-gnu/libpthread.a: error adding symbols: Bad value
collect2: error: ld returned 1 exit status
make[2]: *** [rollback-test.so] Error 1
make[2]: Leaving directory `/home/jenkins/builds/workspace/into-cps-public-coe-test-fmus/rollback-test/build/linux64'
make[1]: *** [CMakeFiles/rollback-test.dir/all] Error 2
make[1]: Leaving directory `/home/jenkins/builds/workspace/into-cps-public-coe-test-fmus/rollback-test/build/linux64'
make: *** [all] Error 2
make: Leaving directory `/home/jenkins/builds/workspace/into-cps-public-coe-test-fmus/rollback-test/build/linux64'
Build step 'Execute shell' marked build as failure
SSH: Current build result is [FAILURE], not going to run.
Started calculate disk usage of build
Finished Calculation of disk usage of build in 0 seconds
Started calculate disk usage of workspace
Finished Calculation of disk usage of workspace in 0 seconds
Finished: FAILURE