FailedConsole Output

Started by GitHub push by lausdahl
Building remotely on jenkinscrosscompiler (Xcompile) in workspace /home/jenkins/builds/workspace/into-cps-public-coe-test-fmus
Wiping out workspace first.
Cloning the remote Git repository
Cloning repository https://github.com/into-cps/public-coe-test-fmus.git
 > /usr/bin/git init /home/jenkins/builds/workspace/into-cps-public-coe-test-fmus # timeout=10
Fetching upstream changes from https://github.com/into-cps/public-coe-test-fmus.git
 > /usr/bin/git --version # timeout=10
 > /usr/bin/git -c core.askpass=true fetch --tags --progress https://github.com/into-cps/public-coe-test-fmus.git +refs/heads/*:refs/remotes/origin/*
 > /usr/bin/git config remote.origin.url https://github.com/into-cps/public-coe-test-fmus.git # timeout=10
 > /usr/bin/git config --add remote.origin.fetch +refs/heads/*:refs/remotes/origin/* # timeout=10
 > /usr/bin/git config remote.origin.url https://github.com/into-cps/public-coe-test-fmus.git # timeout=10
Fetching upstream changes from https://github.com/into-cps/public-coe-test-fmus.git
 > /usr/bin/git -c core.askpass=true fetch --tags --progress https://github.com/into-cps/public-coe-test-fmus.git +refs/heads/development:refs/remotes/origin/development
 > /usr/bin/git rev-parse refs/remotes/origin/development^{commit} # timeout=10
 > /usr/bin/git rev-parse refs/remotes/origin/refs/heads/development^{commit} # timeout=10
Checking out Revision e32164b4a02c0cfe273044265e901edb6de435ec (refs/remotes/origin/development)
 > /usr/bin/git config core.sparsecheckout # timeout=10
 > /usr/bin/git checkout -f e32164b4a02c0cfe273044265e901edb6de435ec
 > /usr/bin/git rev-list ab997c4ccfc80e0d7e9df77e97b5fc83fb5c113c # timeout=10
 > /usr/bin/git remote # timeout=10
 > /usr/bin/git submodule init # timeout=10
 > /usr/bin/git submodule sync # timeout=10
 > /usr/bin/git config --get remote.origin.url # timeout=10
 > /usr/bin/git submodule update --init --recursive
Setting commit status on GitHub for https://github.com/into-cps/public-coe-test-fmus/commit/e32164b4a02c0cfe273044265e901edb6de435ec
[into-cps-public-coe-test-fmus] $ /bin/sh -xe /tmp/hudson5566636455792438415.sh
+ pwd
/home/jenkins/builds/workspace/into-cps-public-coe-test-fmus
+ git submodule update --init
+ ./xcompile.sh
Folder is ./cascading-watertank1-20sim
Cleadning old builds ...
Compiling using CMake and make
Building Darwin 64 .dylib
-- Compiler..
-- Compiler..GNUGNU
-- Checking whether C compiler has -isysroot
-- Checking whether C compiler has -isysroot - yes
-- Checking whether C compiler supports OSX deployment target flag
-- Checking whether C compiler supports OSX deployment target flag - yes
-- Checking whether CXX compiler has -isysroot
-- Checking whether CXX compiler has -isysroot - no
-- Checking whether CXX compiler supports OSX deployment target flag
-- Checking whether CXX compiler supports OSX deployment target flag - no
-- Performing Test COMPILER_SUPPORTS_CXX11
-- Performing Test COMPILER_SUPPORTS_CXX11 - Success
-- Performing Test COMPILER_SUPPORTS_CXX0X
-- Performing Test COMPILER_SUPPORTS_CXX0X - Success
-- Static linking with libstdc++.a in 
-- Configuring done
-- Generating done
-- Build files have been written to: /home/jenkins/builds/workspace/into-cps-public-coe-test-fmus/cascading-watertank1-20sim/build/darwin64
make: Entering directory `/home/jenkins/builds/workspace/into-cps-public-coe-test-fmus/cascading-watertank1-20sim/build/darwin64'
/usr/bin/cmake -H/home/jenkins/builds/workspace/into-cps-public-coe-test-fmus/cascading-watertank1-20sim -B/home/jenkins/builds/workspace/into-cps-public-coe-test-fmus/cascading-watertank1-20sim/build/darwin64 --check-build-system CMakeFiles/Makefile.cmake 0
/usr/bin/cmake -E cmake_progress_start /home/jenkins/builds/workspace/into-cps-public-coe-test-fmus/cascading-watertank1-20sim/build/darwin64/CMakeFiles /home/jenkins/builds/workspace/into-cps-public-coe-test-fmus/cascading-watertank1-20sim/build/darwin64/CMakeFiles/progress.marks
make -f CMakeFiles/Makefile2 all
make[1]: Entering directory `/home/jenkins/builds/workspace/into-cps-public-coe-test-fmus/cascading-watertank1-20sim/build/darwin64'
make -f CMakeFiles/cascading-watertank1-20sim.dir/build.make CMakeFiles/cascading-watertank1-20sim.dir/depend
make[2]: Entering directory `/home/jenkins/builds/workspace/into-cps-public-coe-test-fmus/cascading-watertank1-20sim/build/darwin64'
cd /home/jenkins/builds/workspace/into-cps-public-coe-test-fmus/cascading-watertank1-20sim/build/darwin64 && /usr/bin/cmake -E cmake_depends "Unix Makefiles" /home/jenkins/builds/workspace/into-cps-public-coe-test-fmus/cascading-watertank1-20sim /home/jenkins/builds/workspace/into-cps-public-coe-test-fmus/cascading-watertank1-20sim /home/jenkins/builds/workspace/into-cps-public-coe-test-fmus/cascading-watertank1-20sim/build/darwin64 /home/jenkins/builds/workspace/into-cps-public-coe-test-fmus/cascading-watertank1-20sim/build/darwin64 /home/jenkins/builds/workspace/into-cps-public-coe-test-fmus/cascading-watertank1-20sim/build/darwin64/CMakeFiles/cascading-watertank1-20sim.dir/DependInfo.cmake --color=
Scanning dependencies of target cascading-watertank1-20sim
make[2]: Leaving directory `/home/jenkins/builds/workspace/into-cps-public-coe-test-fmus/cascading-watertank1-20sim/build/darwin64'
make -f CMakeFiles/cascading-watertank1-20sim.dir/build.make CMakeFiles/cascading-watertank1-20sim.dir/build
make[2]: Entering directory `/home/jenkins/builds/workspace/into-cps-public-coe-test-fmus/cascading-watertank1-20sim/build/darwin64'
/usr/bin/cmake -E cmake_progress_report /home/jenkins/builds/workspace/into-cps-public-coe-test-fmus/cascading-watertank1-20sim/build/darwin64/CMakeFiles 1
/usr/bin/cmake -E cmake_progress_report /home/jenkins/builds/workspace/into-cps-public-coe-test-fmus/cascading-watertank1-20sim/build/darwin64/CMakeFiles 2
/usr/bin/cmake -E cmake_progress_report /home/jenkins/builds/workspace/into-cps-public-coe-test-fmus/cascading-watertank1-20sim/build/darwin64/CMakeFiles 3
/usr/bin/cmake -E cmake_progress_report /home/jenkins/builds/workspace/into-cps-public-coe-test-fmus/cascading-watertank1-20sim/build/darwin64/CMakeFiles 4
[ 11%] [ 22%] [ 33%] [ 44%] Building C object CMakeFiles/cascading-watertank1-20sim.dir/sources/xxmodel.c.o
/var/lib/osxcross/target/bin/x86_64-apple-darwin15-gcc  -Dcascading_watertank1_20sim_EXPORTS -fmessage-length=0 -std=c11 -isysroot /var/lib/osxcross/target/SDK/MacOSX10.11.sdk -I/home/jenkins/builds/workspace/into-cps-public-coe-test-fmus/cascading-watertank1-20sim/build/darwin64 -I/home/jenkins/builds/workspace/into-cps-public-coe-test-fmus/cascading-watertank1-20sim -I/home/jenkins/builds/workspace/into-cps-public-coe-test-fmus/cascading-watertank1-20sim/sources -I/home/jenkins/builds/workspace/into-cps-public-coe-test-fmus/cascading-watertank1-20sim/../includes/fmi/include -I/home/jenkins/builds/workspace/into-cps-public-coe-test-fmus/cascading-watertank1-20sim/../includes/templates    -o CMakeFiles/cascading-watertank1-20sim.dir/sources/xxmodel.c.o   -c /home/jenkins/builds/workspace/into-cps-public-coe-test-fmus/cascading-watertank1-20sim/sources/xxmodel.c
Building C object CMakeFiles/cascading-watertank1-20sim.dir/sources/xxfuncs.c.o
/var/lib/osxcross/target/bin/x86_64-apple-darwin15-gcc  -Dcascading_watertank1_20sim_EXPORTS -fmessage-length=0 -std=c11 -isysroot /var/lib/osxcross/target/SDK/MacOSX10.11.sdk -I/home/jenkins/builds/workspace/into-cps-public-coe-test-fmus/cascading-watertank1-20sim/build/darwin64 -I/home/jenkins/builds/workspace/into-cps-public-coe-test-fmus/cascading-watertank1-20sim -I/home/jenkins/builds/workspace/into-cps-public-coe-test-fmus/cascading-watertank1-20sim/sources -I/home/jenkins/builds/workspace/into-cps-public-coe-test-fmus/cascading-watertank1-20sim/../includes/fmi/include -I/home/jenkins/builds/workspace/into-cps-public-coe-test-fmus/cascading-watertank1-20sim/../includes/templates    -o CMakeFiles/cascading-watertank1-20sim.dir/sources/xxfuncs.c.o   -c /home/jenkins/builds/workspace/into-cps-public-coe-test-fmus/cascading-watertank1-20sim/sources/xxfuncs.c
Building C object CMakeFiles/cascading-watertank1-20sim.dir/sources/fmi2Functions.c.o
/var/lib/osxcross/target/bin/x86_64-apple-darwin15-gcc  -Dcascading_watertank1_20sim_EXPORTS -fmessage-length=0 -std=c11 -isysroot /var/lib/osxcross/target/SDK/MacOSX10.11.sdk -I/home/jenkins/builds/workspace/into-cps-public-coe-test-fmus/cascading-watertank1-20sim/build/darwin64 -I/home/jenkins/builds/workspace/into-cps-public-coe-test-fmus/cascading-watertank1-20sim -I/home/jenkins/builds/workspace/into-cps-public-coe-test-fmus/cascading-watertank1-20sim/sources -I/home/jenkins/builds/workspace/into-cps-public-coe-test-fmus/cascading-watertank1-20sim/../includes/fmi/include -I/home/jenkins/builds/workspace/into-cps-public-coe-test-fmus/cascading-watertank1-20sim/../includes/templates    -o CMakeFiles/cascading-watertank1-20sim.dir/sources/fmi2Functions.c.o   -c /home/jenkins/builds/workspace/into-cps-public-coe-test-fmus/cascading-watertank1-20sim/sources/fmi2Functions.c
Building C object CMakeFiles/cascading-watertank1-20sim.dir/sources/xxinteg.c.o
/var/lib/osxcross/target/bin/x86_64-apple-darwin15-gcc  -Dcascading_watertank1_20sim_EXPORTS -fmessage-length=0 -std=c11 -isysroot /var/lib/osxcross/target/SDK/MacOSX10.11.sdk -I/home/jenkins/builds/workspace/into-cps-public-coe-test-fmus/cascading-watertank1-20sim/build/darwin64 -I/home/jenkins/builds/workspace/into-cps-public-coe-test-fmus/cascading-watertank1-20sim -I/home/jenkins/builds/workspace/into-cps-public-coe-test-fmus/cascading-watertank1-20sim/sources -I/home/jenkins/builds/workspace/into-cps-public-coe-test-fmus/cascading-watertank1-20sim/../includes/fmi/include -I/home/jenkins/builds/workspace/into-cps-public-coe-test-fmus/cascading-watertank1-20sim/../includes/templates    -o CMakeFiles/cascading-watertank1-20sim.dir/sources/xxinteg.c.o   -c /home/jenkins/builds/workspace/into-cps-public-coe-test-fmus/cascading-watertank1-20sim/sources/xxinteg.c
/usr/bin/cmake -E cmake_progress_report /home/jenkins/builds/workspace/into-cps-public-coe-test-fmus/cascading-watertank1-20sim/build/darwin64/CMakeFiles 5
/usr/bin/cmake -E cmake_progress_report /home/jenkins/builds/workspace/into-cps-public-coe-test-fmus/cascading-watertank1-20sim/build/darwin64/CMakeFiles 6
[ 55%] /usr/bin/cmake -E cmake_progress_report /home/jenkins/builds/workspace/into-cps-public-coe-test-fmus/cascading-watertank1-20sim/build/darwin64/CMakeFiles 7
[ 66%] Building C object CMakeFiles/cascading-watertank1-20sim.dir/sources/motionprofiles.c.o
/var/lib/osxcross/target/bin/x86_64-apple-darwin15-gcc  -Dcascading_watertank1_20sim_EXPORTS -fmessage-length=0 -std=c11 -isysroot /var/lib/osxcross/target/SDK/MacOSX10.11.sdk -I/home/jenkins/builds/workspace/into-cps-public-coe-test-fmus/cascading-watertank1-20sim/build/darwin64 -I/home/jenkins/builds/workspace/into-cps-public-coe-test-fmus/cascading-watertank1-20sim -I/home/jenkins/builds/workspace/into-cps-public-coe-test-fmus/cascading-watertank1-20sim/sources -I/home/jenkins/builds/workspace/into-cps-public-coe-test-fmus/cascading-watertank1-20sim/../includes/fmi/include -I/home/jenkins/builds/workspace/into-cps-public-coe-test-fmus/cascading-watertank1-20sim/../includes/templates    -o CMakeFiles/cascading-watertank1-20sim.dir/sources/motionprofiles.c.o   -c /home/jenkins/builds/workspace/into-cps-public-coe-test-fmus/cascading-watertank1-20sim/sources/motionprofiles.c
[ 77%] Building C object CMakeFiles/cascading-watertank1-20sim.dir/sources/xxinverse.c.o
/var/lib/osxcross/target/bin/x86_64-apple-darwin15-gcc  -Dcascading_watertank1_20sim_EXPORTS -fmessage-length=0 -std=c11 -isysroot /var/lib/osxcross/target/SDK/MacOSX10.11.sdk -I/home/jenkins/builds/workspace/into-cps-public-coe-test-fmus/cascading-watertank1-20sim/build/darwin64 -I/home/jenkins/builds/workspace/into-cps-public-coe-test-fmus/cascading-watertank1-20sim -I/home/jenkins/builds/workspace/into-cps-public-coe-test-fmus/cascading-watertank1-20sim/sources -I/home/jenkins/builds/workspace/into-cps-public-coe-test-fmus/cascading-watertank1-20sim/../includes/fmi/include -I/home/jenkins/builds/workspace/into-cps-public-coe-test-fmus/cascading-watertank1-20sim/../includes/templates    -o CMakeFiles/cascading-watertank1-20sim.dir/sources/xxinverse.c.o   -c /home/jenkins/builds/workspace/into-cps-public-coe-test-fmus/cascading-watertank1-20sim/sources/xxinverse.c
/usr/bin/cmake -E cmake_progress_report /home/jenkins/builds/workspace/into-cps-public-coe-test-fmus/cascading-watertank1-20sim/build/darwin64/CMakeFiles 8
Building C object CMakeFiles/cascading-watertank1-20sim.dir/sources/xxmatrix.c.o
/var/lib/osxcross/target/bin/x86_64-apple-darwin15-gcc  -Dcascading_watertank1_20sim_EXPORTS -fmessage-length=0 -std=c11 -isysroot /var/lib/osxcross/target/SDK/MacOSX10.11.sdk -I/home/jenkins/builds/workspace/into-cps-public-coe-test-fmus/cascading-watertank1-20sim/build/darwin64 -I/home/jenkins/builds/workspace/into-cps-public-coe-test-fmus/cascading-watertank1-20sim -I/home/jenkins/builds/workspace/into-cps-public-coe-test-fmus/cascading-watertank1-20sim/sources -I/home/jenkins/builds/workspace/into-cps-public-coe-test-fmus/cascading-watertank1-20sim/../includes/fmi/include -I/home/jenkins/builds/workspace/into-cps-public-coe-test-fmus/cascading-watertank1-20sim/../includes/templates    -o CMakeFiles/cascading-watertank1-20sim.dir/sources/xxmatrix.c.o   -c /home/jenkins/builds/workspace/into-cps-public-coe-test-fmus/cascading-watertank1-20sim/sources/xxmatrix.c
[ 88%] /usr/bin/cmake -E cmake_progress_report /home/jenkins/builds/workspace/into-cps-public-coe-test-fmus/cascading-watertank1-20sim/build/darwin64/CMakeFiles 9
[100%] Building C object CMakeFiles/cascading-watertank1-20sim.dir/sources/EulerAngles.c.o
/var/lib/osxcross/target/bin/x86_64-apple-darwin15-gcc  -Dcascading_watertank1_20sim_EXPORTS -fmessage-length=0 -std=c11 -isysroot /var/lib/osxcross/target/SDK/MacOSX10.11.sdk -I/home/jenkins/builds/workspace/into-cps-public-coe-test-fmus/cascading-watertank1-20sim/build/darwin64 -I/home/jenkins/builds/workspace/into-cps-public-coe-test-fmus/cascading-watertank1-20sim -I/home/jenkins/builds/workspace/into-cps-public-coe-test-fmus/cascading-watertank1-20sim/sources -I/home/jenkins/builds/workspace/into-cps-public-coe-test-fmus/cascading-watertank1-20sim/../includes/fmi/include -I/home/jenkins/builds/workspace/into-cps-public-coe-test-fmus/cascading-watertank1-20sim/../includes/templates    -o CMakeFiles/cascading-watertank1-20sim.dir/sources/EulerAngles.c.o   -c /home/jenkins/builds/workspace/into-cps-public-coe-test-fmus/cascading-watertank1-20sim/sources/EulerAngles.c
Building C object CMakeFiles/cascading-watertank1-20sim.dir/sources/xxsubmod.c.o
/var/lib/osxcross/target/bin/x86_64-apple-darwin15-gcc  -Dcascading_watertank1_20sim_EXPORTS -fmessage-length=0 -std=c11 -isysroot /var/lib/osxcross/target/SDK/MacOSX10.11.sdk -I/home/jenkins/builds/workspace/into-cps-public-coe-test-fmus/cascading-watertank1-20sim/build/darwin64 -I/home/jenkins/builds/workspace/into-cps-public-coe-test-fmus/cascading-watertank1-20sim -I/home/jenkins/builds/workspace/into-cps-public-coe-test-fmus/cascading-watertank1-20sim/sources -I/home/jenkins/builds/workspace/into-cps-public-coe-test-fmus/cascading-watertank1-20sim/../includes/fmi/include -I/home/jenkins/builds/workspace/into-cps-public-coe-test-fmus/cascading-watertank1-20sim/../includes/templates    -o CMakeFiles/cascading-watertank1-20sim.dir/sources/xxsubmod.c.o   -c /home/jenkins/builds/workspace/into-cps-public-coe-test-fmus/cascading-watertank1-20sim/sources/xxsubmod.c
Linking C shared library cascading-watertank1-20sim.dylib
/usr/bin/cmake -E cmake_link_script CMakeFiles/cascading-watertank1-20sim.dir/link.txt --verbose=1
/var/lib/osxcross/target/bin/x86_64-apple-darwin15-gcc   -fmessage-length=0 -std=c11 -isysroot /var/lib/osxcross/target/SDK/MacOSX10.11.sdk -dynamiclib -Wl,-headerpad_max_install_names  -o cascading-watertank1-20sim.dylib -install_name /home/jenkins/builds/workspace/into-cps-public-coe-test-fmus/cascading-watertank1-20sim/build/darwin64/cascading-watertank1-20sim.dylib CMakeFiles/cascading-watertank1-20sim.dir/sources/fmi2Functions.c.o CMakeFiles/cascading-watertank1-20sim.dir/sources/xxfuncs.c.o CMakeFiles/cascading-watertank1-20sim.dir/sources/xxmodel.c.o CMakeFiles/cascading-watertank1-20sim.dir/sources/xxinteg.c.o CMakeFiles/cascading-watertank1-20sim.dir/sources/xxinverse.c.o CMakeFiles/cascading-watertank1-20sim.dir/sources/xxmatrix.c.o CMakeFiles/cascading-watertank1-20sim.dir/sources/motionprofiles.c.o CMakeFiles/cascading-watertank1-20sim.dir/sources/EulerAngles.c.o CMakeFiles/cascading-watertank1-20sim.dir/sources/xxsubmod.c.o -lpthread 
make[2]: Leaving directory `/home/jenkins/builds/workspace/into-cps-public-coe-test-fmus/cascading-watertank1-20sim/build/darwin64'
/usr/bin/cmake -E cmake_progress_report /home/jenkins/builds/workspace/into-cps-public-coe-test-fmus/cascading-watertank1-20sim/build/darwin64/CMakeFiles  1 2 3 4 5 6 7 8 9
[100%] Built target cascading-watertank1-20sim
make[1]: Leaving directory `/home/jenkins/builds/workspace/into-cps-public-coe-test-fmus/cascading-watertank1-20sim/build/darwin64'
/usr/bin/cmake -E cmake_progress_start /home/jenkins/builds/workspace/into-cps-public-coe-test-fmus/cascading-watertank1-20sim/build/darwin64/CMakeFiles 0
make: Leaving directory `/home/jenkins/builds/workspace/into-cps-public-coe-test-fmus/cascading-watertank1-20sim/build/darwin64'
Building Linux x64 .so
-- The C compiler identification is GNU 4.8.4
-- The CXX compiler identification is GNU 4.8.4
-- Check for working C compiler: /usr/bin/cc
-- Check for working C compiler: /usr/bin/cc -- works
-- Detecting C compiler ABI info
-- Detecting C compiler ABI info - done
-- Detecting C compile features
-- Detecting C compile features - done
-- Check for working CXX compiler: /usr/bin/c++
-- Check for working CXX compiler: /usr/bin/c++ -- works
-- Detecting CXX compiler ABI info
-- Detecting CXX compiler ABI info - done
-- Detecting CXX compile features
-- Detecting CXX compile features - done
-- Performing Test COMPILER_SUPPORTS_CXX11
-- Performing Test COMPILER_SUPPORTS_CXX11 - Success
-- Performing Test COMPILER_SUPPORTS_CXX0X
-- Performing Test COMPILER_SUPPORTS_CXX0X - Success
-- Static linking with libstdc++.a in /usr/lib/gcc/x86_64-linux-gnu/4.8/libstdc++.a
-- Configuring done
-- Generating done
-- Build files have been written to: /home/jenkins/builds/workspace/into-cps-public-coe-test-fmus/cascading-watertank1-20sim/build/linux64
make: Entering directory `/home/jenkins/builds/workspace/into-cps-public-coe-test-fmus/cascading-watertank1-20sim/build/linux64'
/usr/bin/cmake -H/home/jenkins/builds/workspace/into-cps-public-coe-test-fmus/cascading-watertank1-20sim -B/home/jenkins/builds/workspace/into-cps-public-coe-test-fmus/cascading-watertank1-20sim/build/linux64 --check-build-system CMakeFiles/Makefile.cmake 0
/usr/bin/cmake -E cmake_progress_start /home/jenkins/builds/workspace/into-cps-public-coe-test-fmus/cascading-watertank1-20sim/build/linux64/CMakeFiles /home/jenkins/builds/workspace/into-cps-public-coe-test-fmus/cascading-watertank1-20sim/build/linux64/CMakeFiles/progress.marks
make -f CMakeFiles/Makefile2 all
make[1]: Entering directory `/home/jenkins/builds/workspace/into-cps-public-coe-test-fmus/cascading-watertank1-20sim/build/linux64'
make -f CMakeFiles/cascading-watertank1-20sim.dir/build.make CMakeFiles/cascading-watertank1-20sim.dir/depend
make[2]: Entering directory `/home/jenkins/builds/workspace/into-cps-public-coe-test-fmus/cascading-watertank1-20sim/build/linux64'
cd /home/jenkins/builds/workspace/into-cps-public-coe-test-fmus/cascading-watertank1-20sim/build/linux64 && /usr/bin/cmake -E cmake_depends "Unix Makefiles" /home/jenkins/builds/workspace/into-cps-public-coe-test-fmus/cascading-watertank1-20sim /home/jenkins/builds/workspace/into-cps-public-coe-test-fmus/cascading-watertank1-20sim /home/jenkins/builds/workspace/into-cps-public-coe-test-fmus/cascading-watertank1-20sim/build/linux64 /home/jenkins/builds/workspace/into-cps-public-coe-test-fmus/cascading-watertank1-20sim/build/linux64 /home/jenkins/builds/workspace/into-cps-public-coe-test-fmus/cascading-watertank1-20sim/build/linux64/CMakeFiles/cascading-watertank1-20sim.dir/DependInfo.cmake --color=
Scanning dependencies of target cascading-watertank1-20sim
make[2]: Leaving directory `/home/jenkins/builds/workspace/into-cps-public-coe-test-fmus/cascading-watertank1-20sim/build/linux64'
make -f CMakeFiles/cascading-watertank1-20sim.dir/build.make CMakeFiles/cascading-watertank1-20sim.dir/build
make[2]: Entering directory `/home/jenkins/builds/workspace/into-cps-public-coe-test-fmus/cascading-watertank1-20sim/build/linux64'
/usr/bin/cmake -E cmake_progress_report /home/jenkins/builds/workspace/into-cps-public-coe-test-fmus/cascading-watertank1-20sim/build/linux64/CMakeFiles 1
/usr/bin/cmake -E cmake_progress_report /home/jenkins/builds/workspace/into-cps-public-coe-test-fmus/cascading-watertank1-20sim/build/linux64/CMakeFiles 2
/usr/bin/cmake -E cmake_progress_report /home/jenkins/builds/workspace/into-cps-public-coe-test-fmus/cascading-watertank1-20sim/build/linux64/CMakeFiles 3
[ 11%] [ 22%] [ 33%] /usr/bin/cmake -E cmake_progress_report /home/jenkins/builds/workspace/into-cps-public-coe-test-fmus/cascading-watertank1-20sim/build/linux64/CMakeFiles 4
[ 44%] Building C object CMakeFiles/cascading-watertank1-20sim.dir/sources/xxmodel.c.o
/usr/bin/cc  -Dcascading_watertank1_20sim_EXPORTS -fmessage-length=0 -std=c11 -fPIC -I/home/jenkins/builds/workspace/into-cps-public-coe-test-fmus/cascading-watertank1-20sim/build/linux64 -I/home/jenkins/builds/workspace/into-cps-public-coe-test-fmus/cascading-watertank1-20sim -I/home/jenkins/builds/workspace/into-cps-public-coe-test-fmus/cascading-watertank1-20sim/sources -I/home/jenkins/builds/workspace/into-cps-public-coe-test-fmus/cascading-watertank1-20sim/../includes/fmi/include -I/home/jenkins/builds/workspace/into-cps-public-coe-test-fmus/cascading-watertank1-20sim/../includes/templates    -o CMakeFiles/cascading-watertank1-20sim.dir/sources/xxmodel.c.o   -c /home/jenkins/builds/workspace/into-cps-public-coe-test-fmus/cascading-watertank1-20sim/sources/xxmodel.c
Building C object CMakeFiles/cascading-watertank1-20sim.dir/sources/xxfuncs.c.o
Building C object CMakeFiles/cascading-watertank1-20sim.dir/sources/fmi2Functions.c.o
/usr/bin/cc  -Dcascading_watertank1_20sim_EXPORTS -fmessage-length=0 -std=c11 -fPIC -I/home/jenkins/builds/workspace/into-cps-public-coe-test-fmus/cascading-watertank1-20sim/build/linux64 -I/home/jenkins/builds/workspace/into-cps-public-coe-test-fmus/cascading-watertank1-20sim -I/home/jenkins/builds/workspace/into-cps-public-coe-test-fmus/cascading-watertank1-20sim/sources -I/home/jenkins/builds/workspace/into-cps-public-coe-test-fmus/cascading-watertank1-20sim/../includes/fmi/include -I/home/jenkins/builds/workspace/into-cps-public-coe-test-fmus/cascading-watertank1-20sim/../includes/templates    -o CMakeFiles/cascading-watertank1-20sim.dir/sources/xxfuncs.c.o   -c /home/jenkins/builds/workspace/into-cps-public-coe-test-fmus/cascading-watertank1-20sim/sources/xxfuncs.c
/usr/bin/cc  -Dcascading_watertank1_20sim_EXPORTS -fmessage-length=0 -std=c11 -fPIC -I/home/jenkins/builds/workspace/into-cps-public-coe-test-fmus/cascading-watertank1-20sim/build/linux64 -I/home/jenkins/builds/workspace/into-cps-public-coe-test-fmus/cascading-watertank1-20sim -I/home/jenkins/builds/workspace/into-cps-public-coe-test-fmus/cascading-watertank1-20sim/sources -I/home/jenkins/builds/workspace/into-cps-public-coe-test-fmus/cascading-watertank1-20sim/../includes/fmi/include -I/home/jenkins/builds/workspace/into-cps-public-coe-test-fmus/cascading-watertank1-20sim/../includes/templates    -o CMakeFiles/cascading-watertank1-20sim.dir/sources/fmi2Functions.c.o   -c /home/jenkins/builds/workspace/into-cps-public-coe-test-fmus/cascading-watertank1-20sim/sources/fmi2Functions.c
Building C object CMakeFiles/cascading-watertank1-20sim.dir/sources/xxinteg.c.o
/usr/bin/cc  -Dcascading_watertank1_20sim_EXPORTS -fmessage-length=0 -std=c11 -fPIC -I/home/jenkins/builds/workspace/into-cps-public-coe-test-fmus/cascading-watertank1-20sim/build/linux64 -I/home/jenkins/builds/workspace/into-cps-public-coe-test-fmus/cascading-watertank1-20sim -I/home/jenkins/builds/workspace/into-cps-public-coe-test-fmus/cascading-watertank1-20sim/sources -I/home/jenkins/builds/workspace/into-cps-public-coe-test-fmus/cascading-watertank1-20sim/../includes/fmi/include -I/home/jenkins/builds/workspace/into-cps-public-coe-test-fmus/cascading-watertank1-20sim/../includes/templates    -o CMakeFiles/cascading-watertank1-20sim.dir/sources/xxinteg.c.o   -c /home/jenkins/builds/workspace/into-cps-public-coe-test-fmus/cascading-watertank1-20sim/sources/xxinteg.c
/usr/bin/cmake -E cmake_progress_report /home/jenkins/builds/workspace/into-cps-public-coe-test-fmus/cascading-watertank1-20sim/build/linux64/CMakeFiles 5
[ 55%] /usr/bin/cmake -E cmake_progress_report /home/jenkins/builds/workspace/into-cps-public-coe-test-fmus/cascading-watertank1-20sim/build/linux64/CMakeFiles 6
[ 66%] Building C object CMakeFiles/cascading-watertank1-20sim.dir/sources/xxinverse.c.o
/usr/bin/cc  -Dcascading_watertank1_20sim_EXPORTS -fmessage-length=0 -std=c11 -fPIC -I/home/jenkins/builds/workspace/into-cps-public-coe-test-fmus/cascading-watertank1-20sim/build/linux64 -I/home/jenkins/builds/workspace/into-cps-public-coe-test-fmus/cascading-watertank1-20sim -I/home/jenkins/builds/workspace/into-cps-public-coe-test-fmus/cascading-watertank1-20sim/sources -I/home/jenkins/builds/workspace/into-cps-public-coe-test-fmus/cascading-watertank1-20sim/../includes/fmi/include -I/home/jenkins/builds/workspace/into-cps-public-coe-test-fmus/cascading-watertank1-20sim/../includes/templates    -o CMakeFiles/cascading-watertank1-20sim.dir/sources/xxinverse.c.o   -c /home/jenkins/builds/workspace/into-cps-public-coe-test-fmus/cascading-watertank1-20sim/sources/xxinverse.c
Building C object CMakeFiles/cascading-watertank1-20sim.dir/sources/xxmatrix.c.o
/usr/bin/cc  -Dcascading_watertank1_20sim_EXPORTS -fmessage-length=0 -std=c11 -fPIC -I/home/jenkins/builds/workspace/into-cps-public-coe-test-fmus/cascading-watertank1-20sim/build/linux64 -I/home/jenkins/builds/workspace/into-cps-public-coe-test-fmus/cascading-watertank1-20sim -I/home/jenkins/builds/workspace/into-cps-public-coe-test-fmus/cascading-watertank1-20sim/sources -I/home/jenkins/builds/workspace/into-cps-public-coe-test-fmus/cascading-watertank1-20sim/../includes/fmi/include -I/home/jenkins/builds/workspace/into-cps-public-coe-test-fmus/cascading-watertank1-20sim/../includes/templates    -o CMakeFiles/cascading-watertank1-20sim.dir/sources/xxmatrix.c.o   -c /home/jenkins/builds/workspace/into-cps-public-coe-test-fmus/cascading-watertank1-20sim/sources/xxmatrix.c
/usr/bin/cmake -E cmake_progress_report /home/jenkins/builds/workspace/into-cps-public-coe-test-fmus/cascading-watertank1-20sim/build/linux64/CMakeFiles 7
[ 77%] /usr/bin/cmake -E cmake_progress_report /home/jenkins/builds/workspace/into-cps-public-coe-test-fmus/cascading-watertank1-20sim/build/linux64/CMakeFiles 8
/usr/bin/cmake -E cmake_progress_report /home/jenkins/builds/workspace/into-cps-public-coe-test-fmus/cascading-watertank1-20sim/build/linux64/CMakeFiles 9
Building C object CMakeFiles/cascading-watertank1-20sim.dir/sources/motionprofiles.c.o
/usr/bin/cc  -Dcascading_watertank1_20sim_EXPORTS -fmessage-length=0 -std=c11 -fPIC -I/home/jenkins/builds/workspace/into-cps-public-coe-test-fmus/cascading-watertank1-20sim/build/linux64 -I/home/jenkins/builds/workspace/into-cps-public-coe-test-fmus/cascading-watertank1-20sim -I/home/jenkins/builds/workspace/into-cps-public-coe-test-fmus/cascading-watertank1-20sim/sources -I/home/jenkins/builds/workspace/into-cps-public-coe-test-fmus/cascading-watertank1-20sim/../includes/fmi/include -I/home/jenkins/builds/workspace/into-cps-public-coe-test-fmus/cascading-watertank1-20sim/../includes/templates    -o CMakeFiles/cascading-watertank1-20sim.dir/sources/motionprofiles.c.o   -c /home/jenkins/builds/workspace/into-cps-public-coe-test-fmus/cascading-watertank1-20sim/sources/motionprofiles.c
[ 88%] [100%] Building C object CMakeFiles/cascading-watertank1-20sim.dir/sources/EulerAngles.c.o
/usr/bin/cc  -Dcascading_watertank1_20sim_EXPORTS -fmessage-length=0 -std=c11 -fPIC -I/home/jenkins/builds/workspace/into-cps-public-coe-test-fmus/cascading-watertank1-20sim/build/linux64 -I/home/jenkins/builds/workspace/into-cps-public-coe-test-fmus/cascading-watertank1-20sim -I/home/jenkins/builds/workspace/into-cps-public-coe-test-fmus/cascading-watertank1-20sim/sources -I/home/jenkins/builds/workspace/into-cps-public-coe-test-fmus/cascading-watertank1-20sim/../includes/fmi/include -I/home/jenkins/builds/workspace/into-cps-public-coe-test-fmus/cascading-watertank1-20sim/../includes/templates    -o CMakeFiles/cascading-watertank1-20sim.dir/sources/EulerAngles.c.o   -c /home/jenkins/builds/workspace/into-cps-public-coe-test-fmus/cascading-watertank1-20sim/sources/EulerAngles.c
Building C object CMakeFiles/cascading-watertank1-20sim.dir/sources/xxsubmod.c.o
/usr/bin/cc  -Dcascading_watertank1_20sim_EXPORTS -fmessage-length=0 -std=c11 -fPIC -I/home/jenkins/builds/workspace/into-cps-public-coe-test-fmus/cascading-watertank1-20sim/build/linux64 -I/home/jenkins/builds/workspace/into-cps-public-coe-test-fmus/cascading-watertank1-20sim -I/home/jenkins/builds/workspace/into-cps-public-coe-test-fmus/cascading-watertank1-20sim/sources -I/home/jenkins/builds/workspace/into-cps-public-coe-test-fmus/cascading-watertank1-20sim/../includes/fmi/include -I/home/jenkins/builds/workspace/into-cps-public-coe-test-fmus/cascading-watertank1-20sim/../includes/templates    -o CMakeFiles/cascading-watertank1-20sim.dir/sources/xxsubmod.c.o   -c /home/jenkins/builds/workspace/into-cps-public-coe-test-fmus/cascading-watertank1-20sim/sources/xxsubmod.c
Linking C shared library cascading-watertank1-20sim.so
/usr/bin/cmake -E cmake_link_script CMakeFiles/cascading-watertank1-20sim.dir/link.txt --verbose=1
/usr/bin/cc  -fPIC  -fmessage-length=0 -std=c11 -fPIC  -shared -Wl,-soname,cascading-watertank1-20sim.so -o cascading-watertank1-20sim.so CMakeFiles/cascading-watertank1-20sim.dir/sources/fmi2Functions.c.o CMakeFiles/cascading-watertank1-20sim.dir/sources/xxfuncs.c.o CMakeFiles/cascading-watertank1-20sim.dir/sources/xxmodel.c.o CMakeFiles/cascading-watertank1-20sim.dir/sources/xxinteg.c.o CMakeFiles/cascading-watertank1-20sim.dir/sources/xxinverse.c.o CMakeFiles/cascading-watertank1-20sim.dir/sources/xxmatrix.c.o CMakeFiles/cascading-watertank1-20sim.dir/sources/motionprofiles.c.o CMakeFiles/cascading-watertank1-20sim.dir/sources/EulerAngles.c.o CMakeFiles/cascading-watertank1-20sim.dir/sources/xxsubmod.c.o -Wl,-Bstatic -lstdc++ -lpthread -Wl,-Bdynamic 
make[2]: Leaving directory `/home/jenkins/builds/workspace/into-cps-public-coe-test-fmus/cascading-watertank1-20sim/build/linux64'
/usr/bin/cmake -E cmake_progress_report /home/jenkins/builds/workspace/into-cps-public-coe-test-fmus/cascading-watertank1-20sim/build/linux64/CMakeFiles  1 2 3 4 5 6 7 8 9
[100%] Built target cascading-watertank1-20sim
make[1]: Leaving directory `/home/jenkins/builds/workspace/into-cps-public-coe-test-fmus/cascading-watertank1-20sim/build/linux64'
/usr/bin/cmake -E cmake_progress_start /home/jenkins/builds/workspace/into-cps-public-coe-test-fmus/cascading-watertank1-20sim/build/linux64/CMakeFiles 0
make: Leaving directory `/home/jenkins/builds/workspace/into-cps-public-coe-test-fmus/cascading-watertank1-20sim/build/linux64'
Building Linux x32 .so
-- The C compiler identification is GNU 4.8.4
-- The CXX compiler identification is GNU 4.8.4
-- Check for working C compiler: /usr/bin/cc
-- Check for working C compiler: /usr/bin/cc -- works
-- Detecting C compiler ABI info
-- Detecting C compiler ABI info - done
-- Detecting C compile features
-- Detecting C compile features - done
-- Check for working CXX compiler: /usr/bin/c++
-- Check for working CXX compiler: /usr/bin/c++ -- works
-- Detecting CXX compiler ABI info
-- Detecting CXX compiler ABI info - done
-- Detecting CXX compile features
-- Detecting CXX compile features - done
-- Performing Test COMPILER_SUPPORTS_CXX11
-- Performing Test COMPILER_SUPPORTS_CXX11 - Success
-- Performing Test COMPILER_SUPPORTS_CXX0X
-- Performing Test COMPILER_SUPPORTS_CXX0X - Success
-- Static linking with libstdc++.a in /usr/lib/gcc/x86_64-linux-gnu/4.8/libstdc++.a
-- Configuring done
-- Generating done
CMake Warning:
  Manually-specified variables were not used by the project:

    CFLAGS
    LINK_FLAGS


-- Build files have been written to: /home/jenkins/builds/workspace/into-cps-public-coe-test-fmus/cascading-watertank1-20sim/build/linux32
make: Entering directory `/home/jenkins/builds/workspace/into-cps-public-coe-test-fmus/cascading-watertank1-20sim/build/linux32'
/usr/bin/cmake -H/home/jenkins/builds/workspace/into-cps-public-coe-test-fmus/cascading-watertank1-20sim -B/home/jenkins/builds/workspace/into-cps-public-coe-test-fmus/cascading-watertank1-20sim/build/linux32 --check-build-system CMakeFiles/Makefile.cmake 0
/usr/bin/cmake -E cmake_progress_start /home/jenkins/builds/workspace/into-cps-public-coe-test-fmus/cascading-watertank1-20sim/build/linux32/CMakeFiles /home/jenkins/builds/workspace/into-cps-public-coe-test-fmus/cascading-watertank1-20sim/build/linux32/CMakeFiles/progress.marks
make -f CMakeFiles/Makefile2 all
make[1]: Entering directory `/home/jenkins/builds/workspace/into-cps-public-coe-test-fmus/cascading-watertank1-20sim/build/linux32'
make -f CMakeFiles/cascading-watertank1-20sim.dir/build.make CMakeFiles/cascading-watertank1-20sim.dir/depend
make[2]: Entering directory `/home/jenkins/builds/workspace/into-cps-public-coe-test-fmus/cascading-watertank1-20sim/build/linux32'
cd /home/jenkins/builds/workspace/into-cps-public-coe-test-fmus/cascading-watertank1-20sim/build/linux32 && /usr/bin/cmake -E cmake_depends "Unix Makefiles" /home/jenkins/builds/workspace/into-cps-public-coe-test-fmus/cascading-watertank1-20sim /home/jenkins/builds/workspace/into-cps-public-coe-test-fmus/cascading-watertank1-20sim /home/jenkins/builds/workspace/into-cps-public-coe-test-fmus/cascading-watertank1-20sim/build/linux32 /home/jenkins/builds/workspace/into-cps-public-coe-test-fmus/cascading-watertank1-20sim/build/linux32 /home/jenkins/builds/workspace/into-cps-public-coe-test-fmus/cascading-watertank1-20sim/build/linux32/CMakeFiles/cascading-watertank1-20sim.dir/DependInfo.cmake --color=
Scanning dependencies of target cascading-watertank1-20sim
make[2]: Leaving directory `/home/jenkins/builds/workspace/into-cps-public-coe-test-fmus/cascading-watertank1-20sim/build/linux32'
make -f CMakeFiles/cascading-watertank1-20sim.dir/build.make CMakeFiles/cascading-watertank1-20sim.dir/build
make[2]: Entering directory `/home/jenkins/builds/workspace/into-cps-public-coe-test-fmus/cascading-watertank1-20sim/build/linux32'
/usr/bin/cmake -E cmake_progress_report /home/jenkins/builds/workspace/into-cps-public-coe-test-fmus/cascading-watertank1-20sim/build/linux32/CMakeFiles 1
/usr/bin/cmake -E cmake_progress_report /home/jenkins/builds/workspace/into-cps-public-coe-test-fmus/cascading-watertank1-20sim/build/linux32/CMakeFiles 2
/usr/bin/cmake -E cmake_progress_report /home/jenkins/builds/workspace/into-cps-public-coe-test-fmus/cascading-watertank1-20sim/build/linux32/CMakeFiles 3
[ 11%] [ 22%] /usr/bin/cmake -E cmake_progress_report /home/jenkins/builds/workspace/into-cps-public-coe-test-fmus/cascading-watertank1-20sim/build/linux32/CMakeFiles 4
[ 33%] Building C object CMakeFiles/cascading-watertank1-20sim.dir/sources/xxfuncs.c.o
Building C object CMakeFiles/cascading-watertank1-20sim.dir/sources/fmi2Functions.c.o
/usr/bin/cc  -Dcascading_watertank1_20sim_EXPORTS -fmessage-length=0 -std=c11 -fPIC -I/home/jenkins/builds/workspace/into-cps-public-coe-test-fmus/cascading-watertank1-20sim/build/linux32 -I/home/jenkins/builds/workspace/into-cps-public-coe-test-fmus/cascading-watertank1-20sim -I/home/jenkins/builds/workspace/into-cps-public-coe-test-fmus/cascading-watertank1-20sim/sources -I/home/jenkins/builds/workspace/into-cps-public-coe-test-fmus/cascading-watertank1-20sim/../includes/fmi/include -I/home/jenkins/builds/workspace/into-cps-public-coe-test-fmus/cascading-watertank1-20sim/../includes/templates    -o CMakeFiles/cascading-watertank1-20sim.dir/sources/fmi2Functions.c.o   -c /home/jenkins/builds/workspace/into-cps-public-coe-test-fmus/cascading-watertank1-20sim/sources/fmi2Functions.c
[ 44%] /usr/bin/cc  -Dcascading_watertank1_20sim_EXPORTS -fmessage-length=0 -std=c11 -fPIC -I/home/jenkins/builds/workspace/into-cps-public-coe-test-fmus/cascading-watertank1-20sim/build/linux32 -I/home/jenkins/builds/workspace/into-cps-public-coe-test-fmus/cascading-watertank1-20sim -I/home/jenkins/builds/workspace/into-cps-public-coe-test-fmus/cascading-watertank1-20sim/sources -I/home/jenkins/builds/workspace/into-cps-public-coe-test-fmus/cascading-watertank1-20sim/../includes/fmi/include -I/home/jenkins/builds/workspace/into-cps-public-coe-test-fmus/cascading-watertank1-20sim/../includes/templates    -o CMakeFiles/cascading-watertank1-20sim.dir/sources/xxfuncs.c.o   -c /home/jenkins/builds/workspace/into-cps-public-coe-test-fmus/cascading-watertank1-20sim/sources/xxfuncs.c
Building C object CMakeFiles/cascading-watertank1-20sim.dir/sources/xxmodel.c.o
/usr/bin/cc  -Dcascading_watertank1_20sim_EXPORTS -fmessage-length=0 -std=c11 -fPIC -I/home/jenkins/builds/workspace/into-cps-public-coe-test-fmus/cascading-watertank1-20sim/build/linux32 -I/home/jenkins/builds/workspace/into-cps-public-coe-test-fmus/cascading-watertank1-20sim -I/home/jenkins/builds/workspace/into-cps-public-coe-test-fmus/cascading-watertank1-20sim/sources -I/home/jenkins/builds/workspace/into-cps-public-coe-test-fmus/cascading-watertank1-20sim/../includes/fmi/include -I/home/jenkins/builds/workspace/into-cps-public-coe-test-fmus/cascading-watertank1-20sim/../includes/templates    -o CMakeFiles/cascading-watertank1-20sim.dir/sources/xxmodel.c.o   -c /home/jenkins/builds/workspace/into-cps-public-coe-test-fmus/cascading-watertank1-20sim/sources/xxmodel.c
Building C object CMakeFiles/cascading-watertank1-20sim.dir/sources/xxinteg.c.o
/usr/bin/cc  -Dcascading_watertank1_20sim_EXPORTS -fmessage-length=0 -std=c11 -fPIC -I/home/jenkins/builds/workspace/into-cps-public-coe-test-fmus/cascading-watertank1-20sim/build/linux32 -I/home/jenkins/builds/workspace/into-cps-public-coe-test-fmus/cascading-watertank1-20sim -I/home/jenkins/builds/workspace/into-cps-public-coe-test-fmus/cascading-watertank1-20sim/sources -I/home/jenkins/builds/workspace/into-cps-public-coe-test-fmus/cascading-watertank1-20sim/../includes/fmi/include -I/home/jenkins/builds/workspace/into-cps-public-coe-test-fmus/cascading-watertank1-20sim/../includes/templates    -o CMakeFiles/cascading-watertank1-20sim.dir/sources/xxinteg.c.o   -c /home/jenkins/builds/workspace/into-cps-public-coe-test-fmus/cascading-watertank1-20sim/sources/xxinteg.c
/usr/bin/cmake -E cmake_progress_report /home/jenkins/builds/workspace/into-cps-public-coe-test-fmus/cascading-watertank1-20sim/build/linux32/CMakeFiles 5
/usr/bin/cmake -E cmake_progress_report /home/jenkins/builds/workspace/into-cps-public-coe-test-fmus/cascading-watertank1-20sim/build/linux32/CMakeFiles 6
[ 55%] Building C object CMakeFiles/cascading-watertank1-20sim.dir/sources/xxinverse.c.o
/usr/bin/cc  -Dcascading_watertank1_20sim_EXPORTS -fmessage-length=0 -std=c11 -fPIC -I/home/jenkins/builds/workspace/into-cps-public-coe-test-fmus/cascading-watertank1-20sim/build/linux32 -I/home/jenkins/builds/workspace/into-cps-public-coe-test-fmus/cascading-watertank1-20sim -I/home/jenkins/builds/workspace/into-cps-public-coe-test-fmus/cascading-watertank1-20sim/sources -I/home/jenkins/builds/workspace/into-cps-public-coe-test-fmus/cascading-watertank1-20sim/../includes/fmi/include -I/home/jenkins/builds/workspace/into-cps-public-coe-test-fmus/cascading-watertank1-20sim/../includes/templates    -o CMakeFiles/cascading-watertank1-20sim.dir/sources/xxinverse.c.o   -c /home/jenkins/builds/workspace/into-cps-public-coe-test-fmus/cascading-watertank1-20sim/sources/xxinverse.c
[ 66%] /usr/bin/cmake -E cmake_progress_report /home/jenkins/builds/workspace/into-cps-public-coe-test-fmus/cascading-watertank1-20sim/build/linux32/CMakeFiles 7
/usr/bin/cmake -E cmake_progress_report /home/jenkins/builds/workspace/into-cps-public-coe-test-fmus/cascading-watertank1-20sim/build/linux32/CMakeFiles 8
/usr/bin/cmake -E cmake_progress_report /home/jenkins/builds/workspace/into-cps-public-coe-test-fmus/cascading-watertank1-20sim/build/linux32/CMakeFiles 9
[ 77%] [ 88%] Building C object CMakeFiles/cascading-watertank1-20sim.dir/sources/xxmatrix.c.o
/usr/bin/cc  -Dcascading_watertank1_20sim_EXPORTS -fmessage-length=0 -std=c11 -fPIC -I/home/jenkins/builds/workspace/into-cps-public-coe-test-fmus/cascading-watertank1-20sim/build/linux32 -I/home/jenkins/builds/workspace/into-cps-public-coe-test-fmus/cascading-watertank1-20sim -I/home/jenkins/builds/workspace/into-cps-public-coe-test-fmus/cascading-watertank1-20sim/sources -I/home/jenkins/builds/workspace/into-cps-public-coe-test-fmus/cascading-watertank1-20sim/../includes/fmi/include -I/home/jenkins/builds/workspace/into-cps-public-coe-test-fmus/cascading-watertank1-20sim/../includes/templates    -o CMakeFiles/cascading-watertank1-20sim.dir/sources/xxmatrix.c.o   -c /home/jenkins/builds/workspace/into-cps-public-coe-test-fmus/cascading-watertank1-20sim/sources/xxmatrix.c
Building C object CMakeFiles/cascading-watertank1-20sim.dir/sources/EulerAngles.c.o
/usr/bin/cc  -Dcascading_watertank1_20sim_EXPORTS -fmessage-length=0 -std=c11 -fPIC -I/home/jenkins/builds/workspace/into-cps-public-coe-test-fmus/cascading-watertank1-20sim/build/linux32 -I/home/jenkins/builds/workspace/into-cps-public-coe-test-fmus/cascading-watertank1-20sim -I/home/jenkins/builds/workspace/into-cps-public-coe-test-fmus/cascading-watertank1-20sim/sources -I/home/jenkins/builds/workspace/into-cps-public-coe-test-fmus/cascading-watertank1-20sim/../includes/fmi/include -I/home/jenkins/builds/workspace/into-cps-public-coe-test-fmus/cascading-watertank1-20sim/../includes/templates    -o CMakeFiles/cascading-watertank1-20sim.dir/sources/EulerAngles.c.o   -c /home/jenkins/builds/workspace/into-cps-public-coe-test-fmus/cascading-watertank1-20sim/sources/EulerAngles.c
Building C object CMakeFiles/cascading-watertank1-20sim.dir/sources/motionprofiles.c.o
/usr/bin/cc  -Dcascading_watertank1_20sim_EXPORTS -fmessage-length=0 -std=c11 -fPIC -I/home/jenkins/builds/workspace/into-cps-public-coe-test-fmus/cascading-watertank1-20sim/build/linux32 -I/home/jenkins/builds/workspace/into-cps-public-coe-test-fmus/cascading-watertank1-20sim -I/home/jenkins/builds/workspace/into-cps-public-coe-test-fmus/cascading-watertank1-20sim/sources -I/home/jenkins/builds/workspace/into-cps-public-coe-test-fmus/cascading-watertank1-20sim/../includes/fmi/include -I/home/jenkins/builds/workspace/into-cps-public-coe-test-fmus/cascading-watertank1-20sim/../includes/templates    -o CMakeFiles/cascading-watertank1-20sim.dir/sources/motionprofiles.c.o   -c /home/jenkins/builds/workspace/into-cps-public-coe-test-fmus/cascading-watertank1-20sim/sources/motionprofiles.c
[100%] Building C object CMakeFiles/cascading-watertank1-20sim.dir/sources/xxsubmod.c.o
/usr/bin/cc  -Dcascading_watertank1_20sim_EXPORTS -fmessage-length=0 -std=c11 -fPIC -I/home/jenkins/builds/workspace/into-cps-public-coe-test-fmus/cascading-watertank1-20sim/build/linux32 -I/home/jenkins/builds/workspace/into-cps-public-coe-test-fmus/cascading-watertank1-20sim -I/home/jenkins/builds/workspace/into-cps-public-coe-test-fmus/cascading-watertank1-20sim/sources -I/home/jenkins/builds/workspace/into-cps-public-coe-test-fmus/cascading-watertank1-20sim/../includes/fmi/include -I/home/jenkins/builds/workspace/into-cps-public-coe-test-fmus/cascading-watertank1-20sim/../includes/templates    -o CMakeFiles/cascading-watertank1-20sim.dir/sources/xxsubmod.c.o   -c /home/jenkins/builds/workspace/into-cps-public-coe-test-fmus/cascading-watertank1-20sim/sources/xxsubmod.c
Linking C shared library cascading-watertank1-20sim.so
/usr/bin/cmake -E cmake_link_script CMakeFiles/cascading-watertank1-20sim.dir/link.txt --verbose=1
/usr/bin/cc  -fPIC  -fmessage-length=0 -std=c11 -fPIC  -shared -Wl,-soname,cascading-watertank1-20sim.so -o cascading-watertank1-20sim.so CMakeFiles/cascading-watertank1-20sim.dir/sources/fmi2Functions.c.o CMakeFiles/cascading-watertank1-20sim.dir/sources/xxfuncs.c.o CMakeFiles/cascading-watertank1-20sim.dir/sources/xxmodel.c.o CMakeFiles/cascading-watertank1-20sim.dir/sources/xxinteg.c.o CMakeFiles/cascading-watertank1-20sim.dir/sources/xxinverse.c.o CMakeFiles/cascading-watertank1-20sim.dir/sources/xxmatrix.c.o CMakeFiles/cascading-watertank1-20sim.dir/sources/motionprofiles.c.o CMakeFiles/cascading-watertank1-20sim.dir/sources/EulerAngles.c.o CMakeFiles/cascading-watertank1-20sim.dir/sources/xxsubmod.c.o -Wl,-Bstatic -lstdc++ -lpthread -Wl,-Bdynamic 
make[2]: Leaving directory `/home/jenkins/builds/workspace/into-cps-public-coe-test-fmus/cascading-watertank1-20sim/build/linux32'
/usr/bin/cmake -E cmake_progress_report /home/jenkins/builds/workspace/into-cps-public-coe-test-fmus/cascading-watertank1-20sim/build/linux32/CMakeFiles  1 2 3 4 5 6 7 8 9
[100%] Built target cascading-watertank1-20sim
make[1]: Leaving directory `/home/jenkins/builds/workspace/into-cps-public-coe-test-fmus/cascading-watertank1-20sim/build/linux32'
/usr/bin/cmake -E cmake_progress_start /home/jenkins/builds/workspace/into-cps-public-coe-test-fmus/cascading-watertank1-20sim/build/linux32/CMakeFiles 0
make: Leaving directory `/home/jenkins/builds/workspace/into-cps-public-coe-test-fmus/cascading-watertank1-20sim/build/linux32'
Building Win64 .dll
-- The C compiler identification is GNU 4.8.2
-- The CXX compiler identification is GNU 4.8.2
-- Check for working C compiler: /usr/bin/x86_64-w64-mingw32-gcc
-- Check for working C compiler: /usr/bin/x86_64-w64-mingw32-gcc -- works
-- Detecting C compiler ABI info
-- Detecting C compiler ABI info - done
-- Detecting C compile features
-- Detecting C compile features - done
-- Check for working CXX compiler: /usr/bin/x86_64-w64-mingw32-g++
-- Check for working CXX compiler: /usr/bin/x86_64-w64-mingw32-g++ -- works
-- Detecting CXX compiler ABI info
-- Detecting CXX compiler ABI info - done
-- Detecting CXX compile features
-- Detecting CXX compile features - done
-- Performing Test COMPILER_SUPPORTS_CXX11
-- Performing Test COMPILER_SUPPORTS_CXX11 - Success
-- Performing Test COMPILER_SUPPORTS_CXX0X
-- Performing Test COMPILER_SUPPORTS_CXX0X - Success
-- Static linking with libstdc++.a in /usr/lib/gcc/x86_64-w64-mingw32/4.8/libstdc++.a
-- Configuring done
-- Generating done
-- Build files have been written to: /home/jenkins/builds/workspace/into-cps-public-coe-test-fmus/cascading-watertank1-20sim/build/win64
make: Entering directory `/home/jenkins/builds/workspace/into-cps-public-coe-test-fmus/cascading-watertank1-20sim/build/win64'
/usr/bin/cmake -H/home/jenkins/builds/workspace/into-cps-public-coe-test-fmus/cascading-watertank1-20sim -B/home/jenkins/builds/workspace/into-cps-public-coe-test-fmus/cascading-watertank1-20sim/build/win64 --check-build-system CMakeFiles/Makefile.cmake 0
/usr/bin/cmake -E cmake_progress_start /home/jenkins/builds/workspace/into-cps-public-coe-test-fmus/cascading-watertank1-20sim/build/win64/CMakeFiles /home/jenkins/builds/workspace/into-cps-public-coe-test-fmus/cascading-watertank1-20sim/build/win64/CMakeFiles/progress.marks
make -f CMakeFiles/Makefile2 all
make[1]: Entering directory `/home/jenkins/builds/workspace/into-cps-public-coe-test-fmus/cascading-watertank1-20sim/build/win64'
make -f CMakeFiles/cascading-watertank1-20sim.dir/build.make CMakeFiles/cascading-watertank1-20sim.dir/depend
make[2]: Entering directory `/home/jenkins/builds/workspace/into-cps-public-coe-test-fmus/cascading-watertank1-20sim/build/win64'
cd /home/jenkins/builds/workspace/into-cps-public-coe-test-fmus/cascading-watertank1-20sim/build/win64 && /usr/bin/cmake -E cmake_depends "Unix Makefiles" /home/jenkins/builds/workspace/into-cps-public-coe-test-fmus/cascading-watertank1-20sim /home/jenkins/builds/workspace/into-cps-public-coe-test-fmus/cascading-watertank1-20sim /home/jenkins/builds/workspace/into-cps-public-coe-test-fmus/cascading-watertank1-20sim/build/win64 /home/jenkins/builds/workspace/into-cps-public-coe-test-fmus/cascading-watertank1-20sim/build/win64 /home/jenkins/builds/workspace/into-cps-public-coe-test-fmus/cascading-watertank1-20sim/build/win64/CMakeFiles/cascading-watertank1-20sim.dir/DependInfo.cmake --color=
Scanning dependencies of target cascading-watertank1-20sim
make[2]: Leaving directory `/home/jenkins/builds/workspace/into-cps-public-coe-test-fmus/cascading-watertank1-20sim/build/win64'
make -f CMakeFiles/cascading-watertank1-20sim.dir/build.make CMakeFiles/cascading-watertank1-20sim.dir/build
make[2]: Entering directory `/home/jenkins/builds/workspace/into-cps-public-coe-test-fmus/cascading-watertank1-20sim/build/win64'
/usr/bin/cmake -E cmake_progress_report /home/jenkins/builds/workspace/into-cps-public-coe-test-fmus/cascading-watertank1-20sim/build/win64/CMakeFiles 1
/usr/bin/cmake -E cmake_progress_report /home/jenkins/builds/workspace/into-cps-public-coe-test-fmus/cascading-watertank1-20sim/build/win64/CMakeFiles 2
/usr/bin/cmake -E cmake_progress_report /home/jenkins/builds/workspace/into-cps-public-coe-test-fmus/cascading-watertank1-20sim/build/win64/CMakeFiles 3
[ 11%] [ 22%] /usr/bin/cmake -E cmake_progress_report /home/jenkins/builds/workspace/into-cps-public-coe-test-fmus/cascading-watertank1-20sim/build/win64/CMakeFiles 4
[ 33%] Building C object CMakeFiles/cascading-watertank1-20sim.dir/sources/fmi2Functions.c.obj
[ 44%] Building C object CMakeFiles/cascading-watertank1-20sim.dir/sources/xxfuncs.c.obj
/usr/bin/x86_64-w64-mingw32-gcc  -Dcascading_watertank1_20sim_EXPORTS -fmessage-length=0 -std=c11 @CMakeFiles/cascading-watertank1-20sim.dir/includes_C.rsp   -o CMakeFiles/cascading-watertank1-20sim.dir/sources/fmi2Functions.c.obj   -c /home/jenkins/builds/workspace/into-cps-public-coe-test-fmus/cascading-watertank1-20sim/sources/fmi2Functions.c
Building C object CMakeFiles/cascading-watertank1-20sim.dir/sources/xxinteg.c.obj
/usr/bin/x86_64-w64-mingw32-gcc  -Dcascading_watertank1_20sim_EXPORTS -fmessage-length=0 -std=c11 @CMakeFiles/cascading-watertank1-20sim.dir/includes_C.rsp   -o CMakeFiles/cascading-watertank1-20sim.dir/sources/xxfuncs.c.obj   -c /home/jenkins/builds/workspace/into-cps-public-coe-test-fmus/cascading-watertank1-20sim/sources/xxfuncs.c
/usr/bin/x86_64-w64-mingw32-gcc  -Dcascading_watertank1_20sim_EXPORTS -fmessage-length=0 -std=c11 @CMakeFiles/cascading-watertank1-20sim.dir/includes_C.rsp   -o CMakeFiles/cascading-watertank1-20sim.dir/sources/xxinteg.c.obj   -c /home/jenkins/builds/workspace/into-cps-public-coe-test-fmus/cascading-watertank1-20sim/sources/xxinteg.c
Building C object CMakeFiles/cascading-watertank1-20sim.dir/sources/xxmodel.c.obj
/usr/bin/x86_64-w64-mingw32-gcc  -Dcascading_watertank1_20sim_EXPORTS -fmessage-length=0 -std=c11 @CMakeFiles/cascading-watertank1-20sim.dir/includes_C.rsp   -o CMakeFiles/cascading-watertank1-20sim.dir/sources/xxmodel.c.obj   -c /home/jenkins/builds/workspace/into-cps-public-coe-test-fmus/cascading-watertank1-20sim/sources/xxmodel.c
/usr/bin/cmake -E cmake_progress_report /home/jenkins/builds/workspace/into-cps-public-coe-test-fmus/cascading-watertank1-20sim/build/win64/CMakeFiles 5
[ 55%] /usr/bin/cmake -E cmake_progress_report /home/jenkins/builds/workspace/into-cps-public-coe-test-fmus/cascading-watertank1-20sim/build/win64/CMakeFiles 6
[ 66%] Building C object CMakeFiles/cascading-watertank1-20sim.dir/sources/xxinverse.c.obj
/usr/bin/x86_64-w64-mingw32-gcc  -Dcascading_watertank1_20sim_EXPORTS -fmessage-length=0 -std=c11 @CMakeFiles/cascading-watertank1-20sim.dir/includes_C.rsp   -o CMakeFiles/cascading-watertank1-20sim.dir/sources/xxinverse.c.obj   -c /home/jenkins/builds/workspace/into-cps-public-coe-test-fmus/cascading-watertank1-20sim/sources/xxinverse.c
/usr/bin/cmake -E cmake_progress_report /home/jenkins/builds/workspace/into-cps-public-coe-test-fmus/cascading-watertank1-20sim/build/win64/CMakeFiles 7
[ 77%] Building C object CMakeFiles/cascading-watertank1-20sim.dir/sources/xxmatrix.c.obj
/usr/bin/x86_64-w64-mingw32-gcc  -Dcascading_watertank1_20sim_EXPORTS -fmessage-length=0 -std=c11 @CMakeFiles/cascading-watertank1-20sim.dir/includes_C.rsp   -o CMakeFiles/cascading-watertank1-20sim.dir/sources/xxmatrix.c.obj   -c /home/jenkins/builds/workspace/into-cps-public-coe-test-fmus/cascading-watertank1-20sim/sources/xxmatrix.c
/usr/bin/cmake -E cmake_progress_report /home/jenkins/builds/workspace/into-cps-public-coe-test-fmus/cascading-watertank1-20sim/build/win64/CMakeFiles 8
[ 88%] /usr/bin/cmake -E cmake_progress_report /home/jenkins/builds/workspace/into-cps-public-coe-test-fmus/cascading-watertank1-20sim/build/win64/CMakeFiles 9
Building C object CMakeFiles/cascading-watertank1-20sim.dir/sources/motionprofiles.c.obj
/usr/bin/x86_64-w64-mingw32-gcc  -Dcascading_watertank1_20sim_EXPORTS -fmessage-length=0 -std=c11 @CMakeFiles/cascading-watertank1-20sim.dir/includes_C.rsp   -o CMakeFiles/cascading-watertank1-20sim.dir/sources/motionprofiles.c.obj   -c /home/jenkins/builds/workspace/into-cps-public-coe-test-fmus/cascading-watertank1-20sim/sources/motionprofiles.c
Building C object CMakeFiles/cascading-watertank1-20sim.dir/sources/EulerAngles.c.obj
/usr/bin/x86_64-w64-mingw32-gcc  -Dcascading_watertank1_20sim_EXPORTS -fmessage-length=0 -std=c11 @CMakeFiles/cascading-watertank1-20sim.dir/includes_C.rsp   -o CMakeFiles/cascading-watertank1-20sim.dir/sources/EulerAngles.c.obj   -c /home/jenkins/builds/workspace/into-cps-public-coe-test-fmus/cascading-watertank1-20sim/sources/EulerAngles.c
[100%] Building C object CMakeFiles/cascading-watertank1-20sim.dir/sources/xxsubmod.c.obj
/usr/bin/x86_64-w64-mingw32-gcc  -Dcascading_watertank1_20sim_EXPORTS -fmessage-length=0 -std=c11 @CMakeFiles/cascading-watertank1-20sim.dir/includes_C.rsp   -o CMakeFiles/cascading-watertank1-20sim.dir/sources/xxsubmod.c.obj   -c /home/jenkins/builds/workspace/into-cps-public-coe-test-fmus/cascading-watertank1-20sim/sources/xxsubmod.c
Linking C shared library cascading-watertank1-20sim.dll
/usr/bin/cmake -E cmake_link_script CMakeFiles/cascading-watertank1-20sim.dir/link.txt --verbose=1
/usr/bin/cmake -E remove -f CMakeFiles/cascading-watertank1-20sim.dir/objects.a
/usr/bin/x86_64-w64-mingw32-ar cr CMakeFiles/cascading-watertank1-20sim.dir/objects.a @CMakeFiles/cascading-watertank1-20sim.dir/objects1.rsp
/usr/bin/x86_64-w64-mingw32-gcc    -fmessage-length=0 -std=c11  -static-libstdc++ -static-libgcc -shared -o cascading-watertank1-20sim.dll -Wl,--out-implib,libcascading-watertank1-20sim.dll.a -Wl,--major-image-version,0,--minor-image-version,0 -Wl,--whole-archive CMakeFiles/cascading-watertank1-20sim.dir/objects.a -Wl,--no-whole-archive @CMakeFiles/cascading-watertank1-20sim.dir/linklibs.rsp
make[2]: Leaving directory `/home/jenkins/builds/workspace/into-cps-public-coe-test-fmus/cascading-watertank1-20sim/build/win64'
/usr/bin/cmake -E cmake_progress_report /home/jenkins/builds/workspace/into-cps-public-coe-test-fmus/cascading-watertank1-20sim/build/win64/CMakeFiles  1 2 3 4 5 6 7 8 9
[100%] Built target cascading-watertank1-20sim
make[1]: Leaving directory `/home/jenkins/builds/workspace/into-cps-public-coe-test-fmus/cascading-watertank1-20sim/build/win64'
/usr/bin/cmake -E cmake_progress_start /home/jenkins/builds/workspace/into-cps-public-coe-test-fmus/cascading-watertank1-20sim/build/win64/CMakeFiles 0
make: Leaving directory `/home/jenkins/builds/workspace/into-cps-public-coe-test-fmus/cascading-watertank1-20sim/build/win64'
Building Win32 .dll
-- The C compiler identification is GNU 4.8.2
-- The CXX compiler identification is GNU 4.8.2
-- Check for working C compiler: /usr/bin/i686-w64-mingw32-gcc
-- Check for working C compiler: /usr/bin/i686-w64-mingw32-gcc -- works
-- Detecting C compiler ABI info
-- Detecting C compiler ABI info - done
-- Detecting C compile features
-- Detecting C compile features - done
-- Check for working CXX compiler: /usr/bin/i686-w64-mingw32-g++
-- Check for working CXX compiler: /usr/bin/i686-w64-mingw32-g++ -- works
-- Detecting CXX compiler ABI info
-- Detecting CXX compiler ABI info - done
-- Detecting CXX compile features
-- Detecting CXX compile features - done
-- Performing Test COMPILER_SUPPORTS_CXX11
-- Performing Test COMPILER_SUPPORTS_CXX11 - Success
-- Performing Test COMPILER_SUPPORTS_CXX0X
-- Performing Test COMPILER_SUPPORTS_CXX0X - Success
-- Static linking with libstdc++.a in /usr/lib/gcc/i686-w64-mingw32/4.8/libstdc++.a
-- Configuring done
-- Generating done
-- Build files have been written to: /home/jenkins/builds/workspace/into-cps-public-coe-test-fmus/cascading-watertank1-20sim/build/win32
make: Entering directory `/home/jenkins/builds/workspace/into-cps-public-coe-test-fmus/cascading-watertank1-20sim/build/win32'
/usr/bin/cmake -H/home/jenkins/builds/workspace/into-cps-public-coe-test-fmus/cascading-watertank1-20sim -B/home/jenkins/builds/workspace/into-cps-public-coe-test-fmus/cascading-watertank1-20sim/build/win32 --check-build-system CMakeFiles/Makefile.cmake 0
/usr/bin/cmake -E cmake_progress_start /home/jenkins/builds/workspace/into-cps-public-coe-test-fmus/cascading-watertank1-20sim/build/win32/CMakeFiles /home/jenkins/builds/workspace/into-cps-public-coe-test-fmus/cascading-watertank1-20sim/build/win32/CMakeFiles/progress.marks
make -f CMakeFiles/Makefile2 all
make[1]: Entering directory `/home/jenkins/builds/workspace/into-cps-public-coe-test-fmus/cascading-watertank1-20sim/build/win32'
make -f CMakeFiles/cascading-watertank1-20sim.dir/build.make CMakeFiles/cascading-watertank1-20sim.dir/depend
make[2]: Entering directory `/home/jenkins/builds/workspace/into-cps-public-coe-test-fmus/cascading-watertank1-20sim/build/win32'
cd /home/jenkins/builds/workspace/into-cps-public-coe-test-fmus/cascading-watertank1-20sim/build/win32 && /usr/bin/cmake -E cmake_depends "Unix Makefiles" /home/jenkins/builds/workspace/into-cps-public-coe-test-fmus/cascading-watertank1-20sim /home/jenkins/builds/workspace/into-cps-public-coe-test-fmus/cascading-watertank1-20sim /home/jenkins/builds/workspace/into-cps-public-coe-test-fmus/cascading-watertank1-20sim/build/win32 /home/jenkins/builds/workspace/into-cps-public-coe-test-fmus/cascading-watertank1-20sim/build/win32 /home/jenkins/builds/workspace/into-cps-public-coe-test-fmus/cascading-watertank1-20sim/build/win32/CMakeFiles/cascading-watertank1-20sim.dir/DependInfo.cmake --color=
Scanning dependencies of target cascading-watertank1-20sim
make[2]: Leaving directory `/home/jenkins/builds/workspace/into-cps-public-coe-test-fmus/cascading-watertank1-20sim/build/win32'
make -f CMakeFiles/cascading-watertank1-20sim.dir/build.make CMakeFiles/cascading-watertank1-20sim.dir/build
make[2]: Entering directory `/home/jenkins/builds/workspace/into-cps-public-coe-test-fmus/cascading-watertank1-20sim/build/win32'
/usr/bin/cmake -E cmake_progress_report /home/jenkins/builds/workspace/into-cps-public-coe-test-fmus/cascading-watertank1-20sim/build/win32/CMakeFiles 1
/usr/bin/cmake -E cmake_progress_report /home/jenkins/builds/workspace/into-cps-public-coe-test-fmus/cascading-watertank1-20sim/build/win32/CMakeFiles 2
/usr/bin/cmake -E cmake_progress_report /home/jenkins/builds/workspace/into-cps-public-coe-test-fmus/cascading-watertank1-20sim/build/win32/CMakeFiles 3
[ 11%] [ 22%] /usr/bin/cmake -E cmake_progress_report /home/jenkins/builds/workspace/into-cps-public-coe-test-fmus/cascading-watertank1-20sim/build/win32/CMakeFiles 4
[ 33%] [ 44%] Building C object CMakeFiles/cascading-watertank1-20sim.dir/sources/fmi2Functions.c.obj
/usr/bin/i686-w64-mingw32-gcc  -Dcascading_watertank1_20sim_EXPORTS -fmessage-length=0 -std=c11 @CMakeFiles/cascading-watertank1-20sim.dir/includes_C.rsp   -o CMakeFiles/cascading-watertank1-20sim.dir/sources/fmi2Functions.c.obj   -c /home/jenkins/builds/workspace/into-cps-public-coe-test-fmus/cascading-watertank1-20sim/sources/fmi2Functions.c
Building C object CMakeFiles/cascading-watertank1-20sim.dir/sources/xxinteg.c.obj
/usr/bin/i686-w64-mingw32-gcc  -Dcascading_watertank1_20sim_EXPORTS -fmessage-length=0 -std=c11 @CMakeFiles/cascading-watertank1-20sim.dir/includes_C.rsp   -o CMakeFiles/cascading-watertank1-20sim.dir/sources/xxinteg.c.obj   -c /home/jenkins/builds/workspace/into-cps-public-coe-test-fmus/cascading-watertank1-20sim/sources/xxinteg.c
Building C object CMakeFiles/cascading-watertank1-20sim.dir/sources/xxfuncs.c.obj
Building C object CMakeFiles/cascading-watertank1-20sim.dir/sources/xxmodel.c.obj
/usr/bin/i686-w64-mingw32-gcc  -Dcascading_watertank1_20sim_EXPORTS -fmessage-length=0 -std=c11 @CMakeFiles/cascading-watertank1-20sim.dir/includes_C.rsp   -o CMakeFiles/cascading-watertank1-20sim.dir/sources/xxmodel.c.obj   -c /home/jenkins/builds/workspace/into-cps-public-coe-test-fmus/cascading-watertank1-20sim/sources/xxmodel.c
/usr/bin/i686-w64-mingw32-gcc  -Dcascading_watertank1_20sim_EXPORTS -fmessage-length=0 -std=c11 @CMakeFiles/cascading-watertank1-20sim.dir/includes_C.rsp   -o CMakeFiles/cascading-watertank1-20sim.dir/sources/xxfuncs.c.obj   -c /home/jenkins/builds/workspace/into-cps-public-coe-test-fmus/cascading-watertank1-20sim/sources/xxfuncs.c
/usr/bin/cmake -E cmake_progress_report /home/jenkins/builds/workspace/into-cps-public-coe-test-fmus/cascading-watertank1-20sim/build/win32/CMakeFiles 5
[ 55%] /usr/bin/cmake -E cmake_progress_report /home/jenkins/builds/workspace/into-cps-public-coe-test-fmus/cascading-watertank1-20sim/build/win32/CMakeFiles 6
/usr/bin/cmake -E cmake_progress_report /home/jenkins/builds/workspace/into-cps-public-coe-test-fmus/cascading-watertank1-20sim/build/win32/CMakeFiles 7
[ 66%] [ 77%] Building C object CMakeFiles/cascading-watertank1-20sim.dir/sources/xxinverse.c.obj
/usr/bin/i686-w64-mingw32-gcc  -Dcascading_watertank1_20sim_EXPORTS -fmessage-length=0 -std=c11 @CMakeFiles/cascading-watertank1-20sim.dir/includes_C.rsp   -o CMakeFiles/cascading-watertank1-20sim.dir/sources/xxinverse.c.obj   -c /home/jenkins/builds/workspace/into-cps-public-coe-test-fmus/cascading-watertank1-20sim/sources/xxinverse.c
/usr/bin/cmake -E cmake_progress_report /home/jenkins/builds/workspace/into-cps-public-coe-test-fmus/cascading-watertank1-20sim/build/win32/CMakeFiles 8
[ 88%] Building C object CMakeFiles/cascading-watertank1-20sim.dir/sources/motionprofiles.c.obj
Building C object CMakeFiles/cascading-watertank1-20sim.dir/sources/xxmatrix.c.obj
/usr/bin/i686-w64-mingw32-gcc  -Dcascading_watertank1_20sim_EXPORTS -fmessage-length=0 -std=c11 @CMakeFiles/cascading-watertank1-20sim.dir/includes_C.rsp   -o CMakeFiles/cascading-watertank1-20sim.dir/sources/motionprofiles.c.obj   -c /home/jenkins/builds/workspace/into-cps-public-coe-test-fmus/cascading-watertank1-20sim/sources/motionprofiles.c
/usr/bin/i686-w64-mingw32-gcc  -Dcascading_watertank1_20sim_EXPORTS -fmessage-length=0 -std=c11 @CMakeFiles/cascading-watertank1-20sim.dir/includes_C.rsp   -o CMakeFiles/cascading-watertank1-20sim.dir/sources/xxmatrix.c.obj   -c /home/jenkins/builds/workspace/into-cps-public-coe-test-fmus/cascading-watertank1-20sim/sources/xxmatrix.c
/usr/bin/cmake -E cmake_progress_report /home/jenkins/builds/workspace/into-cps-public-coe-test-fmus/cascading-watertank1-20sim/build/win32/CMakeFiles 9
Building C object CMakeFiles/cascading-watertank1-20sim.dir/sources/EulerAngles.c.obj
/usr/bin/i686-w64-mingw32-gcc  -Dcascading_watertank1_20sim_EXPORTS -fmessage-length=0 -std=c11 @CMakeFiles/cascading-watertank1-20sim.dir/includes_C.rsp   -o CMakeFiles/cascading-watertank1-20sim.dir/sources/EulerAngles.c.obj   -c /home/jenkins/builds/workspace/into-cps-public-coe-test-fmus/cascading-watertank1-20sim/sources/EulerAngles.c
[100%] Building C object CMakeFiles/cascading-watertank1-20sim.dir/sources/xxsubmod.c.obj
/usr/bin/i686-w64-mingw32-gcc  -Dcascading_watertank1_20sim_EXPORTS -fmessage-length=0 -std=c11 @CMakeFiles/cascading-watertank1-20sim.dir/includes_C.rsp   -o CMakeFiles/cascading-watertank1-20sim.dir/sources/xxsubmod.c.obj   -c /home/jenkins/builds/workspace/into-cps-public-coe-test-fmus/cascading-watertank1-20sim/sources/xxsubmod.c
Linking C shared library cascading-watertank1-20sim.dll
/usr/bin/cmake -E cmake_link_script CMakeFiles/cascading-watertank1-20sim.dir/link.txt --verbose=1
/usr/bin/cmake -E remove -f CMakeFiles/cascading-watertank1-20sim.dir/objects.a
/usr/bin/i686-w64-mingw32-ar cr CMakeFiles/cascading-watertank1-20sim.dir/objects.a @CMakeFiles/cascading-watertank1-20sim.dir/objects1.rsp
/usr/bin/i686-w64-mingw32-gcc    -fmessage-length=0 -std=c11  -static-libstdc++ -static-libgcc -shared -o cascading-watertank1-20sim.dll -Wl,--out-implib,libcascading-watertank1-20sim.dll.a -Wl,--major-image-version,0,--minor-image-version,0 -Wl,--whole-archive CMakeFiles/cascading-watertank1-20sim.dir/objects.a -Wl,--no-whole-archive @CMakeFiles/cascading-watertank1-20sim.dir/linklibs.rsp
make[2]: Leaving directory `/home/jenkins/builds/workspace/into-cps-public-coe-test-fmus/cascading-watertank1-20sim/build/win32'
/usr/bin/cmake -E cmake_progress_report /home/jenkins/builds/workspace/into-cps-public-coe-test-fmus/cascading-watertank1-20sim/build/win32/CMakeFiles  1 2 3 4 5 6 7 8 9
[100%] Built target cascading-watertank1-20sim
make[1]: Leaving directory `/home/jenkins/builds/workspace/into-cps-public-coe-test-fmus/cascading-watertank1-20sim/build/win32'
/usr/bin/cmake -E cmake_progress_start /home/jenkins/builds/workspace/into-cps-public-coe-test-fmus/cascading-watertank1-20sim/build/win32/CMakeFiles 0
make: Leaving directory `/home/jenkins/builds/workspace/into-cps-public-coe-test-fmus/cascading-watertank1-20sim/build/win32'
Copying files...
Zipping...
  adding: sources/ (stored 0%)
  adding: sources/motionprofiles.h (deflated 50%)
  adding: sources/fmiGUID.h (stored 0%)
  adding: sources/ModelConfiguration.xml (deflated 83%)
  adding: sources/fmi2Functions.c (deflated 76%)
  adding: sources/xxfuncs.c (deflated 52%)
  adding: sources/xxmodel.h (deflated 63%)
  adding: sources/xxmodel.c (deflated 70%)
  adding: sources/xxinteg.c (deflated 82%)
  adding: sources/xxmatrix.h (deflated 48%)
  adding: sources/xxinteg.h (deflated 62%)
  adding: sources/xxinverse.c (deflated 48%)
  adding: sources/xxmatrix.c (deflated 48%)
  adding: sources/fmi2FunctionTypes.h (deflated 73%)
  adding: sources/EulerAngles.h (deflated 63%)
  adding: sources/guid.txt (stored 0%)
  adding: sources/fmi2TypesPlatform.h (deflated 62%)
  adding: sources/xxfuncs.h (deflated 50%)
  adding: sources/motionprofiles.c (deflated 50%)
  adding: sources/xxtypes.h (deflated 55%)
  adding: sources/GUID.xml (deflated 12%)
  adding: sources/xxsubmod.h (deflated 52%)
  adding: sources/tokens.xml (deflated 84%)
  adding: sources/EulerAngles.c (deflated 63%)
  adding: sources/variables.txt (deflated 42%)
  adding: sources/xxsubmod.c (deflated 64%)
  adding: sources/fmi2Functions.h (deflated 74%)
  adding: binaries/ (stored 0%)
  adding: binaries/linux32/ (stored 0%)
  adding: binaries/linux32/cascading-watertank1-20sim.so (deflated 69%)
  adding: binaries/win32/ (stored 0%)
  adding: binaries/win32/cascading-watertank1-20sim.dll (deflated 66%)
  adding: binaries/linux64/ (stored 0%)
  adding: binaries/linux64/cascading-watertank1-20sim.so (deflated 69%)
  adding: binaries/win64/ (stored 0%)
  adding: binaries/win64/cascading-watertank1-20sim.dll (deflated 68%)
  adding: binaries/darwin64/ (stored 0%)
  adding: binaries/darwin64/cascading-watertank1-20sim.dylib (deflated 85%)
  adding: resources/ (stored 0%)
  adding: modelDescription.xml (deflated 87%)
Folder is ./string-in
Cleadning old builds ...
Compiling using CMake and make
Building Darwin 64 .dylib
-- Compiler..
-- Compiler..GNUGNU
-- Checking whether C compiler has -isysroot
-- Checking whether C compiler has -isysroot - yes
-- Checking whether C compiler supports OSX deployment target flag
-- Checking whether C compiler supports OSX deployment target flag - yes
-- Checking whether CXX compiler has -isysroot
-- Checking whether CXX compiler has -isysroot - no
-- Checking whether CXX compiler supports OSX deployment target flag
-- Checking whether CXX compiler supports OSX deployment target flag - no
-- Performing Test COMPILER_SUPPORTS_CXX11
-- Performing Test COMPILER_SUPPORTS_CXX11 - Success
-- Performing Test COMPILER_SUPPORTS_CXX0X
-- Performing Test COMPILER_SUPPORTS_CXX0X - Success
-- Static linking with libstdc++.a in 
-- Configuring done
-- Generating done
-- Build files have been written to: /home/jenkins/builds/workspace/into-cps-public-coe-test-fmus/string-in/build/darwin64
make: Entering directory `/home/jenkins/builds/workspace/into-cps-public-coe-test-fmus/string-in/build/darwin64'
/usr/bin/cmake -H/home/jenkins/builds/workspace/into-cps-public-coe-test-fmus/string-in -B/home/jenkins/builds/workspace/into-cps-public-coe-test-fmus/string-in/build/darwin64 --check-build-system CMakeFiles/Makefile.cmake 0
/usr/bin/cmake -E cmake_progress_start /home/jenkins/builds/workspace/into-cps-public-coe-test-fmus/string-in/build/darwin64/CMakeFiles /home/jenkins/builds/workspace/into-cps-public-coe-test-fmus/string-in/build/darwin64/CMakeFiles/progress.marks
make -f CMakeFiles/Makefile2 all
make[1]: Entering directory `/home/jenkins/builds/workspace/into-cps-public-coe-test-fmus/string-in/build/darwin64'
make -f CMakeFiles/string-in.dir/build.make CMakeFiles/string-in.dir/depend
make[2]: Entering directory `/home/jenkins/builds/workspace/into-cps-public-coe-test-fmus/string-in/build/darwin64'
cd /home/jenkins/builds/workspace/into-cps-public-coe-test-fmus/string-in/build/darwin64 && /usr/bin/cmake -E cmake_depends "Unix Makefiles" /home/jenkins/builds/workspace/into-cps-public-coe-test-fmus/string-in /home/jenkins/builds/workspace/into-cps-public-coe-test-fmus/string-in /home/jenkins/builds/workspace/into-cps-public-coe-test-fmus/string-in/build/darwin64 /home/jenkins/builds/workspace/into-cps-public-coe-test-fmus/string-in/build/darwin64 /home/jenkins/builds/workspace/into-cps-public-coe-test-fmus/string-in/build/darwin64/CMakeFiles/string-in.dir/DependInfo.cmake --color=
Scanning dependencies of target string-in
make[2]: Leaving directory `/home/jenkins/builds/workspace/into-cps-public-coe-test-fmus/string-in/build/darwin64'
make -f CMakeFiles/string-in.dir/build.make CMakeFiles/string-in.dir/build
make[2]: Entering directory `/home/jenkins/builds/workspace/into-cps-public-coe-test-fmus/string-in/build/darwin64'
/usr/bin/cmake -E cmake_progress_report /home/jenkins/builds/workspace/into-cps-public-coe-test-fmus/string-in/build/darwin64/CMakeFiles 1
[100%] Building CXX object CMakeFiles/string-in.dir/sources/fmu.cpp.o
/var/lib/osxcross/target/bin/x86_64-apple-darwin15-g++   -DFMI_COSIMULATION -DGUID1=\"{ddd}\" -DLIBXML_STATIC -Dstring_in_EXPORTS -std=c++11 -fmessage-length=0 -std=c11 -I/home/jenkins/builds/workspace/into-cps-public-coe-test-fmus/string-in/build/darwin64 -I/home/jenkins/builds/workspace/into-cps-public-coe-test-fmus/string-in -I/home/jenkins/builds/workspace/into-cps-public-coe-test-fmus/string-in/sources -I/home/jenkins/builds/workspace/into-cps-public-coe-test-fmus/string-in/../includes/fmi/include    -o CMakeFiles/string-in.dir/sources/fmu.cpp.o -c /home/jenkins/builds/workspace/into-cps-public-coe-test-fmus/string-in/sources/fmu.cpp
cc1plus: warning: command line option '-std=c11' is valid for C/ObjC but not for C++
Linking CXX shared library string-in.dylib
/usr/bin/cmake -E cmake_link_script CMakeFiles/string-in.dir/link.txt --verbose=1
/var/lib/osxcross/target/bin/x86_64-apple-darwin15-g++   -std=c++11 -fmessage-length=0 -std=c11 -dynamiclib -Wl,-headerpad_max_install_names  -lpthread -o string-in.dylib -install_name /home/jenkins/builds/workspace/into-cps-public-coe-test-fmus/string-in/build/darwin64/string-in.dylib CMakeFiles/string-in.dir/sources/fmu.cpp.o /var/lib/osxcross/target/SDK/MacOSX10.11.sdk/usr/lib/libpthread.dylib 
make[2]: Leaving directory `/home/jenkins/builds/workspace/into-cps-public-coe-test-fmus/string-in/build/darwin64'
/usr/bin/cmake -E cmake_progress_report /home/jenkins/builds/workspace/into-cps-public-coe-test-fmus/string-in/build/darwin64/CMakeFiles  1
[100%] Built target string-in
make[1]: Leaving directory `/home/jenkins/builds/workspace/into-cps-public-coe-test-fmus/string-in/build/darwin64'
/usr/bin/cmake -E cmake_progress_start /home/jenkins/builds/workspace/into-cps-public-coe-test-fmus/string-in/build/darwin64/CMakeFiles 0
make: Leaving directory `/home/jenkins/builds/workspace/into-cps-public-coe-test-fmus/string-in/build/darwin64'
Building Linux x64 .so
-- The C compiler identification is GNU 4.8.4
-- The CXX compiler identification is GNU 4.8.4
-- Check for working C compiler: /usr/bin/cc
-- Check for working C compiler: /usr/bin/cc -- works
-- Detecting C compiler ABI info
-- Detecting C compiler ABI info - done
-- Detecting C compile features
-- Detecting C compile features - done
-- Check for working CXX compiler: /usr/bin/c++
-- Check for working CXX compiler: /usr/bin/c++ -- works
-- Detecting CXX compiler ABI info
-- Detecting CXX compiler ABI info - done
-- Detecting CXX compile features
-- Detecting CXX compile features - done
-- Performing Test COMPILER_SUPPORTS_CXX11
-- Performing Test COMPILER_SUPPORTS_CXX11 - Success
-- Performing Test COMPILER_SUPPORTS_CXX0X
-- Performing Test COMPILER_SUPPORTS_CXX0X - Success
-- Static linking with libstdc++.a in /usr/lib/gcc/x86_64-linux-gnu/4.8/libstdc++.a
-- Configuring done
-- Generating done
-- Build files have been written to: /home/jenkins/builds/workspace/into-cps-public-coe-test-fmus/string-in/build/linux64
make: Entering directory `/home/jenkins/builds/workspace/into-cps-public-coe-test-fmus/string-in/build/linux64'
/usr/bin/cmake -H/home/jenkins/builds/workspace/into-cps-public-coe-test-fmus/string-in -B/home/jenkins/builds/workspace/into-cps-public-coe-test-fmus/string-in/build/linux64 --check-build-system CMakeFiles/Makefile.cmake 0
/usr/bin/cmake -E cmake_progress_start /home/jenkins/builds/workspace/into-cps-public-coe-test-fmus/string-in/build/linux64/CMakeFiles /home/jenkins/builds/workspace/into-cps-public-coe-test-fmus/string-in/build/linux64/CMakeFiles/progress.marks
make -f CMakeFiles/Makefile2 all
make[1]: Entering directory `/home/jenkins/builds/workspace/into-cps-public-coe-test-fmus/string-in/build/linux64'
make -f CMakeFiles/string-in.dir/build.make CMakeFiles/string-in.dir/depend
make[2]: Entering directory `/home/jenkins/builds/workspace/into-cps-public-coe-test-fmus/string-in/build/linux64'
cd /home/jenkins/builds/workspace/into-cps-public-coe-test-fmus/string-in/build/linux64 && /usr/bin/cmake -E cmake_depends "Unix Makefiles" /home/jenkins/builds/workspace/into-cps-public-coe-test-fmus/string-in /home/jenkins/builds/workspace/into-cps-public-coe-test-fmus/string-in /home/jenkins/builds/workspace/into-cps-public-coe-test-fmus/string-in/build/linux64 /home/jenkins/builds/workspace/into-cps-public-coe-test-fmus/string-in/build/linux64 /home/jenkins/builds/workspace/into-cps-public-coe-test-fmus/string-in/build/linux64/CMakeFiles/string-in.dir/DependInfo.cmake --color=
Scanning dependencies of target string-in
make[2]: Leaving directory `/home/jenkins/builds/workspace/into-cps-public-coe-test-fmus/string-in/build/linux64'
make -f CMakeFiles/string-in.dir/build.make CMakeFiles/string-in.dir/build
make[2]: Entering directory `/home/jenkins/builds/workspace/into-cps-public-coe-test-fmus/string-in/build/linux64'
/usr/bin/cmake -E cmake_progress_report /home/jenkins/builds/workspace/into-cps-public-coe-test-fmus/string-in/build/linux64/CMakeFiles 1
[100%] Building CXX object CMakeFiles/string-in.dir/sources/fmu.cpp.o
/usr/bin/c++   -DFMI_COSIMULATION -DGUID1=\"{ddd}\" -DLIBXML_STATIC -Dstring_in_EXPORTS -std=c++11 -fmessage-length=0 -std=c11 -fPIC -I/home/jenkins/builds/workspace/into-cps-public-coe-test-fmus/string-in/build/linux64 -I/home/jenkins/builds/workspace/into-cps-public-coe-test-fmus/string-in -I/home/jenkins/builds/workspace/into-cps-public-coe-test-fmus/string-in/sources -I/home/jenkins/builds/workspace/into-cps-public-coe-test-fmus/string-in/../includes/fmi/include    -o CMakeFiles/string-in.dir/sources/fmu.cpp.o -c /home/jenkins/builds/workspace/into-cps-public-coe-test-fmus/string-in/sources/fmu.cpp
cc1plus: warning: command line option ‘-std=c11’ is valid for C/ObjC but not for C++ [enabled by default]
Linking CXX shared library string-in.so
/usr/bin/cmake -E cmake_link_script CMakeFiles/string-in.dir/link.txt --verbose=1
/usr/bin/c++  -fPIC  -std=c++11 -fmessage-length=0 -std=c11 -fPIC  -lpthread -shared -Wl,-soname,string-in.so -o string-in.so CMakeFiles/string-in.dir/sources/fmu.cpp.o -Wl,-Bstatic -lstdc++ -lpthread -Wl,-Bdynamic 
/usr/bin/ld: /usr/lib/gcc/x86_64-linux-gnu/4.8/../../../x86_64-linux-gnu/libpthread.a(unwind.o): relocation R_X86_64_32 against `.rodata.str1.8' can not be used when making a shared object; recompile with -fPIC
/usr/lib/gcc/x86_64-linux-gnu/4.8/../../../x86_64-linux-gnu/libpthread.a: error adding symbols: Bad value
collect2: error: ld returned 1 exit status
make[2]: *** [string-in.so] Error 1
make[2]: Leaving directory `/home/jenkins/builds/workspace/into-cps-public-coe-test-fmus/string-in/build/linux64'
make[1]: *** [CMakeFiles/string-in.dir/all] Error 2
make[1]: Leaving directory `/home/jenkins/builds/workspace/into-cps-public-coe-test-fmus/string-in/build/linux64'
make: *** [all] Error 2
make: Leaving directory `/home/jenkins/builds/workspace/into-cps-public-coe-test-fmus/string-in/build/linux64'
Build step 'Execute shell' marked build as failure
SSH: Current build result is [FAILURE], not going to run.
Setting commit status on GitHub for https://github.com/into-cps/public-coe-test-fmus/commit/e32164b4a02c0cfe273044265e901edb6de435ec
Started calculate disk usage of build
Finished Calculation of disk usage of build in 0 seconds
Started calculate disk usage of workspace
Finished Calculation of disk usage of workspace in 0 seconds
Finished: FAILURE