FailedConsole Output

Skipping 940 KB.. Full Log
ject$ - 	--- Execution time of 'updateDerivatives' was 0 [ms]
13:06:26.713 [main] DEBUG org.intocps.orchestration.coe.scala.CoeObject$ - 	--- Execution time of 'resolveInputs' was 1 [ms]
13:06:26.715 [main] DEBUG org.intocps.orchestration.coe.scala.CoeObject$ - 	--- Execution time of 'setallinputs' was 2 [ms]
13:06:26.715 [main] DEBUG org.intocps.orchestration.coe.scala.CoeObject$ - 	--- Execution time of 'serilizeStates' was 0 [ms]
13:06:26.715 [main] DEBUG org.intocps.orchestration.coe.scala.CoeObject$ - 	--- Execution time of 'getStepSize' was 0 [ms]
13:06:26.715 [main] DEBUG org.intocps.orchestration.coe.scala.CoeObject$ - 	--- Execution time of 'doStep' was 0 [ms]
13:06:26.715 [main] DEBUG org.intocps.orchestration.coe.scala.CoeObject$ - 	--- Execution time of 'processResults' was 0 [ms]
13:06:26.715 [main] DEBUG org.intocps.orchestration.coe.scala.CoeObject$ -  ## DoStep at: 4.4 Completed with: ok
13:06:26.716 [main] DEBUG org.intocps.orchestration.coe.scala.CoeObject$ - 	--- Execution time of 'notifier' was 1 [ms]
13:06:26.716 [main] DEBUG org.intocps.orchestration.coe.scala.CoeObject$ - 	--- Execution time of 'updateDerivatives' was 0 [ms]
13:06:26.717 [main] DEBUG org.intocps.orchestration.coe.scala.CoeObject$ - 	--- Execution time of 'resolveInputs' was 1 [ms]
13:06:26.719 [main] DEBUG org.intocps.orchestration.coe.scala.CoeObject$ - 	--- Execution time of 'setallinputs' was 2 [ms]
13:06:26.720 [main] DEBUG org.intocps.orchestration.coe.scala.CoeObject$ - 	--- Execution time of 'serilizeStates' was 0 [ms]
13:06:26.720 [main] DEBUG org.intocps.orchestration.coe.scala.CoeObject$ - 	--- Execution time of 'getStepSize' was 0 [ms]
13:06:26.720 [main] DEBUG org.intocps.orchestration.coe.scala.CoeObject$ - 	--- Execution time of 'doStep' was 0 [ms]
13:06:26.720 [main] DEBUG org.intocps.orchestration.coe.scala.CoeObject$ - 	--- Execution time of 'processResults' was 0 [ms]
13:06:26.720 [main] DEBUG org.intocps.orchestration.coe.scala.CoeObject$ -  ## DoStep at: 4.5 Completed with: ok
13:06:26.720 [main] DEBUG org.intocps.orchestration.coe.scala.CoeObject$ - 	--- Execution time of 'notifier' was 0 [ms]
13:06:26.721 [main] DEBUG org.intocps.orchestration.coe.scala.CoeObject$ - 	--- Execution time of 'updateDerivatives' was 1 [ms]
13:06:26.722 [main] DEBUG org.intocps.orchestration.coe.scala.CoeObject$ - 	--- Execution time of 'resolveInputs' was 1 [ms]
13:06:26.724 [main] DEBUG org.intocps.orchestration.coe.scala.CoeObject$ - 	--- Execution time of 'setallinputs' was 2 [ms]
13:06:26.724 [main] DEBUG org.intocps.orchestration.coe.scala.CoeObject$ - 	--- Execution time of 'serilizeStates' was 0 [ms]
13:06:26.724 [main] DEBUG org.intocps.orchestration.coe.scala.CoeObject$ - 	--- Execution time of 'getStepSize' was 0 [ms]
13:06:26.724 [main] DEBUG org.intocps.orchestration.coe.scala.CoeObject$ - 	--- Execution time of 'doStep' was 0 [ms]
13:06:26.725 [main] DEBUG org.intocps.orchestration.coe.scala.CoeObject$ - 	--- Execution time of 'processResults' was 1 [ms]
13:06:26.725 [main] DEBUG org.intocps.orchestration.coe.scala.CoeObject$ -  ## DoStep at: 4.6 Completed with: ok
13:06:26.725 [main] DEBUG org.intocps.orchestration.coe.scala.CoeObject$ - 	--- Execution time of 'notifier' was 0 [ms]
13:06:26.725 [main] DEBUG org.intocps.orchestration.coe.scala.CoeObject$ - 	--- Execution time of 'updateDerivatives' was 0 [ms]
13:06:26.728 [main] DEBUG org.intocps.orchestration.coe.scala.CoeObject$ - 	--- Execution time of 'resolveInputs' was 2 [ms]
13:06:26.729 [main] DEBUG org.intocps.orchestration.coe.scala.CoeObject$ - 	--- Execution time of 'setallinputs' was 1 [ms]
13:06:26.729 [main] DEBUG org.intocps.orchestration.coe.scala.CoeObject$ - 	--- Execution time of 'serilizeStates' was 0 [ms]
13:06:26.730 [main] DEBUG org.intocps.orchestration.coe.scala.CoeObject$ - 	--- Execution time of 'getStepSize' was 0 [ms]
13:06:26.730 [main] DEBUG org.intocps.orchestration.coe.scala.CoeObject$ - 	--- Execution time of 'doStep' was 0 [ms]
13:06:26.730 [main] DEBUG org.intocps.orchestration.coe.scala.CoeObject$ - 	--- Execution time of 'processResults' was 0 [ms]
13:06:26.730 [main] DEBUG org.intocps.orchestration.coe.scala.CoeObject$ -  ## DoStep at: 4.699999999999999 Completed with: ok
13:06:26.730 [main] DEBUG org.intocps.orchestration.coe.scala.CoeObject$ - 	--- Execution time of 'notifier' was 0 [ms]
13:06:26.730 [main] DEBUG org.intocps.orchestration.coe.scala.CoeObject$ - 	--- Execution time of 'updateDerivatives' was 0 [ms]
13:06:26.732 [main] DEBUG org.intocps.orchestration.coe.scala.CoeObject$ - 	--- Execution time of 'resolveInputs' was 2 [ms]
13:06:26.734 [main] DEBUG org.intocps.orchestration.coe.scala.CoeObject$ - 	--- Execution time of 'setallinputs' was 2 [ms]
13:06:26.734 [main] DEBUG org.intocps.orchestration.coe.scala.CoeObject$ - 	--- Execution time of 'serilizeStates' was 0 [ms]
13:06:26.734 [main] DEBUG org.intocps.orchestration.coe.scala.CoeObject$ - 	--- Execution time of 'getStepSize' was 0 [ms]
13:06:26.734 [main] DEBUG org.intocps.orchestration.coe.scala.CoeObject$ - 	--- Execution time of 'doStep' was 0 [ms]
13:06:26.734 [main] DEBUG org.intocps.orchestration.coe.scala.CoeObject$ - 	--- Execution time of 'processResults' was 0 [ms]
13:06:26.734 [main] DEBUG org.intocps.orchestration.coe.scala.CoeObject$ -  ## DoStep at: 4.799999999999999 Completed with: ok
13:06:26.734 [main] DEBUG org.intocps.orchestration.coe.scala.CoeObject$ - 	--- Execution time of 'notifier' was 0 [ms]
13:06:26.735 [main] DEBUG org.intocps.orchestration.coe.scala.CoeObject$ - 	--- Execution time of 'updateDerivatives' was 1 [ms]
13:06:26.736 [main] DEBUG org.intocps.orchestration.coe.scala.CoeObject$ - 	--- Execution time of 'resolveInputs' was 1 [ms]
13:06:26.738 [main] DEBUG org.intocps.orchestration.coe.scala.CoeObject$ - 	--- Execution time of 'setallinputs' was 2 [ms]
13:06:26.738 [main] DEBUG org.intocps.orchestration.coe.scala.CoeObject$ - 	--- Execution time of 'serilizeStates' was 0 [ms]
13:06:26.738 [main] DEBUG org.intocps.orchestration.coe.scala.CoeObject$ - 	--- Execution time of 'getStepSize' was 0 [ms]
13:06:26.739 [main] DEBUG org.intocps.orchestration.coe.scala.CoeObject$ - 	--- Execution time of 'doStep' was 1 [ms]
13:06:26.739 [main] DEBUG org.intocps.orchestration.coe.scala.CoeObject$ - 	--- Execution time of 'processResults' was 0 [ms]
13:06:26.739 [main] DEBUG org.intocps.orchestration.coe.scala.CoeObject$ -  ## DoStep at: 4.899999999999999 Completed with: ok
13:06:26.739 [main] DEBUG org.intocps.orchestration.coe.scala.CoeObject$ - 	--- Execution time of 'notifier' was 0 [ms]
13:06:26.739 [main] DEBUG org.intocps.orchestration.coe.scala.CoeObject$ - 	--- Execution time of 'updateDerivatives' was 0 [ms]
13:06:26.741 [main] DEBUG org.intocps.orchestration.coe.scala.CoeObject$ - 	--- Execution time of 'resolveInputs' was 1 [ms]
13:06:26.743 [main] DEBUG org.intocps.orchestration.coe.scala.CoeObject$ - 	--- Execution time of 'setallinputs' was 2 [ms]
13:06:26.743 [main] DEBUG org.intocps.orchestration.coe.scala.CoeObject$ - 	--- Execution time of 'serilizeStates' was 0 [ms]
13:06:26.743 [main] DEBUG org.intocps.orchestration.coe.scala.CoeObject$ - 	--- Execution time of 'getStepSize' was 0 [ms]
13:06:26.743 [main] DEBUG org.intocps.orchestration.coe.scala.CoeObject$ - 	--- Execution time of 'doStep' was 0 [ms]
13:06:26.743 [main] DEBUG org.intocps.orchestration.coe.scala.CoeObject$ - 	--- Execution time of 'processResults' was 0 [ms]
13:06:26.743 [main] DEBUG org.intocps.orchestration.coe.scala.CoeObject$ -  ## DoStep at: 4.999999999999998 Completed with: ok
13:06:26.743 [main] DEBUG org.intocps.orchestration.coe.scala.CoeObject$ - 	--- Execution time of 'notifier' was 0 [ms]
13:06:26.744 [main] DEBUG org.intocps.orchestration.coe.scala.CoeObject$ - 	--- Execution time of 'updateDerivatives' was 1 [ms]
13:06:26.745 [main] DEBUG org.intocps.orchestration.coe.scala.CoeObject$ - 	--- Execution time of 'resolveInputs' was 1 [ms]
13:06:26.747 [main] DEBUG org.intocps.orchestration.coe.scala.CoeObject$ - 	--- Execution time of 'setallinputs' was 2 [ms]
13:06:26.747 [main] DEBUG org.intocps.orchestration.coe.scala.CoeObject$ - 	--- Execution time of 'serilizeStates' was 0 [ms]
13:06:26.747 [main] DEBUG org.intocps.orchestration.coe.scala.CoeObject$ - 	--- Execution time of 'getStepSize' was 0 [ms]
13:06:26.747 [main] DEBUG org.intocps.orchestration.coe.scala.CoeObject$ - 	--- Execution time of 'doStep' was 0 [ms]
13:06:26.748 [main] DEBUG org.intocps.orchestration.coe.scala.CoeObject$ - 	--- Execution time of 'processResults' was 1 [ms]
13:06:26.748 [main] DEBUG org.intocps.orchestration.coe.scala.CoeObject$ -  ## DoStep at: 5.099999999999998 Completed with: ok
13:06:26.748 [main] DEBUG org.intocps.orchestration.coe.scala.CoeObject$ - 	--- Execution time of 'notifier' was 0 [ms]
13:06:26.748 [main] DEBUG org.intocps.orchestration.coe.scala.CoeObject$ - 	--- Execution time of 'updateDerivatives' was 0 [ms]
13:06:26.750 [main] DEBUG org.intocps.orchestration.coe.scala.CoeObject$ - 	--- Execution time of 'resolveInputs' was 2 [ms]
13:06:26.751 [main] DEBUG org.intocps.orchestration.coe.scala.CoeObject$ - 	--- Execution time of 'setallinputs' was 1 [ms]
13:06:26.751 [main] DEBUG org.intocps.orchestration.coe.scala.CoeObject$ - 	--- Execution time of 'serilizeStates' was 0 [ms]
13:06:26.751 [main] DEBUG org.intocps.orchestration.coe.scala.CoeObject$ - 	--- Execution time of 'getStepSize' was 0 [ms]
13:06:26.751 [main] DEBUG org.intocps.orchestration.coe.scala.CoeObject$ - 	--- Execution time of 'doStep' was 0 [ms]
13:06:26.751 [main] DEBUG org.intocps.orchestration.coe.scala.CoeObject$ - 	--- Execution time of 'processResults' was 0 [ms]
13:06:26.752 [main] DEBUG org.intocps.orchestration.coe.scala.CoeObject$ -  ## DoStep at: 5.1999999999999975 Completed with: ok
13:06:26.752 [main] DEBUG org.intocps.orchestration.coe.scala.CoeObject$ - 	--- Execution time of 'notifier' was 0 [ms]
13:06:26.752 [main] DEBUG org.intocps.orchestration.coe.scala.CoeObject$ - 	--- Execution time of 'updateDerivatives' was 0 [ms]
13:06:26.753 [main] DEBUG org.intocps.orchestration.coe.scala.CoeObject$ - 	--- Execution time of 'resolveInputs' was 1 [ms]
13:06:26.755 [main] DEBUG org.intocps.orchestration.coe.scala.CoeObject$ - 	--- Execution time of 'setallinputs' was 2 [ms]
13:06:26.755 [main] DEBUG org.intocps.orchestration.coe.scala.CoeObject$ - 	--- Execution time of 'serilizeStates' was 0 [ms]
13:06:26.755 [main] DEBUG org.intocps.orchestration.coe.scala.CoeObject$ - 	--- Execution time of 'getStepSize' was 0 [ms]
13:06:26.755 [main] DEBUG org.intocps.orchestration.coe.scala.CoeObject$ - 	--- Execution time of 'doStep' was 0 [ms]
13:06:26.755 [main] DEBUG org.intocps.orchestration.coe.scala.CoeObject$ - 	--- Execution time of 'processResults' was 0 [ms]
13:06:26.755 [main] DEBUG org.intocps.orchestration.coe.scala.CoeObject$ -  ## DoStep at: 5.299999999999997 Completed with: ok
13:06:26.755 [main] DEBUG org.intocps.orchestration.coe.scala.CoeObject$ - 	--- Execution time of 'notifier' was 0 [ms]
13:06:26.756 [main] DEBUG org.intocps.orchestration.coe.scala.CoeObject$ - 	--- Execution time of 'updateDerivatives' was 0 [ms]
13:06:26.757 [main] DEBUG org.intocps.orchestration.coe.scala.CoeObject$ - 	--- Execution time of 'resolveInputs' was 1 [ms]
13:06:26.759 [main] DEBUG org.intocps.orchestration.coe.scala.CoeObject$ - 	--- Execution time of 'setallinputs' was 2 [ms]
13:06:26.759 [main] DEBUG org.intocps.orchestration.coe.scala.CoeObject$ - 	--- Execution time of 'serilizeStates' was 0 [ms]
13:06:26.759 [main] DEBUG org.intocps.orchestration.coe.scala.CoeObject$ - 	--- Execution time of 'getStepSize' was 0 [ms]
13:06:26.759 [main] DEBUG org.intocps.orchestration.coe.scala.CoeObject$ - 	--- Execution time of 'doStep' was 0 [ms]
13:06:26.760 [main] DEBUG org.intocps.orchestration.coe.scala.CoeObject$ - 	--- Execution time of 'processResults' was 1 [ms]
13:06:26.760 [main] DEBUG org.intocps.orchestration.coe.scala.CoeObject$ -  ## DoStep at: 5.399999999999997 Completed with: ok
13:06:26.760 [main] DEBUG org.intocps.orchestration.coe.scala.CoeObject$ - 	--- Execution time of 'notifier' was 0 [ms]
13:06:26.760 [main] DEBUG org.intocps.orchestration.coe.scala.CoeObject$ - 	--- Execution time of 'updateDerivatives' was 0 [ms]
13:06:26.762 [main] DEBUG org.intocps.orchestration.coe.scala.CoeObject$ - 	--- Execution time of 'resolveInputs' was 2 [ms]
13:06:26.764 [main] DEBUG org.intocps.orchestration.coe.scala.CoeObject$ - 	--- Execution time of 'setallinputs' was 2 [ms]
13:06:26.764 [main] DEBUG org.intocps.orchestration.coe.scala.CoeObject$ - 	--- Execution time of 'serilizeStates' was 0 [ms]
13:06:26.764 [main] DEBUG org.intocps.orchestration.coe.scala.CoeObject$ - 	--- Execution time of 'getStepSize' was 0 [ms]
13:06:26.765 [main] DEBUG org.intocps.orchestration.coe.scala.CoeObject$ - 	--- Execution time of 'doStep' was 1 [ms]
13:06:26.765 [main] DEBUG org.intocps.orchestration.coe.scala.CoeObject$ - 	--- Execution time of 'processResults' was 0 [ms]
13:06:26.765 [main] DEBUG org.intocps.orchestration.coe.scala.CoeObject$ -  ## DoStep at: 5.4999999999999964 Completed with: ok
13:06:26.765 [main] DEBUG org.intocps.orchestration.coe.scala.CoeObject$ - 	--- Execution time of 'notifier' was 0 [ms]
13:06:26.765 [main] DEBUG org.intocps.orchestration.coe.scala.CoeObject$ - 	--- Execution time of 'updateDerivatives' was 0 [ms]
13:06:26.768 [main] DEBUG org.intocps.orchestration.coe.scala.CoeObject$ - 	--- Execution time of 'resolveInputs' was 3 [ms]
13:06:26.770 [main] DEBUG org.intocps.orchestration.coe.scala.CoeObject$ - 	--- Execution time of 'setallinputs' was 1 [ms]
13:06:26.770 [main] DEBUG org.intocps.orchestration.coe.scala.CoeObject$ - 	--- Execution time of 'serilizeStates' was 0 [ms]
13:06:26.770 [main] DEBUG org.intocps.orchestration.coe.scala.CoeObject$ - 	--- Execution time of 'getStepSize' was 0 [ms]
13:06:26.770 [main] DEBUG org.intocps.orchestration.coe.scala.CoeObject$ - 	--- Execution time of 'doStep' was 0 [ms]
13:06:26.770 [main] DEBUG org.intocps.orchestration.coe.scala.CoeObject$ - 	--- Execution time of 'processResults' was 0 [ms]
13:06:26.770 [main] DEBUG org.intocps.orchestration.coe.scala.CoeObject$ -  ## DoStep at: 5.599999999999996 Completed with: ok
13:06:26.770 [main] DEBUG org.intocps.orchestration.coe.scala.CoeObject$ - 	--- Execution time of 'notifier' was 0 [ms]
13:06:26.771 [main] DEBUG org.intocps.orchestration.coe.scala.CoeObject$ - 	--- Execution time of 'updateDerivatives' was 1 [ms]
13:06:26.772 [main] DEBUG org.intocps.orchestration.coe.scala.CoeObject$ - 	--- Execution time of 'resolveInputs' was 1 [ms]
13:06:26.773 [main] DEBUG org.intocps.orchestration.coe.scala.CoeObject$ - 	--- Execution time of 'setallinputs' was 1 [ms]
13:06:26.773 [main] DEBUG org.intocps.orchestration.coe.scala.CoeObject$ - 	--- Execution time of 'serilizeStates' was 0 [ms]
13:06:26.773 [main] DEBUG org.intocps.orchestration.coe.scala.CoeObject$ - 	--- Execution time of 'getStepSize' was 0 [ms]
13:06:26.773 [main] DEBUG org.intocps.orchestration.coe.scala.CoeObject$ - 	--- Execution time of 'doStep' was 0 [ms]
13:06:26.774 [main] DEBUG org.intocps.orchestration.coe.scala.CoeObject$ - 	--- Execution time of 'processResults' was 1 [ms]
13:06:26.774 [main] DEBUG org.intocps.orchestration.coe.scala.CoeObject$ -  ## DoStep at: 5.699999999999996 Completed with: ok
13:06:26.774 [main] DEBUG org.intocps.orchestration.coe.scala.CoeObject$ - 	--- Execution time of 'notifier' was 0 [ms]
13:06:26.774 [main] DEBUG org.intocps.orchestration.coe.scala.CoeObject$ - 	--- Execution time of 'updateDerivatives' was 0 [ms]
13:06:26.775 [main] DEBUG org.intocps.orchestration.coe.scala.CoeObject$ - 	--- Execution time of 'resolveInputs' was 1 [ms]
13:06:26.777 [main] DEBUG org.intocps.orchestration.coe.scala.CoeObject$ - 	--- Execution time of 'setallinputs' was 1 [ms]
13:06:26.777 [main] DEBUG org.intocps.orchestration.coe.scala.CoeObject$ - 	--- Execution time of 'serilizeStates' was 0 [ms]
13:06:26.777 [main] DEBUG org.intocps.orchestration.coe.scala.CoeObject$ - 	--- Execution time of 'getStepSize' was 0 [ms]
13:06:26.777 [main] DEBUG org.intocps.orchestration.coe.scala.CoeObject$ - 	--- Execution time of 'doStep' was 0 [ms]
13:06:26.777 [main] DEBUG org.intocps.orchestration.coe.scala.CoeObject$ - 	--- Execution time of 'processResults' was 0 [ms]
13:06:26.777 [main] DEBUG org.intocps.orchestration.coe.scala.CoeObject$ -  ## DoStep at: 5.799999999999995 Completed with: ok
13:06:26.778 [main] DEBUG org.intocps.orchestration.coe.scala.CoeObject$ - 	--- Execution time of 'notifier' was 1 [ms]
13:06:26.778 [main] DEBUG org.intocps.orchestration.coe.scala.CoeObject$ - 	--- Execution time of 'updateDerivatives' was 0 [ms]
13:06:26.779 [main] DEBUG org.intocps.orchestration.coe.scala.CoeObject$ - 	--- Execution time of 'resolveInputs' was 1 [ms]
13:06:26.781 [main] DEBUG org.intocps.orchestration.coe.scala.CoeObject$ - 	--- Execution time of 'setallinputs' was 2 [ms]
13:06:26.781 [main] DEBUG org.intocps.orchestration.coe.scala.CoeObject$ - 	--- Execution time of 'serilizeStates' was 0 [ms]
13:06:26.781 [main] DEBUG org.intocps.orchestration.coe.scala.CoeObject$ - 	--- Execution time of 'getStepSize' was 0 [ms]
13:06:26.781 [main] DEBUG org.intocps.orchestration.coe.scala.CoeObject$ - 	--- Execution time of 'doStep' was 0 [ms]
13:06:26.781 [main] DEBUG org.intocps.orchestration.coe.scala.CoeObject$ - 	--- Execution time of 'processResults' was 0 [ms]
13:06:26.781 [main] DEBUG org.intocps.orchestration.coe.scala.CoeObject$ -  ## DoStep at: 5.899999999999995 Completed with: ok
13:06:26.782 [main] DEBUG org.intocps.orchestration.coe.scala.CoeObject$ - 	--- Execution time of 'notifier' was 1 [ms]
13:06:26.782 [main] DEBUG org.intocps.orchestration.coe.scala.CoeObject$ - 	--- Execution time of 'updateDerivatives' was 0 [ms]
13:06:26.784 [main] DEBUG org.intocps.orchestration.coe.scala.CoeObject$ - 	--- Execution time of 'resolveInputs' was 2 [ms]
13:06:26.786 [main] DEBUG org.intocps.orchestration.coe.scala.CoeObject$ - 	--- Execution time of 'setallinputs' was 2 [ms]
13:06:26.786 [main] DEBUG org.intocps.orchestration.coe.scala.CoeObject$ - 	--- Execution time of 'serilizeStates' was 0 [ms]
13:06:26.786 [main] DEBUG org.intocps.orchestration.coe.scala.CoeObject$ - 	--- Execution time of 'getStepSize' was 0 [ms]
13:06:26.786 [main] DEBUG org.intocps.orchestration.coe.scala.CoeObject$ - 	--- Execution time of 'doStep' was 0 [ms]
13:06:26.786 [main] DEBUG org.intocps.orchestration.coe.scala.CoeObject$ - 	--- Execution time of 'processResults' was 0 [ms]
13:06:26.786 [main] DEBUG org.intocps.orchestration.coe.scala.CoeObject$ -  ## DoStep at: 5.999999999999995 Completed with: ok
13:06:26.787 [main] DEBUG org.intocps.orchestration.coe.scala.CoeObject$ - 	--- Execution time of 'notifier' was 1 [ms]
13:06:26.787 [main] DEBUG org.intocps.orchestration.coe.scala.CoeObject$ - 	--- Execution time of 'updateDerivatives' was 0 [ms]
13:06:26.789 [main] DEBUG org.intocps.orchestration.coe.scala.CoeObject$ - 	--- Execution time of 'resolveInputs' was 2 [ms]
13:06:26.792 [main] DEBUG org.intocps.orchestration.coe.scala.CoeObject$ - 	--- Execution time of 'setallinputs' was 3 [ms]
13:06:26.792 [main] DEBUG org.intocps.orchestration.coe.scala.CoeObject$ - 	--- Execution time of 'serilizeStates' was 0 [ms]
13:06:26.792 [main] DEBUG org.intocps.orchestration.coe.scala.CoeObject$ - 	--- Execution time of 'getStepSize' was 0 [ms]
13:06:26.792 [main] DEBUG org.intocps.orchestration.coe.scala.CoeObject$ - 	--- Execution time of 'doStep' was 0 [ms]
13:06:26.792 [main] DEBUG org.intocps.orchestration.coe.scala.CoeObject$ - 	--- Execution time of 'processResults' was 0 [ms]
13:06:26.792 [main] DEBUG org.intocps.orchestration.coe.scala.CoeObject$ -  ## DoStep at: 6.099999999999994 Completed with: ok
13:06:26.793 [main] DEBUG org.intocps.orchestration.coe.scala.CoeObject$ - 	--- Execution time of 'notifier' was 1 [ms]
13:06:26.793 [main] DEBUG org.intocps.orchestration.coe.scala.CoeObject$ - 	--- Execution time of 'updateDerivatives' was 0 [ms]
13:06:26.795 [main] DEBUG org.intocps.orchestration.coe.scala.CoeObject$ - 	--- Execution time of 'resolveInputs' was 2 [ms]
13:06:26.797 [main] DEBUG org.intocps.orchestration.coe.scala.CoeObject$ - 	--- Execution time of 'setallinputs' was 2 [ms]
13:06:26.797 [main] DEBUG org.intocps.orchestration.coe.scala.CoeObject$ - 	--- Execution time of 'serilizeStates' was 0 [ms]
13:06:26.798 [main] DEBUG org.intocps.orchestration.coe.scala.CoeObject$ - 	--- Execution time of 'getStepSize' was 0 [ms]
13:06:26.798 [main] DEBUG org.intocps.orchestration.coe.scala.CoeObject$ - 	--- Execution time of 'doStep' was 0 [ms]
13:06:26.798 [main] DEBUG org.intocps.orchestration.coe.scala.CoeObject$ - 	--- Execution time of 'processResults' was 0 [ms]
13:06:26.798 [main] DEBUG org.intocps.orchestration.coe.scala.CoeObject$ -  ## DoStep at: 6.199999999999994 Completed with: ok
13:06:26.798 [main] DEBUG org.intocps.orchestration.coe.scala.CoeObject$ - 	--- Execution time of 'notifier' was 0 [ms]
13:06:26.799 [main] DEBUG org.intocps.orchestration.coe.scala.CoeObject$ - 	--- Execution time of 'updateDerivatives' was 1 [ms]
13:06:26.801 [main] DEBUG org.intocps.orchestration.coe.scala.CoeObject$ - 	--- Execution time of 'resolveInputs' was 2 [ms]
13:06:26.802 [main] DEBUG org.intocps.orchestration.coe.scala.CoeObject$ - 	--- Execution time of 'setallinputs' was 1 [ms]
13:06:26.802 [main] DEBUG org.intocps.orchestration.coe.scala.CoeObject$ - 	--- Execution time of 'serilizeStates' was 0 [ms]
13:06:26.802 [main] DEBUG org.intocps.orchestration.coe.scala.CoeObject$ - 	--- Execution time of 'getStepSize' was 0 [ms]
13:06:26.803 [main] DEBUG org.intocps.orchestration.coe.scala.CoeObject$ - 	--- Execution time of 'doStep' was 0 [ms]
13:06:26.803 [main] DEBUG org.intocps.orchestration.coe.scala.CoeObject$ - 	--- Execution time of 'processResults' was 0 [ms]
13:06:26.803 [main] DEBUG org.intocps.orchestration.coe.scala.CoeObject$ -  ## DoStep at: 6.299999999999994 Completed with: ok
13:06:26.803 [main] DEBUG org.intocps.orchestration.coe.scala.CoeObject$ - 	--- Execution time of 'notifier' was 0 [ms]
13:06:26.803 [main] DEBUG org.intocps.orchestration.coe.scala.CoeObject$ - 	--- Execution time of 'updateDerivatives' was 0 [ms]
13:06:26.805 [main] DEBUG org.intocps.orchestration.coe.scala.CoeObject$ - 	--- Execution time of 'resolveInputs' was 2 [ms]
13:06:26.808 [main] DEBUG org.intocps.orchestration.coe.scala.CoeObject$ - 	--- Execution time of 'setallinputs' was 3 [ms]
13:06:26.808 [main] DEBUG org.intocps.orchestration.coe.scala.CoeObject$ - 	--- Execution time of 'serilizeStates' was 0 [ms]
13:06:26.808 [main] DEBUG org.intocps.orchestration.coe.scala.CoeObject$ - 	--- Execution time of 'getStepSize' was 0 [ms]
13:06:26.808 [main] DEBUG org.intocps.orchestration.coe.scala.CoeObject$ - 	--- Execution time of 'doStep' was 0 [ms]
13:06:26.808 [main] DEBUG org.intocps.orchestration.coe.scala.CoeObject$ - 	--- Execution time of 'processResults' was 0 [ms]
13:06:26.808 [main] DEBUG org.intocps.orchestration.coe.scala.CoeObject$ -  ## DoStep at: 6.399999999999993 Completed with: ok
13:06:26.809 [main] DEBUG org.intocps.orchestration.coe.scala.CoeObject$ - 	--- Execution time of 'notifier' was 1 [ms]
13:06:26.809 [main] DEBUG org.intocps.orchestration.coe.scala.CoeObject$ - 	--- Execution time of 'updateDerivatives' was 0 [ms]
13:06:26.811 [main] DEBUG org.intocps.orchestration.coe.scala.CoeObject$ - 	--- Execution time of 'resolveInputs' was 2 [ms]
13:06:26.813 [main] DEBUG org.intocps.orchestration.coe.scala.CoeObject$ - 	--- Execution time of 'setallinputs' was 2 [ms]
13:06:26.813 [main] DEBUG org.intocps.orchestration.coe.scala.CoeObject$ - 	--- Execution time of 'serilizeStates' was 0 [ms]
13:06:26.813 [main] DEBUG org.intocps.orchestration.coe.scala.CoeObject$ - 	--- Execution time of 'getStepSize' was 0 [ms]
13:06:26.813 [main] DEBUG org.intocps.orchestration.coe.scala.CoeObject$ - 	--- Execution time of 'doStep' was 0 [ms]
13:06:26.814 [main] DEBUG org.intocps.orchestration.coe.scala.CoeObject$ - 	--- Execution time of 'processResults' was 1 [ms]
13:06:26.814 [main] DEBUG org.intocps.orchestration.coe.scala.CoeObject$ -  ## DoStep at: 6.499999999999993 Completed with: ok
13:06:26.814 [main] DEBUG org.intocps.orchestration.coe.scala.CoeObject$ - 	--- Execution time of 'notifier' was 0 [ms]
13:06:26.814 [main] DEBUG org.intocps.orchestration.coe.scala.CoeObject$ - 	--- Execution time of 'updateDerivatives' was 0 [ms]
13:06:26.815 [main] DEBUG org.intocps.orchestration.coe.scala.CoeObject$ - 	--- Execution time of 'resolveInputs' was 1 [ms]
13:06:26.816 [main] DEBUG org.intocps.orchestration.coe.scala.CoeObject$ - 	--- Execution time of 'setallinputs' was 1 [ms]
13:06:26.816 [main] DEBUG org.intocps.orchestration.coe.scala.CoeObject$ - 	--- Execution time of 'serilizeStates' was 0 [ms]
13:06:26.816 [main] DEBUG org.intocps.orchestration.coe.scala.CoeObject$ - 	--- Execution time of 'getStepSize' was 0 [ms]
13:06:26.816 [main] DEBUG org.intocps.orchestration.coe.scala.CoeObject$ - 	--- Execution time of 'doStep' was 0 [ms]
13:06:26.817 [main] DEBUG org.intocps.orchestration.coe.scala.CoeObject$ - 	--- Execution time of 'processResults' was 0 [ms]
13:06:26.817 [main] DEBUG org.intocps.orchestration.coe.scala.CoeObject$ -  ## DoStep at: 6.5999999999999925 Completed with: ok
13:06:26.817 [main] DEBUG org.intocps.orchestration.coe.scala.CoeObject$ - 	--- Execution time of 'notifier' was 0 [ms]
13:06:26.817 [main] DEBUG org.intocps.orchestration.coe.scala.CoeObject$ - 	--- Execution time of 'updateDerivatives' was 0 [ms]
13:06:26.818 [main] DEBUG org.intocps.orchestration.coe.scala.CoeObject$ - 	--- Execution time of 'resolveInputs' was 1 [ms]
13:06:26.820 [main] DEBUG org.intocps.orchestration.coe.scala.CoeObject$ - 	--- Execution time of 'setallinputs' was 1 [ms]
13:06:26.820 [main] DEBUG org.intocps.orchestration.coe.scala.CoeObject$ - 	--- Execution time of 'serilizeStates' was 0 [ms]
13:06:26.820 [main] DEBUG org.intocps.orchestration.coe.scala.CoeObject$ - 	--- Execution time of 'getStepSize' was 0 [ms]
13:06:26.820 [main] DEBUG org.intocps.orchestration.coe.scala.CoeObject$ - 	--- Execution time of 'doStep' was 0 [ms]
13:06:26.820 [main] DEBUG org.intocps.orchestration.coe.scala.CoeObject$ - 	--- Execution time of 'processResults' was 0 [ms]
13:06:26.820 [main] DEBUG org.intocps.orchestration.coe.scala.CoeObject$ -  ## DoStep at: 6.699999999999992 Completed with: ok
13:06:26.821 [main] DEBUG org.intocps.orchestration.coe.scala.CoeObject$ - 	--- Execution time of 'notifier' was 1 [ms]
13:06:26.821 [main] DEBUG org.intocps.orchestration.coe.scala.CoeObject$ - 	--- Execution time of 'updateDerivatives' was 0 [ms]
13:06:26.822 [main] DEBUG org.intocps.orchestration.coe.scala.CoeObject$ - 	--- Execution time of 'resolveInputs' was 1 [ms]
13:06:26.823 [main] DEBUG org.intocps.orchestration.coe.scala.CoeObject$ - 	--- Execution time of 'setallinputs' was 1 [ms]
13:06:26.823 [main] DEBUG org.intocps.orchestration.coe.scala.CoeObject$ - 	--- Execution time of 'serilizeStates' was 0 [ms]
13:06:26.824 [main] DEBUG org.intocps.orchestration.coe.scala.CoeObject$ - 	--- Execution time of 'getStepSize' was 0 [ms]
13:06:26.824 [main] DEBUG org.intocps.orchestration.coe.scala.CoeObject$ - 	--- Execution time of 'doStep' was 0 [ms]
13:06:26.824 [main] DEBUG org.intocps.orchestration.coe.scala.CoeObject$ - 	--- Execution time of 'processResults' was 0 [ms]
13:06:26.824 [main] DEBUG org.intocps.orchestration.coe.scala.CoeObject$ -  ## DoStep at: 6.799999999999992 Completed with: ok
13:06:26.824 [main] DEBUG org.intocps.orchestration.coe.scala.CoeObject$ - 	--- Execution time of 'notifier' was 0 [ms]
13:06:26.824 [main] DEBUG org.intocps.orchestration.coe.scala.CoeObject$ - 	--- Execution time of 'updateDerivatives' was 0 [ms]
13:06:26.826 [main] DEBUG org.intocps.orchestration.coe.scala.CoeObject$ - 	--- Execution time of 'resolveInputs' was 2 [ms]
13:06:26.827 [main] DEBUG org.intocps.orchestration.coe.scala.CoeObject$ - 	--- Execution time of 'setallinputs' was 1 [ms]
13:06:26.827 [main] DEBUG org.intocps.orchestration.coe.scala.CoeObject$ - 	--- Execution time of 'serilizeStates' was 0 [ms]
13:06:26.827 [main] DEBUG org.intocps.orchestration.coe.scala.CoeObject$ - 	--- Execution time of 'getStepSize' was 0 [ms]
13:06:26.828 [main] DEBUG org.intocps.orchestration.coe.scala.CoeObject$ - 	--- Execution time of 'doStep' was 1 [ms]
13:06:26.828 [main] DEBUG org.intocps.orchestration.coe.scala.CoeObject$ - 	--- Execution time of 'processResults' was 0 [ms]
13:06:26.828 [main] DEBUG org.intocps.orchestration.coe.scala.CoeObject$ -  ## DoStep at: 6.8999999999999915 Completed with: ok
13:06:26.828 [main] DEBUG org.intocps.orchestration.coe.scala.CoeObject$ - 	--- Execution time of 'notifier' was 0 [ms]
13:06:26.828 [main] DEBUG org.intocps.orchestration.coe.scala.CoeObject$ - 	--- Execution time of 'updateDerivatives' was 0 [ms]
13:06:26.830 [main] DEBUG org.intocps.orchestration.coe.scala.CoeObject$ - 	--- Execution time of 'resolveInputs' was 2 [ms]
13:06:26.830 [main] DEBUG org.intocps.orchestration.coe.scala.CoeObject$ - 	--- Execution time of 'setallinputs' was 0 [ms]
13:06:26.831 [main] DEBUG org.intocps.orchestration.coe.scala.CoeObject$ - 	--- Execution time of 'serilizeStates' was 0 [ms]
13:06:26.831 [main] DEBUG org.intocps.orchestration.coe.scala.CoeObject$ - 	--- Execution time of 'getStepSize' was 0 [ms]
13:06:26.831 [main] DEBUG org.intocps.orchestration.coe.scala.CoeObject$ - 	--- Execution time of 'doStep' was 0 [ms]
13:06:26.831 [main] DEBUG org.intocps.orchestration.coe.scala.CoeObject$ - 	--- Execution time of 'processResults' was 0 [ms]
13:06:26.831 [main] DEBUG org.intocps.orchestration.coe.scala.CoeObject$ -  ## DoStep at: 6.999999999999991 Completed with: ok
13:06:26.831 [main] DEBUG org.intocps.orchestration.coe.scala.CoeObject$ - 	--- Execution time of 'notifier' was 0 [ms]
13:06:26.832 [main] DEBUG org.intocps.orchestration.coe.scala.CoeObject$ - 	--- Execution time of 'updateDerivatives' was 1 [ms]
13:06:26.833 [main] DEBUG org.intocps.orchestration.coe.scala.CoeObject$ - 	--- Execution time of 'resolveInputs' was 1 [ms]
13:06:26.835 [main] DEBUG org.intocps.orchestration.coe.scala.CoeObject$ - 	--- Execution time of 'setallinputs' was 2 [ms]
13:06:26.835 [main] DEBUG org.intocps.orchestration.coe.scala.CoeObject$ - 	--- Execution time of 'serilizeStates' was 0 [ms]
13:06:26.835 [main] DEBUG org.intocps.orchestration.coe.scala.CoeObject$ - 	--- Execution time of 'getStepSize' was 0 [ms]
13:06:26.835 [main] DEBUG org.intocps.orchestration.coe.scala.CoeObject$ - 	--- Execution time of 'doStep' was 0 [ms]
13:06:26.835 [main] DEBUG org.intocps.orchestration.coe.scala.CoeObject$ - 	--- Execution time of 'processResults' was 0 [ms]
13:06:26.835 [main] DEBUG org.intocps.orchestration.coe.scala.CoeObject$ -  ## DoStep at: 7.099999999999991 Completed with: ok
13:06:26.835 [main] DEBUG org.intocps.orchestration.coe.scala.CoeObject$ - 	--- Execution time of 'notifier' was 0 [ms]
13:06:26.836 [main] DEBUG org.intocps.orchestration.coe.scala.CoeObject$ - 	--- Execution time of 'updateDerivatives' was 1 [ms]
13:06:26.837 [main] DEBUG org.intocps.orchestration.coe.scala.CoeObject$ - 	--- Execution time of 'resolveInputs' was 1 [ms]
13:06:26.838 [main] DEBUG org.intocps.orchestration.coe.scala.CoeObject$ - 	--- Execution time of 'setallinputs' was 1 [ms]
13:06:26.838 [main] DEBUG org.intocps.orchestration.coe.scala.CoeObject$ - 	--- Execution time of 'serilizeStates' was 0 [ms]
13:06:26.838 [main] DEBUG org.intocps.orchestration.coe.scala.CoeObject$ - 	--- Execution time of 'getStepSize' was 0 [ms]
13:06:26.839 [main] DEBUG org.intocps.orchestration.coe.scala.CoeObject$ - 	--- Execution time of 'doStep' was 1 [ms]
13:06:26.839 [main] DEBUG org.intocps.orchestration.coe.scala.CoeObject$ - 	--- Execution time of 'processResults' was 0 [ms]
13:06:26.839 [main] DEBUG org.intocps.orchestration.coe.scala.CoeObject$ -  ## DoStep at: 7.19999999999999 Completed with: ok
13:06:26.839 [main] DEBUG org.intocps.orchestration.coe.scala.CoeObject$ - 	--- Execution time of 'notifier' was 0 [ms]
13:06:26.839 [main] DEBUG org.intocps.orchestration.coe.scala.CoeObject$ - 	--- Execution time of 'updateDerivatives' was 0 [ms]
13:06:26.841 [main] DEBUG org.intocps.orchestration.coe.scala.CoeObject$ - 	--- Execution time of 'resolveInputs' was 2 [ms]
13:06:26.842 [main] DEBUG org.intocps.orchestration.coe.scala.CoeObject$ - 	--- Execution time of 'setallinputs' was 1 [ms]
13:06:26.842 [main] DEBUG org.intocps.orchestration.coe.scala.CoeObject$ - 	--- Execution time of 'serilizeStates' was 0 [ms]
13:06:26.843 [main] DEBUG org.intocps.orchestration.coe.scala.CoeObject$ - 	--- Execution time of 'getStepSize' was 0 [ms]
13:06:26.843 [main] DEBUG org.intocps.orchestration.coe.scala.CoeObject$ - 	--- Execution time of 'doStep' was 0 [ms]
13:06:26.843 [main] DEBUG org.intocps.orchestration.coe.scala.CoeObject$ - 	--- Execution time of 'processResults' was 0 [ms]
13:06:26.843 [main] DEBUG org.intocps.orchestration.coe.scala.CoeObject$ -  ## DoStep at: 7.29999999999999 Completed with: ok
13:06:26.845 [main] DEBUG org.intocps.orchestration.coe.scala.CoeObject$ - 	--- Execution time of 'notifier' was 0 [ms]
13:06:26.846 [main] DEBUG org.intocps.orchestration.coe.scala.CoeObject$ - 	--- Execution time of 'updateDerivatives' was 1 [ms]
13:06:26.847 [main] DEBUG org.intocps.orchestration.coe.scala.CoeObject$ - 	--- Execution time of 'resolveInputs' was 1 [ms]
13:06:26.848 [main] DEBUG org.intocps.orchestration.coe.scala.CoeObject$ - 	--- Execution time of 'setallinputs' was 1 [ms]
13:06:26.848 [main] DEBUG org.intocps.orchestration.coe.scala.CoeObject$ - 	--- Execution time of 'serilizeStates' was 0 [ms]
13:06:26.848 [main] DEBUG org.intocps.orchestration.coe.scala.CoeObject$ - 	--- Execution time of 'getStepSize' was 0 [ms]
13:06:26.849 [main] DEBUG org.intocps.orchestration.coe.scala.CoeObject$ - 	--- Execution time of 'doStep' was 0 [ms]
13:06:26.849 [main] DEBUG org.intocps.orchestration.coe.scala.CoeObject$ - 	--- Execution time of 'processResults' was 0 [ms]
13:06:26.849 [main] DEBUG org.intocps.orchestration.coe.scala.CoeObject$ -  ## DoStep at: 7.39999999999999 Completed with: ok
13:06:26.849 [main] DEBUG org.intocps.orchestration.coe.scala.CoeObject$ - 	--- Execution time of 'notifier' was 0 [ms]
13:06:26.849 [main] DEBUG org.intocps.orchestration.coe.scala.CoeObject$ - 	--- Execution time of 'updateDerivatives' was 0 [ms]
13:06:26.851 [main] DEBUG org.intocps.orchestration.coe.scala.CoeObject$ - 	--- Execution time of 'resolveInputs' was 1 [ms]
13:06:26.852 [main] DEBUG org.intocps.orchestration.coe.scala.CoeObject$ - 	--- Execution time of 'setallinputs' was 1 [ms]
13:06:26.853 [main] DEBUG org.intocps.orchestration.coe.scala.CoeObject$ - 	--- Execution time of 'serilizeStates' was 0 [ms]
13:06:26.853 [main] DEBUG org.intocps.orchestration.coe.scala.CoeObject$ - 	--- Execution time of 'getStepSize' was 0 [ms]
13:06:26.853 [main] DEBUG org.intocps.orchestration.coe.scala.CoeObject$ - 	--- Execution time of 'doStep' was 0 [ms]
13:06:26.853 [main] DEBUG org.intocps.orchestration.coe.scala.CoeObject$ - 	--- Execution time of 'processResults' was 0 [ms]
13:06:26.853 [main] DEBUG org.intocps.orchestration.coe.scala.CoeObject$ -  ## DoStep at: 7.499999999999989 Completed with: ok
13:06:26.853 [main] DEBUG org.intocps.orchestration.coe.scala.CoeObject$ - 	--- Execution time of 'notifier' was 0 [ms]
13:06:26.854 [main] DEBUG org.intocps.orchestration.coe.scala.CoeObject$ - 	--- Execution time of 'updateDerivatives' was 1 [ms]
13:06:26.856 [main] DEBUG org.intocps.orchestration.coe.scala.CoeObject$ - 	--- Execution time of 'resolveInputs' was 2 [ms]
13:06:26.858 [main] DEBUG org.intocps.orchestration.coe.scala.CoeObject$ - 	--- Execution time of 'setallinputs' was 2 [ms]
13:06:26.858 [main] DEBUG org.intocps.orchestration.coe.scala.CoeObject$ - 	--- Execution time of 'serilizeStates' was 0 [ms]
13:06:26.858 [main] DEBUG org.intocps.orchestration.coe.scala.CoeObject$ - 	--- Execution time of 'getStepSize' was 0 [ms]
13:06:26.858 [main] DEBUG org.intocps.orchestration.coe.scala.CoeObject$ - 	--- Execution time of 'doStep' was 0 [ms]
13:06:26.858 [main] DEBUG org.intocps.orchestration.coe.scala.CoeObject$ - 	--- Execution time of 'processResults' was 0 [ms]
13:06:26.859 [main] DEBUG org.intocps.orchestration.coe.scala.CoeObject$ -  ## DoStep at: 7.599999999999989 Completed with: ok
13:06:26.859 [main] DEBUG org.intocps.orchestration.coe.scala.CoeObject$ - 	--- Execution time of 'notifier' was 0 [ms]
13:06:26.859 [main] DEBUG org.intocps.orchestration.coe.scala.CoeObject$ - 	--- Execution time of 'updateDerivatives' was 0 [ms]
13:06:26.861 [main] DEBUG org.intocps.orchestration.coe.scala.CoeObject$ - 	--- Execution time of 'resolveInputs' was 2 [ms]
13:06:26.863 [main] DEBUG org.intocps.orchestration.coe.scala.CoeObject$ - 	--- Execution time of 'setallinputs' was 2 [ms]
13:06:26.864 [main] DEBUG org.intocps.orchestration.coe.scala.CoeObject$ - 	--- Execution time of 'serilizeStates' was 0 [ms]
13:06:26.864 [main] DEBUG org.intocps.orchestration.coe.scala.CoeObject$ - 	--- Execution time of 'getStepSize' was 0 [ms]
13:06:26.864 [main] DEBUG org.intocps.orchestration.coe.scala.CoeObject$ - 	--- Execution time of 'doStep' was 0 [ms]
13:06:26.864 [main] DEBUG org.intocps.orchestration.coe.scala.CoeObject$ - 	--- Execution time of 'processResults' was 0 [ms]
13:06:26.864 [main] DEBUG org.intocps.orchestration.coe.scala.CoeObject$ -  ## DoStep at: 7.699999999999989 Completed with: ok
13:06:26.864 [main] DEBUG org.intocps.orchestration.coe.scala.CoeObject$ - 	--- Execution time of 'notifier' was 0 [ms]
13:06:26.865 [main] DEBUG org.intocps.orchestration.coe.scala.CoeObject$ - 	--- Execution time of 'updateDerivatives' was 1 [ms]
13:06:26.867 [main] DEBUG org.intocps.orchestration.coe.scala.CoeObject$ - 	--- Execution time of 'resolveInputs' was 2 [ms]
13:06:26.869 [main] DEBUG org.intocps.orchestration.coe.scala.CoeObject$ - 	--- Execution time of 'setallinputs' was 2 [ms]
13:06:26.869 [main] DEBUG org.intocps.orchestration.coe.scala.CoeObject$ - 	--- Execution time of 'serilizeStates' was 0 [ms]
13:06:26.870 [main] DEBUG org.intocps.orchestration.coe.scala.CoeObject$ - 	--- Execution time of 'getStepSize' was 0 [ms]
13:06:26.870 [main] DEBUG org.intocps.orchestration.coe.scala.CoeObject$ - 	--- Execution time of 'doStep' was 0 [ms]
13:06:26.870 [main] DEBUG org.intocps.orchestration.coe.scala.CoeObject$ - 	--- Execution time of 'processResults' was 0 [ms]
13:06:26.870 [main] DEBUG org.intocps.orchestration.coe.scala.CoeObject$ -  ## DoStep at: 7.799999999999988 Completed with: ok
13:06:26.870 [main] DEBUG org.intocps.orchestration.coe.scala.CoeObject$ - 	--- Execution time of 'notifier' was 0 [ms]
13:06:26.870 [main] DEBUG org.intocps.orchestration.coe.scala.CoeObject$ - 	--- Execution time of 'updateDerivatives' was 0 [ms]
13:06:26.873 [main] DEBUG org.intocps.orchestration.coe.scala.CoeObject$ - 	--- Execution time of 'resolveInputs' was 3 [ms]
13:06:26.875 [main] DEBUG org.intocps.orchestration.coe.scala.CoeObject$ - 	--- Execution time of 'setallinputs' was 2 [ms]
13:06:26.875 [main] DEBUG org.intocps.orchestration.coe.scala.CoeObject$ - 	--- Execution time of 'serilizeStates' was 0 [ms]
13:06:26.875 [main] DEBUG org.intocps.orchestration.coe.scala.CoeObject$ - 	--- Execution time of 'getStepSize' was 0 [ms]
13:06:26.875 [main] DEBUG org.intocps.orchestration.coe.scala.CoeObject$ - 	--- Execution time of 'doStep' was 0 [ms]
13:06:26.876 [main] DEBUG org.intocps.orchestration.coe.scala.CoeObject$ - 	--- Execution time of 'processResults' was 1 [ms]
13:06:26.876 [main] DEBUG org.intocps.orchestration.coe.scala.CoeObject$ -  ## DoStep at: 7.899999999999988 Completed with: ok
13:06:26.876 [main] DEBUG org.intocps.orchestration.coe.scala.CoeObject$ - 	--- Execution time of 'notifier' was 0 [ms]
13:06:26.876 [main] DEBUG org.intocps.orchestration.coe.scala.CoeObject$ - 	--- Execution time of 'updateDerivatives' was 0 [ms]
13:06:26.877 [main] DEBUG org.intocps.orchestration.coe.scala.CoeObject$ - 	--- Execution time of 'resolveInputs' was 1 [ms]
13:06:26.879 [main] DEBUG org.intocps.orchestration.coe.scala.CoeObject$ - 	--- Execution time of 'setallinputs' was 2 [ms]
13:06:26.879 [main] DEBUG org.intocps.orchestration.coe.scala.CoeObject$ - 	--- Execution time of 'serilizeStates' was 0 [ms]
13:06:26.879 [main] DEBUG org.intocps.orchestration.coe.scala.CoeObject$ - 	--- Execution time of 'getStepSize' was 0 [ms]
13:06:26.879 [main] DEBUG org.intocps.orchestration.coe.scala.CoeObject$ - 	--- Execution time of 'doStep' was 0 [ms]
13:06:26.880 [main] DEBUG org.intocps.orchestration.coe.scala.CoeObject$ - 	--- Execution time of 'processResults' was 1 [ms]
13:06:26.880 [main] DEBUG org.intocps.orchestration.coe.scala.CoeObject$ -  ## DoStep at: 7.999999999999988 Completed with: ok
13:06:26.880 [main] DEBUG org.intocps.orchestration.coe.scala.CoeObject$ - 	--- Execution time of 'notifier' was 0 [ms]
13:06:26.880 [main] DEBUG org.intocps.orchestration.coe.scala.CoeObject$ - 	--- Execution time of 'updateDerivatives' was 0 [ms]
13:06:26.882 [main] DEBUG org.intocps.orchestration.coe.scala.CoeObject$ - 	--- Execution time of 'resolveInputs' was 2 [ms]
13:06:26.883 [main] DEBUG org.intocps.orchestration.coe.scala.CoeObject$ - 	--- Execution time of 'setallinputs' was 1 [ms]
13:06:26.883 [main] DEBUG org.intocps.orchestration.coe.scala.CoeObject$ - 	--- Execution time of 'serilizeStates' was 0 [ms]
13:06:26.883 [main] DEBUG org.intocps.orchestration.coe.scala.CoeObject$ - 	--- Execution time of 'getStepSize' was 0 [ms]
13:06:26.883 [main] DEBUG org.intocps.orchestration.coe.scala.CoeObject$ - 	--- Execution time of 'doStep' was 0 [ms]
13:06:26.884 [main] DEBUG org.intocps.orchestration.coe.scala.CoeObject$ - 	--- Execution time of 'processResults' was 1 [ms]
13:06:26.884 [main] DEBUG org.intocps.orchestration.coe.scala.CoeObject$ -  ## DoStep at: 8.099999999999987 Completed with: ok
13:06:26.884 [main] DEBUG org.intocps.orchestration.coe.scala.CoeObject$ - 	--- Execution time of 'notifier' was 0 [ms]
13:06:26.884 [main] DEBUG org.intocps.orchestration.coe.scala.CoeObject$ - 	--- Execution time of 'updateDerivatives' was 0 [ms]
13:06:26.885 [main] DEBUG org.intocps.orchestration.coe.scala.CoeObject$ - 	--- Execution time of 'resolveInputs' was 1 [ms]
13:06:26.887 [main] DEBUG org.intocps.orchestration.coe.scala.CoeObject$ - 	--- Execution time of 'setallinputs' was 1 [ms]
13:06:26.887 [main] DEBUG org.intocps.orchestration.coe.scala.CoeObject$ - 	--- Execution time of 'serilizeStates' was 0 [ms]
13:06:26.887 [main] DEBUG org.intocps.orchestration.coe.scala.CoeObject$ - 	--- Execution time of 'getStepSize' was 0 [ms]
13:06:26.887 [main] DEBUG org.intocps.orchestration.coe.scala.CoeObject$ - 	--- Execution time of 'doStep' was 0 [ms]
13:06:26.887 [main] DEBUG org.intocps.orchestration.coe.scala.CoeObject$ - 	--- Execution time of 'processResults' was 0 [ms]
13:06:26.887 [main] DEBUG org.intocps.orchestration.coe.scala.CoeObject$ -  ## DoStep at: 8.199999999999987 Completed with: ok
13:06:26.888 [main] DEBUG org.intocps.orchestration.coe.scala.CoeObject$ - 	--- Execution time of 'notifier' was 1 [ms]
13:06:26.888 [main] DEBUG org.intocps.orchestration.coe.scala.CoeObject$ - 	--- Execution time of 'updateDerivatives' was 0 [ms]
13:06:26.889 [main] DEBUG org.intocps.orchestration.coe.scala.CoeObject$ - 	--- Execution time of 'resolveInputs' was 1 [ms]
13:06:26.891 [main] DEBUG org.intocps.orchestration.coe.scala.CoeObject$ - 	--- Execution time of 'setallinputs' was 2 [ms]
13:06:26.891 [main] DEBUG org.intocps.orchestration.coe.scala.CoeObject$ - 	--- Execution time of 'serilizeStates' was 0 [ms]
13:06:26.891 [main] DEBUG org.intocps.orchestration.coe.scala.CoeObject$ - 	--- Execution time of 'getStepSize' was 0 [ms]
13:06:26.891 [main] DEBUG org.intocps.orchestration.coe.scala.CoeObject$ - 	--- Execution time of 'doStep' was 0 [ms]
13:06:26.891 [main] DEBUG org.intocps.orchestration.coe.scala.CoeObject$ - 	--- Execution time of 'processResults' was 0 [ms]
13:06:26.891 [main] DEBUG org.intocps.orchestration.coe.scala.CoeObject$ -  ## DoStep at: 8.299999999999986 Completed with: ok
13:06:26.891 [main] DEBUG org.intocps.orchestration.coe.scala.CoeObject$ - 	--- Execution time of 'notifier' was 0 [ms]
13:06:26.892 [main] DEBUG org.intocps.orchestration.coe.scala.CoeObject$ - 	--- Execution time of 'updateDerivatives' was 1 [ms]
13:06:26.893 [main] DEBUG org.intocps.orchestration.coe.scala.CoeObject$ - 	--- Execution time of 'resolveInputs' was 1 [ms]
13:06:26.894 [main] DEBUG org.intocps.orchestration.coe.scala.CoeObject$ - 	--- Execution time of 'setallinputs' was 1 [ms]
13:06:26.895 [main] DEBUG org.intocps.orchestration.coe.scala.CoeObject$ - 	--- Execution time of 'serilizeStates' was 0 [ms]
13:06:26.895 [main] DEBUG org.intocps.orchestration.coe.scala.CoeObject$ - 	--- Execution time of 'getStepSize' was 0 [ms]
13:06:26.895 [main] DEBUG org.intocps.orchestration.coe.scala.CoeObject$ - 	--- Execution time of 'doStep' was 0 [ms]
13:06:26.895 [main] DEBUG org.intocps.orchestration.coe.scala.CoeObject$ - 	--- Execution time of 'processResults' was 0 [ms]
13:06:26.895 [main] DEBUG org.intocps.orchestration.coe.scala.CoeObject$ -  ## DoStep at: 8.399999999999986 Completed with: ok
13:06:26.895 [main] DEBUG org.intocps.orchestration.coe.scala.CoeObject$ - 	--- Execution time of 'notifier' was 0 [ms]
13:06:26.895 [main] DEBUG org.intocps.orchestration.coe.scala.CoeObject$ - 	--- Execution time of 'updateDerivatives' was 0 [ms]
13:06:26.897 [main] DEBUG org.intocps.orchestration.coe.scala.CoeObject$ - 	--- Execution time of 'resolveInputs' was 2 [ms]
13:06:26.898 [main] DEBUG org.intocps.orchestration.coe.scala.CoeObject$ - 	--- Execution time of 'setallinputs' was 1 [ms]
13:06:26.898 [main] DEBUG org.intocps.orchestration.coe.scala.CoeObject$ - 	--- Execution time of 'serilizeStates' was 0 [ms]
13:06:26.898 [main] DEBUG org.intocps.orchestration.coe.scala.CoeObject$ - 	--- Execution time of 'getStepSize' was 0 [ms]
13:06:26.898 [main] DEBUG org.intocps.orchestration.coe.scala.CoeObject$ - 	--- Execution time of 'doStep' was 0 [ms]
13:06:26.898 [main] DEBUG org.intocps.orchestration.coe.scala.CoeObject$ - 	--- Execution time of 'processResults' was 0 [ms]
13:06:26.899 [main] DEBUG org.intocps.orchestration.coe.scala.CoeObject$ -  ## DoStep at: 8.499999999999986 Completed with: ok
13:06:26.899 [main] DEBUG org.intocps.orchestration.coe.scala.CoeObject$ - 	--- Execution time of 'notifier' was 0 [ms]
13:06:26.899 [main] DEBUG org.intocps.orchestration.coe.scala.CoeObject$ - 	--- Execution time of 'updateDerivatives' was 0 [ms]
13:06:26.900 [main] DEBUG org.intocps.orchestration.coe.scala.CoeObject$ - 	--- Execution time of 'resolveInputs' was 1 [ms]
13:06:26.902 [main] DEBUG org.intocps.orchestration.coe.scala.CoeObject$ - 	--- Execution time of 'setallinputs' was 2 [ms]
13:06:26.902 [main] DEBUG org.intocps.orchestration.coe.scala.CoeObject$ - 	--- Execution time of 'serilizeStates' was 0 [ms]
13:06:26.902 [main] DEBUG org.intocps.orchestration.coe.scala.CoeObject$ - 	--- Execution time of 'getStepSize' was 0 [ms]
13:06:26.902 [main] DEBUG org.intocps.orchestration.coe.scala.CoeObject$ - 	--- Execution time of 'doStep' was 0 [ms]
13:06:26.902 [main] DEBUG org.intocps.orchestration.coe.scala.CoeObject$ - 	--- Execution time of 'processResults' was 0 [ms]
13:06:26.902 [main] DEBUG org.intocps.orchestration.coe.scala.CoeObject$ -  ## DoStep at: 8.599999999999985 Completed with: ok
13:06:26.902 [main] DEBUG org.intocps.orchestration.coe.scala.CoeObject$ - 	--- Execution time of 'notifier' was 0 [ms]
13:06:26.903 [main] DEBUG org.intocps.orchestration.coe.scala.CoeObject$ - 	--- Execution time of 'updateDerivatives' was 1 [ms]
13:06:26.904 [main] DEBUG org.intocps.orchestration.coe.scala.CoeObject$ - 	--- Execution time of 'resolveInputs' was 1 [ms]
13:06:26.906 [main] DEBUG org.intocps.orchestration.coe.scala.CoeObject$ - 	--- Execution time of 'setallinputs' was 2 [ms]
13:06:26.906 [main] DEBUG org.intocps.orchestration.coe.scala.CoeObject$ - 	--- Execution time of 'serilizeStates' was 0 [ms]
13:06:26.906 [main] DEBUG org.intocps.orchestration.coe.scala.CoeObject$ - 	--- Execution time of 'getStepSize' was 0 [ms]
13:06:26.907 [main] DEBUG org.intocps.orchestration.coe.scala.CoeObject$ - 	--- Execution time of 'doStep' was 1 [ms]
13:06:26.907 [main] DEBUG org.intocps.orchestration.coe.scala.CoeObject$ - 	--- Execution time of 'processResults' was 0 [ms]
13:06:26.907 [main] DEBUG org.intocps.orchestration.coe.scala.CoeObject$ -  ## DoStep at: 8.699999999999985 Completed with: ok
13:06:26.907 [main] DEBUG org.intocps.orchestration.coe.scala.CoeObject$ - 	--- Execution time of 'notifier' was 0 [ms]
13:06:26.907 [main] DEBUG org.intocps.orchestration.coe.scala.CoeObject$ - 	--- Execution time of 'updateDerivatives' was 0 [ms]
13:06:26.909 [main] DEBUG org.intocps.orchestration.coe.scala.CoeObject$ - 	--- Execution time of 'resolveInputs' was 2 [ms]
13:06:26.911 [main] DEBUG org.intocps.orchestration.coe.scala.CoeObject$ - 	--- Execution time of 'setallinputs' was 2 [ms]
13:06:26.911 [main] DEBUG org.intocps.orchestration.coe.scala.CoeObject$ - 	--- Execution time of 'serilizeStates' was 0 [ms]
13:06:26.911 [main] DEBUG org.intocps.orchestration.coe.scala.CoeObject$ - 	--- Execution time of 'getStepSize' was 0 [ms]
13:06:26.912 [main] DEBUG org.intocps.orchestration.coe.scala.CoeObject$ - 	--- Execution time of 'doStep' was 0 [ms]
13:06:26.912 [main] DEBUG org.intocps.orchestration.coe.scala.CoeObject$ - 	--- Execution time of 'processResults' was 0 [ms]
13:06:26.912 [main] DEBUG org.intocps.orchestration.coe.scala.CoeObject$ -  ## DoStep at: 8.799999999999985 Completed with: ok
13:06:26.912 [main] DEBUG org.intocps.orchestration.coe.scala.CoeObject$ - 	--- Execution time of 'notifier' was 0 [ms]
13:06:26.912 [main] DEBUG org.intocps.orchestration.coe.scala.CoeObject$ - 	--- Execution time of 'updateDerivatives' was 0 [ms]
13:06:26.915 [main] DEBUG org.intocps.orchestration.coe.scala.CoeObject$ - 	--- Execution time of 'resolveInputs' was 3 [ms]
13:06:26.917 [main] DEBUG org.intocps.orchestration.coe.scala.CoeObject$ - 	--- Execution time of 'setallinputs' was 2 [ms]
13:06:26.917 [main] DEBUG org.intocps.orchestration.coe.scala.CoeObject$ - 	--- Execution time of 'serilizeStates' was 0 [ms]
13:06:26.917 [main] DEBUG org.intocps.orchestration.coe.scala.CoeObject$ - 	--- Execution time of 'getStepSize' was 0 [ms]
13:06:26.918 [main] DEBUG org.intocps.orchestration.coe.scala.CoeObject$ - 	--- Execution time of 'doStep' was 0 [ms]
13:06:26.918 [main] DEBUG org.intocps.orchestration.coe.scala.CoeObject$ - 	--- Execution time of 'processResults' was 0 [ms]
13:06:26.918 [main] DEBUG org.intocps.orchestration.coe.scala.CoeObject$ -  ## DoStep at: 8.899999999999984 Completed with: ok
13:06:26.918 [main] DEBUG org.intocps.orchestration.coe.scala.CoeObject$ - 	--- Execution time of 'notifier' was 0 [ms]
13:06:26.918 [main] DEBUG org.intocps.orchestration.coe.scala.CoeObject$ - 	--- Execution time of 'updateDerivatives' was 0 [ms]
13:06:26.921 [main] DEBUG org.intocps.orchestration.coe.scala.CoeObject$ - 	--- Execution time of 'resolveInputs' was 3 [ms]
13:06:26.923 [main] DEBUG org.intocps.orchestration.coe.scala.CoeObject$ - 	--- Execution time of 'setallinputs' was 2 [ms]
13:06:26.923 [main] DEBUG org.intocps.orchestration.coe.scala.CoeObject$ - 	--- Execution time of 'serilizeStates' was 0 [ms]
13:06:26.923 [main] DEBUG org.intocps.orchestration.coe.scala.CoeObject$ - 	--- Execution time of 'getStepSize' was 0 [ms]
13:06:26.924 [main] DEBUG org.intocps.orchestration.coe.scala.CoeObject$ - 	--- Execution time of 'doStep' was 1 [ms]
13:06:26.924 [main] DEBUG org.intocps.orchestration.coe.scala.CoeObject$ - 	--- Execution time of 'processResults' was 0 [ms]
13:06:26.924 [main] DEBUG org.intocps.orchestration.coe.scala.CoeObject$ -  ## DoStep at: 8.999999999999984 Completed with: ok
13:06:26.924 [main] DEBUG org.intocps.orchestration.coe.scala.CoeObject$ - 	--- Execution time of 'notifier' was 0 [ms]
13:06:26.924 [main] DEBUG org.intocps.orchestration.coe.scala.CoeObject$ - 	--- Execution time of 'updateDerivatives' was 0 [ms]
13:06:26.927 [main] DEBUG org.intocps.orchestration.coe.scala.CoeObject$ - 	--- Execution time of 'resolveInputs' was 3 [ms]
13:06:26.929 [main] DEBUG org.intocps.orchestration.coe.scala.CoeObject$ - 	--- Execution time of 'setallinputs' was 2 [ms]
13:06:26.929 [main] DEBUG org.intocps.orchestration.coe.scala.CoeObject$ - 	--- Execution time of 'serilizeStates' was 0 [ms]
13:06:26.929 [main] DEBUG org.intocps.orchestration.coe.scala.CoeObject$ - 	--- Execution time of 'getStepSize' was 0 [ms]
13:06:26.929 [main] DEBUG org.intocps.orchestration.coe.scala.CoeObject$ - 	--- Execution time of 'doStep' was 0 [ms]
13:06:26.929 [main] DEBUG org.intocps.orchestration.coe.scala.CoeObject$ - 	--- Execution time of 'processResults' was 0 [ms]
13:06:26.929 [main] DEBUG org.intocps.orchestration.coe.scala.CoeObject$ -  ## DoStep at: 9.099999999999984 Completed with: ok
13:06:26.929 [main] DEBUG org.intocps.orchestration.coe.scala.CoeObject$ - 	--- Execution time of 'notifier' was 0 [ms]
13:06:26.930 [main] DEBUG org.intocps.orchestration.coe.scala.CoeObject$ - 	--- Execution time of 'updateDerivatives' was 1 [ms]
13:06:26.931 [main] DEBUG org.intocps.orchestration.coe.scala.CoeObject$ - 	--- Execution time of 'resolveInputs' was 1 [ms]
13:06:26.933 [main] DEBUG org.intocps.orchestration.coe.scala.CoeObject$ - 	--- Execution time of 'setallinputs' was 2 [ms]
13:06:26.933 [main] DEBUG org.intocps.orchestration.coe.scala.CoeObject$ - 	--- Execution time of 'serilizeStates' was 0 [ms]
13:06:26.934 [main] DEBUG org.intocps.orchestration.coe.scala.CoeObject$ - 	--- Execution time of 'getStepSize' was 0 [ms]
13:06:26.934 [main] DEBUG org.intocps.orchestration.coe.scala.CoeObject$ - 	--- Execution time of 'doStep' was 0 [ms]
13:06:26.934 [main] DEBUG org.intocps.orchestration.coe.scala.CoeObject$ - 	--- Execution time of 'processResults' was 0 [ms]
13:06:26.934 [main] DEBUG org.intocps.orchestration.coe.scala.CoeObject$ -  ## DoStep at: 9.199999999999983 Completed with: ok
13:06:26.934 [main] DEBUG org.intocps.orchestration.coe.scala.CoeObject$ - 	--- Execution time of 'notifier' was 0 [ms]
13:06:26.934 [main] DEBUG org.intocps.orchestration.coe.scala.CoeObject$ - 	--- Execution time of 'updateDerivatives' was 0 [ms]
13:06:26.937 [main] DEBUG org.intocps.orchestration.coe.scala.CoeObject$ - 	--- Execution time of 'resolveInputs' was 3 [ms]
13:06:26.939 [main] DEBUG org.intocps.orchestration.coe.scala.CoeObject$ - 	--- Execution time of 'setallinputs' was 2 [ms]
13:06:26.939 [main] DEBUG org.intocps.orchestration.coe.scala.CoeObject$ - 	--- Execution time of 'serilizeStates' was 0 [ms]
13:06:26.939 [main] DEBUG org.intocps.orchestration.coe.scala.CoeObject$ - 	--- Execution time of 'getStepSize' was 0 [ms]
13:06:26.940 [main] DEBUG org.intocps.orchestration.coe.scala.CoeObject$ - 	--- Execution time of 'doStep' was 0 [ms]
13:06:26.940 [main] DEBUG org.intocps.orchestration.coe.scala.CoeObject$ - 	--- Execution time of 'processResults' was 0 [ms]
13:06:26.940 [main] DEBUG org.intocps.orchestration.coe.scala.CoeObject$ -  ## DoStep at: 9.299999999999983 Completed with: ok
13:06:26.940 [main] DEBUG org.intocps.orchestration.coe.scala.CoeObject$ - 	--- Execution time of 'notifier' was 0 [ms]
13:06:26.940 [main] DEBUG org.intocps.orchestration.coe.scala.CoeObject$ - 	--- Execution time of 'updateDerivatives' was 0 [ms]
13:06:26.943 [main] DEBUG org.intocps.orchestration.coe.scala.CoeObject$ - 	--- Execution time of 'resolveInputs' was 3 [ms]
13:06:26.945 [main] DEBUG org.intocps.orchestration.coe.scala.CoeObject$ - 	--- Execution time of 'setallinputs' was 2 [ms]
13:06:26.945 [main] DEBUG org.intocps.orchestration.coe.scala.CoeObject$ - 	--- Execution time of 'serilizeStates' was 0 [ms]
13:06:26.945 [main] DEBUG org.intocps.orchestration.coe.scala.CoeObject$ - 	--- Execution time of 'getStepSize' was 0 [ms]
13:06:26.945 [main] DEBUG org.intocps.orchestration.coe.scala.CoeObject$ - 	--- Execution time of 'doStep' was 0 [ms]
13:06:26.946 [main] DEBUG org.intocps.orchestration.coe.scala.CoeObject$ - 	--- Execution time of 'processResults' was 0 [ms]
13:06:26.946 [main] DEBUG org.intocps.orchestration.coe.scala.CoeObject$ -  ## DoStep at: 9.399999999999983 Completed with: ok
13:06:26.946 [main] DEBUG org.intocps.orchestration.coe.scala.CoeObject$ - 	--- Execution time of 'notifier' was 0 [ms]
13:06:26.946 [main] DEBUG org.intocps.orchestration.coe.scala.CoeObject$ - 	--- Execution time of 'updateDerivatives' was 0 [ms]
13:06:26.948 [main] DEBUG org.intocps.orchestration.coe.scala.CoeObject$ - 	--- Execution time of 'resolveInputs' was 2 [ms]
13:06:26.951 [main] DEBUG org.intocps.orchestration.coe.scala.CoeObject$ - 	--- Execution time of 'setallinputs' was 3 [ms]
13:06:26.951 [main] DEBUG org.intocps.orchestration.coe.scala.CoeObject$ - 	--- Execution time of 'serilizeStates' was 0 [ms]
13:06:26.951 [main] DEBUG org.intocps.orchestration.coe.scala.CoeObject$ - 	--- Execution time of 'getStepSize' was 0 [ms]
13:06:26.951 [main] DEBUG org.intocps.orchestration.coe.scala.CoeObject$ - 	--- Execution time of 'doStep' was 0 [ms]
13:06:26.951 [main] DEBUG org.intocps.orchestration.coe.scala.CoeObject$ - 	--- Execution time of 'processResults' was 0 [ms]
13:06:26.951 [main] DEBUG org.intocps.orchestration.coe.scala.CoeObject$ -  ## DoStep at: 9.499999999999982 Completed with: ok
13:06:26.952 [main] DEBUG org.intocps.orchestration.coe.scala.CoeObject$ - 	--- Execution time of 'notifier' was 0 [ms]
13:06:26.952 [main] DEBUG org.intocps.orchestration.coe.scala.CoeObject$ - 	--- Execution time of 'updateDerivatives' was 0 [ms]
13:06:26.954 [main] DEBUG org.intocps.orchestration.coe.scala.CoeObject$ - 	--- Execution time of 'resolveInputs' was 2 [ms]
13:06:26.956 [main] DEBUG org.intocps.orchestration.coe.scala.CoeObject$ - 	--- Execution time of 'setallinputs' was 2 [ms]
13:06:26.956 [main] DEBUG org.intocps.orchestration.coe.scala.CoeObject$ - 	--- Execution time of 'serilizeStates' was 0 [ms]
13:06:26.956 [main] DEBUG org.intocps.orchestration.coe.scala.CoeObject$ - 	--- Execution time of 'getStepSize' was 0 [ms]
13:06:26.956 [main] DEBUG org.intocps.orchestration.coe.scala.CoeObject$ - 	--- Execution time of 'doStep' was 0 [ms]
13:06:26.957 [main] DEBUG org.intocps.orchestration.coe.scala.CoeObject$ - 	--- Execution time of 'processResults' was 1 [ms]
13:06:26.957 [main] DEBUG org.intocps.orchestration.coe.scala.CoeObject$ -  ## DoStep at: 9.599999999999982 Completed with: ok
13:06:26.957 [main] DEBUG org.intocps.orchestration.coe.scala.CoeObject$ - 	--- Execution time of 'notifier' was 0 [ms]
13:06:26.957 [main] DEBUG org.intocps.orchestration.coe.scala.CoeObject$ - 	--- Execution time of 'updateDerivatives' was 0 [ms]
13:06:26.959 [main] DEBUG org.intocps.orchestration.coe.scala.CoeObject$ - 	--- Execution time of 'resolveInputs' was 2 [ms]
13:06:26.960 [main] DEBUG org.intocps.orchestration.coe.scala.CoeObject$ - 	--- Execution time of 'setallinputs' was 1 [ms]
13:06:26.960 [main] DEBUG org.intocps.orchestration.coe.scala.CoeObject$ - 	--- Execution time of 'serilizeStates' was 0 [ms]
13:06:26.960 [main] DEBUG org.intocps.orchestration.coe.scala.CoeObject$ - 	--- Execution time of 'getStepSize' was 0 [ms]
13:06:26.960 [main] DEBUG org.intocps.orchestration.coe.scala.CoeObject$ - 	--- Execution time of 'doStep' was 0 [ms]
13:06:26.960 [main] DEBUG org.intocps.orchestration.coe.scala.CoeObject$ - 	--- Execution time of 'processResults' was 0 [ms]
13:06:26.960 [main] DEBUG org.intocps.orchestration.coe.scala.CoeObject$ -  ## DoStep at: 9.699999999999982 Completed with: ok
13:06:26.961 [main] DEBUG org.intocps.orchestration.coe.scala.CoeObject$ - 	--- Execution time of 'notifier' was 1 [ms]
13:06:26.961 [main] DEBUG org.intocps.orchestration.coe.scala.CoeObject$ - 	--- Execution time of 'updateDerivatives' was 0 [ms]
13:06:26.962 [main] DEBUG org.intocps.orchestration.coe.scala.CoeObject$ - 	--- Execution time of 'resolveInputs' was 1 [ms]
13:06:26.963 [main] DEBUG org.intocps.orchestration.coe.scala.CoeObject$ - 	--- Execution time of 'setallinputs' was 1 [ms]
13:06:26.963 [main] DEBUG org.intocps.orchestration.coe.scala.CoeObject$ - 	--- Execution time of 'serilizeStates' was 0 [ms]
13:06:26.963 [main] DEBUG org.intocps.orchestration.coe.scala.CoeObject$ - 	--- Execution time of 'getStepSize' was 0 [ms]
13:06:26.963 [main] DEBUG org.intocps.orchestration.coe.scala.CoeObject$ - 	--- Execution time of 'doStep' was 0 [ms]
13:06:26.963 [main] DEBUG org.intocps.orchestration.coe.scala.CoeObject$ - 	--- Execution time of 'processResults' was 0 [ms]
13:06:26.964 [main] DEBUG org.intocps.orchestration.coe.scala.CoeObject$ -  ## DoStep at: 9.799999999999981 Completed with: ok
13:06:26.964 [main] DEBUG org.intocps.orchestration.coe.scala.CoeObject$ - 	--- Execution time of 'notifier' was 0 [ms]
13:06:26.964 [main] DEBUG org.intocps.orchestration.coe.scala.CoeObject$ - 	--- Execution time of 'updateDerivatives' was 0 [ms]
13:06:26.965 [main] DEBUG org.intocps.orchestration.coe.scala.CoeObject$ - 	--- Execution time of 'resolveInputs' was 1 [ms]
13:06:26.967 [main] DEBUG org.intocps.orchestration.coe.scala.CoeObject$ - 	--- Execution time of 'setallinputs' was 1 [ms]
13:06:26.967 [main] DEBUG org.intocps.orchestration.coe.scala.CoeObject$ - 	--- Execution time of 'serilizeStates' was 0 [ms]
13:06:26.967 [main] DEBUG org.intocps.orchestration.coe.scala.CoeObject$ - 	--- Execution time of 'getStepSize' was 0 [ms]
13:06:26.967 [main] DEBUG org.intocps.orchestration.coe.scala.CoeObject$ - 	--- Execution time of 'doStep' was 0 [ms]
13:06:26.967 [main] DEBUG org.intocps.orchestration.coe.scala.CoeObject$ - 	--- Execution time of 'processResults' was 0 [ms]
13:06:26.967 [main] DEBUG org.intocps.orchestration.coe.scala.CoeObject$ -  ## DoStep at: 9.89999999999998 Completed with: ok
13:06:26.968 [main] DEBUG org.intocps.orchestration.coe.scala.CoeObject$ - 	--- Execution time of 'notifier' was 1 [ms]
13:06:26.968 [main] DEBUG org.intocps.orchestration.coe.scala.CoeObject$ - 	--- Execution time of 'updateDerivatives' was 0 [ms]
13:06:26.969 [main] DEBUG org.intocps.orchestration.coe.scala.CoeObject$ - 	--- Execution time of 'resolveInputs' was 1 [ms]
13:06:26.971 [main] DEBUG org.intocps.orchestration.coe.scala.CoeObject$ - 	--- Execution time of 'setallinputs' was 2 [ms]
13:06:26.971 [main] DEBUG org.intocps.orchestration.coe.scala.CoeObject$ - 	--- Execution time of 'serilizeStates' was 0 [ms]
13:06:26.971 [main] DEBUG org.intocps.orchestration.coe.scala.CoeObject$ - 	--- Execution time of 'getStepSize' was 0 [ms]
13:06:26.971 [main] DEBUG org.intocps.orchestration.coe.scala.CoeObject$ - 	--- Execution time of 'doStep' was 0 [ms]
13:06:26.972 [main] DEBUG org.intocps.orchestration.coe.scala.CoeObject$ - 	--- Execution time of 'processResults' was 0 [ms]
13:06:26.972 [main] DEBUG org.intocps.orchestration.coe.scala.CoeObject$ -  ## DoStep at: 9.99999999999998 Completed with: ok
13:06:26.972 [main] DEBUG org.intocps.orchestration.coe.scala.CoeObject$ - 	--- Execution time of 'notifier' was 0 [ms]
13:06:26.976 [main] DEBUG org.intocps.orchestration.coe.scala.CoeObject$ - Calling terminate for: {tankFmu}.tankIns
13:06:26.977 [main] DEBUG org.intocps.orchestration.coe.scala.CoeObject$ - Calling terminate for: {~env~}.global
13:06:26.977 [main] DEBUG org.intocps.orchestration.coe.scala.CoeObject$ - Calling freeInstance for: {tankFmu}.tankIns
13:06:26.981 [main] DEBUG org.intocps.orchestration.coe.scala.CoeObject$ - Calling freeInstance for: {~env~}.global
13:06:26.981 [main] DEBUG org.intocps.fmi.jnifmuapi.NativeFmu - UnLoad FMU /var/lib/jenkins/workspace/eanutils-commons-beanutils-1.9.4/orchestration/webapi/src/test/resources/esa/fmus/singlewatertank-20sim.fmu, temp folder
13:06:26.982 [main] DEBUG org.intocps.fmi.jnifmuapi.NativeFmu - Deleting temp folder /tmp/singlewatertank-20sim5519485174005336303
13:06:26.987 [main] INFO  org.intocps.orchestration.coe.scala.Coe - Total simulation time 00:00:00,475, initialization time 00:00:00,009, Simulation time 00:00:00,466
13:06:26.987 [main] DEBUG org.intocps.orchestration.coe.scala.ResultLogger - Closing file 4b0c9da0-f1fd-445f-9dec-a14e27a2c836/outputs.csv.
13:06:26.987 [main] INFO  org.intocps.orchestration.coe.scala.Coe - Total global simulations performed: 5
time,step-size,{tankFmu}.tankIns.level,{~env~}.global.valvecontrol1
0.0,0.0,0.0,1.0
0.1,0.1,0.10366134568054694,1.0
0.2,0.1,0.1797014296446159,1.0
0.30000000000000004,0.1,0.2558864742618375,1.0
0.4,0.1,0.3242039211294444,1.0
0.5,0.1,0.38546625378223964,1.0
0.6,0.1,0.4404020509196074,1.0
0.7,0.1,0.48966465122283476,1.0
0.7999999999999999,0.1,0.5338399233603679,1.0
0.8999999999999999,0.1,0.573453233587869,1.0
0.9999999999999999,0.1,0.6089756938071227,1.0
1.0999999999999999,0.1,0.6408297643905105,1.0
1.2,0.1,0.6693942784041399,1.0
1.3,0.1,0.6950089469815474,1.0
1.4000000000000001,0.1,0.717978399429342,1.0
1.5000000000000002,0.1,0.7385758061128254,1.0
1.6000000000000003,0.1,0.7570461272077254,1.0
1.7000000000000004,0.1,0.7736090259546959,1.0
1.8000000000000005,0.1,0.7884614810632401,1.0
1.9000000000000006,0.1,0.8017801293337711,1.0
2.0000000000000004,0.1,0.8137233663580712,1.0
2.1000000000000005,0.1,0.8254414035450813,1.0
2.2000000000000006,0.1,0.8349411506603936,1.0
2.3000000000000007,0.1,0.8434598628573454,1.0
2.400000000000001,0.1,0.8510988512023643,1.0
2.500000000000001,0.1,0.8579489644103457,1.0
2.600000000000001,0.1,0.8640916692873287,1.0
2.700000000000001,0.1,0.8696000195963055,1.0
2.800000000000001,0.1,0.8745395248686646,1.0
2.9000000000000012,0.1,0.8789689294938395,1.0
3.0000000000000013,0.1,0.8829409113526924,1.0
3.1000000000000014,0.1,0.886502708303323,1.0
3.2000000000000015,0.1,0.8896966799699474,1.0
3.3000000000000016,0.1,0.8925608115160739,1.0
3.4000000000000017,0.1,0.8951291653932352,1.0
3.5000000000000018,0.1,0.8974322864378151,1.0
3.600000000000002,0.1,0.899497565133697,1.0
3.700000000000002,0.1,0.9013495633609293,1.0
3.800000000000002,0.1,0.9030103065044626,1.0
3.900000000000002,0.1,0.9044995453969402,1.0
4.000000000000002,0.1,0.905834991210763,1.0
4.100000000000001,0.1,0.9070325260929544,1.0
4.200000000000001,0.1,0.9081063920478444,1.0
4.300000000000001,0.1,0.9090693603139225,1.0
4.4,0.1,0.9099328832492114,1.0
4.5,0.1,0.9107072305315029,1.0
4.6,0.1,0.9114016112932491,1.0
4.699999999999999,0.1,0.9120242836436407,1.0
4.799999999999999,0.1,0.9125826528803794,1.0
4.899999999999999,0.1,0.9130833595591645,1.0
4.999999999999998,0.1,0.9135323584682814,1.0
5.099999999999998,0.1,0.9139349894475153,1.0
5.1999999999999975,0.1,0.9142960408936263,1.0
5.299999999999997,0.1,0.9146198067076401,1.0
5.399999999999997,0.1,0.9149101373612158,1.0
5.4999999999999964,0.1,0.9151704856894124,1.0
5.599999999999996,0.1,0.9154039479544542,1.0
5.699999999999996,0.1,0.9156133006688582,1.0
5.799999999999995,0.1,0.9158010336158519,1.0
5.899999999999995,0.1,0.9159693794597903,1.0
5.999999999999995,0.1,0.9161203402987116,1.0
6.099999999999994,0.1,0.9162557114748249,1.0
6.199999999999994,0.1,0.9163771029260998,1.0
6.299999999999994,0.1,0.9164859583328838,1.0
6.399999999999993,0.1,0.9165835722872574,1.0
6.499999999999993,0.1,0.916671105689318,1.0
6.5999999999999925,0.1,0.9167495995534938,1.0
6.699999999999992,0.1,0.9168199873890878,1.0
6.799999999999992,0.1,0.9168831063022874,1.0
6.8999999999999915,0.1,0.916939706951674,1.0
6.999999999999991,0.1,0.9169904624756297,1.0
7.099999999999991,0.1,0.9170359764978173,1.0
7.19999999999999,0.1,0.9170767903059365,1.0
7.29999999999999,0.1,0.917113389289131,1.0
7.39999999999999,0.1,0.9171462087106116,1.0
7.499999999999989,0.1,0.9171756388841382,1.0
7.599999999999989,0.1,0.9172020298159321,1.0
7.699999999999989,0.1,0.9172256953672182,1.0
7.799999999999988,0.1,0.9172469169869036,1.0
7.899999999999988,0.1,0.917265947058784,1.0
7.999999999999988,0.1,0.9172830119030867,1.0
8.099999999999987,0.1,0.917298314468043,1.0
8.199999999999987,0.1,0.9173120367435055,1.0
8.299999999999986,0.1,0.9173243419253101,1.0
8.399999999999986,0.1,0.917335376356127,1.0
8.499999999999986,0.1,0.9173452712658808,1.0
8.599999999999985,0.1,0.9173541443324351,1.0
8.699999999999985,0.1,0.9173621010811109,1.0
8.799999999999985,0.1,0.9173692361396732,1.0
8.899999999999984,0.1,0.9173756343637172,1.0
8.999999999999984,0.1,0.9173813718458351,1.0
9.099999999999984,0.1,0.9173865168205698,1.0
9.199999999999983,0.1,0.9173911304759121,1.0
9.299999999999983,0.1,0.9173952676809934,1.0
9.399999999999983,0.1,0.917398977638633,1.0
9.499999999999982,0.1,0.9174023044704963,1.0
9.599999999999982,0.1,0.917405287741822,1.0
9.699999999999982,0.1,0.9174079629319633,1.0
9.799999999999981,0.1,0.917410361856336,1.0
9.89999999999998,0.1,0.9174125130447901,1.0
9.99999999999998,0.1,0.917414442080911,1.0

13:06:26.996 [main] INFO  org.springframework.boot.test.mock.web.SpringBootMockServletContext - Initializing Spring TestDispatcherServlet ''
13:06:26.996 [main] INFO  org.springframework.test.web.servlet.TestDispatcherServlet - Initializing Servlet ''
13:06:26.999 [main] INFO  org.springframework.test.web.servlet.TestDispatcherServlet - Completed initialization in 2 ms
13:06:27.005 [main] DEBUG org.intocps.orchestration.coe.webapi.controllers.EsaSimulationController - Got initial data: {"fmus":{"{tankFmu}":"file:/var/lib/jenkins/workspace/eanutils-commons-beanutils-1.9.4/orchestration/webapi/src/test/resources/esa/fmus/singlewatertank-20sim.fmu"},"connections":null,"parameters":null,"inputs":{"{tankFmu}.tankIns.valvecontrol":1.0},"requested_outputs":{"{tankFmu}.tankIns":["level"]},"step_size":0.1,"log_levels":null,"end_time":10.0,"simulator_log_level":"TRACE"}
13:06:27.083 [main] INFO  org.intocps.orchestration.coe.scala.CoeObject$ - loading fmus
13:06:27.186 [main] INFO  org.intocps.orchestration.coe.scala.CoeObject$ - Outputs from: {tankFmu}.tankIns = Set(level)
13:06:27.187 [main] INFO  org.intocps.orchestration.coe.scala.CoeObject$ - Outputs from: {~env~}.global = Set(valvecontrol1)
13:06:27.187 [main] INFO  org.intocps.orchestration.coe.scala.CoeObject$ - Inputs for: {tankFmu}.tankIns
13:06:27.187 [main] INFO  org.intocps.orchestration.coe.scala.CoeObject$ - 	{~env~}.global.valvecontrol1 --> valvecontrol
13:06:27.187 [main] INFO  org.intocps.orchestration.coe.scala.CoeObject$ - Inputs for: {~env~}.global
13:06:27.187 [main] INFO  org.intocps.orchestration.coe.scala.CoeObject$ - 	{tankFmu}.tankIns.level --> level2
13:06:27.187 [main] DEBUG org.intocps.fmi.jnifmuapi.NativeFmu - Load FMU /var/lib/jenkins/workspace/eanutils-commons-beanutils-1.9.4/orchestration/webapi/src/test/resources/esa/fmus/singlewatertank-20sim.fmu
13:06:27.187 [main] DEBUG org.intocps.fmi.jnifmuapi.NativeFmu - Extracting: /var/lib/jenkins/workspace/eanutils-commons-beanutils-1.9.4/orchestration/webapi/src/test/resources/esa/fmus/singlewatertank-20sim.fmu to /tmp/singlewatertank-20sim5279547734255511660
13:06:27.208 [main] DEBUG org.intocps.fmi.jnifmuapi.NativeFmu - Extracted '/var/lib/jenkins/workspace/eanutils-commons-beanutils-1.9.4/orchestration/webapi/src/test/resources/esa/fmus/singlewatertank-20sim.fmu' to '/tmp/singlewatertank-20sim5279547734255511660'
13:06:27.214 [main] ERROR org.intocps.fmi.jnifmuapi.NativeFmu - The library corresponding to the modelIdentifier 'SingleWatertank' could not be found at: 'binaries/linux64/SingleWatertank.so
13:06:27.214 [main] WARN  org.intocps.fmi.jnifmuapi.NativeFmu - Attempting to recover loading of the library by setting modelIdentifier to 'singlewatertank-20sim'
13:06:27.214 [main] DEBUG org.intocps.fmi.jnifmuapi.NativeFmu - Loading FMU library: /tmp/singlewatertank-20sim5279547734255511660/binaries/linux64/singlewatertank-20sim.so
13:06:27.214 [main] DEBUG org.intocps.fmi.jnifmuapi.NativeFmu - Dll pointer: 139673238280704
13:06:27.215 [main] DEBUG org.intocps.orchestration.coe.scala.CoeObject$ - Loading native FMU. GUID: {cfc65592-9ece-4563-9705-1581b6e7071c}, NAME: tankIns
13:06:27.247 [main] INFO  org.intocps.orchestration.coe.scala.CoeObject$ - Instantiating FMU. ModelName: 'SingleWatertank', GUID: '{cfc65592-9ece-4563-9705-1581b6e7071c}', Vendor tool: '', Generated by: '20-sim', at:  Execution tool required: false
13:06:27.248 [main] DEBUG org.intocps.orchestration.coe.scala.CoeObject$ - Loading native FMU. GUID: {abb4bff1-d423-4e02-90d9-011f519869ff}, NAME: global
13:06:27.249 [main] INFO  org.intocps.orchestration.coe.scala.CoeObject$ - Instantiating FMU. ModelName: '~env~', GUID: '{abb4bff1-d423-4e02-90d9-011f519869ff}', Vendor tool: '', Generated by: '', at:  Execution tool required: false
[INFO] Tests run: 4, Failures: 0, Errors: 0, Skipped: 0, Time elapsed: 1.252 s - in org.intocps.orchestration.coe.webapi.esav1.Stp4Test
[INFO] Running org.intocps.orchestration.coe.webapi.esav1.Stp6Test
13:06:27.261 [main] INFO  org.springframework.boot.test.context.SpringBootTestContextBootstrapper - Neither @ContextConfiguration nor @ContextHierarchy found for test class [org.intocps.orchestration.coe.webapi.esav1.Stp6Test], using SpringBootContextLoader
13:06:27.262 [main] INFO  org.springframework.test.context.support.AbstractContextLoader - Could not detect default resource locations for test class [org.intocps.orchestration.coe.webapi.esav1.Stp6Test]: no resource found for suffixes {-context.xml, Context.groovy}.
13:06:27.262 [main] INFO  org.springframework.test.context.support.AnnotationConfigContextLoaderUtils - Could not detect default configuration classes for test class [org.intocps.orchestration.coe.webapi.esav1.Stp6Test]: Stp6Test does not declare any static, non-private, non-final, nested classes annotated with @Configuration.
13:06:27.264 [main] INFO  org.springframework.boot.test.context.SpringBootTestContextBootstrapper - Found @SpringBootConfiguration org.intocps.orchestration.coe.webapi.Application for test class org.intocps.orchestration.coe.webapi.esav1.Stp6Test
13:06:27.265 [main] INFO  org.springframework.boot.test.context.SpringBootTestContextBootstrapper - Loaded default TestExecutionListener class names from location [META-INF/spring.factories]: [org.springframework.boot.test.mock.mockito.MockitoTestExecutionListener, org.springframework.boot.test.mock.mockito.ResetMocksTestExecutionListener, org.springframework.boot.test.autoconfigure.restdocs.RestDocsTestExecutionListener, org.springframework.boot.test.autoconfigure.web.client.MockRestServiceServerResetTestExecutionListener, org.springframework.boot.test.autoconfigure.web.servlet.MockMvcPrintOnlyOnFailureTestExecutionListener, org.springframework.boot.test.autoconfigure.web.servlet.WebDriverTestExecutionListener, org.springframework.test.context.web.ServletTestExecutionListener, org.springframework.test.context.support.DirtiesContextBeforeModesTestExecutionListener, org.springframework.test.context.support.DependencyInjectionTestExecutionListener, org.springframework.test.context.support.DirtiesContextTestExecutionListener, org.springframework.test.context.transaction.TransactionalTestExecutionListener, org.springframework.test.context.jdbc.SqlScriptsTestExecutionListener]
13:06:27.266 [main] INFO  org.springframework.boot.test.context.SpringBootTestContextBootstrapper - Using TestExecutionListeners: [org.springframework.test.context.web.ServletTestExecutionListener@218dd55c, org.springframework.test.context.support.DirtiesContextBeforeModesTestExecutionListener@b581459, org.springframework.boot.test.mock.mockito.MockitoTestExecutionListener@6bccf0e2, org.springframework.boot.test.autoconfigure.SpringBootDependencyInjectionTestExecutionListener@478f7762, org.springframework.test.context.support.DirtiesContextTestExecutionListener@8e76dfa, org.springframework.boot.test.mock.mockito.ResetMocksTestExecutionListener@43564a63, org.springframework.boot.test.autoconfigure.restdocs.RestDocsTestExecutionListener@4f11e90b, org.springframework.boot.test.autoconfigure.web.client.MockRestServiceServerResetTestExecutionListener@7319b3ec, org.springframework.boot.test.autoconfigure.web.servlet.MockMvcPrintOnlyOnFailureTestExecutionListener@40a288c8, org.springframework.boot.test.autoconfigure.web.servlet.WebDriverTestExecutionListener@3156d7ed]
13:06:27.272 [main] INFO  org.springframework.boot.test.mock.web.SpringBootMockServletContext - Initializing Spring TestDispatcherServlet ''
13:06:27.272 [main] INFO  org.springframework.test.web.servlet.TestDispatcherServlet - Initializing Servlet ''
13:06:27.274 [main] INFO  org.springframework.test.web.servlet.TestDispatcherServlet - Completed initialization in 2 ms
13:06:27.288 [main] INFO  org.springframework.boot.test.mock.web.SpringBootMockServletContext - Initializing Spring TestDispatcherServlet ''
13:06:27.288 [main] INFO  org.springframework.test.web.servlet.TestDispatcherServlet - Initializing Servlet ''
13:06:27.290 [main] INFO  org.springframework.test.web.servlet.TestDispatcherServlet - Completed initialization in 2 ms
13:06:27.296 [main] DEBUG org.intocps.orchestration.coe.webapi.controllers.EsaSimulationController - Got initial data: {"fmus":{"{controllerFmu}":"file:/var/lib/jenkins/workspace/eanutils-commons-beanutils-1.9.4/orchestration/webapi/src/test/resources/esa/fmus/watertankController-Standalone.fmu","{tankFmu}":"file:/var/lib/jenkins/workspace/eanutils-commons-beanutils-1.9.4/orchestration/webapi/src/test/resources/esa/fmus/singlewatertank-20sim.fmu"},"connections":{"{controllerFmu}.crtlIns.valve":["{tankFmu}.tankIns.valvecontrol"],"{tankFmu}.tankIns.level":["{controllerFmu}.crtlIns.level"]},"parameters":{"{controllerFmu}.crtlIns.maxLevel":8,"{controllerFmu}.crtlIns.minLevel":2},"inputs":null,"requested_outputs":{"{controllerFmu}.crtlIns":["valve"],"{tankFmu}.tankIns":["level"]},"step_size":1.0,"log_levels":{"{controllerFmu}.crtlIns":["logAll","logError","VdmErr"],"{tankFmu}.tankIns":[]},"end_time":10.0,"simulator_log_level":"TRACE"}
13:06:27.320 [main] INFO  org.intocps.orchestration.coe.scala.CoeObject$ - loading fmus
13:06:27.373 [main] INFO  org.intocps.orchestration.coe.scala.CoeObject$ - Outputs from: {controllerFmu}.crtlIns = Set(valve)
13:06:27.373 [main] INFO  org.intocps.orchestration.coe.scala.CoeObject$ - Outputs from: {tankFmu}.tankIns = Set(level)
13:06:27.373 [main] INFO  org.intocps.orchestration.coe.scala.CoeObject$ - Inputs for: {tankFmu}.tankIns
13:06:27.373 [main] INFO  org.intocps.orchestration.coe.scala.CoeObject$ - 	{controllerFmu}.crtlIns.valve --> valvecontrol
13:06:27.374 [main] INFO  org.intocps.orchestration.coe.scala.CoeObject$ - Inputs for: {controllerFmu}.crtlIns
13:06:27.374 [main] INFO  org.intocps.orchestration.coe.scala.CoeObject$ - 	{tankFmu}.tankIns.level --> level
13:06:27.374 [main] INFO  org.intocps.orchestration.coe.scala.CoeObject$ - Inputs for: {~env~}.global
13:06:27.374 [main] INFO  org.intocps.orchestration.coe.scala.CoeObject$ - 	{controllerFmu}.crtlIns.valve --> valve1
13:06:27.374 [main] INFO  org.intocps.orchestration.coe.scala.CoeObject$ - 	{tankFmu}.tankIns.level --> level2
13:06:27.374 [main] DEBUG org.intocps.fmi.jnifmuapi.NativeFmu - Load FMU /var/lib/jenkins/workspace/eanutils-commons-beanutils-1.9.4/orchestration/webapi/src/test/resources/esa/fmus/watertankController-Standalone.fmu
13:06:27.374 [main] DEBUG org.intocps.fmi.jnifmuapi.NativeFmu - Extracting: /var/lib/jenkins/workspace/eanutils-commons-beanutils-1.9.4/orchestration/webapi/src/test/resources/esa/fmus/watertankController-Standalone.fmu to /tmp/watertankController-Standalone4271295412281016214
13:06:27.411 [main] DEBUG org.intocps.fmi.jnifmuapi.NativeFmu - Extracted '/var/lib/jenkins/workspace/eanutils-commons-beanutils-1.9.4/orchestration/webapi/src/test/resources/esa/fmus/watertankController-Standalone.fmu' to '/tmp/watertankController-Standalone4271295412281016214'
13:06:27.414 [main] DEBUG org.intocps.fmi.jnifmuapi.NativeFmu - Loading FMU library: /tmp/watertankController-Standalone4271295412281016214/binaries/linux64/watertankController-Standalone.so
13:06:27.414 [main] DEBUG org.intocps.fmi.jnifmuapi.NativeFmu - Dll pointer: 139673239617984
13:06:27.414 [main] DEBUG org.intocps.fmi.jnifmuapi.NativeFmu - Load FMU /var/lib/jenkins/workspace/eanutils-commons-beanutils-1.9.4/orchestration/webapi/src/test/resources/esa/fmus/singlewatertank-20sim.fmu
13:06:27.415 [main] DEBUG org.intocps.fmi.jnifmuapi.NativeFmu - Extracting: /var/lib/jenkins/workspace/eanutils-commons-beanutils-1.9.4/orchestration/webapi/src/test/resources/esa/fmus/singlewatertank-20sim.fmu to /tmp/singlewatertank-20sim5738804631378410021
13:06:27.432 [main] DEBUG org.intocps.fmi.jnifmuapi.NativeFmu - Extracted '/var/lib/jenkins/workspace/eanutils-commons-beanutils-1.9.4/orchestration/webapi/src/test/resources/esa/fmus/singlewatertank-20sim.fmu' to '/tmp/singlewatertank-20sim5738804631378410021'
13:06:27.434 [main] ERROR org.intocps.fmi.jnifmuapi.NativeFmu - The library corresponding to the modelIdentifier 'SingleWatertank' could not be found at: 'binaries/linux64/SingleWatertank.so
13:06:27.434 [main] WARN  org.intocps.fmi.jnifmuapi.NativeFmu - Attempting to recover loading of the library by setting modelIdentifier to 'singlewatertank-20sim'
13:06:27.434 [main] DEBUG org.intocps.fmi.jnifmuapi.NativeFmu - Loading FMU library: /tmp/singlewatertank-20sim5738804631378410021/binaries/linux64/singlewatertank-20sim.so
13:06:27.434 [main] DEBUG org.intocps.fmi.jnifmuapi.NativeFmu - Dll pointer: 139673237529968
13:06:27.435 [main] DEBUG org.intocps.orchestration.coe.scala.CoeObject$ - Loading native FMU. GUID: {48741697-77ec-41ed-90eb-8c9c8c7f1bad}, NAME: crtlIns
13:06:27.436 [main] INFO  org.intocps.orchestration.coe.scala.CoeObject$ - Instantiating FMU. ModelName: 'watertankController-Standalone', GUID: '{48741697-77ec-41ed-90eb-8c9c8c7f1bad}', Vendor tool: 'Overture', Generated by: 'Overture Tool FMI Exporter - v0.1.7-SNAPSHOT', at: 2017-03-16T16:30:05 Execution tool required: false
13:06:27.438 [main] DEBUG org.intocps.orchestration.coe.scala.CoeObject$ - Loading native FMU. GUID: {cfc65592-9ece-4563-9705-1581b6e7071c}, NAME: tankIns
13:06:27.439 [main] INFO  org.intocps.orchestration.coe.scala.CoeObject$ - Instantiating FMU. ModelName: 'SingleWatertank', GUID: '{cfc65592-9ece-4563-9705-1581b6e7071c}', Vendor tool: '', Generated by: '20-sim', at:  Execution tool required: false
13:06:27.443 [main] DEBUG org.intocps.orchestration.coe.scala.CoeObject$ - Loading native FMU. GUID: {abb4bff1-d423-4e02-90d9-011f519869ff}, NAME: global
13:06:27.444 [main] INFO  org.intocps.orchestration.coe.scala.CoeObject$ - Instantiating FMU. ModelName: '~env~', GUID: '{abb4bff1-d423-4e02-90d9-011f519869ff}', Vendor tool: '', Generated by: '', at:  Execution tool required: false
13:06:27.452 [main] DEBUG org.intocps.orchestration.coe.scala.CoeObject$ - Calling setupExperiment for {controllerFmu}.crtlIns
13:06:27.452 [main] DEBUG org.intocps.orchestration.coe.scala.CoeObject$ - Calling setupExperiment for {tankFmu}.tankIns
13:06:27.452 [main] DEBUG org.intocps.orchestration.coe.scala.CoeObject$ - Calling setupExperiment for {~env~}.global
13:06:27.457 [main] DEBUG org.intocps.orchestration.coe.BasicInitializer - Initialization, state = before initialization
13:06:27.458 [main] DEBUG org.intocps.orchestration.coe.BasicInitializer - Setting independent values
13:06:27.458 [main] DEBUG org.intocps.orchestration.coe.BasicInitializer - Setting no input values
13:06:27.458 [main] DEBUG org.intocps.orchestration.coe.BasicInitializer - Entering initialization mode
13:06:27.458 [main] DEBUG org.intocps.orchestration.coe.BasicInitializer - Setting pending ports
13:06:27.460 [main] DEBUG org.intocps.orchestration.coe.BasicInitializer - Setting remaining inputs
13:06:27.461 [main] DEBUG org.intocps.orchestration.coe.BasicInitializer - Exiting initialization mode
13:06:27.461 [main] WARN  org.intocps.orchestration.coe.BasicInitializer - Initial parameter not found: {controllerFmu}.crtlIns.maxLevel
13:06:27.461 [main] WARN  org.intocps.orchestration.coe.BasicInitializer - Initial parameter not found: {controllerFmu}.crtlIns.minLevel
13:06:27.461 [main] INFO  org.intocps.orchestration.coe.BasicInitializer - Initialization complete
13:06:27.461 [main] DEBUG org.intocps.orchestration.coe.scala.ResultLogger - Starting logger with file: 5ac5d511-1a16-4313-9eed-680dc6dcc372/outputs.csv
13:06:27.462 [main] DEBUG org.intocps.orchestration.coe.scala.CoeObject$ - 	--- Execution time of 'updateDerivatives' was 0 [ms]
13:06:27.463 [main] DEBUG org.intocps.orchestration.coe.scala.CoeObject$ - 	--- Execution time of 'resolveInputs' was 1 [ms]
13:06:27.464 [main] DEBUG org.intocps.orchestration.coe.scala.CoeObject$ - 	--- Execution time of 'setallinputs' was 1 [ms]
13:06:27.464 [main] DEBUG org.intocps.orchestration.coe.scala.CoeObject$ - 	--- Execution time of 'serilizeStates' was 0 [ms]
13:06:27.464 [main] DEBUG org.intocps.orchestration.coe.scala.CoeObject$ - 	--- Execution time of 'getStepSize' was 0 [ms]
13:06:27.465 [main] INFO  fmi.instance.crtlIns - logAll OK crtlIns called &periodic_taskg_System_controller__Z4loopEV

13:06:27.465 [main] INFO  fmi.instance.crtlIns - logAll OK crtlIns called &periodic_taskg_System_controller__Z4loopEV

13:06:27.465 [main] INFO  fmi.instance.crtlIns - logAll OK crtlIns called &periodic_taskg_System_controller__Z4loopEV

13:06:27.465 [main] INFO  fmi.instance.crtlIns - logAll OK crtlIns called &periodic_taskg_System_controller__Z4loopEV

13:06:27.465 [main] INFO  fmi.instance.crtlIns - logAll OK crtlIns called &periodic_taskg_System_controller__Z4loopEV

13:06:27.465 [main] INFO  fmi.instance.crtlIns - logAll OK crtlIns called &periodic_taskg_System_controller__Z4loopEV

13:06:27.465 [main] INFO  fmi.instance.crtlIns - logAll OK crtlIns called &periodic_taskg_System_controller__Z4loopEV

13:06:27.465 [main] INFO  fmi.instance.crtlIns - logAll OK crtlIns called &periodic_taskg_System_controller__Z4loopEV

13:06:27.466 [main] INFO  fmi.instance.crtlIns - logAll OK crtlIns called &periodic_taskg_System_controller__Z4loopEV

13:06:27.466 [main] INFO  fmi.instance.crtlIns - logAll OK crtlIns called &periodic_taskg_System_controller__Z4loopEV

13:06:27.466 [main] INFO  fmi.instance.crtlIns - logAll OK crtlIns called &periodic_taskg_System_controller__Z4loopEV

13:06:27.466 [main] INFO  fmi.instance.crtlIns - logAll OK crtlIns called &periodic_taskg_System_controller__Z4loopEV

13:06:27.466 [main] INFO  fmi.instance.crtlIns - logAll OK crtlIns called &periodic_taskg_System_controller__Z4loopEV

13:06:27.466 [main] INFO  fmi.instance.crtlIns - logAll OK crtlIns called &periodic_taskg_System_controller__Z4loopEV

13:06:27.466 [main] INFO  fmi.instance.crtlIns - logAll OK crtlIns called &periodic_taskg_System_controller__Z4loopEV

13:06:27.466 [main] INFO  fmi.instance.crtlIns - logAll OK crtlIns called &periodic_taskg_System_controller__Z4loopEV

13:06:27.467 [main] INFO  fmi.instance.crtlIns - logAll OK crtlIns called &periodic_taskg_System_controller__Z4loopEV

13:06:27.467 [main] INFO  fmi.instance.crtlIns - logAll OK crtlIns called &periodic_taskg_System_controller__Z4loopEV

13:06:27.467 [main] INFO  fmi.instance.crtlIns - logAll OK crtlIns called &periodic_taskg_System_controller__Z4loopEV

13:06:27.467 [main] INFO  fmi.instance.crtlIns - logAll OK crtlIns called &periodic_taskg_System_controller__Z4loopEV

13:06:27.467 [main] INFO  fmi.instance.crtlIns - logAll OK crtlIns called &periodic_taskg_System_controller__Z4loopEV

13:06:27.467 [main] INFO  fmi.instance.crtlIns - logAll OK crtlIns called &periodic_taskg_System_controller__Z4loopEV

13:06:27.467 [main] INFO  fmi.instance.crtlIns - logAll OK crtlIns called &periodic_taskg_System_controller__Z4loopEV

13:06:27.467 [main] INFO  fmi.instance.crtlIns - logAll OK crtlIns called &periodic_taskg_System_controller__Z4loopEV

13:06:27.468 [main] INFO  fmi.instance.crtlIns - logAll OK crtlIns called &periodic_taskg_System_controller__Z4loopEV

13:06:27.468 [main] INFO  fmi.instance.crtlIns - logAll OK crtlIns called &periodic_taskg_System_controller__Z4loopEV

13:06:27.468 [main] INFO  fmi.instance.crtlIns - logAll OK crtlIns called &periodic_taskg_System_controller__Z4loopEV

13:06:27.468 [main] INFO  fmi.instance.crtlIns - logAll OK crtlIns called &periodic_taskg_System_controller__Z4loopEV

13:06:27.468 [main] INFO  fmi.instance.crtlIns - logAll OK crtlIns called &periodic_taskg_System_controller__Z4loopEV

13:06:27.468 [main] INFO  fmi.instance.crtlIns - logAll OK crtlIns called &periodic_taskg_System_controller__Z4loopEV

13:06:27.468 [main] INFO  fmi.instance.crtlIns - logAll OK crtlIns called &periodic_taskg_System_controller__Z4loopEV

13:06:27.468 [main] INFO  fmi.instance.crtlIns - logAll OK crtlIns called &periodic_taskg_System_controller__Z4loopEV

13:06:27.469 [main] INFO  fmi.instance.crtlIns - logAll OK crtlIns called &periodic_taskg_System_controller__Z4loopEV

13:06:27.469 [main] INFO  fmi.instance.crtlIns - logAll OK crtlIns called &periodic_taskg_System_controller__Z4loopEV

13:06:27.469 [main] INFO  fmi.instance.crtlIns - logAll OK crtlIns called &periodic_taskg_System_controller__Z4loopEV

13:06:27.469 [main] INFO  fmi.instance.crtlIns - logAll OK crtlIns called &periodic_taskg_System_controller__Z4loopEV

13:06:27.469 [main] INFO  fmi.instance.crtlIns - logAll OK crtlIns called &periodic_taskg_System_controller__Z4loopEV

13:06:27.469 [main] INFO  fmi.instance.crtlIns - logAll OK crtlIns called &periodic_taskg_System_controller__Z4loopEV

13:06:27.469 [main] INFO  fmi.instance.crtlIns - logAll OK crtlIns called &periodic_taskg_System_controller__Z4loopEV

13:06:27.469 [main] INFO  fmi.instance.crtlIns - logAll OK crtlIns called &periodic_taskg_System_controller__Z4loopEV

13:06:27.470 [main] INFO  fmi.instance.crtlIns - logAll OK crtlIns called &periodic_taskg_System_controller__Z4loopEV

13:06:27.470 [main] INFO  fmi.instance.crtlIns - logAll OK crtlIns called &periodic_taskg_System_controller__Z4loopEV

13:06:27.470 [main] INFO  fmi.instance.crtlIns - logAll OK crtlIns called &periodic_taskg_System_controller__Z4loopEV

13:06:27.470 [main] INFO  fmi.instance.crtlIns - logAll OK crtlIns called &periodic_taskg_System_controller__Z4loopEV

13:06:27.470 [main] INFO  fmi.instance.crtlIns - logAll OK crtlIns called &periodic_taskg_System_controller__Z4loopEV

13:06:27.470 [main] INFO  fmi.instance.crtlIns - logAll OK crtlIns called &periodic_taskg_System_controller__Z4loopEV

13:06:27.470 [main] INFO  fmi.instance.crtlIns - logAll OK crtlIns called &periodic_taskg_System_controller__Z4loopEV

13:06:27.470 [main] INFO  fmi.instance.crtlIns - logAll OK crtlIns called &periodic_taskg_System_controller__Z4loopEV

13:06:27.470 [main] INFO  fmi.instance.crtlIns - logAll OK crtlIns called &periodic_taskg_System_controller__Z4loopEV

13:06:27.471 [main] INFO  fmi.instance.crtlIns - logAll OK crtlIns called &periodic_taskg_System_controller__Z4loopEV

13:06:27.471 [main] INFO  fmi.instance.crtlIns - logAll OK crtlIns called &periodic_taskg_System_controller__Z4loopEV

13:06:27.471 [main] INFO  fmi.instance.crtlIns - logAll OK crtlIns called &periodic_taskg_System_controller__Z4loopEV

13:06:27.471 [main] INFO  fmi.instance.crtlIns - logAll OK crtlIns called &periodic_taskg_System_controller__Z4loopEV

13:06:27.471 [main] INFO  fmi.instance.crtlIns - logAll OK crtlIns called &periodic_taskg_System_controller__Z4loopEV

13:06:27.471 [main] INFO  fmi.instance.crtlIns - logAll OK crtlIns called &periodic_taskg_System_controller__Z4loopEV

13:06:27.471 [main] INFO  fmi.instance.crtlIns - logAll OK crtlIns called &periodic_taskg_System_controller__Z4loopEV

13:06:27.471 [main] INFO  fmi.instance.crtlIns - logAll OK crtlIns called &periodic_taskg_System_controller__Z4loopEV

13:06:27.471 [main] INFO  fmi.instance.crtlIns - logAll OK crtlIns called &periodic_taskg_System_controller__Z4loopEV

13:06:27.472 [main] INFO  fmi.instance.crtlIns - logAll OK crtlIns called &periodic_taskg_System_controller__Z4loopEV

13:06:27.472 [main] INFO  fmi.instance.crtlIns - logAll OK crtlIns called &periodic_taskg_System_controller__Z4loopEV

13:06:27.472 [main] INFO  fmi.instance.crtlIns - logAll OK crtlIns called &periodic_taskg_System_controller__Z4loopEV

13:06:27.472 [main] INFO  fmi.instance.crtlIns - logAll OK crtlIns called &periodic_taskg_System_controller__Z4loopEV

13:06:27.472 [main] INFO  fmi.instance.crtlIns - logAll OK crtlIns called &periodic_taskg_System_controller__Z4loopEV

13:06:27.472 [main] INFO  fmi.instance.crtlIns - logAll OK crtlIns called &periodic_taskg_System_controller__Z4loopEV

13:06:27.472 [main] INFO  fmi.instance.crtlIns - logAll OK crtlIns called &periodic_taskg_System_controller__Z4loopEV

13:06:27.472 [main] INFO  fmi.instance.crtlIns - logAll OK crtlIns called &periodic_taskg_System_controller__Z4loopEV

13:06:27.472 [main] INFO  fmi.instance.crtlIns - logAll OK crtlIns called &periodic_taskg_System_controller__Z4loopEV

13:06:27.473 [main] INFO  fmi.instance.crtlIns - logAll OK crtlIns called &periodic_taskg_System_controller__Z4loopEV

13:06:27.473 [main] INFO  fmi.instance.crtlIns - logAll OK crtlIns called &periodic_taskg_System_controller__Z4loopEV

13:06:27.473 [main] INFO  fmi.instance.crtlIns - logAll OK crtlIns called &periodic_taskg_System_controller__Z4loopEV

13:06:27.473 [main] INFO  fmi.instance.crtlIns - logAll OK crtlIns called &periodic_taskg_System_controller__Z4loopEV

13:06:27.473 [main] INFO  fmi.instance.crtlIns - logAll OK crtlIns called &periodic_taskg_System_controller__Z4loopEV

13:06:27.473 [main] INFO  fmi.instance.crtlIns - logAll OK crtlIns called &periodic_taskg_System_controller__Z4loopEV

13:06:27.473 [main] INFO  fmi.instance.crtlIns - logAll OK crtlIns called &periodic_taskg_System_controller__Z4loopEV

13:06:27.473 [main] INFO  fmi.instance.crtlIns - logAll OK crtlIns called &periodic_taskg_System_controller__Z4loopEV

13:06:27.474 [main] INFO  fmi.instance.crtlIns - logAll OK crtlIns called &periodic_taskg_System_controller__Z4loopEV

13:06:27.474 [main] INFO  fmi.instance.crtlIns - logAll OK crtlIns called &periodic_taskg_System_controller__Z4loopEV

13:06:27.474 [main] INFO  fmi.instance.crtlIns - logAll OK crtlIns called &periodic_taskg_System_controller__Z4loopEV

13:06:27.474 [main] INFO  fmi.instance.crtlIns - logAll OK crtlIns called &periodic_taskg_System_controller__Z4loopEV

13:06:27.474 [main] INFO  fmi.instance.crtlIns - logAll OK crtlIns called &periodic_taskg_System_controller__Z4loopEV

13:06:27.474 [main] INFO  fmi.instance.crtlIns - logAll OK crtlIns called &periodic_taskg_System_controller__Z4loopEV

13:06:27.474 [main] INFO  fmi.instance.crtlIns - logAll OK crtlIns called &periodic_taskg_System_controller__Z4loopEV

13:06:27.474 [main] INFO  fmi.instance.crtlIns - logAll OK crtlIns called &periodic_taskg_System_controller__Z4loopEV

13:06:27.475 [main] INFO  fmi.instance.crtlIns - logAll OK crtlIns called &periodic_taskg_System_controller__Z4loopEV

13:06:27.475 [main] INFO  fmi.instance.crtlIns - logAll OK crtlIns called &periodic_taskg_System_controller__Z4loopEV

13:06:27.475 [main] INFO  fmi.instance.crtlIns - logAll OK crtlIns called &periodic_taskg_System_controller__Z4loopEV

13:06:27.475 [main] INFO  fmi.instance.crtlIns - logAll OK crtlIns called &periodic_taskg_System_controller__Z4loopEV

13:06:27.475 [main] INFO  fmi.instance.crtlIns - logAll OK crtlIns called &periodic_taskg_System_controller__Z4loopEV

13:06:27.475 [main] INFO  fmi.instance.crtlIns - logAll OK crtlIns called &periodic_taskg_System_controller__Z4loopEV

13:06:27.475 [main] INFO  fmi.instance.crtlIns - logAll OK crtlIns called &periodic_taskg_System_controller__Z4loopEV

13:06:27.475 [main] INFO  fmi.instance.crtlIns - logAll OK crtlIns called &periodic_taskg_System_controller__Z4loopEV

13:06:27.476 [main] INFO  fmi.instance.crtlIns - logAll OK crtlIns called &periodic_taskg_System_controller__Z4loopEV

13:06:27.476 [main] INFO  fmi.instance.crtlIns - logAll OK crtlIns called &periodic_taskg_System_controller__Z4loopEV

13:06:27.476 [main] INFO  fmi.instance.crtlIns - logAll OK crtlIns called &periodic_taskg_System_controller__Z4loopEV

13:06:27.476 [main] INFO  fmi.instance.crtlIns - logAll OK crtlIns called &periodic_taskg_System_controller__Z4loopEV

13:06:27.476 [main] INFO  fmi.instance.crtlIns - logAll OK crtlIns called &periodic_taskg_System_controller__Z4loopEV

13:06:27.476 [main] INFO  fmi.instance.crtlIns - logAll OK crtlIns called &periodic_taskg_System_controller__Z4loopEV

13:06:27.476 [main] INFO  fmi.instance.crtlIns - logAll OK crtlIns called &periodic_taskg_System_controller__Z4loopEV

13:06:27.476 [main] INFO  fmi.instance.crtlIns - logAll OK crtlIns called &periodic_taskg_System_controller__Z4loopEV

13:06:27.477 [main] INFO  fmi.instance.crtlIns - logAll OK crtlIns called &periodic_taskg_System_controller__Z4loopEV

13:06:27.477 [main] DEBUG org.intocps.orchestration.coe.scala.CoeObject$ - 	--- Execution time of 'doStep' was 13 [ms]
13:06:27.477 [main] DEBUG org.intocps.orchestration.coe.scala.CoeObject$ - 	--- Execution time of 'processResults' was 0 [ms]
13:06:27.477 [main] DEBUG org.intocps.orchestration.coe.scala.CoeObject$ -  ## DoStep at: 1.0 Completed with: ok
13:06:27.477 [main] DEBUG org.intocps.orchestration.coe.scala.CoeObject$ - 	--- Execution time of 'notifier' was 0 [ms]
13:06:27.478 [main] DEBUG org.intocps.orchestration.coe.scala.CoeObject$ - 	--- Execution time of 'updateDerivatives' was 1 [ms]
13:06:27.478 [main] DEBUG org.intocps.orchestration.coe.scala.CoeObject$ - 	--- Execution time of 'resolveInputs' was 0 [ms]
13:06:27.479 [main] DEBUG org.intocps.orchestration.coe.scala.CoeObject$ - 	--- Execution time of 'setallinputs' was 1 [ms]
13:06:27.479 [main] DEBUG org.intocps.orchestration.coe.scala.CoeObject$ - 	--- Execution time of 'serilizeStates' was 0 [ms]
13:06:27.479 [main] DEBUG org.intocps.orchestration.coe.scala.CoeObject$ - 	--- Execution time of 'getStepSize' was 0 [ms]
13:06:27.479 [main] INFO  fmi.instance.crtlIns - logAll OK crtlIns called &periodic_taskg_System_controller__Z4loopEV

13:06:27.479 [main] INFO  fmi.instance.crtlIns - logAll OK crtlIns called &periodic_taskg_System_controller__Z4loopEV

13:06:27.479 [main] INFO  fmi.instance.crtlIns - logAll OK crtlIns called &periodic_taskg_System_controller__Z4loopEV

13:06:27.479 [main] INFO  fmi.instance.crtlIns - logAll OK crtlIns called &periodic_taskg_System_controller__Z4loopEV

13:06:27.479 [main] INFO  fmi.instance.crtlIns - logAll OK crtlIns called &periodic_taskg_System_controller__Z4loopEV

13:06:27.480 [main] INFO  fmi.instance.crtlIns - logAll OK crtlIns called &periodic_taskg_System_controller__Z4loopEV

13:06:27.480 [main] INFO  fmi.instance.crtlIns - logAll OK crtlIns called &periodic_taskg_System_controller__Z4loopEV

13:06:27.480 [main] INFO  fmi.instance.crtlIns - logAll OK crtlIns called &periodic_taskg_System_controller__Z4loopEV

13:06:27.480 [main] INFO  fmi.instance.crtlIns - logAll OK crtlIns called &periodic_taskg_System_controller__Z4loopEV

13:06:27.480 [main] INFO  fmi.instance.crtlIns - logAll OK crtlIns called &periodic_taskg_System_controller__Z4loopEV

13:06:27.480 [main] INFO  fmi.instance.crtlIns - logAll OK crtlIns called &periodic_taskg_System_controller__Z4loopEV

13:06:27.480 [main] INFO  fmi.instance.crtlIns - logAll OK crtlIns called &periodic_taskg_System_controller__Z4loopEV

13:06:27.480 [main] INFO  fmi.instance.crtlIns - logAll OK crtlIns called &periodic_taskg_System_controller__Z4loopEV

13:06:27.480 [main] INFO  fmi.instance.crtlIns - logAll OK crtlIns called &periodic_taskg_System_controller__Z4loopEV

13:06:27.480 [main] INFO  fmi.instance.crtlIns - logAll OK crtlIns called &periodic_taskg_System_controller__Z4loopEV

13:06:27.480 [main] INFO  fmi.instance.crtlIns - logAll OK crtlIns called &periodic_taskg_System_controller__Z4loopEV

13:06:27.481 [main] INFO  fmi.instance.crtlIns - logAll OK crtlIns called &periodic_taskg_System_controller__Z4loopEV

13:06:27.481 [main] INFO  fmi.instance.crtlIns - logAll OK crtlIns called &periodic_taskg_System_controller__Z4loopEV

13:06:27.481 [main] INFO  fmi.instance.crtlIns - logAll OK crtlIns called &periodic_taskg_System_controller__Z4loopEV

13:06:27.481 [main] INFO  fmi.instance.crtlIns - logAll OK crtlIns called &periodic_taskg_System_controller__Z4loopEV

13:06:27.481 [main] INFO  fmi.instance.crtlIns - logAll OK crtlIns called &periodic_taskg_System_controller__Z4loopEV

13:06:27.481 [main] INFO  fmi.instance.crtlIns - logAll OK crtlIns called &periodic_taskg_System_controller__Z4loopEV

13:06:27.481 [main] INFO  fmi.instance.crtlIns - logAll OK crtlIns called &periodic_taskg_System_controller__Z4loopEV

13:06:27.481 [main] INFO  fmi.instance.crtlIns - logAll OK crtlIns called &periodic_taskg_System_controller__Z4loopEV

13:06:27.481 [main] INFO  fmi.instance.crtlIns - logAll OK crtlIns called &periodic_taskg_System_controller__Z4loopEV

13:06:27.481 [main] INFO  fmi.instance.crtlIns - logAll OK crtlIns called &periodic_taskg_System_controller__Z4loopEV

13:06:27.481 [main] INFO  fmi.instance.crtlIns - logAll OK crtlIns called &periodic_taskg_System_controller__Z4loopEV

13:06:27.482 [main] INFO  fmi.instance.crtlIns - logAll OK crtlIns called &periodic_taskg_System_controller__Z4loopEV

13:06:27.482 [main] INFO  fmi.instance.crtlIns - logAll OK crtlIns called &periodic_taskg_System_controller__Z4loopEV

13:06:27.482 [main] INFO  fmi.instance.crtlIns - logAll OK crtlIns called &periodic_taskg_System_controller__Z4loopEV

13:06:27.482 [main] INFO  fmi.instance.crtlIns - logAll OK crtlIns called &periodic_taskg_System_controller__Z4loopEV

13:06:27.482 [main] INFO  fmi.instance.crtlIns - logAll OK crtlIns called &periodic_taskg_System_controller__Z4loopEV

13:06:27.482 [main] INFO  fmi.instance.crtlIns - logAll OK crtlIns called &periodic_taskg_System_controller__Z4loopEV

13:06:27.482 [main] INFO  fmi.instance.crtlIns - logAll OK crtlIns called &periodic_taskg_System_controller__Z4loopEV

13:06:27.482 [main] INFO  fmi.instance.crtlIns - logAll OK crtlIns called &periodic_taskg_System_controller__Z4loopEV

13:06:27.482 [main] INFO  fmi.instance.crtlIns - logAll OK crtlIns called &periodic_taskg_System_controller__Z4loopEV

13:06:27.482 [main] INFO  fmi.instance.crtlIns - logAll OK crtlIns called &periodic_taskg_System_controller__Z4loopEV

13:06:27.482 [main] INFO  fmi.instance.crtlIns - logAll OK crtlIns called &periodic_taskg_System_controller__Z4loopEV

13:06:27.482 [main] INFO  fmi.instance.crtlIns - logAll OK crtlIns called &periodic_taskg_System_controller__Z4loopEV

13:06:27.483 [main] INFO  fmi.instance.crtlIns - logAll OK crtlIns called &periodic_taskg_System_controller__Z4loopEV

13:06:27.483 [main] INFO  fmi.instance.crtlIns - logAll OK crtlIns called &periodic_taskg_System_controller__Z4loopEV

13:06:27.483 [main] INFO  fmi.instance.crtlIns - logAll OK crtlIns called &periodic_taskg_System_controller__Z4loopEV

13:06:27.483 [main] INFO  fmi.instance.crtlIns - logAll OK crtlIns called &periodic_taskg_System_controller__Z4loopEV

13:06:27.483 [main] INFO  fmi.instance.crtlIns - logAll OK crtlIns called &periodic_taskg_System_controller__Z4loopEV

13:06:27.483 [main] INFO  fmi.instance.crtlIns - logAll OK crtlIns called &periodic_taskg_System_controller__Z4loopEV

13:06:27.483 [main] INFO  fmi.instance.crtlIns - logAll OK crtlIns called &periodic_taskg_System_controller__Z4loopEV

13:06:27.483 [main] INFO  fmi.instance.crtlIns - logAll OK crtlIns called &periodic_taskg_System_controller__Z4loopEV

13:06:27.483 [main] INFO  fmi.instance.crtlIns - logAll OK crtlIns called &periodic_taskg_System_controller__Z4loopEV

13:06:27.483 [main] INFO  fmi.instance.crtlIns - logAll OK crtlIns called &periodic_taskg_System_controller__Z4loopEV

13:06:27.484 [main] INFO  fmi.instance.crtlIns - logAll OK crtlIns called &periodic_taskg_System_controller__Z4loopEV

13:06:27.484 [main] INFO  fmi.instance.crtlIns - logAll OK crtlIns called &periodic_taskg_System_controller__Z4loopEV

13:06:27.484 [main] INFO  fmi.instance.crtlIns - logAll OK crtlIns called &periodic_taskg_System_controller__Z4loopEV

13:06:27.484 [main] INFO  fmi.instance.crtlIns - logAll OK crtlIns called &periodic_taskg_System_controller__Z4loopEV

13:06:27.484 [main] INFO  fmi.instance.crtlIns - logAll OK crtlIns called &periodic_taskg_System_controller__Z4loopEV

13:06:27.484 [main] INFO  fmi.instance.crtlIns - logAll OK crtlIns called &periodic_taskg_System_controller__Z4loopEV

13:06:27.484 [main] INFO  fmi.instance.crtlIns - logAll OK crtlIns called &periodic_taskg_System_controller__Z4loopEV

13:06:27.484 [main] INFO  fmi.instance.crtlIns - logAll OK crtlIns called &periodic_taskg_System_controller__Z4loopEV

13:06:27.484 [main] INFO  fmi.instance.crtlIns - logAll OK crtlIns called &periodic_taskg_System_controller__Z4loopEV

13:06:27.485 [main] INFO  fmi.instance.crtlIns - logAll OK crtlIns called &periodic_taskg_System_controller__Z4loopEV

13:06:27.485 [main] INFO  fmi.instance.crtlIns - logAll OK crtlIns called &periodic_taskg_System_controller__Z4loopEV

13:06:27.485 [main] INFO  fmi.instance.crtlIns - logAll OK crtlIns called &periodic_taskg_System_controller__Z4loopEV

13:06:27.485 [main] INFO  fmi.instance.crtlIns - logAll OK crtlIns called &periodic_taskg_System_controller__Z4loopEV

13:06:27.485 [main] INFO  fmi.instance.crtlIns - logAll OK crtlIns called &periodic_taskg_System_controller__Z4loopEV

13:06:27.485 [main] INFO  fmi.instance.crtlIns - logAll OK crtlIns called &periodic_taskg_System_controller__Z4loopEV

13:06:27.485 [main] INFO  fmi.instance.crtlIns - logAll OK crtlIns called &periodic_taskg_System_controller__Z4loopEV

13:06:27.485 [main] INFO  fmi.instance.crtlIns - logAll OK crtlIns called &periodic_taskg_System_controller__Z4loopEV

13:06:27.485 [main] INFO  fmi.instance.crtlIns - logAll OK crtlIns called &periodic_taskg_System_controller__Z4loopEV

13:06:27.485 [main] INFO  fmi.instance.crtlIns - logAll OK crtlIns called &periodic_taskg_System_controller__Z4loopEV

13:06:27.485 [main] INFO  fmi.instance.crtlIns - logAll OK crtlIns called &periodic_taskg_System_controller__Z4loopEV

13:06:27.486 [main] INFO  fmi.instance.crtlIns - logAll OK crtlIns called &periodic_taskg_System_controller__Z4loopEV

13:06:27.486 [main] INFO  fmi.instance.crtlIns - logAll OK crtlIns called &periodic_taskg_System_controller__Z4loopEV

13:06:27.486 [main] INFO  fmi.instance.crtlIns - logAll OK crtlIns called &periodic_taskg_System_controller__Z4loopEV

13:06:27.486 [main] INFO  fmi.instance.crtlIns - logAll OK crtlIns called &periodic_taskg_System_controller__Z4loopEV

13:06:27.486 [main] INFO  fmi.instance.crtlIns - logAll OK crtlIns called &periodic_taskg_System_controller__Z4loopEV

13:06:27.486 [main] INFO  fmi.instance.crtlIns - logAll OK crtlIns called &periodic_taskg_System_controller__Z4loopEV

13:06:27.486 [main] INFO  fmi.instance.crtlIns - logAll OK crtlIns called &periodic_taskg_System_controller__Z4loopEV

13:06:27.486 [main] INFO  fmi.instance.crtlIns - logAll OK crtlIns called &periodic_taskg_System_controller__Z4loopEV

13:06:27.486 [main] INFO  fmi.instance.crtlIns - logAll OK crtlIns called &periodic_taskg_System_controller__Z4loopEV

13:06:27.486 [main] INFO  fmi.instance.crtlIns - logAll OK crtlIns called &periodic_taskg_System_controller__Z4loopEV

13:06:27.486 [main] INFO  fmi.instance.crtlIns - logAll OK crtlIns called &periodic_taskg_System_controller__Z4loopEV

13:06:27.486 [main] INFO  fmi.instance.crtlIns - logAll OK crtlIns called &periodic_taskg_System_controller__Z4loopEV

13:06:27.487 [main] INFO  fmi.instance.crtlIns - logAll OK crtlIns called &periodic_taskg_System_controller__Z4loopEV

13:06:27.487 [main] INFO  fmi.instance.crtlIns - logAll OK crtlIns called &periodic_taskg_System_controller__Z4loopEV

13:06:27.487 [main] INFO  fmi.instance.crtlIns - logAll OK crtlIns called &periodic_taskg_System_controller__Z4loopEV

13:06:27.487 [main] INFO  fmi.instance.crtlIns - logAll OK crtlIns called &periodic_taskg_System_controller__Z4loopEV

13:06:27.487 [main] INFO  fmi.instance.crtlIns - logAll OK crtlIns called &periodic_taskg_System_controller__Z4loopEV

13:06:27.487 [main] INFO  fmi.instance.crtlIns - logAll OK crtlIns called &periodic_taskg_System_controller__Z4loopEV

13:06:27.487 [main] INFO  fmi.instance.crtlIns - logAll OK crtlIns called &periodic_taskg_System_controller__Z4loopEV

13:06:27.487 [main] INFO  fmi.instance.crtlIns - logAll OK crtlIns called &periodic_taskg_System_controller__Z4loopEV

13:06:27.487 [main] INFO  fmi.instance.crtlIns - logAll OK crtlIns called &periodic_taskg_System_controller__Z4loopEV

13:06:27.487 [main] INFO  fmi.instance.crtlIns - logAll OK crtlIns called &periodic_taskg_System_controller__Z4loopEV

13:06:27.487 [main] INFO  fmi.instance.crtlIns - logAll OK crtlIns called &periodic_taskg_System_controller__Z4loopEV

13:06:27.487 [main] INFO  fmi.instance.crtlIns - logAll OK crtlIns called &periodic_taskg_System_controller__Z4loopEV

13:06:27.488 [main] INFO  fmi.instance.crtlIns - logAll OK crtlIns called &periodic_taskg_System_controller__Z4loopEV

13:06:27.488 [main] INFO  fmi.instance.crtlIns - logAll OK crtlIns called &periodic_taskg_System_controller__Z4loopEV

13:06:27.488 [main] INFO  fmi.instance.crtlIns - logAll OK crtlIns called &periodic_taskg_System_controller__Z4loopEV

13:06:27.488 [main] INFO  fmi.instance.crtlIns - logAll OK crtlIns called &periodic_taskg_System_controller__Z4loopEV

13:06:27.488 [main] INFO  fmi.instance.crtlIns - logAll OK crtlIns called &periodic_taskg_System_controller__Z4loopEV

13:06:27.488 [main] INFO  fmi.instance.crtlIns - logAll OK crtlIns called &periodic_taskg_System_controller__Z4loopEV

13:06:27.488 [main] INFO  fmi.instance.crtlIns - logAll OK crtlIns called &periodic_taskg_System_controller__Z4loopEV

13:06:27.488 [main] DEBUG org.intocps.orchestration.coe.scala.CoeObject$ - 	--- Execution time of 'doStep' was 9 [ms]
13:06:27.488 [main] DEBUG org.intocps.orchestration.coe.scala.CoeObject$ - 	--- Execution time of 'processResults' was 0 [ms]
13:06:27.489 [main] DEBUG org.intocps.orchestration.coe.scala.CoeObject$ -  ## DoStep at: 2.0 Completed with: ok
13:06:27.489 [main] DEBUG org.intocps.orchestration.coe.scala.CoeObject$ - 	--- Execution time of 'notifier' was 0 [ms]
13:06:27.489 [main] DEBUG org.intocps.orchestration.coe.scala.CoeObject$ - 	--- Execution time of 'updateDerivatives' was 0 [ms]
13:06:27.490 [main] DEBUG org.intocps.orchestration.coe.scala.CoeObject$ - 	--- Execution time of 'resolveInputs' was 1 [ms]
13:06:27.490 [main] DEBUG org.intocps.orchestration.coe.scala.CoeObject$ - 	--- Execution time of 'setallinputs' was 0 [ms]
13:06:27.490 [main] DEBUG org.intocps.orchestration.coe.scala.CoeObject$ - 	--- Execution time of 'serilizeStates' was 0 [ms]
13:06:27.490 [main] DEBUG org.intocps.orchestration.coe.scala.CoeObject$ - 	--- Execution time of 'getStepSize' was 0 [ms]
[WARNING] Corrupted STDOUT by directly writing to native stream in forked JVM 1. See FAQ web page and the dump file /var/lib/jenkins/workspace/eanutils-commons-beanutils-1.9.4/orchestration/webapi/target/surefire-reports/2020-07-27T13-02-39_447-jvmRun1.dumpstream
[INFO] 
[INFO] Results:
[INFO] 
[INFO] Tests run: 24, Failures: 0, Errors: 0, Skipped: 0
[INFO] 
[INFO] ------------------------------------------------------------------------
[INFO] Reactor Summary for The INTO CPS Tool Platform root 1.0.11-SNAPSHOT:
[INFO] 
[INFO] The INTO CPS Tool Platform root .................... SUCCESS [ 12.922 s]
[INFO] NanoHTTPD – a tiny web server in Java .............. SUCCESS [  6.236 s]
[INFO] FMI model definition API ........................... SUCCESS [ 13.870 s]
[INFO] orchestration Tools ................................ SUCCESS [  0.027 s]
[INFO] A VDM model checker for Model Definition ........... SUCCESS [ 13.029 s]
[INFO] The orchestration engine ........................... SUCCESS [02:53 min]
[INFO] webapi ............................................. FAILURE [ 25.173 s]
[INFO] ------------------------------------------------------------------------
[INFO] BUILD FAILURE
[INFO] ------------------------------------------------------------------------
[INFO] Total time:  04:07 min
[INFO] Finished at: 2020-07-27T13:06:27+02:00
[INFO] ------------------------------------------------------------------------
[INFO] [jenkins-event-spy] Generated /var/lib/jenkins/workspace/eanutils-commons-beanutils-1.9.4@tmp/withMavendc6faec5/maven-spy-20200727-130219-5848752970385734695417.log
[ERROR] Failed to execute goal org.apache.maven.plugins:maven-surefire-plugin:2.22.2:test (default-test) on project webapi: There are test failures.
[ERROR] 
[ERROR] Please refer to /var/lib/jenkins/workspace/eanutils-commons-beanutils-1.9.4/orchestration/webapi/target/surefire-reports for the individual test results.
[ERROR] Please refer to dump files (if any exist) [date].dump, [date]-jvmRun[N].dump and [date].dumpstream.
[ERROR] The forked VM terminated without properly saying goodbye. VM crash or System.exit called?
[ERROR] Command was /bin/sh -c cd /var/lib/jenkins/workspace/eanutils-commons-beanutils-1.9.4/orchestration/webapi && /usr/lib/jvm/java-8-oracle/jre/bin/java '-javaagent:/var/lib/jenkins/workspace/eanutils-commons-beanutils-1.9.4/.repository/org/jacoco/org.jacoco.agent/0.8.5/org.jacoco.agent-0.8.5-runtime.jar=destfile=/var/lib/jenkins/workspace/eanutils-commons-beanutils-1.9.4/orchestration/webapi/target/coverage-reports/jacoco-unit.exec,excludes=org/overture/cgc/extast/analysis/**/*.*:org/overture/codegen/vdm2c/extast/expressions/**/*:org/overture/codegen/vdm2c/extast/declarations/**/*:org/overture/codegen/vdm2c/extast/statements/**/*:org/overture/cgc/extast/node/**/*:org/overture/codegen/vdm2c/ast/preview/**/*' -jar /var/lib/jenkins/workspace/eanutils-commons-beanutils-1.9.4/orchestration/webapi/target/surefire/surefirebooter3815110171270270602.jar /var/lib/jenkins/workspace/eanutils-commons-beanutils-1.9.4/orchestration/webapi/target/surefire 2020-07-27T13-02-39_447-jvmRun1 surefire2251151635951275656tmp surefire_1191483627688619627tmp
[ERROR] Error occurred in starting fork, check output in log
[ERROR] Process Exit Code: 134
[ERROR] Crashed tests:
[ERROR] org.intocps.orchestration.coe.webapi.esav1.Stp6Test
[ERROR] org.apache.maven.surefire.booter.SurefireBooterForkException: The forked VM terminated without properly saying goodbye. VM crash or System.exit called?
[ERROR] Command was /bin/sh -c cd /var/lib/jenkins/workspace/eanutils-commons-beanutils-1.9.4/orchestration/webapi && /usr/lib/jvm/java-8-oracle/jre/bin/java '-javaagent:/var/lib/jenkins/workspace/eanutils-commons-beanutils-1.9.4/.repository/org/jacoco/org.jacoco.agent/0.8.5/org.jacoco.agent-0.8.5-runtime.jar=destfile=/var/lib/jenkins/workspace/eanutils-commons-beanutils-1.9.4/orchestration/webapi/target/coverage-reports/jacoco-unit.exec,excludes=org/overture/cgc/extast/analysis/**/*.*:org/overture/codegen/vdm2c/extast/expressions/**/*:org/overture/codegen/vdm2c/extast/declarations/**/*:org/overture/codegen/vdm2c/extast/statements/**/*:org/overture/cgc/extast/node/**/*:org/overture/codegen/vdm2c/ast/preview/**/*' -jar /var/lib/jenkins/workspace/eanutils-commons-beanutils-1.9.4/orchestration/webapi/target/surefire/surefirebooter3815110171270270602.jar /var/lib/jenkins/workspace/eanutils-commons-beanutils-1.9.4/orchestration/webapi/target/surefire 2020-07-27T13-02-39_447-jvmRun1 surefire2251151635951275656tmp surefire_1191483627688619627tmp
[ERROR] Error occurred in starting fork, check output in log
[ERROR] Process Exit Code: 134
[ERROR] Crashed tests:
[ERROR] org.intocps.orchestration.coe.webapi.esav1.Stp6Test
[ERROR] 	at org.apache.maven.plugin.surefire.booterclient.ForkStarter.fork(ForkStarter.java:669)
[ERROR] 	at org.apache.maven.plugin.surefire.booterclient.ForkStarter.run(ForkStarter.java:282)
[ERROR] 	at org.apache.maven.plugin.surefire.booterclient.ForkStarter.run(ForkStarter.java:245)
[ERROR] 	at org.apache.maven.plugin.surefire.AbstractSurefireMojo.executeProvider(AbstractSurefireMojo.java:1183)
[ERROR] 	at org.apache.maven.plugin.surefire.AbstractSurefireMojo.executeAfterPreconditionsChecked(AbstractSurefireMojo.java:1011)
[ERROR] 	at org.apache.maven.plugin.surefire.AbstractSurefireMojo.execute(AbstractSurefireMojo.java:857)
[ERROR] 	at org.apache.maven.plugin.DefaultBuildPluginManager.executeMojo(DefaultBuildPluginManager.java:137)
[ERROR] 	at org.apache.maven.lifecycle.internal.MojoExecutor.execute(MojoExecutor.java:210)
[ERROR] 	at org.apache.maven.lifecycle.internal.MojoExecutor.execute(MojoExecutor.java:156)
[ERROR] 	at org.apache.maven.lifecycle.internal.MojoExecutor.execute(MojoExecutor.java:148)
[ERROR] 	at org.apache.maven.lifecycle.internal.LifecycleModuleBuilder.buildProject(LifecycleModuleBuilder.java:117)
[ERROR] 	at org.apache.maven.lifecycle.internal.LifecycleModuleBuilder.buildProject(LifecycleModuleBuilder.java:81)
[ERROR] 	at org.apache.maven.lifecycle.internal.builder.singlethreaded.SingleThreadedBuilder.build(SingleThreadedBuilder.java:56)
[ERROR] 	at org.apache.maven.lifecycle.internal.LifecycleStarter.execute(LifecycleStarter.java:128)
[ERROR] 	at org.apache.maven.DefaultMaven.doExecute(DefaultMaven.java:305)
[ERROR] 	at org.apache.maven.DefaultMaven.doExecute(DefaultMaven.java:192)
[ERROR] 	at org.apache.maven.DefaultMaven.execute(DefaultMaven.java:105)
[ERROR] 	at org.apache.maven.cli.MavenCli.execute(MavenCli.java:956)
[ERROR] 	at org.apache.maven.cli.MavenCli.doMain(MavenCli.java:288)
[ERROR] 	at org.apache.maven.cli.MavenCli.main(MavenCli.java:192)
[ERROR] 	at sun.reflect.NativeMethodAccessorImpl.invoke0(Native Method)
[ERROR] 	at sun.reflect.NativeMethodAccessorImpl.invoke(NativeMethodAccessorImpl.java:62)
[ERROR] 	at sun.reflect.DelegatingMethodAccessorImpl.invoke(DelegatingMethodAccessorImpl.java:43)
[ERROR] 	at java.lang.reflect.Method.invoke(Method.java:498)
[ERROR] 	at org.codehaus.plexus.classworlds.launcher.Launcher.launchEnhanced(Launcher.java:289)
[ERROR] 	at org.codehaus.plexus.classworlds.launcher.Launcher.launch(Launcher.java:229)
[ERROR] 	at org.codehaus.plexus.classworlds.launcher.Launcher.mainWithExitCode(Launcher.java:415)
[ERROR] 	at org.codehaus.plexus.classworlds.launcher.Launcher.main(Launcher.java:356)
[ERROR] -> [Help 1]
[ERROR] 
[ERROR] To see the full stack trace of the errors, re-run Maven with the -e switch.
[ERROR] Re-run Maven using the -X switch to enable full debug logging.
[ERROR] 
[ERROR] For more information about the errors and possible solutions, please read the following articles:
[ERROR] [Help 1] http://cwiki.apache.org/confluence/display/MAVEN/MojoExecutionException
[ERROR] 
[ERROR] After correcting the problems, you can resume the build with the command
[ERROR]   mvn <goals> -rf :webapi
[Pipeline] }
Lock released on resource [FMU-SHM]
[Pipeline] // lock
[Pipeline] }
[withMaven] artifactsPublisher - Archive artifact pom.xml under org/into-cps/root/1.0.11-SNAPSHOT/root-1.0.11-SNAPSHOT.pom
[withMaven] artifactsPublisher - Archive artifact nanohttpd/pom.xml under org/into-cps/nanohttpd/1.0.11-SNAPSHOT/nanohttpd-1.0.11-SNAPSHOT.pom
[withMaven] artifactsPublisher - Archive artifact nanohttpd/target/nanohttpd-1.0.11-SNAPSHOT.jar under org/into-cps/nanohttpd/1.0.11-SNAPSHOT/nanohttpd-1.0.11-SNAPSHOT.jar
[withMaven] artifactsPublisher - Archive artifact nanohttpd/target/nanohttpd-1.0.11-SNAPSHOT-javadoc.jar under org/into-cps/nanohttpd/1.0.11-SNAPSHOT/nanohttpd-1.0.11-SNAPSHOT-javadoc.jar
[withMaven] artifactsPublisher - Archive artifact nanohttpd/target/nanohttpd-1.0.11-SNAPSHOT-sources.jar under org/into-cps/nanohttpd/1.0.11-SNAPSHOT/nanohttpd-1.0.11-SNAPSHOT-sources.jar
[withMaven] artifactsPublisher - Archive artifact modeldefinition/pom.xml under org/into-cps/modeldefinition/1.0.11-SNAPSHOT/modeldefinition-1.0.11-SNAPSHOT.pom
[withMaven] artifactsPublisher - Archive artifact modeldefinition/target/modeldefinition-1.0.11-SNAPSHOT.jar under org/into-cps/modeldefinition/1.0.11-SNAPSHOT/modeldefinition-1.0.11-SNAPSHOT.jar
[withMaven] artifactsPublisher - Archive artifact modeldefinition/target/modeldefinition-1.0.11-SNAPSHOT-javadoc.jar under org/into-cps/modeldefinition/1.0.11-SNAPSHOT/modeldefinition-1.0.11-SNAPSHOT-javadoc.jar
[withMaven] artifactsPublisher - Archive artifact modeldefinition/target/modeldefinition-1.0.11-SNAPSHOT-sources.jar under org/into-cps/modeldefinition/1.0.11-SNAPSHOT/modeldefinition-1.0.11-SNAPSHOT-sources.jar
[withMaven] artifactsPublisher - Archive artifact modeldefinition/target/modeldefinition-1.0.11-SNAPSHOT-jar-with-dependencies.jar under org/into-cps/modeldefinition/1.0.11-SNAPSHOT/modeldefinition-1.0.11-SNAPSHOT-jar-with-dependencies.jar
[withMaven] artifactsPublisher - Archive artifact orchestration/pom.xml under org/into-cps/orchestration/1.0.11-SNAPSHOT/orchestration-1.0.11-SNAPSHOT.pom
[withMaven] artifactsPublisher - Archive artifact orchestration/modeldefinitionchecker/pom.xml under org/into-cps/orchestration/modeldefinitionchecker/1.0.11-SNAPSHOT/modeldefinitionchecker-1.0.11-SNAPSHOT.pom
[withMaven] artifactsPublisher - Archive artifact orchestration/modeldefinitionchecker/target/modeldefinitionchecker-1.0.11-SNAPSHOT.jar under org/into-cps/orchestration/modeldefinitionchecker/1.0.11-SNAPSHOT/modeldefinitionchecker-1.0.11-SNAPSHOT.jar
[withMaven] artifactsPublisher - Archive artifact orchestration/modeldefinitionchecker/target/modeldefinitionchecker-1.0.11-SNAPSHOT-javadoc.jar under org/into-cps/orchestration/modeldefinitionchecker/1.0.11-SNAPSHOT/modeldefinitionchecker-1.0.11-SNAPSHOT-javadoc.jar
[withMaven] artifactsPublisher - Archive artifact orchestration/modeldefinitionchecker/target/modeldefinitionchecker-1.0.11-SNAPSHOT-sources.jar under org/into-cps/orchestration/modeldefinitionchecker/1.0.11-SNAPSHOT/modeldefinitionchecker-1.0.11-SNAPSHOT-sources.jar
[withMaven] artifactsPublisher - Archive artifact orchestration/coe/pom.xml under org/into-cps/orchestration/coe/1.0.11-SNAPSHOT/coe-1.0.11-SNAPSHOT.pom
[withMaven] artifactsPublisher - Archive artifact orchestration/coe/target/coe-1.0.11-SNAPSHOT.jar under org/into-cps/orchestration/coe/1.0.11-SNAPSHOT/coe-1.0.11-SNAPSHOT.jar
[withMaven] artifactsPublisher - Archive artifact orchestration/coe/target/coe-1.0.11-SNAPSHOT-javadoc.jar under org/into-cps/orchestration/coe/1.0.11-SNAPSHOT/coe-1.0.11-SNAPSHOT-javadoc.jar
[withMaven] artifactsPublisher - Archive artifact orchestration/coe/target/coe-1.0.11-SNAPSHOT-sources.jar under org/into-cps/orchestration/coe/1.0.11-SNAPSHOT/coe-1.0.11-SNAPSHOT-sources.jar
[withMaven] artifactsPublisher - Archive artifact orchestration/coe/target/coe-1.0.11-SNAPSHOT-jar-with-dependencies.jar under org/into-cps/orchestration/coe/1.0.11-SNAPSHOT/coe-1.0.11-SNAPSHOT-jar-with-dependencies.jar
[withMaven] junitPublisher - Archive test results for Maven artifact org.into-cps:nanohttpd:jar:1.0.11-SNAPSHOT generated by maven-surefire-plugin:test (default-test): nanohttpd/target/surefire-reports/*.xml
[withMaven] junitPublisher - Archive test results for Maven artifact org.into-cps:modeldefinition:jar:1.0.11-SNAPSHOT generated by maven-surefire-plugin:test (default-test): modeldefinition/target/surefire-reports/*.xml
[withMaven] junitPublisher - Archive test results for Maven artifact org.into-cps.orchestration:modeldefinitionchecker:jar:1.0.11-SNAPSHOT generated by maven-surefire-plugin:test (default-test): orchestration/modeldefinitionchecker/target/surefire-reports/*.xml
[withMaven] junitPublisher - Archive test results for Maven artifact org.into-cps.orchestration:coe:jar:1.0.11-SNAPSHOT generated by maven-surefire-plugin:test (default-test): orchestration/coe/target/surefire-reports/*.xml
[withMaven] junitPublisher - Archive test results for Maven artifact org.into-cps.orchestration:webapi:jar:1.0.11-SNAPSHOT generated by maven-surefire-plugin:test (default-test): orchestration/webapi/target/surefire-reports/*.xml
[withMaven] junitPublisher - Jenkins JUnit Attachments Plugin not found, can't publish test attachments.Recording test results
[withMaven] jacocoPublisher - Archive JaCoCo analysis results for Maven artifact MavenArtifact{org.into-cps:root:pom:1.0.11-SNAPSHOT(version: 1.0.11-SNAPSHOT, snapshot:false) } generated by PluginInvocation{org.jacoco:jacoco-maven-plugin:0.8.5@prepare-agent  jacoco-initialize}: execFile: target/coverage-reports/jacoco-unit.exec, sources: src/main/java, classes: target/classes
[withMaven] jacocoPublisher - Archive JaCoCo analysis results for Maven artifact MavenArtifact{org.into-cps:root:pom:1.0.11-SNAPSHOT(version: 1.0.11-SNAPSHOT, snapshot:false) } generated by PluginInvocation{org.jacoco:jacoco-maven-plugin:0.8.5@prepare-agent  jacoco-initialize}: execFile: target/coverage-reports/jacoco-unit.exec, sources: src/main/java, classes: target/classes
[withMaven] jacocoPublisher - Archive JaCoCo analysis results for Maven artifact MavenArtifact{org.into-cps:nanohttpd:jar:1.0.11-SNAPSHOT(version: 1.0.11-SNAPSHOT, snapshot:false) } generated by PluginInvocation{org.jacoco:jacoco-maven-plugin:0.8.5@prepare-agent  jacoco-initialize}: execFile: nanohttpd/target/coverage-reports/jacoco-unit.exec, sources: nanohttpd/src/main/java, classes: nanohttpd/target/classes
[withMaven] jacocoPublisher - Archive JaCoCo analysis results for Maven artifact MavenArtifact{org.into-cps:nanohttpd:jar:1.0.11-SNAPSHOT(version: 1.0.11-SNAPSHOT, snapshot:false) } generated by PluginInvocation{org.jacoco:jacoco-maven-plugin:0.8.5@prepare-agent  jacoco-initialize}: execFile: nanohttpd/target/coverage-reports/jacoco-unit.exec, sources: nanohttpd/src/main/java, classes: nanohttpd/target/classes
[withMaven] jacocoPublisher - Archive JaCoCo analysis results for Maven artifact MavenArtifact{org.into-cps:modeldefinition:jar:1.0.11-SNAPSHOT(version: 1.0.11-SNAPSHOT, snapshot:false) } generated by PluginInvocation{org.jacoco:jacoco-maven-plugin:0.8.5@prepare-agent  jacoco-initialize}: execFile: modeldefinition/target/coverage-reports/jacoco-unit.exec, sources: modeldefinition/src/main/java, classes: modeldefinition/target/classes
[withMaven] jacocoPublisher - Archive JaCoCo analysis results for Maven artifact MavenArtifact{org.into-cps:modeldefinition:jar:1.0.11-SNAPSHOT(version: 1.0.11-SNAPSHOT, snapshot:false) } generated by PluginInvocation{org.jacoco:jacoco-maven-plugin:0.8.5@prepare-agent  jacoco-initialize}: execFile: modeldefinition/target/coverage-reports/jacoco-unit.exec, sources: modeldefinition/src/main/java, classes: modeldefinition/target/classes
[withMaven] jacocoPublisher - Archive JaCoCo analysis results for Maven artifact MavenArtifact{org.into-cps:orchestration:pom:1.0.11-SNAPSHOT(version: 1.0.11-SNAPSHOT, snapshot:false) } generated by PluginInvocation{org.jacoco:jacoco-maven-plugin:0.8.5@prepare-agent  jacoco-initialize}: execFile: orchestration/target/coverage-reports/jacoco-unit.exec, sources: orchestration/src/main/java, classes: orchestration/target/classes
[withMaven] jacocoPublisher - Archive JaCoCo analysis results for Maven artifact MavenArtifact{org.into-cps:orchestration:pom:1.0.11-SNAPSHOT(version: 1.0.11-SNAPSHOT, snapshot:false) } generated by PluginInvocation{org.jacoco:jacoco-maven-plugin:0.8.5@prepare-agent  jacoco-initialize}: execFile: orchestration/target/coverage-reports/jacoco-unit.exec, sources: orchestration/src/main/java, classes: orchestration/target/classes
[withMaven] jacocoPublisher - Archive JaCoCo analysis results for Maven artifact MavenArtifact{org.into-cps.orchestration:modeldefinitionchecker:jar:1.0.11-SNAPSHOT(version: 1.0.11-SNAPSHOT, snapshot:false) } generated by PluginInvocation{org.jacoco:jacoco-maven-plugin:0.8.5@prepare-agent  jacoco-initialize}: execFile: orchestration/modeldefinitionchecker/target/coverage-reports/jacoco-unit.exec, sources: orchestration/modeldefinitionchecker/src/main/java, classes: orchestration/modeldefinitionchecker/target/classes
[withMaven] jacocoPublisher - Archive JaCoCo analysis results for Maven artifact MavenArtifact{org.into-cps.orchestration:modeldefinitionchecker:jar:1.0.11-SNAPSHOT(version: 1.0.11-SNAPSHOT, snapshot:false) } generated by PluginInvocation{org.jacoco:jacoco-maven-plugin:0.8.5@prepare-agent  jacoco-initialize}: execFile: orchestration/modeldefinitionchecker/target/coverage-reports/jacoco-unit.exec, sources: orchestration/modeldefinitionchecker/src/main/java, classes: orchestration/modeldefinitionchecker/target/classes
[withMaven] jacocoPublisher - Archive JaCoCo analysis results for Maven artifact MavenArtifact{org.into-cps.orchestration:coe:jar:1.0.11-SNAPSHOT(version: 1.0.11-SNAPSHOT, snapshot:false) } generated by PluginInvocation{org.jacoco:jacoco-maven-plugin:0.8.5@prepare-agent  jacoco-initialize}: execFile: orchestration/coe/target/coverage-reports/jacoco-unit.exec, sources: orchestration/coe/src/main/java, classes: orchestration/coe/target/classes
[withMaven] jacocoPublisher - Archive JaCoCo analysis results for Maven artifact MavenArtifact{org.into-cps.orchestration:coe:jar:1.0.11-SNAPSHOT(version: 1.0.11-SNAPSHOT, snapshot:false) } generated by PluginInvocation{org.jacoco:jacoco-maven-plugin:0.8.5@prepare-agent  jacoco-initialize}: execFile: orchestration/coe/target/coverage-reports/jacoco-unit.exec, sources: orchestration/coe/src/main/java, classes: orchestration/coe/target/classes
[withMaven] jacocoPublisher - Archive JaCoCo analysis results for Maven artifact MavenArtifact{org.into-cps.orchestration:webapi:jar:1.0.11-SNAPSHOT(version: 1.0.11-SNAPSHOT, snapshot:false) } generated by PluginInvocation{org.jacoco:jacoco-maven-plugin:0.8.5@prepare-agent  jacoco-initialize}: execFile: orchestration/webapi/target/coverage-reports/jacoco-unit.exec, sources: orchestration/webapi/src/main/java, classes: orchestration/webapi/target/classes
[JaCoCo plugin] Collecting JaCoCo coverage data...
[JaCoCo plugin] target/coverage-reports/jacoco-unit.exec,target/coverage-reports/jacoco-unit.exec,nanohttpd/target/coverage-reports/jacoco-unit.exec,nanohttpd/target/coverage-reports/jacoco-unit.exec,modeldefinition/target/coverage-reports/jacoco-unit.exec,modeldefinition/target/coverage-reports/jacoco-unit.exec,orchestration/target/coverage-reports/jacoco-unit.exec,orchestration/target/coverage-reports/jacoco-unit.exec,orchestration/modeldefinitionchecker/target/coverage-reports/jacoco-unit.exec,orchestration/modeldefinitionchecker/target/coverage-reports/jacoco-unit.exec,orchestration/coe/target/coverage-reports/jacoco-unit.exec,orchestration/coe/target/coverage-reports/jacoco-unit.exec,orchestration/webapi/target/coverage-reports/jacoco-unit.exec;target/classes,target/classes,nanohttpd/target/classes,nanohttpd/target/classes,modeldefinition/target/classes,modeldefinition/target/classes,orchestration/target/classes,orchestration/target/classes,orchestration/modeldefinitionchecker/target/classes,orchestration/modeldefinitionchecker/target/classes,orchestration/coe/target/classes,orchestration/coe/target/classes,orchestration/webapi/target/classes;src/main/java,src/main/java,nanohttpd/src/main/java,nanohttpd/src/main/java,modeldefinition/src/main/java,modeldefinition/src/main/java,orchestration/src/main/java,orchestration/src/main/java,orchestration/modeldefinitionchecker/src/main/java,orchestration/modeldefinitionchecker/src/main/java,orchestration/coe/src/main/java,orchestration/coe/src/main/java,orchestration/webapi/src/main/java; locations are configured
[JaCoCo plugin] Number of found exec files for pattern target/coverage-reports/jacoco-unit.exec,target/coverage-reports/jacoco-unit.exec,nanohttpd/target/coverage-reports/jacoco-unit.exec,nanohttpd/target/coverage-reports/jacoco-unit.exec,modeldefinition/target/coverage-reports/jacoco-unit.exec,modeldefinition/target/coverage-reports/jacoco-unit.exec,orchestration/target/coverage-reports/jacoco-unit.exec,orchestration/target/coverage-reports/jacoco-unit.exec,orchestration/modeldefinitionchecker/target/coverage-reports/jacoco-unit.exec,orchestration/modeldefinitionchecker/target/coverage-reports/jacoco-unit.exec,orchestration/coe/target/coverage-reports/jacoco-unit.exec,orchestration/coe/target/coverage-reports/jacoco-unit.exec,orchestration/webapi/target/coverage-reports/jacoco-unit.exec: 4
[JaCoCo plugin] Saving matched execfiles:  /var/lib/jenkins/workspace/eanutils-commons-beanutils-1.9.4/modeldefinition/target/coverage-reports/jacoco-unit.exec /var/lib/jenkins/workspace/eanutils-commons-beanutils-1.9.4/orchestration/coe/target/coverage-reports/jacoco-unit.exec /var/lib/jenkins/workspace/eanutils-commons-beanutils-1.9.4/orchestration/modeldefinitionchecker/target/coverage-reports/jacoco-unit.exec /var/lib/jenkins/workspace/eanutils-commons-beanutils-1.9.4/orchestration/webapi/target/coverage-reports/jacoco-unit.exec
[JaCoCo plugin] Saving matched class directories for class-pattern: target/classes,target/classes,nanohttpd/target/classes,nanohttpd/target/classes,modeldefinition/target/classes,modeldefinition/target/classes,orchestration/target/classes,orchestration/target/classes,orchestration/modeldefinitionchecker/target/classes,orchestration/modeldefinitionchecker/target/classes,orchestration/coe/target/classes,orchestration/coe/target/classes,orchestration/webapi/target/classes: 
[JaCoCo plugin]  - /var/lib/jenkins/workspace/eanutils-commons-beanutils-1.9.4/modeldefinition/target/classes 27 files
[JaCoCo plugin]  - /var/lib/jenkins/workspace/eanutils-commons-beanutils-1.9.4/nanohttpd/target/classes 38 files
[JaCoCo plugin]  - /var/lib/jenkins/workspace/eanutils-commons-beanutils-1.9.4/orchestration/coe/target/classes 399 files
[JaCoCo plugin]  - /var/lib/jenkins/workspace/eanutils-commons-beanutils-1.9.4/orchestration/modeldefinitionchecker/target/classes 28 files
[JaCoCo plugin]  - /var/lib/jenkins/workspace/eanutils-commons-beanutils-1.9.4/orchestration/webapi/target/classes 44 files
[JaCoCo plugin] Saving matched source directories for source-pattern: src/main/java,src/main/java,nanohttpd/src/main/java,nanohttpd/src/main/java,modeldefinition/src/main/java,modeldefinition/src/main/java,orchestration/src/main/java,orchestration/src/main/java,orchestration/modeldefinitionchecker/src/main/java,orchestration/modeldefinitionchecker/src/main/java,orchestration/coe/src/main/java,orchestration/coe/src/main/java,orchestration/webapi/src/main/java: 
[JaCoCo plugin] Source Inclusions: **/*.java,**/*.groovy,**/*.kt,**/*.kts
[JaCoCo plugin] Source Exclusions: 
[JaCoCo plugin] - /var/lib/jenkins/workspace/eanutils-commons-beanutils-1.9.4/modeldefinition/src/main/java 4 files
[JaCoCo plugin] - /var/lib/jenkins/workspace/eanutils-commons-beanutils-1.9.4/nanohttpd/src/main/java 3 files
[JaCoCo plugin] - /var/lib/jenkins/workspace/eanutils-commons-beanutils-1.9.4/orchestration/coe/src/main/java 85 files
[JaCoCo plugin] - /var/lib/jenkins/workspace/eanutils-commons-beanutils-1.9.4/orchestration/modeldefinitionchecker/src/main/java 1 files
[JaCoCo plugin] - /var/lib/jenkins/workspace/eanutils-commons-beanutils-1.9.4/orchestration/webapi/src/main/java 20 files
[JaCoCo plugin] - /var/lib/jenkins/workspace/eanutils-commons-beanutils-1.9.4/src/main/java 0 files
[JaCoCo plugin] Loading inclusions files..
[JaCoCo plugin] inclusions: []
[JaCoCo plugin] exclusions: []
[JaCoCo plugin] Thresholds: JacocoHealthReportThresholds [minClass=0, maxClass=0, minMethod=0, maxMethod=0, minLine=0, maxLine=0, minBranch=0, maxBranch=0, minInstruction=0, maxInstruction=0, minComplexity=0, maxComplexity=0]
[JaCoCo plugin] Publishing the results..
[JaCoCo plugin] Loading packages..
[JaCoCo plugin] Done.
[JaCoCo plugin] Overall coverage: class: 73, method: 55, line: 48, branch: 39, instruction: 51, complexity: 40
[withMaven] openTasksPublisher - Scan Tasks for Maven artifact org.into-cps:root:pom:1.0.11-SNAPSHOT in source directory src/main/java
[withMaven] openTasksPublisher - Scan Tasks for Maven artifact org.into-cps:nanohttpd:jar:1.0.11-SNAPSHOT in source directory nanohttpd/src/main/java
[withMaven] openTasksPublisher - Scan Tasks for Maven artifact org.into-cps:modeldefinition:jar:1.0.11-SNAPSHOT in source directory modeldefinition/src/main/java
[withMaven] openTasksPublisher - Scan Tasks for Maven artifact org.into-cps.orchestration:modeldefinitionchecker:jar:1.0.11-SNAPSHOT in source directory orchestration/modeldefinitionchecker/src/main/java
[withMaven] openTasksPublisher - Scan Tasks for Maven artifact org.into-cps.orchestration:coe:jar:1.0.11-SNAPSHOT in source directory orchestration/coe/src/main/java
[withMaven] openTasksPublisher - Scan Tasks for Maven artifact org.into-cps.orchestration:webapi:jar:1.0.11-SNAPSHOT in source directory orchestration/webapi/src/main/java
[TASKS] Scanning folder '/var/lib/jenkins/workspace/eanutils-commons-beanutils-1.9.4' for files matching the pattern 'src/main/java/**/*,nanohttpd/src/main/java/**/*,modeldefinition/src/main/java/**/*,orchestration/modeldefinitionchecker/src/main/java/**/*,orchestration/coe/src/main/java/**/*,orchestration/webapi/src/main/java/**/*' - excludes: null
[TASKS] Found 138 files to scan for tasks
[TASKS] Found 21 open tasks.
Skipping warnings blame since pipelines do not have an SCM link.%n
[withMaven] Publishers: Pipeline Graph Publisher: 50 ms, Generated Artifacts Publisher: 1448 ms, Junit Publisher: 159 ms, Dependencies Fingerprint Publisher: 146 ms, JGiven Publisher: 1 ms, Jacoco Publisher: 647 ms, Open Task Scanner Publisher: 764 ms
[Pipeline] // withMaven
[Pipeline] }
[Pipeline] // stage
[Pipeline] stage
[Pipeline] { (Reporting)
[Pipeline] emailextrecipients
[Pipeline] emailext
An attempt to send an e-mail to empty list of recipients, ignored.
[Pipeline] }
[Pipeline] // stage
[Pipeline] }
[Pipeline] // node
[Pipeline] End of Pipeline

GitHub has been notified of this commit’s build result

ERROR: script returned exit code 1
Finished: FAILURE