FailedConsole Output

Skipping 4,853 KB.. Full Log
.hpp
-- Installing: /work/build/external/win-i386/include/xercesc/dom/DOMRangeException.hpp
-- Installing: /work/build/external/win-i386/include/xercesc/dom/DOMStringList.hpp
-- Installing: /work/build/external/win-i386/include/xercesc/dom/DOMText.hpp
-- Installing: /work/build/external/win-i386/include/xercesc/dom/DOMTreeWalker.hpp
-- Installing: /work/build/external/win-i386/include/xercesc/dom/DOMTypeInfo.hpp
-- Installing: /work/build/external/win-i386/include/xercesc/dom/DOMUserDataHandler.hpp
-- Installing: /work/build/external/win-i386/include/xercesc/dom/DOMXPathEvaluator.hpp
-- Installing: /work/build/external/win-i386/include/xercesc/dom/DOMXPathException.hpp
-- Installing: /work/build/external/win-i386/include/xercesc/dom/DOMXPathExpression.hpp
-- Installing: /work/build/external/win-i386/include/xercesc/dom/DOMXPathNamespace.hpp
-- Installing: /work/build/external/win-i386/include/xercesc/dom/DOMXPathNSResolver.hpp
-- Installing: /work/build/external/win-i386/include/xercesc/dom/DOMXPathResult.hpp
-- Installing: /work/build/external/win-i386/include/xercesc/dom/StDOMNode.hpp
-- Installing: /work/build/external/win-i386/include/xercesc/dom/impl/DOMAttrImpl.hpp
-- Installing: /work/build/external/win-i386/include/xercesc/dom/impl/DOMAttrMapImpl.hpp
-- Installing: /work/build/external/win-i386/include/xercesc/dom/impl/DOMAttrNSImpl.hpp
-- Installing: /work/build/external/win-i386/include/xercesc/dom/impl/DOMCasts.hpp
-- Installing: /work/build/external/win-i386/include/xercesc/dom/impl/DOMCDATASectionImpl.hpp
-- Installing: /work/build/external/win-i386/include/xercesc/dom/impl/DOMCharacterDataImpl.hpp
-- Installing: /work/build/external/win-i386/include/xercesc/dom/impl/DOMChildNode.hpp
-- Installing: /work/build/external/win-i386/include/xercesc/dom/impl/DOMCommentImpl.hpp
-- Installing: /work/build/external/win-i386/include/xercesc/dom/impl/DOMConfigurationImpl.hpp
-- Installing: /work/build/external/win-i386/include/xercesc/dom/impl/DOMDeepNodeListImpl.hpp
-- Installing: /work/build/external/win-i386/include/xercesc/dom/impl/DOMDeepNodeListPool.hpp
-- Installing: /work/build/external/win-i386/include/xercesc/dom/impl/DOMDeepNodeListPool.c
-- Installing: /work/build/external/win-i386/include/xercesc/dom/impl/DOMDocumentFragmentImpl.hpp
-- Installing: /work/build/external/win-i386/include/xercesc/dom/impl/DOMDocumentImpl.hpp
-- Installing: /work/build/external/win-i386/include/xercesc/dom/impl/DOMDocumentTypeImpl.hpp
-- Installing: /work/build/external/win-i386/include/xercesc/dom/impl/DOMElementImpl.hpp
-- Installing: /work/build/external/win-i386/include/xercesc/dom/impl/DOMElementNSImpl.hpp
-- Installing: /work/build/external/win-i386/include/xercesc/dom/impl/DOMEntityImpl.hpp
-- Installing: /work/build/external/win-i386/include/xercesc/dom/impl/DOMEntityReferenceImpl.hpp
-- Installing: /work/build/external/win-i386/include/xercesc/dom/impl/DOMErrorImpl.hpp
-- Installing: /work/build/external/win-i386/include/xercesc/dom/impl/DOMImplementationImpl.hpp
-- Installing: /work/build/external/win-i386/include/xercesc/dom/impl/DOMImplementationListImpl.hpp
-- Installing: /work/build/external/win-i386/include/xercesc/dom/impl/DOMLocatorImpl.hpp
-- Installing: /work/build/external/win-i386/include/xercesc/dom/impl/DOMNamedNodeMapImpl.hpp
-- Installing: /work/build/external/win-i386/include/xercesc/dom/impl/DOMNodeBase.hpp
-- Installing: /work/build/external/win-i386/include/xercesc/dom/impl/DOMNodeIDMap.hpp
-- Installing: /work/build/external/win-i386/include/xercesc/dom/impl/DOMNodeImpl.hpp
-- Installing: /work/build/external/win-i386/include/xercesc/dom/impl/DOMNodeIteratorImpl.hpp
-- Installing: /work/build/external/win-i386/include/xercesc/dom/impl/DOMNodeListImpl.hpp
-- Installing: /work/build/external/win-i386/include/xercesc/dom/impl/DOMNodeVector.hpp
-- Installing: /work/build/external/win-i386/include/xercesc/dom/impl/DOMNormalizer.hpp
-- Installing: /work/build/external/win-i386/include/xercesc/dom/impl/DOMNotationImpl.hpp
-- Installing: /work/build/external/win-i386/include/xercesc/dom/impl/DOMParentNode.hpp
-- Installing: /work/build/external/win-i386/include/xercesc/dom/impl/DOMProcessingInstructionImpl.hpp
-- Installing: /work/build/external/win-i386/include/xercesc/dom/impl/DOMRangeImpl.hpp
-- Installing: /work/build/external/win-i386/include/xercesc/dom/impl/DOMStringListImpl.hpp
-- Installing: /work/build/external/win-i386/include/xercesc/dom/impl/DOMStringPool.hpp
-- Installing: /work/build/external/win-i386/include/xercesc/dom/impl/DOMTextImpl.hpp
-- Installing: /work/build/external/win-i386/include/xercesc/dom/impl/DOMTreeWalkerImpl.hpp
-- Installing: /work/build/external/win-i386/include/xercesc/dom/impl/DOMTypeInfoImpl.hpp
-- Installing: /work/build/external/win-i386/include/xercesc/dom/impl/DOMLSSerializerImpl.hpp
-- Installing: /work/build/external/win-i386/include/xercesc/dom/impl/DOMLSInputImpl.hpp
-- Installing: /work/build/external/win-i386/include/xercesc/dom/impl/DOMLSOutputImpl.hpp
-- Installing: /work/build/external/win-i386/include/xercesc/dom/impl/DOMXPathExpressionImpl.hpp
-- Installing: /work/build/external/win-i386/include/xercesc/dom/impl/DOMXPathNSResolverImpl.hpp
-- Installing: /work/build/external/win-i386/include/xercesc/dom/impl/DOMXPathResultImpl.hpp
-- Installing: /work/build/external/win-i386/include/xercesc/dom/impl/XSDElementNSImpl.hpp
-- Installing: /work/build/external/win-i386/include/xercesc/framework/BinOutputStream.hpp
-- Installing: /work/build/external/win-i386/include/xercesc/framework/LocalFileFormatTarget.hpp
-- Installing: /work/build/external/win-i386/include/xercesc/framework/LocalFileInputSource.hpp
-- Installing: /work/build/external/win-i386/include/xercesc/framework/MemBufFormatTarget.hpp
-- Installing: /work/build/external/win-i386/include/xercesc/framework/MemBufInputSource.hpp
-- Installing: /work/build/external/win-i386/include/xercesc/framework/MemoryManager.hpp
-- Installing: /work/build/external/win-i386/include/xercesc/framework/psvi/PSVIAttribute.hpp
-- Installing: /work/build/external/win-i386/include/xercesc/framework/psvi/PSVIAttributeList.hpp
-- Installing: /work/build/external/win-i386/include/xercesc/framework/psvi/PSVIElement.hpp
-- Installing: /work/build/external/win-i386/include/xercesc/framework/psvi/PSVIHandler.hpp
-- Installing: /work/build/external/win-i386/include/xercesc/framework/psvi/PSVIItem.hpp
-- Installing: /work/build/external/win-i386/include/xercesc/framework/psvi/XSAnnotation.hpp
-- Installing: /work/build/external/win-i386/include/xercesc/framework/psvi/XSAttributeDeclaration.hpp
-- Installing: /work/build/external/win-i386/include/xercesc/framework/psvi/XSAttributeGroupDefinition.hpp
-- Installing: /work/build/external/win-i386/include/xercesc/framework/psvi/XSAttributeUse.hpp
-- Installing: /work/build/external/win-i386/include/xercesc/framework/psvi/XSComplexTypeDefinition.hpp
-- Installing: /work/build/external/win-i386/include/xercesc/framework/psvi/XSConstants.hpp
-- Installing: /work/build/external/win-i386/include/xercesc/framework/psvi/XSElementDeclaration.hpp
-- Installing: /work/build/external/win-i386/include/xercesc/framework/psvi/XSFacet.hpp
-- Installing: /work/build/external/win-i386/include/xercesc/framework/psvi/XSIDCDefinition.hpp
-- Installing: /work/build/external/win-i386/include/xercesc/framework/psvi/XSModel.hpp
-- Installing: /work/build/external/win-i386/include/xercesc/framework/psvi/XSModelGroup.hpp
-- Installing: /work/build/external/win-i386/include/xercesc/framework/psvi/XSModelGroupDefinition.hpp
-- Installing: /work/build/external/win-i386/include/xercesc/framework/psvi/XSMultiValueFacet.hpp
-- Installing: /work/build/external/win-i386/include/xercesc/framework/psvi/XSNamedMap.hpp
-- Installing: /work/build/external/win-i386/include/xercesc/framework/psvi/XSNamedMap.c
-- Installing: /work/build/external/win-i386/include/xercesc/framework/psvi/XSNamespaceItem.hpp
-- Installing: /work/build/external/win-i386/include/xercesc/framework/psvi/XSNotationDeclaration.hpp
-- Installing: /work/build/external/win-i386/include/xercesc/framework/psvi/XSObject.hpp
-- Installing: /work/build/external/win-i386/include/xercesc/framework/psvi/XSParticle.hpp
-- Installing: /work/build/external/win-i386/include/xercesc/framework/psvi/XSSimpleTypeDefinition.hpp
-- Installing: /work/build/external/win-i386/include/xercesc/framework/psvi/XSTypeDefinition.hpp
-- Installing: /work/build/external/win-i386/include/xercesc/framework/psvi/XSValue.hpp
-- Installing: /work/build/external/win-i386/include/xercesc/framework/psvi/XSWildcard.hpp
-- Installing: /work/build/external/win-i386/include/xercesc/framework/StdInInputSource.hpp
-- Installing: /work/build/external/win-i386/include/xercesc/framework/StdOutFormatTarget.hpp
-- Installing: /work/build/external/win-i386/include/xercesc/framework/URLInputSource.hpp
-- Installing: /work/build/external/win-i386/include/xercesc/framework/ValidationContext.hpp
-- Installing: /work/build/external/win-i386/include/xercesc/framework/Wrapper4DOMLSInput.hpp
-- Installing: /work/build/external/win-i386/include/xercesc/framework/Wrapper4InputSource.hpp
-- Installing: /work/build/external/win-i386/include/xercesc/framework/XMLAttDef.hpp
-- Installing: /work/build/external/win-i386/include/xercesc/framework/XMLAttDefList.hpp
-- Installing: /work/build/external/win-i386/include/xercesc/framework/XMLAttr.hpp
-- Installing: /work/build/external/win-i386/include/xercesc/framework/XMLBuffer.hpp
-- Installing: /work/build/external/win-i386/include/xercesc/framework/XMLBufferMgr.hpp
-- Installing: /work/build/external/win-i386/include/xercesc/framework/XMLContentModel.hpp
-- Installing: /work/build/external/win-i386/include/xercesc/framework/XMLDocumentHandler.hpp
-- Installing: /work/build/external/win-i386/include/xercesc/framework/XMLDTDDescription.hpp
-- Installing: /work/build/external/win-i386/include/xercesc/framework/XMLElementDecl.hpp
-- Installing: /work/build/external/win-i386/include/xercesc/framework/XMLEntityDecl.hpp
-- Installing: /work/build/external/win-i386/include/xercesc/framework/XMLEntityHandler.hpp
-- Installing: /work/build/external/win-i386/include/xercesc/framework/XMLErrorCodes.hpp
-- Installing: /work/build/external/win-i386/include/xercesc/framework/XMLErrorReporter.hpp
-- Installing: /work/build/external/win-i386/include/xercesc/framework/XMLFormatter.hpp
-- Installing: /work/build/external/win-i386/include/xercesc/framework/XMLGrammarDescription.hpp
-- Installing: /work/build/external/win-i386/include/xercesc/framework/XMLGrammarPool.hpp
-- Installing: /work/build/external/win-i386/include/xercesc/framework/XMLGrammarPoolImpl.hpp
-- Installing: /work/build/external/win-i386/include/xercesc/framework/XMLNotationDecl.hpp
-- Installing: /work/build/external/win-i386/include/xercesc/framework/XMLPScanToken.hpp
-- Installing: /work/build/external/win-i386/include/xercesc/framework/XMLRecognizer.hpp
-- Installing: /work/build/external/win-i386/include/xercesc/framework/XMLRefInfo.hpp
-- Installing: /work/build/external/win-i386/include/xercesc/framework/XMLSchemaDescription.hpp
-- Installing: /work/build/external/win-i386/include/xercesc/framework/XMLValidator.hpp
-- Installing: /work/build/external/win-i386/include/xercesc/framework/XMLValidityCodes.hpp
-- Installing: /work/build/external/win-i386/include/xercesc/internal/BinFileOutputStream.hpp
-- Installing: /work/build/external/win-i386/include/xercesc/internal/BinMemOutputStream.hpp
-- Installing: /work/build/external/win-i386/include/xercesc/internal/CharTypeTables.hpp
-- Installing: /work/build/external/win-i386/include/xercesc/internal/DGXMLScanner.hpp
-- Installing: /work/build/external/win-i386/include/xercesc/internal/ElemStack.hpp
-- Installing: /work/build/external/win-i386/include/xercesc/internal/EndOfEntityException.hpp
-- Installing: /work/build/external/win-i386/include/xercesc/internal/IANAEncodings.hpp
-- Installing: /work/build/external/win-i386/include/xercesc/internal/IGXMLScanner.hpp
-- Installing: /work/build/external/win-i386/include/xercesc/internal/MemoryManagerImpl.hpp
-- Installing: /work/build/external/win-i386/include/xercesc/internal/ReaderMgr.hpp
-- Installing: /work/build/external/win-i386/include/xercesc/internal/SGXMLScanner.hpp
-- Installing: /work/build/external/win-i386/include/xercesc/internal/ValidationContextImpl.hpp
-- Installing: /work/build/external/win-i386/include/xercesc/internal/VecAttributesImpl.hpp
-- Installing: /work/build/external/win-i386/include/xercesc/internal/VecAttrListImpl.hpp
-- Installing: /work/build/external/win-i386/include/xercesc/internal/WFXMLScanner.hpp
-- Installing: /work/build/external/win-i386/include/xercesc/internal/XMLInternalErrorHandler.hpp
-- Installing: /work/build/external/win-i386/include/xercesc/internal/XMLReader.hpp
-- Installing: /work/build/external/win-i386/include/xercesc/internal/XMLScanner.hpp
-- Installing: /work/build/external/win-i386/include/xercesc/internal/XMLScannerResolver.hpp
-- Installing: /work/build/external/win-i386/include/xercesc/internal/XProtoType.hpp
-- Installing: /work/build/external/win-i386/include/xercesc/internal/XSAXMLScanner.hpp
-- Installing: /work/build/external/win-i386/include/xercesc/internal/XSerializable.hpp
-- Installing: /work/build/external/win-i386/include/xercesc/internal/XSerializationException.hpp
-- Installing: /work/build/external/win-i386/include/xercesc/internal/XSerializeEngine.hpp
-- Installing: /work/build/external/win-i386/include/xercesc/internal/XSObjectFactory.hpp
-- Installing: /work/build/external/win-i386/include/xercesc/internal/XTemplateSerializer.hpp
-- Installing: /work/build/external/win-i386/include/xercesc/parsers/AbstractDOMParser.hpp
-- Installing: /work/build/external/win-i386/include/xercesc/parsers/DOMLSParserImpl.hpp
-- Installing: /work/build/external/win-i386/include/xercesc/parsers/SAX2XMLFilterImpl.hpp
-- Installing: /work/build/external/win-i386/include/xercesc/parsers/SAX2XMLReaderImpl.hpp
-- Installing: /work/build/external/win-i386/include/xercesc/parsers/SAXParser.hpp
-- Installing: /work/build/external/win-i386/include/xercesc/parsers/XercesDOMParser.hpp
-- Installing: /work/build/external/win-i386/include/xercesc/sax/AttributeList.hpp
-- Installing: /work/build/external/win-i386/include/xercesc/sax/DocumentHandler.hpp
-- Installing: /work/build/external/win-i386/include/xercesc/sax/DTDHandler.hpp
-- Installing: /work/build/external/win-i386/include/xercesc/sax/EntityResolver.hpp
-- Installing: /work/build/external/win-i386/include/xercesc/sax/ErrorHandler.hpp
-- Installing: /work/build/external/win-i386/include/xercesc/sax/HandlerBase.hpp
-- Installing: /work/build/external/win-i386/include/xercesc/sax/InputSource.hpp
-- Installing: /work/build/external/win-i386/include/xercesc/sax/Locator.hpp
-- Installing: /work/build/external/win-i386/include/xercesc/sax/Parser.hpp
-- Installing: /work/build/external/win-i386/include/xercesc/sax/SAXException.hpp
-- Installing: /work/build/external/win-i386/include/xercesc/sax/SAXParseException.hpp
-- Installing: /work/build/external/win-i386/include/xercesc/sax2/Attributes.hpp
-- Installing: /work/build/external/win-i386/include/xercesc/sax2/ContentHandler.hpp
-- Installing: /work/build/external/win-i386/include/xercesc/sax2/DeclHandler.hpp
-- Installing: /work/build/external/win-i386/include/xercesc/sax2/DefaultHandler.hpp
-- Installing: /work/build/external/win-i386/include/xercesc/sax2/LexicalHandler.hpp
-- Installing: /work/build/external/win-i386/include/xercesc/sax2/SAX2XMLFilter.hpp
-- Installing: /work/build/external/win-i386/include/xercesc/sax2/SAX2XMLReader.hpp
-- Installing: /work/build/external/win-i386/include/xercesc/sax2/XMLReaderFactory.hpp
-- Installing: /work/build/external/win-i386/include/xercesc/validators/common/AllContentModel.hpp
-- Installing: /work/build/external/win-i386/include/xercesc/validators/common/CMAny.hpp
-- Installing: /work/build/external/win-i386/include/xercesc/validators/common/CMBinaryOp.hpp
-- Installing: /work/build/external/win-i386/include/xercesc/validators/common/CMLeaf.hpp
-- Installing: /work/build/external/win-i386/include/xercesc/validators/common/CMRepeatingLeaf.hpp
-- Installing: /work/build/external/win-i386/include/xercesc/validators/common/CMNode.hpp
-- Installing: /work/build/external/win-i386/include/xercesc/validators/common/CMStateSet.hpp
-- Installing: /work/build/external/win-i386/include/xercesc/validators/common/CMUnaryOp.hpp
-- Installing: /work/build/external/win-i386/include/xercesc/validators/common/ContentLeafNameTypeVector.hpp
-- Installing: /work/build/external/win-i386/include/xercesc/validators/common/ContentSpecNode.hpp
-- Installing: /work/build/external/win-i386/include/xercesc/validators/common/DFAContentModel.hpp
-- Installing: /work/build/external/win-i386/include/xercesc/validators/common/Grammar.hpp
-- Installing: /work/build/external/win-i386/include/xercesc/validators/common/GrammarResolver.hpp
-- Installing: /work/build/external/win-i386/include/xercesc/validators/common/MixedContentModel.hpp
-- Installing: /work/build/external/win-i386/include/xercesc/validators/common/SimpleContentModel.hpp
-- Installing: /work/build/external/win-i386/include/xercesc/validators/datatype/AbstractNumericFacetValidator.hpp
-- Installing: /work/build/external/win-i386/include/xercesc/validators/datatype/AbstractNumericValidator.hpp
-- Installing: /work/build/external/win-i386/include/xercesc/validators/datatype/AbstractStringValidator.hpp
-- Installing: /work/build/external/win-i386/include/xercesc/validators/datatype/AnySimpleTypeDatatypeValidator.hpp
-- Installing: /work/build/external/win-i386/include/xercesc/validators/datatype/AnyURIDatatypeValidator.hpp
-- Installing: /work/build/external/win-i386/include/xercesc/validators/datatype/Base64BinaryDatatypeValidator.hpp
-- Installing: /work/build/external/win-i386/include/xercesc/validators/datatype/BooleanDatatypeValidator.hpp
-- Installing: /work/build/external/win-i386/include/xercesc/validators/datatype/DatatypeValidator.hpp
-- Installing: /work/build/external/win-i386/include/xercesc/validators/datatype/DatatypeValidatorFactory.hpp
-- Installing: /work/build/external/win-i386/include/xercesc/validators/datatype/DateDatatypeValidator.hpp
-- Installing: /work/build/external/win-i386/include/xercesc/validators/datatype/DateTimeDatatypeValidator.hpp
-- Installing: /work/build/external/win-i386/include/xercesc/validators/datatype/DateTimeValidator.hpp
-- Installing: /work/build/external/win-i386/include/xercesc/validators/datatype/DayDatatypeValidator.hpp
-- Installing: /work/build/external/win-i386/include/xercesc/validators/datatype/DecimalDatatypeValidator.hpp
-- Installing: /work/build/external/win-i386/include/xercesc/validators/datatype/DoubleDatatypeValidator.hpp
-- Installing: /work/build/external/win-i386/include/xercesc/validators/datatype/DurationDatatypeValidator.hpp
-- Installing: /work/build/external/win-i386/include/xercesc/validators/datatype/ENTITYDatatypeValidator.hpp
-- Installing: /work/build/external/win-i386/include/xercesc/validators/datatype/FloatDatatypeValidator.hpp
-- Installing: /work/build/external/win-i386/include/xercesc/validators/datatype/HexBinaryDatatypeValidator.hpp
-- Installing: /work/build/external/win-i386/include/xercesc/validators/datatype/IDDatatypeValidator.hpp
-- Installing: /work/build/external/win-i386/include/xercesc/validators/datatype/IDREFDatatypeValidator.hpp
-- Installing: /work/build/external/win-i386/include/xercesc/validators/datatype/InvalidDatatypeFacetException.hpp
-- Installing: /work/build/external/win-i386/include/xercesc/validators/datatype/InvalidDatatypeValueException.hpp
-- Installing: /work/build/external/win-i386/include/xercesc/validators/datatype/ListDatatypeValidator.hpp
-- Installing: /work/build/external/win-i386/include/xercesc/validators/datatype/MonthDatatypeValidator.hpp
-- Installing: /work/build/external/win-i386/include/xercesc/validators/datatype/MonthDayDatatypeValidator.hpp
-- Installing: /work/build/external/win-i386/include/xercesc/validators/datatype/NameDatatypeValidator.hpp
-- Installing: /work/build/external/win-i386/include/xercesc/validators/datatype/NCNameDatatypeValidator.hpp
-- Installing: /work/build/external/win-i386/include/xercesc/validators/datatype/NOTATIONDatatypeValidator.hpp
-- Installing: /work/build/external/win-i386/include/xercesc/validators/datatype/QNameDatatypeValidator.hpp
-- Installing: /work/build/external/win-i386/include/xercesc/validators/datatype/StringDatatypeValidator.hpp
-- Installing: /work/build/external/win-i386/include/xercesc/validators/datatype/TimeDatatypeValidator.hpp
-- Installing: /work/build/external/win-i386/include/xercesc/validators/datatype/UnionDatatypeValidator.hpp
-- Installing: /work/build/external/win-i386/include/xercesc/validators/datatype/XMLCanRepGroup.hpp
-- Installing: /work/build/external/win-i386/include/xercesc/validators/datatype/YearDatatypeValidator.hpp
-- Installing: /work/build/external/win-i386/include/xercesc/validators/datatype/YearMonthDatatypeValidator.hpp
-- Installing: /work/build/external/win-i386/include/xercesc/validators/DTD/DocTypeHandler.hpp
-- Installing: /work/build/external/win-i386/include/xercesc/validators/DTD/DTDAttDef.hpp
-- Installing: /work/build/external/win-i386/include/xercesc/validators/DTD/DTDAttDefList.hpp
-- Installing: /work/build/external/win-i386/include/xercesc/validators/DTD/DTDElementDecl.hpp
-- Installing: /work/build/external/win-i386/include/xercesc/validators/DTD/DTDEntityDecl.hpp
-- Installing: /work/build/external/win-i386/include/xercesc/validators/DTD/DTDGrammar.hpp
-- Installing: /work/build/external/win-i386/include/xercesc/validators/DTD/DTDScanner.hpp
-- Installing: /work/build/external/win-i386/include/xercesc/validators/DTD/DTDValidator.hpp
-- Installing: /work/build/external/win-i386/include/xercesc/validators/DTD/XMLDTDDescriptionImpl.hpp
-- Installing: /work/build/external/win-i386/include/xercesc/validators/schema/ComplexTypeInfo.hpp
-- Installing: /work/build/external/win-i386/include/xercesc/validators/schema/GeneralAttributeCheck.hpp
-- Installing: /work/build/external/win-i386/include/xercesc/validators/schema/identity/FieldActivator.hpp
-- Installing: /work/build/external/win-i386/include/xercesc/validators/schema/identity/FieldValueMap.hpp
-- Installing: /work/build/external/win-i386/include/xercesc/validators/schema/identity/IC_Field.hpp
-- Installing: /work/build/external/win-i386/include/xercesc/validators/schema/identity/IC_Key.hpp
-- Installing: /work/build/external/win-i386/include/xercesc/validators/schema/identity/IC_KeyRef.hpp
-- Installing: /work/build/external/win-i386/include/xercesc/validators/schema/identity/IC_Selector.hpp
-- Installing: /work/build/external/win-i386/include/xercesc/validators/schema/identity/IC_Unique.hpp
-- Installing: /work/build/external/win-i386/include/xercesc/validators/schema/identity/IdentityConstraint.hpp
-- Installing: /work/build/external/win-i386/include/xercesc/validators/schema/identity/IdentityConstraintHandler.hpp
-- Installing: /work/build/external/win-i386/include/xercesc/validators/schema/identity/ValueStore.hpp
-- Installing: /work/build/external/win-i386/include/xercesc/validators/schema/identity/ValueStoreCache.hpp
-- Installing: /work/build/external/win-i386/include/xercesc/validators/schema/identity/XercesXPath.hpp
-- Installing: /work/build/external/win-i386/include/xercesc/validators/schema/identity/XPathException.hpp
-- Installing: /work/build/external/win-i386/include/xercesc/validators/schema/identity/XPathMatcher.hpp
-- Installing: /work/build/external/win-i386/include/xercesc/validators/schema/identity/XPathMatcherStack.hpp
-- Installing: /work/build/external/win-i386/include/xercesc/validators/schema/identity/XPathSymbols.hpp
-- Installing: /work/build/external/win-i386/include/xercesc/validators/schema/NamespaceScope.hpp
-- Installing: /work/build/external/win-i386/include/xercesc/validators/schema/PSVIDefs.hpp
-- Installing: /work/build/external/win-i386/include/xercesc/validators/schema/SchemaAttDef.hpp
-- Installing: /work/build/external/win-i386/include/xercesc/validators/schema/SchemaAttDefList.hpp
-- Installing: /work/build/external/win-i386/include/xercesc/validators/schema/SchemaElementDecl.hpp
-- Installing: /work/build/external/win-i386/include/xercesc/validators/schema/SchemaGrammar.hpp
-- Installing: /work/build/external/win-i386/include/xercesc/validators/schema/SchemaInfo.hpp
-- Installing: /work/build/external/win-i386/include/xercesc/validators/schema/SchemaSymbols.hpp
-- Installing: /work/build/external/win-i386/include/xercesc/validators/schema/SchemaValidator.hpp
-- Installing: /work/build/external/win-i386/include/xercesc/validators/schema/SubstitutionGroupComparator.hpp
-- Installing: /work/build/external/win-i386/include/xercesc/validators/schema/TraverseSchema.hpp
-- Installing: /work/build/external/win-i386/include/xercesc/validators/schema/XercesAttGroupInfo.hpp
-- Installing: /work/build/external/win-i386/include/xercesc/validators/schema/XercesElementWildcard.hpp
-- Installing: /work/build/external/win-i386/include/xercesc/validators/schema/XercesGroupInfo.hpp
-- Installing: /work/build/external/win-i386/include/xercesc/validators/schema/XMLSchemaDescriptionImpl.hpp
-- Installing: /work/build/external/win-i386/include/xercesc/validators/schema/XSDDOMParser.hpp
-- Installing: /work/build/external/win-i386/include/xercesc/validators/schema/XSDErrorReporter.hpp
-- Installing: /work/build/external/win-i386/include/xercesc/validators/schema/XSDLocator.hpp
-- Installing: /work/build/external/win-i386/include/xercesc/validators/schema/XUtil.hpp
-- Installing: /work/build/external/win-i386/include/xercesc/xinclude/XIncludeDOMDocumentProcessor.hpp
-- Installing: /work/build/external/win-i386/include/xercesc/xinclude/XIncludeLocation.hpp
-- Installing: /work/build/external/win-i386/include/xercesc/xinclude/XIncludeUtils.hpp
-- Installing: /work/build/external/win-i386/include/xercesc/util/Transcoders/Win32/Win32TransService.hpp
-- Installing: /work/build/external/win-i386/include/xercesc/util/MsgLoaders/InMemory/InMemMsgLoader.hpp
-- Installing: /work/build/external/win-i386/include/xercesc/util/MsgLoaders/InMemory/XercesMessages_en_US.hpp
-- Installing: /work/build/external/win-i386/include/xercesc/util/MutexManagers/NoThreadMutexMgr.hpp
-- Installing: /work/build/external/win-i386/include/xercesc/util/FileManagers/WindowsFileMgr.hpp
-- Installing: /work/build/external/win-i386/include/xercesc/util/Xerces_autoconf_config.hpp
-- Installing: /work/build/external/win-i386/include/xercesc/util/XercesVersion.hpp
-- Installing: /work/build/external/win-i386/bin/CreateDOMDocument.exe
-- Installing: /work/build/external/win-i386/bin/DOMCount.exe
-- Installing: /work/build/external/win-i386/bin/DOMPrint.exe
-- Installing: /work/build/external/win-i386/bin/EnumVal.exe
-- Installing: /work/build/external/win-i386/bin/MemParse.exe
-- Installing: /work/build/external/win-i386/bin/PParse.exe
-- Installing: /work/build/external/win-i386/bin/PSVIWriter.exe
-- Installing: /work/build/external/win-i386/bin/Redirect.exe
[ 39%] Building CXX object rabbitmq-fmu/CMakeFiles/rabbitmq.dir/src/rabbitmq/RabbitmqHandler.cpp.o
cd /work/build/linux-x86/rabbitmq-fmu && /usr/i686-linux-gnu/bin/i686-linux-gnu-g++  -DAMQP_STATIC -DFMI_COSIMULATION -Drabbitmq_EXPORTS -I/work/rabbitmq-fmu/../thirdparty/fmi/include -I/work/thirdparty/rapidjson/include -I/work/thirdparty/googletest/googletest/include -I/work/rabbitmq-fmu/src -I/work/thirdparty/rabbitmq-c/rabbitmq-c/librabbitmq -I/work/thirdparty/date/date -I/work/thirdparty/date/date/include -I/work/rabbitmq-core/src -isystem /work/build/external/linux-i386/include  -O2 -g -DNDEBUG -fPIC   -std=gnu++1z -o CMakeFiles/rabbitmq.dir/src/rabbitmq/RabbitmqHandler.cpp.o -c /work/rabbitmq-fmu/src/rabbitmq/RabbitmqHandler.cpp
-- Installing: /work/build/external/win-i386/bin/SAX2Count.exe
-- Installing: /work/build/external/win-i386/bin/SAX2Print.exe
-- Installing: /work/build/external/win-i386/bin/SAXCount.exe
-- Installing: /work/build/external/win-i386/bin/SAXPrint.exe
-- Installing: /work/build/external/win-i386/bin/SCMPrint.exe
-- Installing: /work/build/external/win-i386/bin/SEnumVal.exe
-- Installing: /work/build/external/win-i386/bin/StdInParse.exe
-- Installing: /work/build/external/win-i386/bin/XInclude.exe
make: Leaving directory '/work/build/win-x86/xerces-c'
make: Entering directory '/work/build/win-x64/xerces-c'
make[1]: Entering directory '/work/build/win-x64/xerces-c'
make[2]: Entering directory '/work/build/win-x64/xerces-c'
make[2]: Leaving directory '/work/build/win-x64/xerces-c'
[ 80%] Built target xerces-c
make[2]: Entering directory '/work/build/win-x64/xerces-c'
make[2]: Leaving directory '/work/build/win-x64/xerces-c'
[ 80%] Built target Char16Test
make[2]: Entering directory '/work/build/win-x64/xerces-c'
make[2]: Leaving directory '/work/build/win-x64/xerces-c'
[ 81%] Built target XSTSHarness
make[2]: Entering directory '/work/build/win-x64/xerces-c'
make[2]: Leaving directory '/work/build/win-x64/xerces-c'
[ 82%] Built target XSerializerTest
make[2]: Entering directory '/work/build/win-x64/xerces-c'
make[2]: Leaving directory '/work/build/win-x64/xerces-c'
[ 83%] Built target Normalizer
make[2]: Entering directory '/work/build/win-x64/xerces-c'
make[2]: Leaving directory '/work/build/win-x64/xerces-c'
[ 84%] Built target DOMMemTest
make[2]: Entering directory '/work/build/win-x64/xerces-c'
make[2]: Leaving directory '/work/build/win-x64/xerces-c'
[ 85%] Built target DOMTypeInfoTest
make[2]: Entering directory '/work/build/win-x64/xerces-c'
make[2]: Leaving directory '/work/build/win-x64/xerces-c'
[ 85%] Built target EncodingTest
make[2]: Entering directory '/work/build/win-x64/xerces-c'
make[2]: Leaving directory '/work/build/win-x64/xerces-c'
[ 85%] Built target DOMTraversalTest
make[2]: Entering directory '/work/build/win-x64/xerces-c'
make[2]: Leaving directory '/work/build/win-x64/xerces-c'
[ 86%] Built target RangeTest
make[2]: Entering directory '/work/build/win-x64/xerces-c'
make[2]: Leaving directory '/work/build/win-x64/xerces-c'
[ 86%] Built target InitTermTest
make[2]: Entering directory '/work/build/win-x64/xerces-c'
make[2]: Leaving directory '/work/build/win-x64/xerces-c'
[ 87%] Built target XSValueTest
make[2]: Entering directory '/work/build/win-x64/xerces-c'
make[2]: Leaving directory '/work/build/win-x64/xerces-c'
[ 88%] Built target MemHandlerTest
make[2]: Entering directory '/work/build/win-x64/xerces-c'
make[2]: Leaving directory '/work/build/win-x64/xerces-c'
[ 89%] Built target DOMTest
make[2]: Entering directory '/work/build/win-x64/xerces-c'
make[2]: Leaving directory '/work/build/win-x64/xerces-c'
[ 89%] Built target NetAccessorTest
make[2]: Entering directory '/work/build/win-x64/xerces-c'
make[2]: Leaving directory '/work/build/win-x64/xerces-c'
[ 90%] Built target SAXCount
make[2]: Entering directory '/work/build/win-x64/xerces-c'
make[2]: Leaving directory '/work/build/win-x64/xerces-c'
[ 91%] Built target Redirect
make[2]: Entering directory '/work/build/win-x64/xerces-c'
make[2]: Leaving directory '/work/build/win-x64/xerces-c'
[ 92%] Built target PSVIWriter
make[2]: Entering directory '/work/build/win-x64/xerces-c'
make[2]: Leaving directory '/work/build/win-x64/xerces-c'
[ 93%] Built target MemParse
make[2]: Entering directory '/work/build/win-x64/xerces-c'
make[2]: Leaving directory '/work/build/win-x64/xerces-c'
[ 94%] Built target DOMPrint
make[2]: Entering directory '/work/build/win-x64/xerces-c'
make[2]: Leaving directory '/work/build/win-x64/xerces-c'
[ 94%] Built target PParse
make[2]: Entering directory '/work/build/win-x64/xerces-c'
make[2]: Leaving directory '/work/build/wmake: Entering directory '/work/build/win-x64/xerces-c'
make[1]: Entering directory '/work/build/win-x64/xerces-c'
make[2]: Entering directory '/work/build/win-x64/xerces-c'
make[2]: Leaving directory '/work/build/win-x64/xerces-c'
[ 80%] Built target xerces-c
make[2]: Entering directory '/work/build/win-x64/xerces-c'
make[2]: Leaving directory '/work/build/win-x64/xerces-c'
[ 80%] Built target Char16Test
make[2]: Entering directory '/work/build/win-x64/xerces-c'
make[2]: Leaving directory '/work/build/win-x64/xerces-c'
[ 81%] Built target XSTSHarness
make[2]: Entering directory '/work/build/win-x64/xerces-c'
make[2]: Leaving directory '/work/build/win-x64/xerces-c'
[ 82%] Built target XSerializerTest
make[2]: Entering directory '/work/build/win-x64/xerces-c'
make[2]: Leaving directory '/work/build/win-x64/xerces-c'
[ 83%] Built target Normalizer
make[2]: Entering directory '/work/build/win-x64/xerces-c'
make[2]: Leaving directory '/work/build/win-x64/xerces-c'
[ 84%] Built target DOMMemTest
make[2]: Entering directory '/work/build/win-x64/xerces-c'
make[2]: Leaving directory '/work/build/win-x64/xerces-c'
[ 85%] Built target DOMTypeInfoTest
make[2]: Entering directory '/work/build/win-x64/xerces-c'
make[2]: Leaving directory '/work/build/win-x64/xerces-c'
[ 85%] Built target EncodingTest
make[2]: Entering directory '/work/build/win-x64/xerces-c'
make[2]: Leaving directory '/work/build/win-x64/xerces-c'
[ 85%] Built target DOMTraversalTest
make[2]: Entering directory '/work/build/win-x64/xerces-c'
make[2]: Leaving directory '/work/build/win-x64/xerces-c'
[ 86%] Built target RangeTest
make[2]: Entering directory '/work/build/win-x64/xerces-c'
make[2]: Leaving directory '/work/build/win-x64/xerces-c'
[ 86%] Built target InitTermTest
make[2]: Entering directory '/work/build/win-x64/xerces-c'
make[2]: Leaving directory '/work/build/win-x64/xerces-c'
[ 87%] Built target XSValueTest
make[2]: Entering directory '/work/build/win-x64/xerces-c'
make[2]: Leaving directory '/work/build/win-x64/xerces-c'
[ 88%] Built target MemHandlerTest
make[2]: Entering directory '/work/build/win-x64/xerces-c'
make[2]: Leaving directory '/work/build/win-x64/xerces-c'
[ 89%] Built target DOMTest
make[2]: Entering directory '/work/build/win-x64/xerces-c'
make[2]: Leaving directory '/work/build/win-x64/xerces-c'
[ 89%] Built target NetAccessorTest
make[2]: Entering directory '/work/build/win-x64/xerces-c'
make[2]: Leaving directory '/work/build/win-x64/xerces-c'
[ 90%] Built target SAXCount
make[2]: Entering directory '/work/build/win-x64/xerces-c'
make[2]: Leaving directory '/work/build/win-x64/xerces-c'
[ 91%] Built target Redirect
make[2]: Entering directory '/work/build/win-x64/xerces-c'
make[2]: Leaving directory '/work/build/win-x64/xerces-c'
[ 92%] Built target PSVIWriter
make[2]: Entering directory '/work/build/win-x64/xerces-c'
make[2]: Leaving directory '/work/build/win-x64/xerces-c'
[ 93%] Built target MemParse
make[2]: Entering directory '/work/build/win-x64/xerces-c'
make[2]: Leaving directory '/work/build/win-x64/xerces-c'
[ 94%] Built target DOMPrint
make[2]: Entering directory '/work/build/win-x64/xerces-c'
make[2]: Leaving directory '/work/build/win-x64/xerces-c'
[ 94%] Built target PParse
make[2]: Entering directory '/work/build/win-x64/xerces-c'
make[2]: Leaving directory '/work/build/win-x64/xerces-c'
[ 94%] Built target SAX2Count
make[2]: Entering directory '/work/build/win-x64/xerces-c'
make[2]: Leaving directory '/work/build/win-x64/xerces-c'
[ 95%] Built target EnumVal
make[2]: Entering directory '/work/build/win-x64/xerces-c'
make[2]: Leaving directory '/work/build/win-x64/xerces-c'
[ 95%] Built target SEnumVal
make[2]: Entering directory '/work/build/win-x64/xerces-c'
make[2]: Leaving directory '/work/build/win-x64/xerces-c'
[ 96%] Built target SAXPrint
make[2]: Entering directory '/work/build/win-x64/xerces-c'
make[2]: Leaving directory '/work/build/win-x64/xerces-c'
[ 97%] Built target SAX2Print
make[2]: Entering directory '/work/build/win-x64/xerces-c'
make[2]: Leaving directory '/work/build/win-x64/xerces-c'
[ 97%] Built target DOMCount
make[2]: Entering directory '/work/build/win-x64/xerces-c'
make[2]: Leaving directory '/work/build/win-x64/xerces-c'
[ 98%] Built target StdInParse
make[2]: Entering directory '/work/build/win-x64/xerces-c'
make[2]: Leaving directory '/work/build/win-x64/xerces-c'
[ 98%] Built target XInclude
make[2]: Entering directory '/work/build/win-x64/xerces-c'
make[2]: Leaving directory '/work/build/win-x64/xerces-c'
[ 99%] Built target CreateDOMDocument
make[2]: Entering directory '/work/build/win-x64/xerces-c'
make[2]: Leaving directory '/work/build/win-x64/xerces-c'
[100%] Built target SCMPrint
make[1]: Leaving directory '/work/build/win-x64/xerces-c'
Install the project...
-- Install configuration: "Release"
-- Installing: /work/build/external/win-x86_64/lib/pkgconfig/xerces-c.pc
-- Installing: /work/build/external/win-x86_64/share/doc/xerces-c/html
-- Installing: /work/build/external/win-x86_64/share/doc/xerces-c/html/ApacheDOMC++Binding.html
-- Installing: /work/build/external/win-x86_64/share/doc/xerces-c/html/secadv
-- Installing: /work/build/external/win-x86_64/share/doc/xerces-c/html/secadv/CVE-2015-0252.txt
-- Installing: /work/build/external/win-x86_64/share/doc/xerces-c/html/secadv/CVE-2016-4463.txt
-- Installing: /work/build/external/win-x86_64/share/doc/xerces-c/html/secadv/CVE-2016-0729.txt
-- Installing: /work/build/external/win-x86_64/share/doc/xerces-c/html/secadv/CVE-2017-12627.txt
-- Up-to-date: /work/build/external/win-x86_64/share/doc/xerces-c/html
-- Installing: /work/build/external/win-x86_64/lib/libxerces-c.a
-- Installing: /work/build/external/win-x86_64/cmake/XercesCConfigInternal.cmake
-- Installing: /work/build/external/win-x86_64/cmake/XercesCConfigInternal-release.cmake
-- Installing: /work/build/external/win-x86_64/cmake/XercesCConfig.cmake
-- Installing: /work/build/external/win-x86_64/cmake/XercesCConfigVersion.cmake
-- Installing: /work/build/external/win-x86_64/include/xercesc/util/ArrayIndexOutOfBoundsException.hpp
-- Installing: /work/build/external/win-x86_64/include/xercesc/util/Base64.hpp
-- Installing: /work/build/external/win-x86_64/include/xercesc/util/BaseRefVectorOf.hpp
-- Installing: /work/build/external/win-x86_64/include/xercesc/util/BaseRefVectorOf.c
-- Installing: /work/build/external/win-x86_64/include/xercesc/util/BinFileInputStream.hpp
-- Installing: /work/build/external/win-x86_64/include/xercesc/util/BinInputStream.hpp
-- Installing: /work/build/external/win-x86_64/include/xercesc/util/BinMemInputStream.hpp
-- Installing: /work/build/external/win-x86_64/include/xercesc/util/BitOps.hpp
-- Installing: /work/build/external/win-x86_64/include/xercesc/util/BitSet.hpp
-- Installing: /work/build/external/win-x86_64/include/xercesc/util/CountedPointer.hpp
-- Installing: /work/build/external/win-x86_64/include/xercesc/util/CountedPointer.c
-- Installing: /work/build/external/win-x86_64/include/xercesc/util/DefaultPanicHandler.hpp
-- Installing: /work/build/external/win-x86_64/include/xercesc/util/EmptyStackException.hpp
-- Installing: /work/build/external/win-x86_64/include/xercesc/util/EncodingValidator.hpp
-- Installing: /work/build/external/win-x86_64/include/xercesc/util/FlagJanitor.hpp
-- Installing: /work/build/external/win-x86_64/include/xercesc/util/FlagJanitor.c
-- Installing: /work/build/external/win-x86_64/include/xercesc/util/Hashers.hpp
-- Installing: /work/build/external/win-x86_64/include/xercesc/util/Hash2KeysSetOf.hpp
-- Installing: /work/build/external/win-x86_64/include/xercesc/util/Hash2KeysSetOf.c
-- Installing: /work/build/external/win-x86_64/include/xercesc/util/HexBin.hpp
-- Installing: /work/build/external/win-x86_64/include/xercesc/util/IllegalArgumentException.hpp
-- Installing: /work/build/external/win-x86_64/include/xercesc/util/InvalidCastException.hpp
-- Installing: /work/build/external/win-x86_64/include/xercesc/util/IOException.hpp
-- Installing: /work/build/external/win-x86_64/include/xercesc/util/Janitor.hpp
-- Installing: /work/build/external/win-x86_64/include/xercesc/util/Janitor.c
-- Installing: /work/build/external/win-x86_64/include/xercesc/util/KeyRefPair.hpp
-- Installing: /work/build/external/win-x86_64/include/xercesc/util/KeyRefPair.c
-- Installing: /work/build/external/win-x86_64/include/xercesc/util/KeyValuePair.hpp
-- Installing: /work/build/external/win-x86_64/include/xercesc/util/KeyValuePair.c
-- Installing: /work/build/external/win-x86_64/include/xercesc/util/KVStringPair.hpp
-- Installing: /work/build/external/win-x86_64/include/xercesc/util/Mutexes.hpp
-- Installing: /work/build/external/win-x86_64/include/xercesc/util/LogicalPath.c
-- Installing: /work/build/external/win-x86_64/include/xercesc/util/NameIdPool.hpp
-- Installing: /work/build/external/win-x86_64/include/xercesc/util/NameIdPool.c
-- Installing: /work/build/external/win-x86_64/include/xercesc/util/NoSuchElementException.hpp
-- Installing: /work/build/external/win-x86_64/include/xercesc/util/NullPointerException.hpp
-- Installing: /work/build/external/win-x86_64/include/xercesc/util/NumberFormatException.hpp
-- Installing: /work/build/external/win-x86_64/include/xercesc/util/OutOfMemoryException.hpp
-- Installing: /work/build/external/win-x86_64/include/xercesc/util/PanicHandler.hpp
-- Installing: /work/build/external/win-x86_64/include/xercesc/util/ParseException.hpp
-- Installing: /work/build/external/win-x86_64/include/xercesc/util/PlatformUtils.hpp
-- Installing: /work/build/external/win-x86_64/include/xercesc/util/PSVIUni.hpp
-- Installing: /work/build/external/win-x86_64/include/xercesc/util/QName.hpp
-- Installing: /work/build/external/win-x86_64/include/xercesc/util/RefArrayOf.hpp
-- Installing: /work/build/external/win-x86_64/include/xercesc/util/RefArrayOf.c
-- Installing: /work/build/external/win-x86_64/include/xercesc/util/RefArrayVectorOf.hpp
-- Installing: /work/build/external/win-x86_64/include/xercesc/util/RefArrayVectorOf.c
-- Installing: /work/build/external/win-x86_64/include/xercesc/util/RefHash2KeysTableOf.hpp
-- Installing: /work/build/external/win-x86_64/include/xercesc/util/RefHash2KeysTableOf.c
-- Installing: /work/build/external/win-x86_64/include/xercesc/util/RefHash3KeysIdPool.hpp
-- Installing: /work/build/external/win-x86_64/include/xercesc/util/RefHash3KeysIdPool.c
-- Installing: /work/build/external/win-x86_64/include/xercesc/util/RefHashTableOf.hpp
-- Installing: /work/build/external/win-x86_64/include/xercesc/util/RefHashTableOf.c
-- Installing: /work/build/external/win-x86_64/include/xercesc/util/RefStackOf.hpp
-- Installing: /work/build/external/win-x86_64/include/xercesc/util/RefStackOf.c
-- Installing: /work/build/external/win-x86_64/include/xercesc/util/RefVectorOf.hpp
-- Installing: /work/build/external/win-x86_64/include/xercesc/util/RefVectorOf.c
-- Installing: /work/build/external/win-x86_64/include/xercesc/util/regx/ASCIIRangeFactory.hpp
-- Installing: /work/build/external/win-x86_64/include/xercesc/util/regx/BlockRangeFactory.hpp
-- Installing: /work/build/external/win-x86_64/include/xercesc/util/regx/BMPattern.hpp
-- Installing: /work/build/external/win-x86_64/include/xercesc/util/regx/CharToken.hpp
-- Installing: /work/build/external/win-x86_64/include/xercesc/util/regx/ClosureToken.hpp
-- Installing: /work/build/external/win-x86_64/include/xercesc/util/regx/ConcatToken.hpp
-- Installing: /work/build/external/win-x86_64/include/xercesc/util/regx/Match.hpp
-- Installing: /work/build/external/win-x86_64/include/xercesc/util/regx/Op.hpp
-- Installing: /work/build/external/win-x86_64/include/xercesc/util/regx/OpFactory.hpp
-- Installing: /work/build/external/win-x86_64/include/xercesc/util/regx/ParenToken.hpp
-- Installing: /work/build/external/win-x86_64/include/xercesc/util/regx/ParserForXMLSchema.hpp
-- Installing: /work/build/external/win-x86_64/include/xercesc/util/regx/RangeFactory.hpp
-- Installing: /work/build/external/win-x86_64/include/xercesc/util/regx/RangeToken.hpp
-- Installing: /work/build/external/win-x86_64/include/xercesc/util/regx/RangeTokenMap.hpp
-- Installing: /work/build/external/win-x86_64/include/xercesc/util/regx/RegularExpression.hpp
-- Installing: /work/build/external/win-x86_64/include/xercesc/util/regx/RegxDefs.hpp
-- Installing: /work/build/external/win-x86_64/include/xercesc/util/regx/RegxParser.hpp
-- Installing: /work/build/external/win-x86_64/include/xercesc/util/regx/RegxUtil.hpp
-- Installing: /work/build/external/win-x86_64/include/xercesc/util/regx/StringToken.hpp
-- Installing: /work/build/external/win-x86_64/include/xercesc/util/regx/Token.hpp
-- Installing: /work/build/external/win-x86_64/include/xercesc/util/regx/TokenFactory.hpp
-- Installing: /work/build/external/win-x86_64/include/xercesc/util/regx/TokenInc.hpp
-- Installing: /work/build/external/win-x86_64/include/xercesc/util/regx/UniCharTable.hpp
-- Installing: /work/build/external/win-x86_64/include/xercesc/util/regx/UnicodeRangeFactory.hpp
-- Installing: /work/build/external/win-x86_64/include/xercesc/util/regx/UnionToken.hpp
-- Installing: /work/build/external/win-x86_64/include/xercesc/util/regx/XMLRangeFactory.hpp
-- Installing: /work/build/external/win-x86_64/include/xercesc/util/regx/XMLUniCharacter.hpp
-- Installing: /work/build/external/win-x86_64/include/xercesc/util/RuntimeException.hpp
-- Installing: /work/build/external/win-x86_64/include/xercesc/util/SchemaDateTimeException.hpp
-- Installing: /work/build/external/win-x86_64/include/xercesc/util/SecurityManager.hpp
-- Installing: /work/build/external/win-x86_64/include/xercesc/util/StringPool.hpp
-- Installing: /work/build/external/win-x86_64/include/xercesc/util/SynchronizedStringPool.hpp
-- Installing: /work/build/external/win-x86_64/include/xercesc/util/TranscodingException.hpp
-- Installing: /work/build/external/win-x86_64/include/xercesc/util/TransENameMap.hpp
-- Installing: /work/build/external/win-x86_64/include/xercesc/util/TransENameMap.c
-- Installing: /work/build/external/win-x86_64/include/xercesc/util/TransService.hpp
-- Installing: /work/build/external/win-x86_64/include/xercesc/util/UnexpectedEOFException.hpp
-- Installing: /work/build/external/win-x86_64/include/xercesc/util/UnsupportedEncodingException.hpp
-- Installing: /work/build/external/win-x86_64/include/xercesc/util/UTFDataFormatException.hpp
-- Installing: /work/build/external/win-x86_64/include/xercesc/util/ValueArrayOf.hpp
-- Installing: /work/build/external/win-x86_64/include/xercesc/util/ValueArrayOf.c
-- Installing: /work/build/external/win-x86_64/include/xercesc/util/ValueHashTableOf.hpp
-- Installing: /work/build/external/win-x86_64/include/xercesc/util/ValueHashTableOf.c
-- Installing: /work/build/external/win-x86_64/include/xercesc/util/ValueStackOf.hpp
-- Installing: /work/build/external/win-x86_64/include/xercesc/util/ValueStackOf.c
-- Installing: /work/build/external/win-x86_64/include/xercesc/util/ValueVectorOf.hpp
-- Installing: /work/build/external/win-x86_64/include/xercesc/util/ValueVectorOf.c
-- Installing: /work/build/external/win-x86_64/include/xercesc/util/XercesDefs.hpp
-- Installing: /work/build/external/win-x86_64/include/xercesc/util/XMemory.hpp
-- Installing: /work/build/external/win-x86_64/include/xercesc/util/XML256TableTranscoder.hpp
-- Installing: /work/build/external/win-x86_64/include/xercesc/util/XML88591Transcoder.hpp
-- Installing: /work/build/external/win-x86_64/include/xercesc/util/XMLAbstractDoubleFloat.hpp
-- Installing: /work/build/external/win-x86_64/include/xercesc/util/XMLASCIITranscoder.hpp
-- Installing: /work/build/external/win-x86_64/include/xercesc/util/XMLBigDecimal.hpp
-- Installing: /work/build/external/win-x86_64/include/xercesc/util/XMLBigInteger.hpp
-- Installing: /work/build/external/win-x86_64/include/xercesc/util/XMLChar.hpp
-- Installing: /work/build/external/win-x86_64/include/xercesc/util/XMLChTranscoder.hpp
-- Installing: /work/build/external/win-x86_64/include/xercesc/util/XMLDateTime.hpp
-- Installing: /work/build/external/win-x86_64/include/xercesc/util/XMLDOMMsg.hpp
-- Installing: /work/build/external/win-x86_64/include/xercesc/util/XMLDouble.hpp
-- Installing: /work/build/external/win-x86_64/include/xercesc/util/XMLEBCDICTranscoder.hpp
-- Installing: /work/build/external/win-x86_64/include/xercesc/util/XMLEntityResolver.hpp
-- Installing: /work/build/external/win-x86_64/include/xercesc/util/XMLEnumerator.hpp
-- Installing: /work/build/external/win-x86_64/include/xercesc/util/XMLException.hpp
-- Installing: /work/build/external/win-x86_64/include/xercesc/util/XMLExceptMsgs.hpp
-- Installing: /work/build/external/win-x86_64/include/xercesc/util/XMLFileMgr.hpp
-- Installing: /work/build/external/win-x86_64/include/xercesc/util/XMLFloat.hpp
-- Installing: /work/build/external/win-x86_64/include/xercesc/util/XMLIBM1047Transcoder.hpp
-- Installing: /work/build/external/win-x86_64/include/xercesc/util/XMLIBM1140Transcoder.hpp
-- Installing: /work/build/external/win-x86_64/include/xercesc/util/XMLInitializer.hpp
-- Installing: /work/build/external/win-x86_64/include/xercesc/util/XMLInteger.hpp
-- Installing: /work/build/external/win-x86_64/include/xercesc/util/XMLMutexMgr.hpp
-- Installing: /work/build/external/win-x86_64/include/xercesc/util/XMLMsgLoader.hpp
-- Installing: /work/build/external/win-x86_64/include/xercesc/util/XMLNetAccessor.hpp
-- Installing: /work/build/external/win-x86_64/include/xercesc/util/XMLNumber.hpp
-- Installing: /work/build/external/win-x86_64/include/xercesc/util/XMLResourceIdentifier.hpp
-- Installing: /work/build/external/win-x86_64/include/xercesc/util/XMLString.hpp
-- Installing: /work/build/external/win-x86_64/include/xercesc/util/XMLStringTokenizer.hpp
-- Installing: /work/build/external/win-x86_64/include/xercesc/util/XMLUCS4Transcoder.hpp
-- Installing: /work/build/external/win-x86_64/include/xercesc/util/XMLUni.hpp
-- Installing: /work/build/external/win-x86_64/include/xercesc/util/XMLUniDefs.hpp
-- Installing: /work/build/external/win-x86_64/include/xercesc/util/XMLUri.hpp
-- Installing: /work/build/external/win-x86_64/include/xercesc/util/XMLURL.hpp
-- Installing: /work/build/external/win-x86_64/include/xercesc/util/XMLUTF16Transcoder.hpp
-- Installing: /work/build/external/win-x86_64/include/xercesc/util/XMLUTF8Transcoder.hpp
-- Installing: /work/build/external/win-x86_64/include/xercesc/util/XMLWin1252Transcoder.hpp
-- Installing: /work/build/external/win-x86_64/include/xercesc/dom/DOM.hpp
-- Installing: /work/build/external/win-x86_64/include/xercesc/dom/DOMAttr.hpp
-- Installing: /work/build/external/win-x86_64/include/xercesc/dom/DOMCDATASection.hpp
-- Installing: /work/build/external/win-x86_64/include/xercesc/dom/DOMCharacterData.hpp
-- Installing: /work/build/external/win-x86_64/include/xercesc/dom/DOMComment.hpp
-- Installing: /work/build/external/win-x86_64/include/xercesc/dom/DOMConfiguration.hpp
-- Installing: /work/build/external/win-x86_64/include/xercesc/dom/DOMDocument.hpp
-- Installing: /work/build/external/win-x86_64/include/xercesc/dom/DOMDocumentFragment.hpp
-- Installing: /work/build/external/win-x86_64/include/xercesc/dom/DOMDocumentRange.hpp
-- Installing: /work/build/external/win-x86_64/include/xercesc/dom/DOMDocumentTraversal.hpp
-- Installing: /work/build/external/win-x86_64/include/xercesc/dom/DOMDocumentType.hpp
-- Installing: /work/build/external/win-x86_64/include/xercesc/dom/DOMElement.hpp
-- Installing: /work/build/external/win-x86_64/include/xercesc/dom/DOMEntity.hpp
-- Installing: /work/build/external/win-x86_64/include/xercesc/dom/DOMEntityReference.hpp
-- Installing: /work/build/external/win-x86_64/include/xercesc/dom/DOMError.hpp
-- Installing: /work/build/external/win-x86_64/include/xercesc/dom/DOMErrorHandler.hpp
-- Installing: /work/build/external/win-x86_64/include/xercesc/dom/DOMException.hpp
-- Installing: /work/build/external/win-x86_64/include/xercesc/dom/DOMImplementation.hpp
-- Installing: /work/build/external/win-x86_64/include/xercesc/dom/DOMImplementationList.hpp
-- Installing: /work/build/external/win-x86_64/include/xercesc/dom/DOMImplementationLS.hpp
-- Installing: /work/build/external/win-x86_64/include/xercesc/dom/DOMImplementationRegistry.hpp
-- Installing: /work/build/external/win-x86_64/include/xercesc/dom/DOMImplementationSource.hpp
-- Installing: /work/build/external/win-x86_64/include/xercesc/dom/DOMLocator.hpp
-- Installing: /work/build/external/win-x86_64/include/xercesc/dom/DOMLSException.hpp
-- Installing: /work/build/external/win-x86_64/include/xercesc/dom/DOMLSInput.hpp
-- Installing: /work/build/external/win-x86_64/include/xercesc/dom/DOMLSOutput.hpp
-- Installing: /work/build/external/win-x86_64/include/xercesc/dom/DOMLSParser.hpp
-- Installing: /work/build/external/win-x86_64/include/xercesc/dom/DOMLSParserFilter.hpp
-- Installing: /work/build/external/win-x86_64/include/xercesc/dom/DOMLSResourceResolver.hpp
-- Installing: /work/build/external/win-x86_64/include/xercesc/dom/DOMLSSerializer.hpp
-- Installing: /work/build/external/win-x86_64/include/xercesc/dom/DOMLSSerializerFilter.hpp
-- Installing: /work/build/external/win-x86_64/include/xercesc/dom/DOMMemoryManager.hpp
-- Installing: /work/build/external/win-x86_64/include/xercesc/dom/DOMNamedNodeMap.hpp
-- Installing: /work/build/external/win-x86_64/include/xercesc/dom/DOMNode.hpp
-- Installing: /work/build/external/win-x86_64/include/xercesc/dom/DOMNodeFilter.hpp
-- Installing: /work/build/external/win-x86_64/include/xercesc/dom/DOMNodeIterator.hpp
-- Installing: /work/build/external/win-x86_64/include/xercesc/dom/DOMNodeList.hpp
-- Installing: /work/build/external/win-x86_64/include/xercesc/dom/DOMNotation.hpp
-- Installing: /work/build/external/win-x86_64/include/xercesc/dom/DOMProcessingInstruction.hpp
-- Installing: /work/build/external/win-x86_64/include/xercesc/dom/DOMPSVITypeInfo.hpp
-- Installing: /work/build/external/win-x86_64/include/xercesc/dom/DOMRange.hpp
-- Installing: /work/build/external/win-x86_64/include/xercesc/dom/DOMRangeException.hpp
-- Installing: /work/build/external/win-x86_64/include/xercesc/dom/DOMStringList.hpp
-- Installing: /work/build/external/win-x86_64/include/xercesc/dom/DOMText.hpp
-- Installing: /work/build/external/win-x86_64/include/xercesc/dom/DOMTreeWalker.hpp
-- Installing: /work/build/external/win-x86_64/include/xercesc/dom/DOMTypeInfo.hpp
-- Installing: /work/build/external/win-x86_64/include/xercesc/dom/DOMUserDataHandler.hpp
-- Installing: /work/build/external/win-x86_64/include/xercesc/dom/DOMXPathEvaluator.hpp
-- Installing: /work/build/external/win-x86_64/include/xercesc/dom/DOMXPathException.hpp
-- Installing: /work/build/external/win-x86_64/include/xercesc/dom/DOMXPathExpression.hpp
-- Installing: /work/build/external/win-x86_64/include/xercesc/dom/DOMXPathNamespace.hpp
-- Installing: /work/build/external/win-x86_64/include/xercesc/dom/DOMXPathNSResolver.hpp
-- Installing: /work/build/external/win-x86_64/include/xercesc/dom/DOMXPathResult.hpp
-- Installing: /work/build/external/win-x86_64/include/xercesc/dom/StDOMNode.hpp
-- Installing: /work/build/external/win-x86_64/include/xercesc/dom/impl/DOMAttrImpl.hpp
-- Installing: /work/build/external/win-x86_64/include/xercesc/dom/impl/DOMAttrMapImpl.hpp
-- Installing: /work/build/external/win-x86_64/include/xercesc/dom/impl/DOMAttrNSImpl.hpp
-- Installing: /work/build/external/win-x86_64/include/xercesc/dom/impl/DOMCasts.hpp
-- Installing: /work/build/external/win-x86_64/include/xercesc/dom/impl/DOMCDATASectionImpl.hpp
-- Installing: /work/build/external/win-x86_64/include/xercesc/dom/impl/DOMCharacterDataImpl.hpp
-- Installing: /work/build/external/win-x86_64/include/xercesc/dom/impl/DOMChildNode.hpp
-- Installing: /work/build/external/win-x86_64/include/xercesc/dom/impl/DOMCommentImpl.hpp
-- Installing: /work/build/external/win-x86_64/include/xercesc/dom/impl/DOMConfigurationImpl.hpp
-- Installing: /work/build/external/win-x86_64/include/xercesc/dom/impl/DOMDeepNodeListImpl.hpp
-- Installing: /work/build/external/win-x86_64/include/xercesc/dom/impl/DOMDeepNodeListPool.hpp
-- Installing: /work/build/external/win-x86_64/include/xercesc/dom/impl/DOMDeepNodeListPool.c
-- Installing: /work/build/external/win-x86_64/include/xercesc/dom/impl/DOMDocumentFragmentImpl.hpp
-- Installing: /work/build/external/win-x86_64/include/xercesc/dom/impl/DOMDocumentImpl.hpp
-- Installing: /work/build/external/win-x86_64/include/xercesc/dom/impl/DOMDocumentTypeImpl.hpp
-- Installing: /work/build/external/win-x86_64/include/xercesc/dom/impl/DOMElementImpl.hpp
-- Installing: /work/build/external/win-x86_64/include/xercesc/dom/impl/DOMElementNSImpl.hpp
-- Installing: /work/build/external/win-x86_64/include/xercesc/dom/impl/DOMEntityImpl.hpp
-- Installing: /work/build/external/win-x86_64/include/xercesc/dom/impl/DOMEntityReferenceImpl.hpp
-- Installing: /work/build/external/win-x86_64/include/xercesc/dom/impl/DOMErrorImpl.hpp
-- Installing: /work/build/external/win-x86_64/include/xercesc/dom/impl/DOMImplementationImpl.hpp
-- Installing: /work/build/external/win-x86_64/include/xercesc/dom/impl/DOMImplementationListImpl.hpp
-- Installing: /work/build/external/win-x86_64/include/xercesc/dom/impl/DOMLocatorImpl.hpp
-- Installing: /work/build/external/win-x86_64/include/xercesc/dom/impl/DOMNamedNodeMapImpl.hpp
-- Installing: /work/build/external/win-x86_64/include/xercesc/dom/impl/DOMNodeBase.hpp
-- Installing: /work/build/external/win-x86_64/include/xercesc/dom/impl/DOMNodeIDMap.hpp
-- Installing: /work/build/external/win-x86_64/include/xercesc/dom/impl/DOMNodeImpl.hpp
-- Installing: /work/build/external/win-x86_64/include/xercesc/dom/impl/DOMNodeIteratorImpl.hpp
-- Installing: /work/build/external/win-x86_64/include/xercesc/dom/impl/DOMNodeListImpl.hpp
-- Installing: /work/build/external/win-x86_64/include/xercesc/dom/impl/DOMNodeVector.hpp
-- Installing: /work/build/external/win-x86_64/include/xercesc/dom/impl/DOMNormalizer.hpp
-- Installing: /work/build/external/win-x86_64/include/xercesc/dom/impl/DOMNotationImpl.hpp
-- Installing: /work/build/external/win-x86_64/include/xercesc/dom/impl/DOMParentNode.hpp
-- Installing: /work/build/external/win-x86_64/include/xercesc/dom/impl/DOMProcessingInstructionImpl.hpp
-- Installing: /work/build/external/win-x86_64/include/xercesc/dom/impl/DOMRangeImpl.hpp
-- Installing: /work/build/external/win-x86_64/include/xercesc/dom/impl/DOMStringListImpl.hpp
-- Installing: /work/build/external/win-x86_64/include/xercesc/dom/impl/DOMStringPool.hpp
-- Installing: /work/build/external/win-x86_64/include/xercesc/dom/impl/DOMTextImpl.hpp
-- Installing: /work/build/external/win-x86_64/include/xercesc/dom/impl/DOMTreeWalkerImpl.hpp
-- Installing: /work/build/external/win-x86_64/include/xercesc/dom/impl/DOMTypeInfoImpl.hpp
-- Installing: /work/build/external/win-x86_64/include/xercesc/dom/impl/DOMLSSerializerImpl.hpp
-- Installing: /work/build/external/win-x86_64/include/xercesc/dom/impl/DOMLSInputImpl.hpp
-- Installing: /work/build/external/win-x86_64/include/xercesc/dom/impl/DOMLSOutputImpl.hpp
-- Installing: /work/build/external/win-x86_64/include/xercesc/dom/impl/DOMXPathExpressionImpl.hpp
-- Installing: /work/build/external/win-x86_64/include/xercesc/dom/impl/DOMXPathNSResolverImpl.hpp
-- Installing: /work/build/external/win-x86_64/include/xercesc/dom/impl/DOMXPathResultImpl.hpp
-- Installing: /work/build/external/win-x86_64/include/xercesc/dom/impl/XSDElementNSImpl.hpp
-- Installing: /work/build/external/win-x86_64/include/xercesc/framework/BinOutputStream.hpp
-- Installing: /work/build/external/win-x86_64/include/xercesc/framework/LocalFileFormatTarget.hpp
-- Installing: /work/build/external/win-x86_64/include/xercesc/framework/LocalFileInputSource.hpp
-- Installing: /work/build/external/win-x86_64/include/xercesc/framework/MemBufFormatTarget.hpp
-- Installing: /work/build/external/win-x86_64/include/xercesc/framework/MemBufInputSource.hpp
-- Installing: /work/build/external/win-x86_64/include/xercesc/framework/MemoryManager.hpp
-- Installing: /work/build/external/win-x86_64/include/xercesc/framework/psvi/PSVIAttribute.hpp
-- Installing: /work/build/external/win-x86_64/include/xercesc/framework/psvi/PSVIAttributeList.hpp
-- Installing: /work/build/external/win-x86_64/include/xercesc/framework/psvi/PSVIElement.hpp
-- Installing: /work/build/external/win-x86_64/include/xercesc/framework/psvi/PSVIHandler.hpp
-- Installing: /work/build/external/win-x86_64/include/xercesc/framework/psvi/PSVIItem.hpp
-- Installing: /work/build/external/win-x86_64/include/xercesc/framework/psvi/XSAnnotation.hpp
-- Installing: /work/build/external/win-x86_64/include/xercesc/framework/psvi/XSAttributeDeclaration.hpp
-- Installing: /work/build/external/win-x86_64/include/xercesc/framework/psvi/XSAttributeGroupDefinition.hpp
-- Installing: /work/build/external/win-x86_64/include/xercesc/framework/psvi/XSAttributeUse.hpp
-- Installing: /work/build/external/win-x86_64/include/xercesc/framework/psvi/XSComplexTypeDefinition.hpp
-- Installing: /work/build/external/win-x86_64/include/xercesc/framework/psvi/XSConstants.hpp
-- Installing: /work/build/external/win-x86_64/include/xercesc/framework/psvi/XSElementDeclaration.hpp
-- Installing: /work/build/external/win-x86_64/include/xercesc/framework/psvi/XSFacet.hpp
-- Installing: /work/build/external/win-x86_64/include/xercesc/framework/psvi/XSIDCDefinition.hpp
-- Installing: /work/build/external/win-x86_64/include/xercesc/framework/psvi/XSModel.hpp
-- Installing: /work/build/external/win-x86_64/include/xercesc/framework/psvi/XSModelGroup.hpp
-- Installing: /work/build/external/win-x86_64/include/xercesc/framework/psvi/XSModelGroupDefinition.hpp
-- Installing: /work/build/external/win-x86_64/include/xercesc/framework/psvi/XSMultiValueFacet.hpp
-- Installing: /work/build/external/win-x86_64/include/xercesc/framework/psvi/XSNamedMap.hpp
-- Installing: /work/build/external/win-x86_64/include/xercesc/framework/psvi/XSNamedMap.c
-- Installing: /work/build/external/win-x86_64/include/xercesc/framework/psvi/XSNamespaceItem.hpp
-- Installing: /work/build/external/win-x86_64/include/xercesc/framework/psvi/XSNotationDeclaration.hpp
-- Installing: /work/build/external/win-x86_64/include/xercesc/framework/psvi/XSObject.hpp
-- Installing: /work/build/external/win-x86_64/include/xercesc/framework/psvi/XSParticle.hpp
-- Installing: /work/build/external/win-x86_64/include/xercesc/framework/psvi/XSSimpleTypeDefinition.hpp
-- Installing: /work/build/external/win-x86_64/include/xercesc/framework/psvi/XSTypeDefinition.hpp
-- Installing: /work/build/external/win-x86_64/include/xercesc/framework/psvi/XSValue.hpp
-- Installing: /work/build/external/win-x86_64/include/xercesc/framework/psvi/XSWildcard.hpp
-- Installing: /work/build/external/win-x86_64/include/xercesc/framework/StdInInputSource.hpp
-- Installing: /work/build/external/win-x86_64/include/xercesc/framework/StdOutFormatTarget.hpp
-- Installing: /work/build/external/win-x86_64/include/xercesc/framework/URLInputSource.hpp
-- Installing: /work/build/external/win-x86_64/include/xercesc/framework/ValidationContext.hpp
-- Installing: /work/build/external/win-x86_64/include/xercesc/framework/Wrapper4DOMLSInput.hpp
-- Installing: /work/build/external/win-x86_64/include/xercesc/framework/Wrapper4InputSource.hpp
-- Installing: /work/build/external/win-x86_64/include/xercesc/framework/XMLAttDef.hpp
-- Installing: /work/build/external/win-x86_64/include/xercesc/framework/XMLAttDefList.hpp
-- Installing: /work/build/external/win-x86_64/include/xercesc/framework/XMLAttr.hpp
-- Installing: /work/build/external/win-x86_64/include/xercesc/framework/XMLBuffer.hpp
-- Installing: /work/build/external/win-x86_64/include/xercesc/framework/XMLBufferMgr.hpp
-- Installing: /work/build/external/win-x86_64/include/xercesc/framework/XMLContentModel.hpp
-- Installing: /work/build/external/win-x86_64/include/xercesc/framework/XMLDocumentHandler.hpp
-- Installing: /work/build/external/win-x86_64/include/xercesc/framework/XMLDTDDescription.hpp
-- Installing: /work/build/external/win-x86_64/include/xercesc/framework/XMLElementDecl.hpp
-- Installing: /work/build/external/win-x86_64/include/xercesc/framework/XMLEntityDecl.hpp
-- Installing: /work/build/external/win-x86_64/include/xercesc/framework/XMLEntityHandler.hpp
-- Installing: /work/build/external/win-x86_64/include/xercesc/framework/XMLErrorCodes.hpp
-- Installing: /work/build/external/win-x86_64/include/xercesc/framework/XMLErrorReporter.hpp
-- Installing: /work/build/external/win-x86_64/include/xercesc/framework/XMLFormatter.hpp
-- Installing: /work/build/external/win-x86_64/include/xercesc/framework/XMLGrammarDescription.hpp
-- Installing: /work/build/external/win-x86_64/include/xercesc/framework/XMLGrammarPool.hpp
-- Installing: /work/build/external/win-x86_64/include/xercesc/framework/XMLGrammarPoolImpl.hpp
-- Installing: /work/build/external/win-x86_64/include/xercesc/framework/XMLNotationDecl.hpp
-- Installing: /work/build/external/win-x86_64/include/xercesc/framework/XMLPScanToken.hpp
-- Installing: /work/build/external/win-x86_64/include/xercesc/framework/XMLRecognizer.hpp
-- Installing: /work/build/external/win-x86_64/include/xercesc/framework/XMLRefInfo.hpp
-- Installing: /work/build/external/win-x86_64/include/xercesc/framework/XMLSchemaDescription.hpp
-- Installing: /work/build/external/win-x86_64/include/xercesc/framework/XMLValidator.hpp
-- Installing: /work/build/external/win-x86_64/include/xercesc/framework/XMLValidityCodes.hpp
-- Installing: /work/build/external/win-x86_64/include/xercesc/internal/BinFileOutputStream.hpp
-- Installing: /work/build/external/win-x86_64/include/xercesc/internal/BinMemOutputStream.hpp
-- Installing: /work/build/external/win-x86_64/include/xercesc/internal/CharTypeTables.hpp
-- Installing: /work/build/external/win-x86_64/include/xercesc/internal/DGXMLScanner.hpp
-- Installing: /work/build/external/win-x86_64/include/xercesc/internal/ElemStack.hpp
-- Installing: /work/build/external/win-x86_64/include/xercesc/internal/EndOfEntityException.hpp
-- Installing: /work/build/external/win-x86_64/include/xercesc/internal/IANAEncodings.hpp
-- Installing: /work/build/external/win-x86_64/include/xercesc/internal/IGXMLScanner.hpp
-- Installing: /work/build/external/win-x86_64/include/xercesc/internal/MemoryManagerImpl.hpp
-- Installing: /work/build/external/win-x86_64/include/xercesc/internal/ReaderMgr.hpp
-- Installing: /work/build/external/win-x86_64/include/xercesc/internal/SGXMLScanner.hpp
-- Installing: /work/build/external/win-x86_64/include/xercesc/internal/ValidationContextImpl.hpp
-- Installing: /work/build/external/win-x86_64/include/xercesc/internal/VecAttributesImpl.hpp
-- Installing: /work/build/external/win-x86_64/include/xercesc/internal/VecAttrListImpl.hpp
-- Installing: /work/build/external/win-x86_64/include/xercesc/internal/WFXMLScanner.hpp
-- Installing: /work/build/external/win-x86_64/include/xercesc/internal/XMLInternalErrorHandler.hpp
-- Installing: /work/build/external/win-x86_64/include/xercesc/internal/XMLReader.hpp
-- Installing: /work/build/external/win-x86_64/include/xercesc/internal/XMLScanner.hpp
-- Installing: /work/build/external/win-x86_64/include/xercesc/internal/XMLScannerResolver.hpp
-- Installing: /work/build/external/win-x86_64/include/xercesc/internal/XProtoType.hpp
-- Installing: /work/build/external/win-x86_64/include/xercesc/internal/XSAXMLScanner.hpp
-- Installing: /work/build/external/win-x86_64/include/xercesc/internal/XSerializable.hpp
-- Installing: /work/build/external/win-x86_64/include/xercesc/internal/XSerializationException.hpp
-- Installing: /work/build/external/win-x86_64/include/xercesc/internal/XSerializeEngine.hpp
-- Installing: /work/build/external/win-x86_64/include/xercesc/internal/XSObjectFactory.hpp
-- Installing: /work/build/external/win-x86_64/include/xercesc/internal/XTemplateSerializer.hpp
-- Installing: /work/build/external/win-x86_64/include/xercesc/parsers/AbstractDOMParser.hpp
-- Installing: /work/build/external/win-x86_64/include/xercesc/parsers/DOMLSParserImpl.hpp
-- Installing: /work/build/external/win-x86_64/include/xercesc/parsers/SAX2XMLFilterImpl.hpp
-- Installing: /work/build/external/win-x86_64/include/xercesc/parsers/SAX2XMLReaderImpl.hpp
-- Installing: /work/build/external/win-x86_64/include/xercesc/parsers/SAXParser.hpp
-- Installing: /work/build/external/win-x86_64/include/xercesc/parsers/XercesDOMParser.hpp
-- Installing: /work/build/external/win-x86_64/include/xercesc/sax/AttributeList.hpp
-- Installing: /work/build/external/win-x86_64/include/xercesc/sax/DocumentHandler.hpp
-- Installing: /work/build/external/win-x86_64/include/xercesc/sax/DTDHandler.hpp
-- Installing: /work/build/external/win-x86_64/include/xercesc/sax/EntityResolver.hpp
-- Installing: /work/build/external/win-x86_64/include/xercesc/sax/ErrorHandler.hpp
-- Installing: /work/build/external/win-x86_64/include/xercesc/sax/HandlerBase.hpp
-- Installing: /work/build/external/win-x86_64/include/xercesc/sax/InputSource.hpp
-- Installing: /work/build/external/win-x86_64/include/xercesc/sax/Locator.hpp
-- Installing: /work/build/external/win-x86_64/include/xercesc/sax/Parser.hpp
-- Installing: /work/build/external/win-x86_64/include/xercesc/sax/SAXException.hpp
-- Installing: /work/build/external/win-x86_64/include/xercesc/sax/SAXParseException.hpp
-- Installing: /work/build/external/win-x86_64/include/xercesc/sax2/Attributes.hpp
-- Installing: /work/build/external/win-x86_64/include/xercesc/sax2/ContentHandler.hpp
-- Installing: /work/build/external/win-x86_64/include/xercesc/sax2/DeclHandler.hpp
-- Installing: /work/build/external/win-x86_64/include/xercesc/sax2/DefaultHandler.hpp
-- Installing: /work/build/external/win-x86_64/include/xercesc/sax2/LexicalHandler.hpp
-- Installing: /work/build/external/win-x86_64/include/xercesc/sax2/SAX2XMLFilter.hpp
-- Installing: /work/build/external/win-x86_64/include/xercesc/sax2/SAX2XMLReader.hpp
-- Installing: /work/build/external/win-x86_64/include/xercesc/sax2/XMLReaderFactory.hpp
-- Installing: /work/build/external/win-x86_64/include/xercesc/validators/common/AllContentModel.hpp
-- Installing: /work/build/external/win-x86_64/include/xercesc/validators/common/CMAny.hpp
-- Installing: /work/build/external/win-x86_64/include/xercesc/validators/common/CMBinaryOp.hpp
-- Installing: /work/build/external/win-x86_64/include/xercesc/validators/common/CMLeaf.hpp
-- Installing: /work/build/external/win-x86_64/include/xercesc/validators/common/CMRepeatingLeaf.hpp
-- Installing: /work/build/external/win-x86_64/include/xercesc/validators/common/CMNode.hpp
-- Installing: /work/build/external/win-x86_64/include/xercesc/validators/common/CMStateSet.hpp
-- Installing: /work/build/external/win-x86_64/include/xercesc/validators/common/CMUnaryOp.hpp
-- Installing: /work/build/external/win-x86_64/include/xercesc/validators/common/ContentLeafNameTypeVector.hpp
-- Installing: /work/build/external/win-x86_64/include/xercesc/validators/common/ContentSpecNode.hpp
-- Installing: /work/build/external/win-x86_64/include/xercesc/validators/common/DFAContentModel.hpp
-- Installing: /work/build/external/win-x86_64/include/xercesc/validators/common/Grammar.hpp
-- Installing: /work/build/external/win-x86_64/include/xercesc/validators/common/GrammarResolver.hpp
-- Installing: /work/build/external/win-x86_64/include/xercesc/validators/common/MixedContentModel.hpp
-- Installing: /work/build/external/win-x86_64/include/xercesc/validators/common/SimpleContentModel.hpp
-- Installing: /work/build/external/win-x86_64/include/xercesc/validators/datatype/AbstractNumericFacetValidator.hpp
-- Installing: /work/build/external/win-x86_64/include/xercesc/validators/datatype/AbstractNumericValidator.hpp
-- Installing: /work/build/external/win-x86_64/include/xercesc/validators/datatype/AbstractStringValidator.hpp
-- Installing: /work/build/external/win-x86_64/include/xercesc/validators/datatype/AnySimpleTypeDatatypeValidator.hpp
-- Installing: /work/build/external/win-x86_64/include/xercesc/validators/datatype/AnyURIDatatypeValidator.hpp
-- Installing: /work/build/external/win-x86_64/include/xercesc/validators/datatype/Base64BinaryDatatypeValidator.hpp
-- Installing: /work/build/external/win-x86_64/include/xercesc/validators/datatype/BooleanDatatypeValidator.hpp
-- Installing: /work/build/external/win-x86_64/include/xercesc/validators/datatype/DatatypeValidator.hpp
-- Installing: /work/build/external/win-x86_64/include/xercesc/validators/datatype/DatatypeValidatorFactory.hpp
-- Installing: /work/build/external/win-x86_64/include/xercesc/validators/datatype/DateDatatypeValidator.hpp
-- Installing: /work/build/external/win-x86_64/include/xercesc/validators/datatype/DateTimeDatatypeValidator.hpp
-- Installing: /work/build/external/win-x86_64/include/xercesc/validators/datatype/DateTimeValidator.hpp
-- Installing: /work/build/external/win-x86_64/include/xercesc/validators/datatype/DayDatatypeValidator.hpp
-- Installing: /work/build/external/win-x86_64/include/xercesc/validators/datatype/DecimalDatatypeValidator.hpp
-- Installing: /work/build/external/win-x86_64/include/xercesc/validators/datatype/DoubleDatatypeValidator.hpp
-- Installing: /work/build/external/win-x86_64/include/xercesc/validators/datatype/DurationDatatypeValidator.hpp
-- Installing: /work/build/external/win-x86_64/include/xercesc/validators/datatype/ENTITYDatatypeValidator.hpp
-- Installing: /work/build/external/win-x86_64/include/xercesc/validators/datatype/FloatDatatypeValidator.hpp
-- Installing: /work/build/external/win-x86_64/include/xercesc/validators/datatype/HexBinaryDatatypeValidator.hpp
-- Installing: /work/build/external/win-x86_64/include/xercesc/validators/datatype/IDDatatypeValidator.hpp
-- Installing: /work/build/external/win-x86_64/include/xercesc/validators/datatype/IDREFDatatypeValidator.hpp
-- Installing: /work/build/external/win-x86_64/include/xercesc/validators/datatype/InvalidDatatypeFacetException.hpp
-- Installing: /work/build/external/win-x86_64/include/xercesc/validators/datatype/InvalidDatatypeValueException.hpp
-- Installing: /work/build/external/win-x86_64/include/xercesc/validators/datatype/ListDatatypeValidator.hpp
-- Installing: /work/build/external/win-x86_64/include/xercesc/validators/datatype/MonthDatatypeValidator.hpp
-- Installing: /work/build/external/win-x86_64/include/xercesc/validators/datatype/MonthDayDatatypeValidator.hpp
-- Installing: /work/build/external/win-x86_64/include/xercesc/validators/datatype/NameDatatypeValidator.hpp
-- Installing: /work/build/external/win-x86_64/include/xercesc/validators/datatype/NCNameDatatypeValidator.hpp
-- Installing: /work/build/external/win-x86_64/include/xercesc/validators/datatype/NOTATIONDatatypeValidator.hpp
-- Installing: /work/build/external/win-x86_64/include/xercesc/validators/datatype/QNameDatatypeValidator.hpp
-- Installing: /work/build/external/win-x86_64/include/xercesc/validators/datatype/StringDatatypeValidator.hpp
-- Installing: /work/build/external/win-x86_64/include/xercesc/validators/datatype/TimeDatatypeValidator.hpp
-- Installing: /work/build/external/win-x86_64/include/xercesc/validators/datatype/UnionDatatypeValidator.hpp
-- Installing: /work/build/external/win-x86_64/include/xercesc/validators/datatype/XMLCanRepGroup.hpp
-- Installing: /work/build/external/win-x86_64/include/xercesc/validators/datatype/YearDatatypeValidator.hpp
-- Installing: /work/build/external/win-x86_64/include/xercesc/validators/datatype/YearMonthDatatypeValidator.hpp
-- Installing: /work/build/external/win-x86_64/include/xercesc/validators/DTD/DocTypeHandler.hpp
-- Installing: /work/build/external/win-x86_64/include/xercesc/validators/DTD/DTDAttDef.hpp
-- Installing: /work/build/external/win-x86_64/include/xercesc/validators/DTD/DTDAttDefList.hpp
-- Installing: /work/build/external/win-x86_64/include/xercesc/validators/DTD/DTDElementDecl.hpp
-- Installing: /work/build/external/win-x86_64/include/xercesc/validators/DTD/DTDEntityDecl.hpp
-- Installing: /work/build/external/win-x86_64/include/xercesc/validators/DTD/DTDGrammar.hpp
-- Installing: /work/build/external/win-x86_64/include/xercesc/validators/DTD/DTDScanner.hpp
-- Installing: /work/build/external/win-x86_64/include/xercesc/validators/DTD/DTDValidator.hpp
-- Installing: /work/build/external/win-x86_64/include/xercesc/validators/DTD/XMLDTDDescriptionImpl.hpp
-- Installing: /work/build/external/win-x86_64/include/xercesc/validators/schema/ComplexTypeInfo.hpp
-- Installing: /work/build/external/win-x86_64/include/xercesc/validators/schema/GeneralAttributeCheck.hpp
-- Installing: /work/build/external/win-x86_64/include/xercesc/validators/schema/identity/FieldActivator.hpp
-- Installing: /work/build/external/win-x86_64/include/xercesc/validators/schema/identity/FieldValueMap.hpp
-- Installing: /work/build/external/win-x86_64/include/xercesc/validators/schema/identity/IC_Field.hpp
-- Installing: /work/build/external/win-x86_64/include/xercesc/validators/schema/identity/IC_Key.hpp
-- Installing: /work/build/external/win-x86_64/include/xercesc/validators/schema/identity/IC_KeyRef.hpp
-- Installing: /work/build/external/win-x86_64/include/xercesc/validators/schema/identity/IC_Selector.hpp
-- Installing: /work/build/external/win-x86_64/include/xercesc/validators/schema/identity/IC_Unique.hpp
-- Installing: /work/build/external/win-x86_64/include/xercesc/validators/schema/identity/IdentityConstraint.hpp
-- Installing: /work/build/external/win-x86_64/include/xercesc/validators/schema/identity/IdentityConstraintHandler.hpp
-- Installing: /work/build/external/win-x86_64/include/xercesc/validators/schema/identity/ValueStore.hpp
-- Installing: /work/build/external/win-x86_64/include/xercesc/validators/schema/identity/ValueStoreCache.hpp
-- Installing: /work/build/external/win-x86_64/include/xercesc/validators/schema/identity/XercesXPath.hpp
-- Installing: /work/build/external/win-x86_64/include/xercesc/validators/schema/identity/XPathException.hpp
-- Installing: /work/build/external/win-x86_64/include/xercesc/validators/schema/identity/XPathMatcher.hpp
-- Installing: /work/build/external/win-x86_64/include/xercesc/validators/schema/identity/XPathMatcherStack.hpp
-- Installing: /work/build/external/win-x86_64/include/xercesc/validators/schema/identity/XPathSymbols.hpp
-- Installing: /work/build/external/win-x86_64/include/xercesc/validators/schema/NamespaceScope.hpp
-- Installing: /work/build/external/win-x86_64/include/xercesc/validators/schema/PSVIDefs.hpp
-- Installing: /work/build/external/win-x86_64/include/xercesc/validators/schema/SchemaAttDef.hpp
-- Installing: /work/build/external/win-x86_64/include/xercesc/validators/schema/SchemaAttDefList.hpp
-- Installing: /work/build/external/win-x86_64/include/xercesc/validators/schema/SchemaElementDecl.hpp
-- Installing: /work/build/external/win-x86_64/include/xercesc/validators/schema/SchemaGrammar.hpp
-- Installing: /work/build/external/win-x86_64/include/xercesc/validators/schema/SchemaInfo.hpp
-- Installing: /work/build/external/win-x86_64/include/xercesc/validators/schema/SchemaSymbols.hpp
-- Installing: /work/build/external/win-x86_64/include/xercesc/validators/schema/SchemaValidator.hpp
-- Installing: /work/build/external/win-x86_64/include/xercesc/validators/schema/SubstitutionGroupComparator.hpp
-- Installing: /work/build/external/win-x86_64/include/xercesc/validators/schema/TraverseSchema.hpp
-- Installing: /work/build/external/win-x86_64/include/xercesc/validators/schema/XercesAttGroupInfo.hpp
-- Installing: /work/build/external/win-x86_64/include/xercesc/validators/schema/XercesElementWildcard.hpp
-- Installing: /work/build/external/win-x86_64/include/xercesc/validators/schema/XercesGroupInfo.hpp
-- Installing: /work/build/external/win-x86_64/include/xercesc/validators/schema/XMLSchemaDescriptionImpl.hpp
-- Installing: /work/build/external/win-x86_64/include/xercesc/validators/schema/XSDDOMParser.hpp
-- Installing: /work/build/external/win-x86_64/include/xercesc/validators/schema/XSDErrorReporter.hpp
-- Installing: /work/build/external/win-x86_64/include/xercesc/validators/schema/XSDLocator.hpp
-- Installing: /work/build/external/win-x86_64/include/xercesc/validators/schema/XUtil.hpp
-- Installing: /work/build/external/win-x86_64/include/xercesc/xinclude/XIncludeDOMDocumentProcessor.hpp
-- Installing: /work/build/external/win-x86_64/include/xercesc/xinclude/XIncludeLocation.hpp
-- Installing: /work/build/external/win-x86_64/include/xercesc/xinclude/XIncludeUtils.hpp
-- Installing: /work/build/external/win-x86_64/include/xercesc/util/Transcoders/Win32/Win32TransService.hpp
-- Installing: /work/build/external/win-x86_64/include/xercesc/util/MsgLoaders/InMemory/InMemMsgLoader.hpp
-- Installing: /work/build/external/win-x86_64/include/xercesc/util/MsgLoaders/InMemory/XercesMessages_en_US.hpp
-- Installing: /work/build/external/win-x86_64/include/xercesc/util/MutexManagers/NoThreadMutexMgr.hpp
-- Installing: /work/build/external/win-x86_64/include/xercesc/util/FileManagers/WindowsFileMgr.hpp
-- Installing: /work/build/external/win-x86_64/include/xercesc/util/Xerces_autoconf_config.hpp
-- Installing: /work/build/external/win-x86_64/include/xercesc/util/XercesVersion.hpp
-- Installing: /work/build/external/win-x86_64/bin/CreateDOMDocument.exe
-- Installing: /work/build/external/win-x86_64/bin/DOMCount.exe
-- Installing: /work/build/external/win-x86_64/bin/DOMPrint.exe
-- Installing: /work/build/external/win-x86_64/bin/EnumVal.exe
-- Installing: /work/build/external/win-x86_64/bin/MemParse.exe
-- Installing: /work/build/external/win-x86_64/bin/PParse.exe
CMake Error at samples/cmake_install.cmake:86 (file):
  file INSTALL cannot copy file
  "/work/build/win-x64/xerces-c/samples/PParse.exe" to
  "/work/build/external/win-x86_64/bin/PParse.exe".
Call Stack (most recent call first):
  cmake_install.cmake:44 (include)


make: *** [install] Error 1
Makefile:118: recipe for target 'install' failed
make: Leaving directory '/work/build/win-x64/xerces-c'
/work/rabbitmq-fmu/src/fmu.cpp:582:1: fatal error: error writing to /tmp/cc9qWLXM.s: No space left on device
 }
 ^
compilation terminated.
rabbitmq-fmu/CMakeFiles/rabbitmq.dir/build.make:104: recipe for target 'rabbitmq-fmu/CMakeFiles/rabbitmq.dir/src/fmu.cpp.o' failed
make[2]: *** [rabbitmq-fmu/CMakeFiles/rabbitmq.dir/src/fmu.cpp.o] Error 1
make -f thirdparty/googletest/googletest/CMakeFiles/gtest_main.dir/build.make thirdparty/googletest/googletest/CMakeFiles/gtest_main.dir/depend
make[2]: *** Waiting for unfinished jobs....
make[2]: Entering directory '/work/build/linux-x64'
cd /work/build/linux-x64 && /usr/bin/cmake -E cmake_depends "Unix Makefiles" /work /work/thirdparty/googletest/googletest /work/build/linux-x64 /work/build/linux-x64/thirdparty/googletest/googletest /work/build/linux-x64/thirdparty/googletest/googletest/CMakeFiles/gtest_main.dir/DependInfo.cmake --color=
Scanning dependencies of target gtest_main
make[2]: Leaving directory '/work/build/linux-x64'
make -f thirdparty/googletest/googletest/CMakeFiles/gtest_main.dir/build.make thirdparty/googletest/googletest/CMakeFiles/gtest_main.dir/build
make[2]: Entering directory '/work/build/linux-x64'
[ 36%] Building CXX object thirdparty/googletest/googletest/CMakeFiles/gtest_main.dir/src/gtest_main.cc.o
cd /work/build/linux-x64/thirdparty/googletest/googletest && /usr/bin/x86_64-linux-gnu-g++   -isystem /work/thirdparty/googletest/googletest/include -isystem /work/thirdparty/googletest/googletest  -O2 -g -DNDEBUG   -Wall -Wshadow -Werror -DGTEST_HAS_PTHREAD=1 -fexceptions -Wextra -Wno-unused-parameter -Wno-missing-field-initializers -std=c++11 -o CMakeFiles/gtest_main.dir/src/gtest_main.cc.o -c /work/thirdparty/googletest/googletest/src/gtest_main.cc
/work/rabbitmq-tla-tester/src/TlaTester.cpp:540:1: fatal error: error writing to /tmp/ccv9UeDM.s: No space left on device
 }
 ^
compilation terminated.
rabbitmq-tla-tester/CMakeFiles/rabbitmq-tla-tester-main.dir/build.make:65: recipe for target 'rabbitmq-tla-tester/CMakeFiles/rabbitmq-tla-tester-main.dir/src/TlaTester.cpp.o' failed
make[2]: Leaving directory '/work/build/linux-x64'
make[2]: *** [rabbitmq-tla-tester/CMakeFiles/rabbitmq-tla-tester-main.dir/src/TlaTester.cpp.o] Error 1
make[1]: *** [rabbitmq-tla-tester/CMakeFiles/rabbitmq-tla-tester-main.dir/all] Error 2
make[1]: *** Waiting for unfinished jobs....
CMakeFiles/Makefile2:5051: recipe for target 'rabbitmq-tla-tester/CMakeFiles/rabbitmq-tla-tester-main.dir/all' failed
[ 39%] Building CXX object rabbitmq-fmu/CMakeFiles/rabbitmq-main.dir/src/Iso8601TimeParser.cpp.o
cd /work/build/linux-x64/rabbitmq-fmu && /usr/bin/x86_64-linux-gnu-g++  -DAMQP_STATIC -DFMI_COSIMULATION -I/work/rabbitmq-fmu/../thirdparty/fmi/include -I/work/thirdparty/rapidjson/include -I/work/thirdparty/googletest/googletest/include -I/work/rabbitmq-fmu/src -I/work/thirdparty/rabbitmq-c/rabbitmq-c/librabbitmq -I/work/thirdparty/date/date -I/work/thirdparty/date/date/include -I/work/rabbitmq-core/src -isystem /work/build/external/linux-x86_64/include  -O2 -g -DNDEBUG   -std=gnu++1z -o CMakeFiles/rabbitmq-main.dir/src/Iso8601TimeParser.cpp.o -c /work/rabbitmq-fmu/src/Iso8601TimeParser.cpp
/work/rabbitmq-fmu/src/modeldescription/ModelDescriptionParser.cpp:246:1: fatal error: error writing to /tmp/ccuQDfOu.s: No space left on device
 }
 ^
compilation terminated.
/work/rabbitmq-fmu/src/message/MessageParser.cpp:78:1: fatal error: error writing to /tmp/cctlH8iL.s: No space left on device
 }
 ^
compilation terminated.
make[2]: *** [rabbitmq-fmu/CMakeFiles/rabbitmq.dir/src/modeldescription/ModelDescriptionParser.cpp.o] Error 1
rabbitmq-fmu/CMakeFiles/rabbitmq.dir/build.make:130: recipe for target 'rabbitmq-fmu/CMakeFiles/rabbitmq.dir/src/modeldescription/ModelDescriptionParser.cpp.o' failed
rabbitmq-fmu/CMakeFiles/rabbitmq.dir/build.make:117: recipe for target 'rabbitmq-fmu/CMakeFiles/rabbitmq.dir/src/message/MessageParser.cpp.o' failed
make[2]: *** [rabbitmq-fmu/CMakeFiles/rabbitmq.dir/src/message/MessageParser.cpp.o] Error 1
[ 39%] Building CXX object rabbitmq-fmu/CMakeFiles/rabbitmq-main.dir/src/fmu.cpp.o
[ 39%] Building CXX object rabbitmq-fmu/CMakeFiles/rabbitmq-main.dir/src/message/MessageParser.cpp.o
cd /work/build/linux-x64/rabbitmq-fmu && /usr/bin/x86_64-linux-gnu-g++  -DAMQP_STATIC -DFMI_COSIMULATION -I/work/rabbitmq-fmu/../thirdparty/fmi/include -I/work/thirdparty/rapidjson/include -I/work/thirdparty/googletest/googletest/include -I/work/rabbitmq-fmu/src -I/work/thirdparty/rabbitmq-c/rabbitmq-c/librabbitmq -I/work/thirdparty/date/date -I/work/thirdparty/date/date/include -I/work/rabbitmq-core/src -isystem /work/build/external/linux-x86_64/include  -O2 -g -DNDEBUG   -std=gnu++1z -o CMakeFiles/rabbitmq-main.dir/src/fmu.cpp.o -c /work/rabbitmq-fmu/src/fmu.cpp
cd /work/build/linux-x64/rabbitmq-fmu && /usr/bin/x86_64-linux-gnu-g++  -DAMQP_STATIC -DFMI_COSIMULATION -I/work/rabbitmq-fmu/../thirdparty/fmi/include -I/work/thirdparty/rapidjson/include -I/work/thirdparty/googletest/googletest/include -I/work/rabbitmq-fmu/src -I/work/thirdparty/rabbitmq-c/rabbitmq-c/librabbitmq -I/work/thirdparty/date/date -I/work/thirdparty/date/date/include -I/work/rabbitmq-core/src -isystem /work/build/external/linux-x86_64/include  -O2 -g -DNDEBUG   -std=gnu++1z -o CMakeFiles/rabbitmq-main.dir/src/message/MessageParser.cpp.o -c /work/rabbitmq-fmu/src/message/MessageParser.cpp
[Pipeline] }
/work/rabbitmq-fmu/src/Iso8601TimeParser.cpp:29:1: fatal error: error writing to /tmp/ccqJupzJ.s: No space left on device
 }
 ^
compilation terminated.
make[2]: *** [rabbitmq-fmu/CMakeFiles/rabbitmq.dir/src/Iso8601TimeParser.cpp.o] Error 1
rabbitmq-fmu/CMakeFiles/rabbitmq.dir/build.make:91: recipe for target 'rabbitmq-fmu/CMakeFiles/rabbitmq.dir/src/Iso8601TimeParser.cpp.o' failed
[ 42%] Building CXX object rabbitmq-fmu/CMakeFiles/rabbitmq-main.dir/src/modeldescription/ModelDescriptionParser.cpp.o
cd /work/build/linux-x64/rabbitmq-fmu && /usr/bin/x86_64-linux-gnu-g++  -DAMQP_STATIC -DFMI_COSIMULATION -I/work/rabbitmq-fmu/../thirdparty/fmi/include -I/work/thirdparty/rapidjson/include -I/work/thirdparty/googletest/googletest/include -I/work/rabbitmq-fmu/src -I/work/thirdparty/rabbitmq-c/rabbitmq-c/librabbitmq -I/work/thirdparty/date/date -I/work/thirdparty/date/date/include -I/work/rabbitmq-core/src -isystem /work/build/external/linux-x86_64/include  -O2 -g -DNDEBUG   -std=gnu++1z -o CMakeFiles/rabbitmq-main.dir/src/modeldescription/ModelDescriptionParser.cpp.o -c /work/rabbitmq-fmu/src/modeldescription/ModelDescriptionParser.cpp
[Pipeline] // stage
[Pipeline] }
Failed in branch Xcompile win64
[ 45%] Linking CXX static library ../../../lib/libgtest_main.a
cd /work/build/linux-x64/thirdparty/googletest/googletest && /usr/bin/cmake -P CMakeFiles/gtest_main.dir/cmake_clean_target.cmake
cd /work/build/linux-x64/thirdparty/googletest/googletest && /usr/bin/cmake -E cmake_link_script CMakeFiles/gtest_main.dir/link.txt --verbose=1
/usr/bin/x86_64-linux-gnu-ar qc ../../../lib/libgtest_main.a  CMakeFiles/gtest_main.dir/src/gtest_main.cc.o
/usr/bin/x86_64-linux-gnu-ranlib ../../../lib/libgtest_main.a
make[2]: Leaving directory '/work/build/linux-x64'
[ 45%] Built target gtest_main
[ 45%] Building CXX object rabbitmq-fmu/CMakeFiles/rabbitmq-main.dir/src/rabbitmq/RabbitMqHandlerException.cpp.o
cd /work/build/linux-x64/rabbitmq-fmu && /usr/bin/x86_64-linux-gnu-g++  -DAMQP_STATIC -DFMI_COSIMULATION -I/work/rabbitmq-fmu/../thirdparty/fmi/include -I/work/thirdparty/rapidjson/include -I/work/thirdparty/googletest/googletest/include -I/work/rabbitmq-fmu/src -I/work/thirdparty/rabbitmq-c/rabbitmq-c/librabbitmq -I/work/thirdparty/date/date -I/work/thirdparty/date/date/include -I/work/rabbitmq-core/src -isystem /work/build/external/linux-x86_64/include  -O2 -g -DNDEBUG   -std=gnu++1z -o CMakeFiles/rabbitmq-main.dir/src/rabbitmq/RabbitMqHandlerException.cpp.o -c /work/rabbitmq-fmu/src/rabbitmq/RabbitMqHandlerException.cpp
fatal error: error in backend: IO failure on output stream: No space left on device
make[2]: *** [thirdparty/date/date/CMakeFiles/tz.dir/src/tz.cpp.o] Error 1
thirdparty/date/date/CMakeFiles/tz.dir/build.make:65: recipe for target 'thirdparty/date/date/CMakeFiles/tz.dir/src/tz.cpp.o' failed
make[2]: Leaving directory '/work/build/darwin-x64'
CMakeFiles/Makefile2:3125: recipe for target 'thirdparty/date/date/CMakeFiles/tz.dir/all' failed
make[1]: *** [thirdparty/date/date/CMakeFiles/tz.dir/all] Error 2
make[1]: *** Waiting for unfinished jobs....
/work/rabbitmq-fmu/src/FmuContainer.cpp:506:1: fatal error: error writing to /tmp/ccfAekkJ.s: No space left on device
 }
 ^
compilation terminated.
Running CMake
[Pipeline] }
/work/rabbitmq-fmu/src/FmuContainer.cpp:506:1: fatal error: error writing to /tmp/cclWPpqp.s: No space left on device
 }
 ^
compilation terminated.
rabbitmq-fmu/CMakeFiles/rabbitmq.dir/build.make:78: recipe for target 'rabbitmq-fmu/CMakeFiles/rabbitmq.dir/src/FmuContainer.cpp.o' failed
make[2]: Leaving directory '/work/build/linux-x64'
make[2]: *** [rabbitmq-fmu/CMakeFiles/rabbitmq.dir/src/FmuContainer.cpp.o] Error 1
make[1]: *** [rabbitmq-fmu/CMakeFiles/rabbitmq.dir/all] Error 2
CMakeFiles/Makefile2:5236: recipe for target 'rabbitmq-fmu/CMakeFiles/rabbitmq.dir/all' failed
[ 48%] Building CXX object rabbitmq-fmu/CMakeFiles/rabbitmq-main.dir/src/rabbitmq/RabbitmqHandler.cpp.o
cd /work/build/linux-x64/rabbitmq-fmu && /usr/bin/x86_64-linux-gnu-g++  -DAMQP_STATIC -DFMI_COSIMULATION -I/work/rabbitmq-fmu/../thirdparty/fmi/include -I/work/thirdparty/rapidjson/include -I/work/thirdparty/googletest/googletest/include -I/work/rabbitmq-fmu/src -I/work/thirdparty/rabbitmq-c/rabbitmq-c/librabbitmq -I/work/thirdparty/date/date -I/work/thirdparty/date/date/include -I/work/rabbitmq-core/src -isystem /work/build/external/linux-x86_64/include  -O2 -g -DNDEBUG   -std=gnu++1z -o CMakeFiles/rabbitmq-main.dir/src/rabbitmq/RabbitmqHandler.cpp.o -c /work/rabbitmq-fmu/src/rabbitmq/RabbitmqHandler.cpp
rabbitmq-fmu/CMakeFiles/rabbitmq-main.dir/build.make:78: recipe for target 'rabbitmq-fmu/CMakeFiles/rabbitmq-main.dir/src/FmuContainer.cpp.o' failed
make[2]: *** [rabbitmq-fmu/CMakeFiles/rabbitmq-main.dir/src/FmuContainer.cpp.o] Error 1
make[2]: *** Waiting for unfinished jobs....
[Pipeline] // stage
[Pipeline] }
Failed in branch Xcompile win32
In file included from /work/thirdparty/googletest/googlemock/src/gmock-all.cc:46:0:
/work/thirdparty/googletest/googlemock/src/gmock.cc:213:1: fatal error: error writing to /tmp/ccrcJ71l.s: No space left on device
 }  // namespace testing
 ^
compilation terminated.
make[2]: *** [thirdparty/googletest/googlemock/CMakeFiles/gmock.dir/src/gmock-all.cc.o] Error 1
thirdparty/googletest/googlemock/CMakeFiles/gmock.dir/build.make:65: recipe for target 'thirdparty/googletest/googlemock/CMakeFiles/gmock.dir/src/gmock-all.cc.o' failed
make[2]: Leaving directory '/work/build/linux-x64'
CMakeFiles/Makefile2:1167: recipe for target 'thirdparty/googletest/googlemock/CMakeFiles/gmock.dir/all' failed
make[1]: *** [thirdparty/googletest/googlemock/CMakeFiles/gmock.dir/all] Error 2
make[2]: Leaving directory '/work/build/linux-x64'
CMakeFiles/Makefile2:5115: recipe for target 'rabbitmq-fmu/CMakeFiles/rabbitmq-main.dir/all' failed
make[1]: *** [rabbitmq-fmu/CMakeFiles/rabbitmq-main.dir/all] Error 2
make[1]: Leaving directory '/work/build/linux-x64'
make: *** [all] Error 2
Makefile:143: recipe for target 'all' failed
make: Leaving directory '/work/build/linux-x64'

[Pipeline] }
[Pipeline] // stage
[Pipeline] }
Failed in branch Xcompile linux32
[Pipeline] }
[Pipeline] // stage
[Pipeline] }
Failed in branch Xcompile linux64
[ 18%] Linking CXX static library ../../../lib/libgtest.a
cd /work/build/darwin-x64/thirdparty/googletest/googletest && /usr/bin/cmake -P CMakeFiles/gtest.dir/cmake_clean_target.cmake
cd /work/build/darwin-x64/thirdparty/googletest/googletest && /usr/bin/cmake -E cmake_link_script CMakeFiles/gtest.dir/link.txt --verbose=1
/opt/osxcross/target/bin/x86_64-apple-darwin19-ar qc ../../../lib/libgtest.a  CMakeFiles/gtest.dir/src/gtest-all.cc.o
/opt/osxcross/target/bin/x86_64-apple-darwin19-ranlib ../../../lib/libgtest.a
make[2]: Leaving directory '/work/build/darwin-x64'
[ 18%] Built target gtest
make[1]: Leaving directory '/work/build/darwin-x64'
Makefile:131: recipe for target 'all' failed
make: *** [all] Error 2
make: Leaving directory '/work/build/darwin-x64'
[Pipeline] }
[Pipeline] // stage
[Pipeline] }
Failed in branch Xcompile darwin:
[Pipeline] // parallel
[Pipeline] }
[Pipeline] // stage
[Pipeline] stage
[Pipeline] { (Pack FMU)
Stage "Pack FMU" skipped due to earlier failure(s)
[Pipeline] }
[Pipeline] // stage
[Pipeline] stage
[Pipeline] { (Publish)
Stage "Publish" skipped due to earlier failure(s)
[Pipeline] }
[Pipeline] // stage
[Pipeline] }
[Pipeline] // withEnv
[Pipeline] }
[Pipeline] // node
[Pipeline] End of Pipeline

GitHub has been notified of this commit’s build result

an exception which occurred:
	in field com.cloudbees.groovy.cps.impl.ConstantBlock.value
	in object com.cloudbees.groovy.cps.impl.ConstantBlock@22f460cb
	in field com.cloudbees.groovy.cps.impl.CollectionLiteralBlock.argExps
	in object com.cloudbees.groovy.cps.impl.MapBlock@1c9e0f92
	in field com.cloudbees.groovy.cps.impl.FunctionCallBlock.argExps
	in object com.cloudbees.groovy.cps.impl.FunctionCallBlock@3864f14f
	in field com.cloudbees.groovy.cps.impl.BlockScopedBlock.exp
	in object com.cloudbees.groovy.cps.impl.BlockScopedBlock@528e768a
	in field com.cloudbees.groovy.cps.impl.SequenceBlock.exp2
	in object com.cloudbees.groovy.cps.impl.SequenceBlock@696078c5
	in field com.cloudbees.groovy.cps.impl.BlockScopedBlock.exp
	in object com.cloudbees.groovy.cps.impl.BlockScopedBlock@7f44d66a
	in field com.cloudbees.groovy.cps.impl.ClosureBlock.body
	in object com.cloudbees.groovy.cps.impl.ClosureBlock@9a8d794
	in field com.cloudbees.groovy.cps.impl.FunctionCallBlock.argExps
	in object com.cloudbees.groovy.cps.impl.FunctionCallBlock@77ac33d4
	in field com.cloudbees.groovy.cps.impl.FunctionCallBlock.argExps
	in object com.cloudbees.groovy.cps.impl.FunctionCallBlock@7e7f8aaa
	in field com.cloudbees.groovy.cps.impl.CollectionLiteralBlock.argExps
	in object com.cloudbees.groovy.cps.impl.ListBlock@3909269f
	in field com.cloudbees.groovy.cps.impl.FunctionCallBlock.argExps
	in object com.cloudbees.groovy.cps.impl.FunctionCallBlock@1747aab0
	in field com.cloudbees.groovy.cps.impl.FunctionCallBlock.argExps
	in object com.cloudbees.groovy.cps.impl.FunctionCallBlock@29058507
	in field com.cloudbees.groovy.cps.impl.ReturnBlock.exp
	in object com.cloudbees.groovy.cps.impl.ReturnBlock@30726220
	in field com.cloudbees.groovy.cps.impl.BlockScopedBlock.exp
	in object com.cloudbees.groovy.cps.impl.BlockScopedBlock@371b3a20
	in field com.cloudbees.groovy.cps.impl.SequenceBlock.exp2
	in object com.cloudbees.groovy.cps.impl.SequenceBlock@31236dc0
	in field com.cloudbees.groovy.cps.impl.BlockScopedBlock.exp
	in object com.cloudbees.groovy.cps.impl.BlockScopedBlock@2efdd11e
	in field com.cloudbees.groovy.cps.impl.CpsCallable.body
	in object com.cloudbees.groovy.cps.impl.CpsClosureDef@7218a0e4
	in field com.cloudbees.groovy.cps.impl.CpsClosure.def
	in object org.jenkinsci.plugins.workflow.cps.CpsClosure2@16879830
	in field com.cloudbees.groovy.cps.impl.FunctionCallEnv.locals
	in object com.cloudbees.groovy.cps.impl.FunctionCallEnv@185a70c4
	in field com.cloudbees.groovy.cps.impl.ProxyEnv.parent
	in object com.cloudbees.groovy.cps.impl.BlockScopeEnv@1787e3b7
	in field com.cloudbees.groovy.cps.impl.ProxyEnv.parent
	in object com.cloudbees.groovy.cps.impl.BlockScopeEnv@7c9885a5
	in field com.cloudbees.groovy.cps.impl.ProxyEnv.parent
	in object com.cloudbees.groovy.cps.impl.BlockScopeEnv@4567dad3
	in field com.cloudbees.groovy.cps.impl.ProxyEnv.parent
	in object com.cloudbees.groovy.cps.impl.TryBlockEnv@6dcc43c0
	in field com.cloudbees.groovy.cps.impl.ProxyEnv.parent
	in object com.cloudbees.groovy.cps.impl.BlockScopeEnv@c9ced0c
	in field com.cloudbees.groovy.cps.impl.CallEnv.caller
	in object com.cloudbees.groovy.cps.impl.FunctionCallEnv@5d8796c1
	in field com.cloudbees.groovy.cps.impl.ProxyEnv.parent
	in object com.cloudbees.groovy.cps.impl.BlockScopeEnv@7f85084e
	in field com.cloudbees.groovy.cps.impl.ProxyEnv.parent
	in object com.cloudbees.groovy.cps.impl.BlockScopeEnv@6ea9cfe6
	in field com.cloudbees.groovy.cps.impl.ProxyEnv.parent
	in object com.cloudbees.groovy.cps.impl.BlockScopeEnv@6d411f5
	in field com.cloudbees.groovy.cps.impl.CallEnv.caller
	in object com.cloudbees.groovy.cps.impl.FunctionCallEnv@26c9cb92
	in field com.cloudbees.groovy.cps.impl.ProxyEnv.parent
	in object com.cloudbees.groovy.cps.impl.BlockScopeEnv@6ba924c
	in field com.cloudbees.groovy.cps.impl.ProxyEnv.parent
	in object com.cloudbees.groovy.cps.impl.BlockScopeEnv@41f132c6
	in field com.cloudbees.groovy.cps.impl.CallEnv.caller
	in object com.cloudbees.groovy.cps.impl.FunctionCallEnv@6283480
	in field com.cloudbees.groovy.cps.impl.ProxyEnv.parent
	in object com.cloudbees.groovy.cps.impl.BlockScopeEnv@73354f2e
	in field com.cloudbees.groovy.cps.impl.ProxyEnv.parent
	in object com.cloudbees.groovy.cps.impl.BlockScopeEnv@1202d4b4
	in field com.cloudbees.groovy.cps.impl.CpsClosureDef.capture
	in object com.cloudbees.groovy.cps.impl.CpsClosureDef@36f1ec40
	in field com.cloudbees.groovy.cps.impl.CpsClosure.def
	in object org.jenkinsci.plugins.workflow.cps.CpsClosure2@328327d9
	in field groovy.lang.Closure.delegate
	in object org.jenkinsci.plugins.workflow.cps.CpsClosure2@15d58893
	in field org.jenkinsci.plugins.workflow.cps.CpsThreadGroup.closures
	in object org.jenkinsci.plugins.workflow.cps.CpsThreadGroup@5e537865
	in object org.jenkinsci.plugins.workflow.cps.CpsThreadGroup@5e537865
Also:   java.io.IOException: No space left on device
		at java.io.FileOutputStream.writeBytes(Native Method)
		at java.io.FileOutputStream.write(FileOutputStream.java:326)
		at java.io.BufferedOutputStream.flushBuffer(BufferedOutputStream.java:82)
		at java.io.BufferedOutputStream.write(BufferedOutputStream.java:126)
		at java.io.DataOutputStream.write(DataOutputStream.java:107)
		at org.jboss.marshalling.OutputStreamByteOutput.write(OutputStreamByteOutput.java:52)
		at org.jboss.marshalling.SimpleDataOutput.flush(SimpleDataOutput.java:336)
		at org.jboss.marshalling.SimpleDataOutput.finish(SimpleDataOutput.java:378)
		at org.jboss.marshalling.AbstractMarshaller.finish(AbstractMarshaller.java:126)
		at org.jenkinsci.plugins.workflow.support.pickles.serialization.RiverWriter.close(RiverWriter.java:165)
		at org.jenkinsci.plugins.workflow.cps.CpsThreadGroup.saveProgram(CpsThreadGroup.java:558)
Also:   an exception which occurred:
	in field com.cloudbees.groovy.cps.impl.ConstantBlock.value
	in object com.cloudbees.groovy.cps.impl.ConstantBlock@22f460cb
	in field com.cloudbees.groovy.cps.impl.CollectionLiteralBlock.argExps
	in object com.cloudbees.groovy.cps.impl.MapBlock@1c9e0f92
	in field com.cloudbees.groovy.cps.impl.FunctionCallBlock.argExps
	in object com.cloudbees.groovy.cps.impl.FunctionCallBlock@3864f14f
	in field com.cloudbees.groovy.cps.impl.BlockScopedBlock.exp
	in object com.cloudbees.groovy.cps.impl.BlockScopedBlock@528e768a
	in field com.cloudbees.groovy.cps.impl.SequenceBlock.exp2
	in object com.cloudbees.groovy.cps.impl.SequenceBlock@696078c5
	in field com.cloudbees.groovy.cps.impl.BlockScopedBlock.exp
	in object com.cloudbees.groovy.cps.impl.BlockScopedBlock@7f44d66a
	in field com.cloudbees.groovy.cps.impl.ClosureBlock.body
	in object com.cloudbees.groovy.cps.impl.ClosureBlock@9a8d794
	in field com.cloudbees.groovy.cps.impl.FunctionCallBlock.argExps
	in object com.cloudbees.groovy.cps.impl.FunctionCallBlock@77ac33d4
	in field com.cloudbees.groovy.cps.impl.FunctionCallBlock.argExps
	in object com.cloudbees.groovy.cps.impl.FunctionCallBlock@7e7f8aaa
	in field com.cloudbees.groovy.cps.impl.CollectionLiteralBlock.argExps
	in object com.cloudbees.groovy.cps.impl.ListBlock@3909269f
	in field com.cloudbees.groovy.cps.impl.FunctionCallBlock.argExps
	in object com.cloudbees.groovy.cps.impl.FunctionCallBlock@1747aab0
	in field com.cloudbees.groovy.cps.impl.FunctionCallBlock.argExps
	in object com.cloudbees.groovy.cps.impl.FunctionCallBlock@29058507
	in field com.cloudbees.groovy.cps.impl.ReturnBlock.exp
	in object com.cloudbees.groovy.cps.impl.ReturnBlock@30726220
	in field com.cloudbees.groovy.cps.impl.BlockScopedBlock.exp
	in object com.cloudbees.groovy.cps.impl.BlockScopedBlock@371b3a20
	in field com.cloudbees.groovy.cps.impl.SequenceBlock.exp2
	in object com.cloudbees.groovy.cps.impl.SequenceBlock@31236dc0
	in field com.cloudbees.groovy.cps.impl.BlockScopedBlock.exp
	in object com.cloudbees.groovy.cps.impl.BlockScopedBlock@2efdd11e
	in field com.cloudbees.groovy.cps.impl.CpsCallable.body
	in object com.cloudbees.groovy.cps.impl.CpsClosureDef@7218a0e4
	in field com.cloudbees.groovy.cps.impl.CpsClosure.def
	in object org.jenkinsci.plugins.workflow.cps.CpsClosure2@16879830
	in field com.cloudbees.groovy.cps.impl.FunctionCallEnv.locals
	in object com.cloudbees.groovy.cps.impl.FunctionCallEnv@185a70c4
	in field com.cloudbees.groovy.cps.impl.ProxyEnv.parent
	in object com.cloudbees.groovy.cps.impl.BlockScopeEnv@1787e3b7
	in field com.cloudbees.groovy.cps.impl.ProxyEnv.parent
	in object com.cloudbees.groovy.cps.impl.BlockScopeEnv@7c9885a5
	in field com.cloudbees.groovy.cps.impl.ProxyEnv.parent
	in object com.cloudbees.groovy.cps.impl.BlockScopeEnv@4567dad3
	in field com.cloudbees.groovy.cps.impl.ProxyEnv.parent
	in object com.cloudbees.groovy.cps.impl.TryBlockEnv@6dcc43c0
	in field com.cloudbees.groovy.cps.impl.ProxyEnv.parent
	in object com.cloudbees.groovy.cps.impl.BlockScopeEnv@c9ced0c
	in field com.cloudbees.groovy.cps.impl.CallEnv.caller
	in object com.cloudbees.groovy.cps.impl.FunctionCallEnv@5d8796c1
	in field com.cloudbees.groovy.cps.impl.ProxyEnv.parent
	in object com.cloudbees.groovy.cps.impl.BlockScopeEnv@7f85084e
	in field com.cloudbees.groovy.cps.impl.ProxyEnv.parent
	in object com.cloudbees.groovy.cps.impl.BlockScopeEnv@6ea9cfe6
	in field com.cloudbees.groovy.cps.impl.ProxyEnv.parent
	in object com.cloudbees.groovy.cps.impl.BlockScopeEnv@6d411f5
	in field com.cloudbees.groovy.cps.impl.CallEnv.caller
	in object com.cloudbees.groovy.cps.impl.FunctionCallEnv@26c9cb92
	in field com.cloudbees.groovy.cps.impl.ProxyEnv.parent
	in object com.cloudbees.groovy.cps.impl.BlockScopeEnv@6ba924c
	in field com.cloudbees.groovy.cps.impl.ProxyEnv.parent
	in object com.cloudbees.groovy.cps.impl.BlockScopeEnv@41f132c6
	in field com.cloudbees.groovy.cps.impl.CallEnv.caller
	in object com.cloudbees.groovy.cps.impl.FunctionCallEnv@6283480
	in field com.cloudbees.groovy.cps.impl.ProxyEnv.parent
	in object com.cloudbees.groovy.cps.impl.BlockScopeEnv@73354f2e
	in field com.cloudbees.groovy.cps.impl.ProxyEnv.parent
	in object com.cloudbees.groovy.cps.impl.BlockScopeEnv@1202d4b4
	in field com.cloudbees.groovy.cps.impl.CpsClosureDef.capture
	in object com.cloudbees.groovy.cps.impl.CpsClosureDef@36f1ec40
	in field com.cloudbees.groovy.cps.impl.CpsClosure.def
	in object org.jenkinsci.plugins.workflow.cps.CpsClosure2@328327d9
	in field groovy.lang.Closure.delegate
	in object org.jenkinsci.plugins.workflow.cps.CpsClosure2@15d58893
	in field org.jenkinsci.plugins.workflow.cps.CpsThreadGroup.closures
	in object org.jenkinsci.plugins.workflow.cps.CpsThreadGroup@5e537865
	in object org.jenkinsci.plugins.workflow.cps.CpsThreadGroup@5e537865
	Also:   java.io.IOException: No space left on device
			at java.io.FileOutputStream.writeBytes(Native Method)
			at java.io.FileOutputStream.write(FileOutputStream.java:326)
			at java.io.BufferedOutputStream.flushBuffer(BufferedOutputStream.java:82)
			at java.io.BufferedOutputStream.write(BufferedOutputStream.java:126)
			at java.io.DataOutputStream.write(DataOutputStream.java:107)
			at org.jboss.marshalling.OutputStreamByteOutput.write(OutputStreamByteOutput.java:52)
			at org.jboss.marshalling.SimpleDataOutput.flush(SimpleDataOutput.java:336)
			at org.jboss.marshalling.SimpleDataOutput.finish(SimpleDataOutput.java:378)
			at org.jboss.marshalling.AbstractMarshaller.finish(AbstractMarshaller.java:126)
			at org.jenkinsci.plugins.workflow.support.pickles.serialization.RiverWriter.close(RiverWriter.java:165)
			at org.jenkinsci.plugins.workflow.cps.CpsThreadGroup.saveProgram(CpsThreadGroup.java:558)
	Caused: java.io.IOException: No space left on device
		at java.io.FileOutputStream.writeBytes(Native Method)
		at java.io.FileOutputStream.write(FileOutputStream.java:326)
		at java.io.BufferedOutputStream.flushBuffer(BufferedOutputStream.java:82)
		at java.io.BufferedOutputStream.write(BufferedOutputStream.java:126)
		at java.io.DataOutputStream.write(DataOutputStream.java:107)
		at org.jboss.marshalling.OutputStreamByteOutput.write(OutputStreamByteOutput.java:52)
		at org.jboss.marshalling.SimpleDataOutput.shallowFlush(SimpleDataOutput.java:353)
		at org.jboss.marshalling.river.RiverMarshaller.doWriteObject(RiverMarshaller.java:266)
		at org.jboss.marshalling.river.RiverMarshaller.doWriteFields(RiverMarshaller.java:1082)
		at org.jboss.marshalling.river.RiverMarshaller.doWriteSerializableObject(RiverMarshaller.java:1040)
		at org.jboss.marshalling.river.RiverMarshaller.doWriteObject(RiverMarshaller.java:920)
		at org.jboss.marshalling.river.RiverMarshaller.doWriteObject(RiverMarshaller.java:844)
		at org.jboss.marshalling.river.RiverMarshaller.doWriteFields(RiverMarshaller.java:1082)
		at org.jboss.marshalling.river.RiverMarshaller.doWriteSerializableObject(RiverMarshaller.java:1040)
		at org.jboss.marshalling.river.RiverMarshaller.doWriteSerializableObject(RiverMarshaller.java:1019)
		at org.jboss.marshalling.river.RiverMarshaller.doWriteObject(RiverMarshaller.java:920)
		at org.jboss.marshalling.river.RiverMarshaller.doWriteObject(RiverMarshaller.java:844)
		at org.jboss.marshalling.river.RiverMarshaller.doWriteFields(RiverMarshaller.java:1082)
		at org.jboss.marshalling.river.RiverMarshaller.doWriteSerializableObject(RiverMarshaller.java:1040)
		at org.jboss.marshalling.river.RiverMarshaller.doWriteObject(RiverMarshaller.java:920)
		at org.jboss.marshalling.river.RiverMarshaller.doWriteFields(RiverMarshaller.java:1082)
		at org.jboss.marshalling.river.RiverMarshaller.doWriteSerializableObject(RiverMarshaller.java:1040)
		at org.jboss.marshalling.river.RiverMarshaller.doWriteObject(RiverMarshaller.java:920)
		at org.jboss.marshalling.river.RiverMarshaller.doWriteFields(RiverMarshaller.java:1082)
		at org.jboss.marshalling.river.RiverMarshaller.doWriteSerializableObject(RiverMarshaller.java:1040)
		at org.jboss.marshalling.river.RiverMarshaller.doWriteObject(RiverMarshaller.java:920)
		at org.jboss.marshalling.river.RiverMarshaller.doWriteFields(RiverMarshaller.java:1082)
		at org.jboss.marshalling.river.RiverMarshaller.doWriteSerializableObject(RiverMarshaller.java:1040)
		at org.jboss.marshalling.river.RiverMarshaller.doWriteObject(RiverMarshaller.java:920)
		at org.jboss.marshalling.river.RiverMarshaller.doWriteFields(RiverMarshaller.java:1082)
		at org.jboss.marshalling.river.RiverMarshaller.doWriteSerializableObject(RiverMarshaller.java:1040)
		at org.jboss.marshalling.river.RiverMarshaller.doWriteObject(RiverMarshaller.java:920)
		at org.jboss.marshalling.river.RiverMarshaller.doWriteObject(RiverMarshaller.java:844)
		at org.jboss.marshalling.river.RiverMarshaller.doWriteFields(RiverMarshaller.java:1082)
		at org.jboss.marshalling.river.RiverMarshaller.doWriteSerializableObject(RiverMarshaller.java:1040)
		at org.jboss.marshalling.river.RiverMarshaller.doWriteObject(RiverMarshaller.java:920)
		at org.jboss.marshalling.river.RiverMarshaller.doWriteObject(RiverMarshaller.java:844)
		at org.jboss.marshalling.river.RiverMarshaller.doWriteFields(RiverMarshaller.java:1082)
		at org.jboss.marshalling.river.RiverMarshaller.doWriteSerializableObject(RiverMarshaller.java:1040)
		at org.jboss.marshalling.river.RiverMarshaller.doWriteObject(RiverMarshaller.java:920)
		at org.jboss.marshalling.river.RiverMarshaller.doWriteObject(RiverMarshaller.java:844)
		at org.jboss.marshalling.river.RiverMarshaller.doWriteFields(RiverMarshaller.java:1082)
		at org.jboss.marshalling.river.RiverMarshaller.doWriteSerializableObject(RiverMarshaller.java:1040)
		at org.jboss.marshalling.river.RiverMarshaller.doWriteSerializableObject(RiverMarshaller.java:1019)
		at org.jboss.marshalling.river.RiverMarshaller.doWriteObject(RiverMarshaller.java:920)
		at org.jboss.marshalling.river.RiverMarshaller.doWriteObject(RiverMarshaller.java:844)
		at org.jboss.marshalling.river.RiverMarshaller.doWriteFields(RiverMarshaller.java:1082)
		at org.jboss.marshalling.river.RiverMarshaller.doWriteSerializableObject(RiverMarshaller.java:1040)
		at org.jboss.marshalling.river.RiverMarshaller.doWriteObject(RiverMarshaller.java:920)
		at org.jboss.marshalling.river.RiverMarshaller.doWriteObject(RiverMarshaller.java:844)
		at org.jboss.marshalling.river.RiverMarshaller.doWriteFields(RiverMarshaller.java:1082)
		at org.jboss.marshalling.river.RiverMarshaller.doWriteSerializableObject(RiverMarshaller.java:1040)
		at org.jboss.marshalling.river.RiverMarshaller.doWriteObject(RiverMarshaller.java:920)
		at org.jboss.marshalling.river.RiverMarshaller.doWriteFields(RiverMarshaller.java:1082)
		at org.jboss.marshalling.river.RiverMarshaller.doWriteSerializableObject(RiverMarshaller.java:1040)
		at org.jboss.marshalling.river.RiverMarshaller.doWriteObject(RiverMarshaller.java:920)
		at org.jboss.marshalling.river.RiverMarshaller.doWriteFields(RiverMarshaller.java:1082)
		at org.jboss.marshalling.river.RiverMarshaller.doWriteSerializableObject(RiverMarshaller.java:1040)
		at org.jboss.marshalling.river.RiverMarshaller.doWriteObject(RiverMarshaller.java:920)
		at org.jboss.marshalling.river.RiverMarshaller.doWriteFields(RiverMarshaller.java:1082)
		at org.jboss.marshalling.river.RiverMarshaller.doWriteSerializableObject(RiverMarshaller.java:1040)
		at org.jboss.marshalling.river.RiverMarshaller.doWriteObject(RiverMarshaller.java:920)
		at org.jboss.marshalling.river.RiverMarshaller.doWriteFields(RiverMarshaller.java:1082)
		at org.jboss.marshalling.river.RiverMarshaller.doWriteSerializableObject(RiverMarshaller.java:1040)
		at org.jboss.marshalling.river.RiverMarshaller.doWriteObject(RiverMarshaller.java:920)
		at org.jboss.marshalling.river.RiverMarshaller.doWriteFields(RiverMarshaller.java:1082)
		at org.jboss.marshalling.river.RiverMarshaller.doWriteSerializableObject(RiverMarshaller.java:1040)
		at org.jboss.marshalling.river.RiverMarshaller.doWriteSerializableObject(RiverMarshaller.java:1019)
		at org.jboss.marshalling.river.RiverMarshaller.doWriteObject(RiverMarshaller.java:920)
		at org.jboss.marshalling.river.RiverMarshaller.doWriteFields(RiverMarshaller.java:1082)
		at org.jboss.marshalling.river.RiverMarshaller.doWriteSerializableObject(RiverMarshaller.java:1040)
		at org.jboss.marshalling.river.RiverMarshaller.doWriteSerializableObject(RiverMarshaller.java:1019)
		at org.jboss.marshalling.river.RiverMarshaller.doWriteObject(RiverMarshaller.java:920)
		at org.jboss.marshalling.river.BlockMarshaller.doWriteObject(BlockMarshaller.java:65)
		at org.jboss.marshalling.river.BlockMarshaller.writeObject(BlockMarshaller.java:56)
		at org.jboss.marshalling.MarshallerObjectOutputStream.writeObjectOverride(MarshallerObjectOutputStream.java:50)
		at org.jboss.marshalling.river.RiverObjectOutputStream.writeObjectOverride(RiverObjectOutputStream.java:179)
		at java.io.ObjectOutputStream.writeObject(ObjectOutputStream.java:344)
		at java.util.HashMap.internalWriteEntries(HashMap.java:1785)
		at java.util.HashMap.writeObject(HashMap.java:1362)
		at sun.reflect.GeneratedMethodAccessor49.invoke(Unknown Source)
		at sun.reflect.DelegatingMethodAccessorImpl.invoke(DelegatingMethodAccessorImpl.java:43)
		at java.lang.reflect.Method.invoke(Method.java:498)
		at org.jboss.marshalling.reflect.JDKSpecific$SerMethods.callWriteObject(JDKSpecific.java:156)
		at org.jboss.marshalling.reflect.SerializableClass.callWriteObject(SerializableClass.java:191)
		at org.jboss.marshalling.river.RiverMarshaller.doWriteSerializableObject(RiverMarshaller.java:1028)
		at org.jboss.marshalling.river.RiverMarshaller.doWriteObject(RiverMarshaller.java:920)
		at org.jboss.marshalling.river.RiverMarshaller.doWriteFields(RiverMarshaller.java:1082)
		at org.jboss.marshalling.river.RiverMarshaller.doWriteSerializableObject(RiverMarshaller.java:1040)
		at org.jboss.marshalling.river.RiverMarshaller.doWriteObject(RiverMarshaller.java:920)
		at org.jboss.marshalling.river.RiverMarshaller.doWriteFields(RiverMarshaller.java:1082)
		at org.jboss.marshalling.river.RiverMarshaller.doWriteSerializableObject(RiverMarshaller.java:1040)
		at org.jboss.marshalling.river.RiverMarshaller.doWriteSerializableObject(RiverMarshaller.java:1019)
		at org.jboss.marshalling.river.RiverMarshaller.doWriteObject(RiverMarshaller.java:920)
		at org.jboss.marshalling.river.RiverMarshaller.doWriteFields(RiverMarshaller.java:1082)
		at org.jboss.marshalling.river.RiverMarshaller.doWriteSerializableObject(RiverMarshaller.java:1040)
		at org.jboss.marshalling.river.RiverMarshaller.doWriteSerializableObject(RiverMarshaller.java:1019)
		at org.jboss.marshalling.river.RiverMarshaller.doWriteObject(RiverMarshaller.java:920)
		at org.jboss.marshalling.river.RiverMarshaller.doWriteFields(RiverMarshaller.java:1082)
		at org.jboss.marshalling.river.RiverMarshaller.doWriteSerializableObject(RiverMarshaller.java:1040)
		at org.jboss.marshalling.river.RiverMarshaller.doWriteSerializableObject(RiverMarshaller.java:1019)
		at org.jboss.marshalling.river.RiverMarshaller.doWriteObject(RiverMarshaller.java:920)
		at org.jboss.marshalling.river.RiverMarshaller.doWriteFields(RiverMarshaller.java:1082)
		at org.jboss.marshalling.river.RiverMarshaller.doWriteSerializableObject(RiverMarshaller.java:1040)
		at org.jboss.marshalling.river.RiverMarshaller.doWriteSerializableObject(RiverMarshaller.java:1019)
		at org.jboss.marshalling.river.RiverMarshaller.doWriteObject(RiverMarshaller.java:920)
		at org.jboss.marshalling.river.RiverMarshaller.doWriteFields(RiverMarshaller.java:1082)
		at org.jboss.marshalling.river.RiverMarshaller.doWriteSerializableObject(RiverMarshaller.java:1040)
		at org.jboss.marshalling.river.RiverMarshaller.doWriteSerializableObject(RiverMarshaller.java:1019)
		at org.jboss.marshalling.river.RiverMarshaller.doWriteObject(RiverMarshaller.java:920)
		at org.jboss.marshalling.river.RiverMarshaller.doWriteFields(RiverMarshaller.java:1082)
		at org.jboss.marshalling.river.RiverMarshaller.doWriteSerializableObject(RiverMarshaller.java:1040)
		at org.jboss.marshalling.river.RiverMarshaller.doWriteSerializableObject(RiverMarshaller.java:1019)
		at org.jboss.marshalling.river.RiverMarshaller.doWriteObject(RiverMarshaller.java:920)
		at org.jboss.marshalling.river.RiverMarshaller.doWriteFields(RiverMarshaller.java:1082)
		at org.jboss.marshalling.river.RiverMarshaller.doWriteSerializableObject(RiverMarshaller.java:1040)
		at org.jboss.marshalling.river.RiverMarshaller.doWriteSerializableObject(RiverMarshaller.java:1019)
		at org.jboss.marshalling.river.RiverMarshaller.doWriteObject(RiverMarshaller.java:920)
		at org.jboss.marshalling.river.RiverMarshaller.doWriteFields(RiverMarshaller.java:1082)
		at org.jboss.marshalling.river.RiverMarshaller.doWriteSerializableObject(RiverMarshaller.java:1040)
		at org.jboss.marshalling.river.RiverMarshaller.doWriteSerializableObject(RiverMarshaller.java:1019)
		at org.jboss.marshalling.river.RiverMarshaller.doWriteObject(RiverMarshaller.java:920)
		at org.jboss.marshalling.river.RiverMarshaller.doWriteFields(RiverMarshaller.java:1082)
		at org.jboss.marshalling.river.RiverMarshaller.doWriteSerializableObject(RiverMarshaller.java:1040)
		at org.jboss.marshalling.river.RiverMarshaller.doWriteSerializableObject(RiverMarshaller.java:1019)
		at org.jboss.marshalling.river.RiverMarshaller.doWriteObject(RiverMarshaller.java:920)
		at org.jboss.marshalling.river.RiverMarshaller.doWriteFields(RiverMarshaller.java:1082)
		at org.jboss.marshalling.river.RiverMarshaller.doWriteSerializableObject(RiverMarshaller.java:1040)
		at org.jboss.marshalling.river.RiverMarshaller.doWriteSerializableObject(RiverMarshaller.java:1019)
		at org.jboss.marshalling.river.RiverMarshaller.doWriteObject(RiverMarshaller.java:920)
		at org.jboss.marshalling.river.RiverMarshaller.doWriteFields(RiverMarshaller.java:1082)
		at org.jboss.marshalling.river.RiverMarshaller.doWriteSerializableObject(RiverMarshaller.java:1040)
		at org.jboss.marshalling.river.RiverMarshaller.doWriteSerializableObject(RiverMarshaller.java:1019)
		at org.jboss.marshalling.river.RiverMarshaller.doWriteObject(RiverMarshaller.java:920)
		at org.jboss.marshalling.river.RiverMarshaller.doWriteFields(RiverMarshaller.java:1082)
		at org.jboss.marshalling.river.RiverMarshaller.doWriteSerializableObject(RiverMarshaller.java:1040)
		at org.jboss.marshalling.river.RiverMarshaller.doWriteSerializableObject(RiverMarshaller.java:1019)
		at org.jboss.marshalling.river.RiverMarshaller.doWriteObject(RiverMarshaller.java:920)
		at org.jboss.marshalling.river.RiverMarshaller.doWriteFields(RiverMarshaller.java:1082)
		at org.jboss.marshalling.river.RiverMarshaller.doWriteSerializableObject(RiverMarshaller.java:1040)
		at org.jboss.marshalling.river.RiverMarshaller.doWriteSerializableObject(RiverMarshaller.java:1019)
		at org.jboss.marshalling.river.RiverMarshaller.doWriteObject(RiverMarshaller.java:920)
		at org.jboss.marshalling.river.RiverMarshaller.doWriteFields(RiverMarshaller.java:1082)
		at org.jboss.marshalling.river.RiverMarshaller.doWriteSerializableObject(RiverMarshaller.java:1040)
		at org.jboss.marshalling.river.RiverMarshaller.doWriteSerializableObject(RiverMarshaller.java:1019)
		at org.jboss.marshalling.river.RiverMarshaller.doWriteObject(RiverMarshaller.java:920)
		at org.jboss.marshalling.river.RiverMarshaller.doWriteFields(RiverMarshaller.java:1082)
		at org.jboss.marshalling.river.RiverMarshaller.doWriteSerializableObject(RiverMarshaller.java:1040)
		at org.jboss.marshalling.river.RiverMarshaller.doWriteSerializableObject(RiverMarshaller.java:1019)
		at org.jboss.marshalling.river.RiverMarshaller.doWriteObject(RiverMarshaller.java:920)
		at org.jboss.marshalling.river.RiverMarshaller.doWriteFields(RiverMarshaller.java:1082)
		at org.jboss.marshalling.river.RiverMarshaller.doWriteSerializableObject(RiverMarshaller.java:1040)
		at org.jboss.marshalling.river.RiverMarshaller.doWriteObject(RiverMarshaller.java:920)
		at org.jboss.marshalling.river.RiverMarshaller.doWriteFields(RiverMarshaller.java:1082)
		at org.jboss.marshalling.river.RiverMarshaller.doWriteSerializableObject(RiverMarshaller.java:1040)
		at org.jboss.marshalling.river.RiverMarshaller.doWriteSerializableObject(RiverMarshaller.java:1019)
		at org.jboss.marshalling.river.RiverMarshaller.doWriteObject(RiverMarshaller.java:920)
		at org.jboss.marshalling.river.RiverMarshaller.doWriteFields(RiverMarshaller.java:1082)
		at org.jboss.marshalling.river.RiverMarshaller.doWriteSerializableObject(RiverMarshaller.java:1040)
		at org.jboss.marshalling.river.RiverMarshaller.doWriteSerializableObject(RiverMarshaller.java:1019)
		at org.jboss.marshalling.river.RiverMarshaller.doWriteSerializableObject(RiverMarshaller.java:1019)
		at org.jboss.marshalling.river.RiverMarshaller.doWriteObject(RiverMarshaller.java:920)
		at org.jboss.marshalling.river.BlockMarshaller.doWriteObject(BlockMarshaller.java:65)
		at org.jboss.marshalling.river.BlockMarshaller.writeObject(BlockMarshaller.java:56)
		at org.jboss.marshalling.MarshallerObjectOutputStream.writeObjectOverride(MarshallerObjectOutputStream.java:50)
		at org.jboss.marshalling.river.RiverObjectOutputStream.writeObjectOverride(RiverObjectOutputStream.java:179)
		at java.io.ObjectOutputStream.writeObject(ObjectOutputStream.java:344)
		at java.util.HashMap.internalWriteEntries(HashMap.java:1785)
		at java.util.HashMap.writeObject(HashMap.java:1362)
		at sun.reflect.GeneratedMethodAccessor49.invoke(Unknown Source)
		at sun.reflect.DelegatingMethodAccessorImpl.invoke(DelegatingMethodAccessorImpl.java:43)
		at java.lang.reflect.Method.invoke(Method.java:498)
		at org.jboss.marshalling.reflect.JDKSpecific$SerMethods.callWriteObject(JDKSpecific.java:156)
		at org.jboss.marshalling.reflect.SerializableClass.callWriteObject(SerializableClass.java:191)
		at org.jboss.marshalling.river.RiverMarshaller.doWriteSerializableObject(RiverMarshaller.java:1028)
		at org.jboss.marshalling.river.RiverMarshaller.doWriteObject(RiverMarshaller.java:920)
		at org.jboss.marshalling.river.RiverMarshaller.doWriteFields(RiverMarshaller.java:1082)
		at org.jboss.marshalling.river.RiverMarshaller.doWriteSerializableObject(RiverMarshaller.java:1040)
		at org.jboss.marshalling.river.RiverMarshaller.doWriteObject(RiverMarshaller.java:920)
		at org.jboss.marshalling.AbstractObjectOutput.writeObject(AbstractObjectOutput.java:58)
		at org.jboss.marshalling.AbstractMarshaller.writeObject(AbstractMarshaller.java:111)
		at org.jenkinsci.plugins.workflow.support.pickles.serialization.RiverWriter.lambda$writeObject$0(RiverWriter.java:144)
		at org.jenkinsci.plugins.scriptsecurity.sandbox.groovy.GroovySandbox.runInSandbox(GroovySandbox.java:237)
		at org.jenkinsci.plugins.workflow.support.pickles.serialization.RiverWriter.writeObject(RiverWriter.java:143)
		at org.jenkinsci.plugins.workflow.cps.CpsThreadGroup.saveProgram(CpsThreadGroup.java:557)
		at org.jenkinsci.plugins.workflow.cps.CpsThreadGroup.saveProgram(CpsThreadGroup.java:534)
		at org.jenkinsci.plugins.workflow.cps.CpsThreadGroup.saveProgramIfPossible(CpsThreadGroup.java:521)
		at org.jenkinsci.plugins.workflow.cps.CpsThreadGroup.run(CpsThreadGroup.java:445)
		at org.jenkinsci.plugins.workflow.cps.CpsThreadGroup.access$400(CpsThreadGroup.java:96)
		at org.jenkinsci.plugins.workflow.cps.CpsThreadGroup$2.call(CpsThreadGroup.java:317)
		at org.jenkinsci.plugins.workflow.cps.CpsThreadGroup$2.call(CpsThreadGroup.java:281)
		at org.jenkinsci.plugins.workflow.cps.CpsVmExecutorService$2.call(CpsVmExecutorService.java:67)
Also:   hudson.AbortException: script returned exit code 1
		at org.jenkinsci.plugins.workflow.steps.durable_task.DurableTaskStep$Execution.handleExit(DurableTaskStep.java:658)
		at org.jenkinsci.plugins.workflow.steps.durable_task.DurableTaskStep$Execution.check(DurableTaskStep.java:604)
		at org.jenkinsci.plugins.workflow.steps.durable_task.DurableTaskStep$Execution.run(DurableTaskStep.java:548)
		at java.util.concurrent.Executors$RunnableAdapter.call(Executors.java:511)
		at java.util.concurrent.FutureTask.run(FutureTask.java:266)
		at java.util.concurrent.ScheduledThreadPoolExecutor$ScheduledFutureTask.access$201(ScheduledThreadPoolExecutor.java:180)
		at java.util.concurrent.ScheduledThreadPoolExecutor$ScheduledFutureTask.run(ScheduledThreadPoolExecutor.java:293)
Also:   hudson.AbortException: script returned exit code 2
		at org.jenkinsci.plugins.workflow.steps.durable_task.DurableTaskStep$Execution.handleExit(DurableTaskStep.java:658)
		at org.jenkinsci.plugins.workflow.steps.durable_task.DurableTaskStep$Execution.check(DurableTaskStep.java:604)
		at org.jenkinsci.plugins.workflow.steps.durable_task.DurableTaskStep$Execution.run(DurableTaskStep.java:548)
		at java.util.concurrent.Executors$RunnableAdapter.call(Executors.java:511)
		at java.util.concurrent.FutureTask.run(FutureTask.java:266)
		at java.util.concurrent.ScheduledThreadPoolExecutor$ScheduledFutureTask.access$201(ScheduledThreadPoolExecutor.java:180)
		at java.util.concurrent.ScheduledThreadPoolExecutor$ScheduledFutureTask.run(ScheduledThreadPoolExecutor.java:293)
Also:   hudson.AbortException: script returned exit code 2
		at org.jenkinsci.plugins.workflow.steps.durable_task.DurableTaskStep$Execution.handleExit(DurableTaskStep.java:658)
		at org.jenkinsci.plugins.workflow.steps.durable_task.DurableTaskStep$Execution.check(DurableTaskStep.java:604)
		at org.jenkinsci.plugins.workflow.steps.durable_task.DurableTaskStep$Execution.run(DurableTaskStep.java:548)
		at java.util.concurrent.Executors$RunnableAdapter.call(Executors.java:511)
		at java.util.concurrent.FutureTask.run(FutureTask.java:266)
		at java.util.concurrent.ScheduledThreadPoolExecutor$ScheduledFutureTask.access$201(ScheduledThreadPoolExecutor.java:180)
		at java.util.concurrent.ScheduledThreadPoolExecutor$ScheduledFutureTask.run(ScheduledThreadPoolExecutor.java:293)
Caused: java.io.IOException: No space left on device
	at java.io.FileOutputStream.writeBytes(Native Method)
	at java.io.FileOutputStream.write(FileOutputStream.java:326)
	at java.io.BufferedOutputStream.flushBuffer(BufferedOutputStream.java:82)
	at java.io.BufferedOutputStream.write(BufferedOutputStream.java:126)
	at java.io.DataOutputStream.write(DataOutputStream.java:107)
	at org.jboss.marshalling.OutputStreamByteOutput.write(OutputStreamByteOutput.java:52)
	at org.jboss.marshalling.SimpleDataOutput.shallowFlush(SimpleDataOutput.java:353)
	at org.jboss.marshalling.river.RiverMarshaller.doWriteObject(RiverMarshaller.java:266)
	at org.jboss.marshalling.river.RiverMarshaller.doWriteFields(RiverMarshaller.java:1082)
	at org.jboss.marshalling.river.RiverMarshaller.doWriteSerializableObject(RiverMarshaller.java:1040)
	at org.jboss.marshalling.river.RiverMarshaller.doWriteObject(RiverMarshaller.java:920)
	at org.jboss.marshalling.river.RiverMarshaller.doWriteObject(RiverMarshaller.java:844)
	at org.jboss.marshalling.river.RiverMarshaller.doWriteFields(RiverMarshaller.java:1082)
	at org.jboss.marshalling.river.RiverMarshaller.doWriteSerializableObject(RiverMarshaller.java:1040)
	at org.jboss.marshalling.river.RiverMarshaller.doWriteSerializableObject(RiverMarshaller.java:1019)
	at org.jboss.marshalling.river.RiverMarshaller.doWriteObject(RiverMarshaller.java:920)
	at org.jboss.marshalling.river.RiverMarshaller.doWriteObject(RiverMarshaller.java:844)
	at org.jboss.marshalling.river.RiverMarshaller.doWriteFields(RiverMarshaller.java:1082)
	at org.jboss.marshalling.river.RiverMarshaller.doWriteSerializableObject(RiverMarshaller.java:1040)
	at org.jboss.marshalling.river.RiverMarshaller.doWriteObject(RiverMarshaller.java:920)
	at org.jboss.marshalling.river.RiverMarshaller.doWriteFields(RiverMarshaller.java:1082)
	at org.jboss.marshalling.river.RiverMarshaller.doWriteSerializableObject(RiverMarshaller.java:1040)
	at org.jboss.marshalling.river.RiverMarshaller.doWriteObject(RiverMarshaller.java:920)
	at org.jboss.marshalling.river.RiverMarshaller.doWriteFields(RiverMarshaller.java:1082)
	at org.jboss.marshalling.river.RiverMarshaller.doWriteSerializableObject(RiverMarshaller.java:1040)
	at org.jboss.marshalling.river.RiverMarshaller.doWriteObject(RiverMarshaller.java:920)
	at org.jboss.marshalling.river.RiverMarshaller.doWriteFields(RiverMarshaller.java:1082)
	at org.jboss.marshalling.river.RiverMarshaller.doWriteSerializableObject(RiverMarshaller.java:1040)
	at org.jboss.marshalling.river.RiverMarshaller.doWriteObject(RiverMarshaller.java:920)
	at org.jboss.marshalling.river.RiverMarshaller.doWriteFields(RiverMarshaller.java:1082)
	at org.jboss.marshalling.river.RiverMarshaller.doWriteSerializableObject(RiverMarshaller.java:1040)
	at org.jboss.marshalling.river.RiverMarshaller.doWriteObject(RiverMarshaller.java:920)
	at org.jboss.marshalling.river.RiverMarshaller.doWriteObject(RiverMarshaller.java:844)
	at org.jboss.marshalling.river.RiverMarshaller.doWriteFields(RiverMarshaller.java:1082)
	at org.jboss.marshalling.river.RiverMarshaller.doWriteSerializableObject(RiverMarshaller.java:1040)
	at org.jboss.marshalling.river.RiverMarshaller.doWriteObject(RiverMarshaller.java:920)
	at org.jboss.marshalling.river.RiverMarshaller.doWriteObject(RiverMarshaller.java:844)
	at org.jboss.marshalling.river.RiverMarshaller.doWriteFields(RiverMarshaller.java:1082)
	at org.jboss.marshalling.river.RiverMarshaller.doWriteSerializableObject(RiverMarshaller.java:1040)
	at org.jboss.marshalling.river.RiverMarshaller.doWriteObject(RiverMarshaller.java:920)
	at org.jboss.marshalling.river.RiverMarshaller.doWriteObject(RiverMarshaller.java:844)
	at org.jboss.marshalling.river.RiverMarshaller.doWriteFields(RiverMarshaller.java:1082)
	at org.jboss.marshalling.river.RiverMarshaller.doWriteSerializableObject(RiverMarshaller.java:1040)
	at org.jboss.marshalling.river.RiverMarshaller.doWriteSerializableObject(RiverMarshaller.java:1019)
	at org.jboss.marshalling.river.RiverMarshaller.doWriteObject(RiverMarshaller.java:920)
	at org.jboss.marshalling.river.RiverMarshaller.doWriteObject(RiverMarshaller.java:844)
	at org.jboss.marshalling.river.RiverMarshaller.doWriteFields(RiverMarshaller.java:1082)
	at org.jboss.marshalling.river.RiverMarshaller.doWriteSerializableObject(RiverMarshaller.java:1040)
	at org.jboss.marshalling.river.RiverMarshaller.doWriteObject(RiverMarshaller.java:920)
	at org.jboss.marshalling.river.RiverMarshaller.doWriteObject(RiverMarshaller.java:844)
	at org.jboss.marshalling.river.RiverMarshaller.doWriteFields(RiverMarshaller.java:1082)
	at org.jboss.marshalling.river.RiverMarshaller.doWriteSerializableObject(RiverMarshaller.java:1040)
	at org.jboss.marshalling.river.RiverMarshaller.doWriteObject(RiverMarshaller.java:920)
	at org.jboss.marshalling.river.RiverMarshaller.doWriteFields(RiverMarshaller.java:1082)
	at org.jboss.marshalling.river.RiverMarshaller.doWriteSerializableObject(RiverMarshaller.java:1040)
	at org.jboss.marshalling.river.RiverMarshaller.doWriteObject(RiverMarshaller.java:920)
	at org.jboss.marshalling.river.RiverMarshaller.doWriteFields(RiverMarshaller.java:1082)
	at org.jboss.marshalling.river.RiverMarshaller.doWriteSerializableObject(RiverMarshaller.java:1040)
	at org.jboss.marshalling.river.RiverMarshaller.doWriteObject(RiverMarshaller.java:920)
	at org.jboss.marshalling.river.RiverMarshaller.doWriteFields(RiverMarshaller.java:1082)
	at org.jboss.marshalling.river.RiverMarshaller.doWriteSerializableObject(RiverMarshaller.java:1040)
	at org.jboss.marshalling.river.RiverMarshaller.doWriteObject(RiverMarshaller.java:920)
	at org.jboss.marshalling.river.RiverMarshaller.doWriteFields(RiverMarshaller.java:1082)
	at org.jboss.marshalling.river.RiverMarshaller.doWriteSerializableObject(RiverMarshaller.java:1040)
	at org.jboss.marshalling.river.RiverMarshaller.doWriteObject(RiverMarshaller.java:920)
	at org.jboss.marshalling.river.RiverMarshaller.doWriteFields(RiverMarshaller.java:1082)
	at org.jboss.marshalling.river.RiverMarshaller.doWriteSerializableObject(RiverMarshaller.java:1040)
	at org.jboss.marshalling.river.RiverMarshaller.doWriteSerializableObject(RiverMarshaller.java:1019)
	at org.jboss.marshalling.river.RiverMarshaller.doWriteObject(RiverMarshaller.java:920)
	at org.jboss.marshalling.river.RiverMarshaller.doWriteFields(RiverMarshaller.java:1082)
	at org.jboss.marshalling.river.RiverMarshaller.doWriteSerializableObject(RiverMarshaller.java:1040)
	at org.jboss.marshalling.river.RiverMarshaller.doWriteSerializableObject(RiverMarshaller.java:1019)
	at org.jboss.marshalling.river.RiverMarshaller.doWriteObject(RiverMarshaller.java:920)
	at org.jboss.marshalling.river.BlockMarshaller.doWriteObject(BlockMarshaller.java:65)
	at org.jboss.marshalling.river.BlockMarshaller.writeObject(BlockMarshaller.java:56)
	at org.jboss.marshalling.MarshallerObjectOutputStream.writeObjectOverride(MarshallerObjectOutputStream.java:50)
	at org.jboss.marshalling.river.RiverObjectOutputStream.writeObjectOverride(RiverObjectOutputStream.java:179)
	at java.io.ObjectOutputStream.writeObject(ObjectOutputStream.java:344)
	at java.util.HashMap.internalWriteEntries(HashMap.java:1785)
	at java.util.HashMap.writeObject(HashMap.java:1362)
	at sun.reflect.GeneratedMethodAccessor49.invoke(Unknown Source)
	at sun.reflect.DelegatingMethodAccessorImpl.invoke(DelegatingMethodAccessorImpl.java:43)
	at java.lang.reflect.Method.invoke(Method.java:498)
	at org.jboss.marshalling.reflect.JDKSpecific$SerMethods.callWriteObject(JDKSpecific.java:156)
	at org.jboss.marshalling.reflect.SerializableClass.callWriteObject(SerializableClass.java:191)
	at org.jboss.marshalling.river.RiverMarshaller.doWriteSerializableObject(RiverMarshaller.java:1028)
	at org.jboss.marshalling.river.RiverMarshaller.doWriteObject(RiverMarshaller.java:920)
	at org.jboss.marshalling.river.RiverMarshaller.doWriteFields(RiverMarshaller.java:1082)
	at org.jboss.marshalling.river.RiverMarshaller.doWriteSerializableObject(RiverMarshaller.java:1040)
	at org.jboss.marshalling.river.RiverMarshaller.doWriteObject(RiverMarshaller.java:920)
	at org.jboss.marshalling.river.RiverMarshaller.doWriteFields(RiverMarshaller.java:1082)
	at org.jboss.marshalling.river.RiverMarshaller.doWriteSerializableObject(RiverMarshaller.java:1040)
	at org.jboss.marshalling.river.RiverMarshaller.doWriteSerializableObject(RiverMarshaller.java:1019)
	at org.jboss.marshalling.river.RiverMarshaller.doWriteObject(RiverMarshaller.java:920)
	at org.jboss.marshalling.river.RiverMarshaller.doWriteFields(RiverMarshaller.java:1082)
	at org.jboss.marshalling.river.RiverMarshaller.doWriteSerializableObject(RiverMarshaller.java:1040)
	at org.jboss.marshalling.river.RiverMarshaller.doWriteSerializableObject(RiverMarshaller.java:1019)
	at org.jboss.marshalling.river.RiverMarshaller.doWriteObject(RiverMarshaller.java:920)
	at org.jboss.marshalling.river.RiverMarshaller.doWriteFields(RiverMarshaller.java:1082)
	at org.jboss.marshalling.river.RiverMarshaller.doWriteSerializableObject(RiverMarshaller.java:1040)
	at org.jboss.marshalling.river.RiverMarshaller.doWriteSerializableObject(RiverMarshaller.java:1019)
	at org.jboss.marshalling.river.RiverMarshaller.doWriteObject(RiverMarshaller.java:920)
	at org.jboss.marshalling.river.RiverMarshaller.doWriteFields(RiverMarshaller.java:1082)
	at org.jboss.marshalling.river.RiverMarshaller.doWriteSerializableObject(RiverMarshaller.java:1040)
	at org.jboss.marshalling.river.RiverMarshaller.doWriteSerializableObject(RiverMarshaller.java:1019)
	at org.jboss.marshalling.river.RiverMarshaller.doWriteObject(RiverMarshaller.java:920)
	at org.jboss.marshalling.river.RiverMarshaller.doWriteFields(RiverMarshaller.java:1082)
	at org.jboss.marshalling.river.RiverMarshaller.doWriteSerializableObject(RiverMarshaller.java:1040)
	at org.jboss.marshalling.river.RiverMarshaller.doWriteSerializableObject(RiverMarshaller.java:1019)
	at org.jboss.marshalling.river.RiverMarshaller.doWriteObject(RiverMarshaller.java:920)
	at org.jboss.marshalling.river.RiverMarshaller.doWriteFields(RiverMarshaller.java:1082)
	at org.jboss.marshalling.river.RiverMarshaller.doWriteSerializableObject(RiverMarshaller.java:1040)
	at org.jboss.marshalling.river.RiverMarshaller.doWriteSerializableObject(RiverMarshaller.java:1019)
	at org.jboss.marshalling.river.RiverMarshaller.doWriteObject(RiverMarshaller.java:920)
	at org.jboss.marshalling.river.RiverMarshaller.doWriteFields(RiverMarshaller.java:1082)
	at org.jboss.marshalling.river.RiverMarshaller.doWriteSerializableObject(RiverMarshaller.java:1040)
	at org.jboss.marshalling.river.RiverMarshaller.doWriteSerializableObject(RiverMarshaller.java:1019)
	at org.jboss.marshalling.river.RiverMarshaller.doWriteObject(RiverMarshaller.java:920)
	at org.jboss.marshalling.river.RiverMarshaller.doWriteFields(RiverMarshaller.java:1082)
	at org.jboss.marshalling.river.RiverMarshaller.doWriteSerializableObject(RiverMarshaller.java:1040)
	at org.jboss.marshalling.river.RiverMarshaller.doWriteSerializableObject(RiverMarshaller.java:1019)
	at org.jboss.marshalling.river.RiverMarshaller.doWriteObject(RiverMarshaller.java:920)
	at org.jboss.marshalling.river.RiverMarshaller.doWriteFields(RiverMarshaller.java:1082)
	at org.jboss.marshalling.river.RiverMarshaller.doWriteSerializableObject(RiverMarshaller.java:1040)
	at org.jboss.marshalling.river.RiverMarshaller.doWriteSerializableObject(RiverMarshaller.java:1019)
	at org.jboss.marshalling.river.RiverMarshaller.doWriteObject(RiverMarshaller.java:920)
	at org.jboss.marshalling.river.RiverMarshaller.doWriteFields(RiverMarshaller.java:1082)
	at org.jboss.marshalling.river.RiverMarshaller.doWriteSerializableObject(RiverMarshaller.java:1040)
	at org.jboss.marshalling.river.RiverMarshaller.doWriteSerializableObject(RiverMarshaller.java:1019)
	at org.jboss.marshalling.river.RiverMarshaller.doWriteObject(RiverMarshaller.java:920)
	at org.jboss.marshalling.river.RiverMarshaller.doWriteFields(RiverMarshaller.java:1082)
	at org.jboss.marshalling.river.RiverMarshaller.doWriteSerializableObject(RiverMarshaller.java:1040)
	at org.jboss.marshalling.river.RiverMarshaller.doWriteSerializableObject(RiverMarshaller.java:1019)
	at org.jboss.marshalling.river.RiverMarshaller.doWriteObject(RiverMarshaller.java:920)
	at org.jboss.marshalling.river.RiverMarshaller.doWriteFields(RiverMarshaller.java:1082)
	at org.jboss.marshalling.river.RiverMarshaller.doWriteSerializableObject(RiverMarshaller.java:1040)
	at org.jboss.marshalling.river.RiverMarshaller.doWriteSerializableObject(RiverMarshaller.java:1019)
	at org.jboss.marshalling.river.RiverMarshaller.doWriteObject(RiverMarshaller.java:920)
	at org.jboss.marshalling.river.RiverMarshaller.doWriteFields(RiverMarshaller.java:1082)
	at org.jboss.marshalling.river.RiverMarshaller.doWriteSerializableObject(RiverMarshaller.java:1040)
	at org.jboss.marshalling.river.RiverMarshaller.doWriteSerializableObject(RiverMarshaller.java:1019)
	at org.jboss.marshalling.river.RiverMarshaller.doWriteObject(RiverMarshaller.java:920)
	at org.jboss.marshalling.river.RiverMarshaller.doWriteFields(RiverMarshaller.java:1082)
	at org.jboss.marshalling.river.RiverMarshaller.doWriteSerializableObject(RiverMarshaller.java:1040)
	at org.jboss.marshalling.river.RiverMarshaller.doWriteSerializableObject(RiverMarshaller.java:1019)
	at org.jboss.marshalling.river.RiverMarshaller.doWriteObject(RiverMarshaller.java:920)
	at org.jboss.marshalling.river.RiverMarshaller.doWriteFields(RiverMarshaller.java:1082)
	at org.jboss.marshalling.river.RiverMarshaller.doWriteSerializableObject(RiverMarshaller.java:1040)
	at org.jboss.marshalling.river.RiverMarshaller.doWriteSerializableObject(RiverMarshaller.java:1019)
	at org.jboss.marshalling.river.RiverMarshaller.doWriteObject(RiverMarshaller.java:920)
	at org.jboss.marshalling.river.RiverMarshaller.doWriteFields(RiverMarshaller.java:1082)
	at org.jboss.marshalling.river.RiverMarshaller.doWriteSerializableObject(RiverMarshaller.java:1040)
	at org.jboss.marshalling.river.RiverMarshaller.doWriteObject(RiverMarshaller.java:920)
	at org.jboss.marshalling.river.RiverMarshaller.doWriteFields(RiverMarshaller.java:1082)
	at org.jboss.marshalling.river.RiverMarshaller.doWriteSerializableObject(RiverMarshaller.java:1040)
	at org.jboss.marshalling.river.RiverMarshaller.doWriteSerializableObject(RiverMarshaller.java:1019)
	at org.jboss.marshalling.river.RiverMarshaller.doWriteObject(RiverMarshaller.java:920)
	at org.jboss.marshalling.river.RiverMarshaller.doWriteFields(RiverMarshaller.java:1082)
	at org.jboss.marshalling.river.RiverMarshaller.doWriteSerializableObject(RiverMarshaller.java:1040)
	at org.jboss.marshalling.river.RiverMarshaller.doWriteSerializableObject(RiverMarshaller.java:1019)
	at org.jboss.marshalling.river.RiverMarshaller.doWriteSerializableObject(RiverMarshaller.java:1019)
	at org.jboss.marshalling.river.RiverMarshaller.doWriteObject(RiverMarshaller.java:920)
	at org.jboss.marshalling.river.BlockMarshaller.doWriteObject(BlockMarshaller.java:65)
	at org.jboss.marshalling.river.BlockMarshaller.writeObject(BlockMarshaller.java:56)
	at org.jboss.marshalling.MarshallerObjectOutputStream.writeObjectOverride(MarshallerObjectOutputStream.java:50)
	at org.jboss.marshalling.river.RiverObjectOutputStream.writeObjectOverride(RiverObjectOutputStream.java:179)
	at java.io.ObjectOutputStream.writeObject(ObjectOutputStream.java:344)
	at java.util.HashMap.internalWriteEntries(HashMap.java:1785)
	at java.util.HashMap.writeObject(HashMap.java:1362)
	at sun.reflect.GeneratedMethodAccessor49.invoke(Unknown Source)
	at sun.reflect.DelegatingMethodAccessorImpl.invoke(DelegatingMethodAccessorImpl.java:43)
	at java.lang.reflect.Method.invoke(Method.java:498)
	at org.jboss.marshalling.reflect.JDKSpecific$SerMethods.callWriteObject(JDKSpecific.java:156)
	at org.jboss.marshalling.reflect.SerializableClass.callWriteObject(SerializableClass.java:191)
	at org.jboss.marshalling.river.RiverMarshaller.doWriteSerializableObject(RiverMarshaller.java:1028)
	at org.jboss.marshalling.river.RiverMarshaller.doWriteObject(RiverMarshaller.java:920)
	at org.jboss.marshalling.river.RiverMarshaller.doWriteFields(RiverMarshaller.java:1082)
	at org.jboss.marshalling.river.RiverMarshaller.doWriteSerializableObject(RiverMarshaller.java:1040)
	at org.jboss.marshalling.river.RiverMarshaller.doWriteObject(RiverMarshaller.java:920)
	at org.jboss.marshalling.AbstractObjectOutput.writeObject(AbstractObjectOutput.java:58)
	at org.jboss.marshalling.AbstractMarshaller.writeObject(AbstractMarshaller.java:111)
	at org.jenkinsci.plugins.workflow.support.pickles.serialization.RiverWriter.lambda$writeObject$0(RiverWriter.java:144)
	at org.jenkinsci.plugins.scriptsecurity.sandbox.groovy.GroovySandbox.runInSandbox(GroovySandbox.java:237)
	at org.jenkinsci.plugins.workflow.support.pickles.serialization.RiverWriter.writeObject(RiverWriter.java:143)
	at org.jenkinsci.plugins.workflow.cps.CpsThreadGroup.saveProgram(CpsThreadGroup.java:557)
	at org.jenkinsci.plugins.workflow.cps.CpsThreadGroup.saveProgram(CpsThreadGroup.java:534)
	at org.jenkinsci.plugins.workflow.cps.CpsStepContext$3.onSuccess(CpsStepContext.java:555)
	at org.jenkinsci.plugins.workflow.cps.CpsStepContext$3.onSuccess(CpsStepContext.java:549)
	at org.jenkinsci.plugins.workflow.cps.CpsFlowExecution$4$1.run(CpsFlowExecution.java:907)
	at org.jenkinsci.plugins.workflow.cps.CpsVmExecutorService$1.run(CpsVmExecutorService.java:38)
	at java.util.concurrent.Executors$RunnableAdapter.call(Executors.java:511)
	at java.util.concurrent.FutureTask.run(FutureTask.java:266)
	at hudson.remoting.SingleLaneExecutorService$1.run(SingleLaneExecutorService.java:131)
	at jenkins.util.ContextResettingExecutorService$1.run(ContextResettingExecutorService.java:28)
	at jenkins.security.ImpersonatingExecutorService$1.run(ImpersonatingExecutorService.java:59)
	at java.util.concurrent.Executors$RunnableAdapter.call(Executors.java:511)
	at java.util.concurrent.FutureTask.run(FutureTask.java:266)
	at java.util.concurrent.ThreadPoolExecutor.runWorker(ThreadPoolExecutor.java:1142)
	at java.util.concurrent.ThreadPoolExecutor$Worker.run(ThreadPoolExecutor.java:617)
	at java.lang.Thread.run(Thread.java:745)
Finished: FAILURE