FailedConsole Output

Skipping 5,024 KB.. Full Log
64/thirdparty/googletest/googletest && /usr/bin/cmake -E cmake_link_script CMakeFiles/gtest_main.dir/link.txt --verbose=1
/opt/osxcross/target/bin/x86_64-apple-darwin19-ar qc ../../../lib/libgtest_main.a  CMakeFiles/gtest_main.dir/src/gtest_main.cc.o
/opt/osxcross/target/bin/x86_64-apple-darwin19-ranlib ../../../lib/libgtest_main.a
make[2]: Leaving directory '/work/build/darwin-x64'
[ 51%] Built target gtest_main
make -f rabbitmq-core/CMakeFiles/unit-test-rabbitmq-core.dir/build.make rabbitmq-core/CMakeFiles/unit-test-rabbitmq-core.dir/depend
make -f rabbitmq-core/CMakeFiles/it-test-rabbitmq-core.dir/build.make rabbitmq-core/CMakeFiles/it-test-rabbitmq-core.dir/depend
make -f rabbitmq-fmu/CMakeFiles/unit-test-rabbitmq.dir/build.make rabbitmq-fmu/CMakeFiles/unit-test-rabbitmq.dir/depend
make -f rabbitmq-fmu/CMakeFiles/it-test-rabbitmq.dir/build.make rabbitmq-fmu/CMakeFiles/it-test-rabbitmq.dir/depend
make[2]: Entering directory '/work/build/darwin-x64'
cd /work/build/darwin-x64 && /usr/bin/cmake -E cmake_depends "Unix Makefiles" /work /work/rabbitmq-core /work/build/darwin-x64 /work/build/darwin-x64/rabbitmq-core /work/build/darwin-x64/rabbitmq-core/CMakeFiles/unit-test-rabbitmq-core.dir/DependInfo.cmake --color=
make[2]: Entering directory '/work/build/darwin-x64'
cd /work/build/darwin-x64 && /usr/bin/cmake -E cmake_depends "Unix Makefiles" /work /work/rabbitmq-fmu /work/build/darwin-x64 /work/build/darwin-x64/rabbitmq-fmu /work/build/darwin-x64/rabbitmq-fmu/CMakeFiles/it-test-rabbitmq.dir/DependInfo.cmake --color=
make[2]: Entering directory '/work/build/darwin-x64'
cd /work/build/darwin-x64 && /usr/bin/cmake -E cmake_depends "Unix Makefiles" /work /work/rabbitmq-core /work/build/darwin-x64 /work/build/darwin-x64/rabbitmq-core /work/build/darwin-x64/rabbitmq-core/CMakeFiles/it-test-rabbitmq-core.dir/DependInfo.cmake --color=
make[2]: Entering directory '/work/build/darwin-x64'
cd /work/build/darwin-x64 && /usr/bin/cmake -E cmake_depends "Unix Makefiles" /work /work/rabbitmq-fmu /work/build/darwin-x64 /work/build/darwin-x64/rabbitmq-fmu /work/build/darwin-x64/rabbitmq-fmu/CMakeFiles/unit-test-rabbitmq.dir/DependInfo.cmake --color=
Scanning dependencies of target it-test-rabbitmq-core
make[2]: Leaving directory '/work/build/darwin-x64'
make -f rabbitmq-core/CMakeFiles/it-test-rabbitmq-core.dir/build.make rabbitmq-core/CMakeFiles/it-test-rabbitmq-core.dir/build
make[2]: Entering directory '/work/build/darwin-x64'
Scanning dependencies of target unit-test-rabbitmq-core
make[2]: Leaving directory '/work/build/darwin-x64'
make -f rabbitmq-core/CMakeFiles/unit-test-rabbitmq-core.dir/build.make rabbitmq-core/CMakeFiles/unit-test-rabbitmq-core.dir/build
[ 54%] Building CXX object rabbitmq-fmu/CMakeFiles/it-test-rabbitmq.dir/src/FmuContainer.cpp.o
cd /work/build/linux-x86/rabbitmq-fmu && /usr/i686-linux-gnu/bin/i686-linux-gnu-g++  -DAMQP_STATIC -DFMI_COSIMULATION -I/work/rabbitmq-fmu/../thirdparty/fmi/include -I/work/thirdparty/rapidjson/include -I/work/rabbitmq-fmu/src -I/work/thirdparty/rabbitmq-c/rabbitmq-c/librabbitmq -I/work/thirdparty/date/date -I/work/thirdparty/date/date/include -I/work/rabbitmq-core/src -isystem /work/thirdparty/googletest/googletest/include -isystem /work/thirdparty/googletest/googletest -isystem /work/build/external/linux-i386/include  -O2 -g -DNDEBUG   -std=gnu++1z -o CMakeFiles/it-test-rabbitmq.dir/src/FmuContainer.cpp.o -c /work/rabbitmq-fmu/src/FmuContainer.cpp
[ 51%] Building CXX object rabbitmq-core/CMakeFiles/it-test-rabbitmq-core.dir/src/FmuContainerCore.cpp.o
cd /work/build/darwin-x64/rabbitmq-core && /opt/osxcross/target/bin/o64-clang++   -isystem /work/thirdparty/googletest/googletest/include -I/work/rabbitmq-core/src -isystem /work/thirdparty/googletest/googletest -I/work/thirdparty/date/date -I/work/thirdparty/date/date/include  -O2 -g -DNDEBUG -isysroot /opt/osxcross/target/SDK/MacOSX10.15.sdk   -std=gnu++1z -o CMakeFiles/it-test-rabbitmq-core.dir/src/FmuContainerCore.cpp.o -c /work/rabbitmq-core/src/FmuContainerCore.cpp
make[2]: Entering directory '/work/build/darwin-x64'
[ 54%] Building CXX object rabbitmq-core/CMakeFiles/unit-test-rabbitmq-core.dir/src/FmuContainerCore.cpp.o
cd /work/build/darwin-x64/rabbitmq-core && /opt/osxcross/target/bin/o64-clang++   -isystem /work/thirdparty/googletest/googletest/include -I/work/rabbitmq-core/src -isystem /work/thirdparty/googletest/googletest -I/work/thirdparty/date/date -I/work/thirdparty/date/date/include  -O2 -g -DNDEBUG -isysroot /opt/osxcross/target/SDK/MacOSX10.15.sdk   -std=gnu++1z -o CMakeFiles/unit-test-rabbitmq-core.dir/src/FmuContainerCore.cpp.o -c /work/rabbitmq-core/src/FmuContainerCore.cpp
make[2]: Leaving directory '/work/build/darwin-x64'
[ 54%] Building CXX object rabbitmq-fmu/CMakeFiles/unit-test-rabbitmq.dir/src/FmuContainer.cpp.o
cd /work/build/linux-x86/rabbitmq-fmu && /usr/i686-linux-gnu/bin/i686-linux-gnu-g++  -DAMQP_STATIC -DFMI_COSIMULATION -I/work/rabbitmq-fmu/../thirdparty/fmi/include -I/work/thirdparty/rapidjson/include -I/work/rabbitmq-fmu/src -I/work/thirdparty/rabbitmq-c/rabbitmq-c/librabbitmq -I/work/thirdparty/date/date -I/work/thirdparty/date/date/include -I/work/rabbitmq-core/src -isystem /work/thirdparty/googletest/googletest/include -isystem /work/thirdparty/googletest/googletest -isystem /work/build/external/linux-i386/include  -O2 -g -DNDEBUG   -std=gnu++1z -o CMakeFiles/unit-test-rabbitmq.dir/src/FmuContainer.cpp.o -c /work/rabbitmq-fmu/src/FmuContainer.cpp
[ 54%] Built target rabbitmq-main
Scanning dependencies of target it-test-rabbitmq
make[2]: Leaving directory '/work/build/darwin-x64'
make -f rabbitmq-fmu/CMakeFiles/it-test-rabbitmq.dir/build.make rabbitmq-fmu/CMakeFiles/it-test-rabbitmq.dir/build
make[2]: Entering directory '/work/build/darwin-x64'
[ 54%] Building CXX object rabbitmq-core/CMakeFiles/unit-test-rabbitmq-core.dir/test/FmuContainerCore_test.cpp.o
cd /work/build/darwin-x64/rabbitmq-core && /opt/osxcross/target/bin/o64-clang++   -isystem /work/thirdparty/googletest/googletest/include -I/work/rabbitmq-core/src -isystem /work/thirdparty/googletest/googletest -I/work/thirdparty/date/date -I/work/thirdparty/date/date/include  -O2 -g -DNDEBUG -isysroot /opt/osxcross/target/SDK/MacOSX10.15.sdk   -std=gnu++1z -o CMakeFiles/unit-test-rabbitmq-core.dir/test/FmuContainerCore_test.cpp.o -c /work/rabbitmq-core/test/FmuContainerCore_test.cpp
[ 54%] Building C object rabbitmq-fmu/CMakeFiles/it-test-rabbitmq.dir/src/uri.c.o
[ 16%] Linking CXX static library libtz.a
cd /work/build/win-x86/thirdparty/date/date && /usr/src/mxe/usr/x86_64-pc-linux-gnu/bin/cmake -P CMakeFiles/tz.dir/cmake_clean_target.cmake
cd /work/build/win-x86/thirdparty/date/date && /usr/src/mxe/usr/x86_64-pc-linux-gnu/bin/cmake -E cmake_link_script CMakeFiles/tz.dir/link.txt --verbose=1
/usr/src/mxe/usr/bin/i686-w64-mingw32.static-ar qc libtz.a  CMakeFiles/tz.dir/src/tz.cpp.obj
/usr/src/mxe/usr/bin/i686-w64-mingw32.static-ranlib libtz.a
make[2]: Leaving directory '/work/build/win-x86'
[ 16%] Built target tz
make -f rabbitmq-core/CMakeFiles/rabbitmq-core.dir/build.make rabbitmq-core/CMakeFiles/rabbitmq-core.dir/depend
make[2]: Entering directory '/work/build/win-x86'
cd /work/build/win-x86 && /usr/src/mxe/usr/x86_64-pc-linux-gnu/bin/cmake -E cmake_depends "Unix Makefiles" /work /work/rabbitmq-core /work/build/win-x86 /work/build/win-x86/rabbitmq-core /work/build/win-x86/rabbitmq-core/CMakeFiles/rabbitmq-core.dir/DependInfo.cmake --color=
Scanning dependencies of target rabbitmq-core
make[2]: Leaving directory '/work/build/win-x86'
make -f rabbitmq-core/CMakeFiles/rabbitmq-core.dir/build.make rabbitmq-core/CMakeFiles/rabbitmq-core.dir/build
make[2]: Entering directory '/work/build/win-x86'
[ 16%] Building CXX object rabbitmq-core/CMakeFiles/rabbitmq-core.dir/src/FmuContainerCore.cpp.obj
cd /work/build/win-x86/rabbitmq-core && /usr/src/mxe/usr/bin/i686-w64-mingw32.static-g++   @CMakeFiles/rabbitmq-core.dir/includes_CXX.rsp -O3 -DNDEBUG   -std=gnu++17 -o CMakeFiles/rabbitmq-core.dir/src/FmuContainerCore.cpp.obj -c /work/rabbitmq-core/src/FmuContainerCore.cpp
cd /work/build/darwin-x64/rabbitmq-fmu && /opt/osxcross/target/bin/o64-clang -DAMQP_STATIC -DFMI_COSIMULATION -I/work/rabbitmq-fmu/../thirdparty/fmi/include -I/work/thirdparty/rapidjson/include -isystem /work/thirdparty/googletest/googletest/include -I/work/rabbitmq-fmu/src -isystem /work/thirdparty/googletest/googletest -isystem /work/build/external/darwin-x86_64/include -I/work/thirdparty/rabbitmq-c/rabbitmq-c/librabbitmq -I/work/thirdparty/date/date -I/work/thirdparty/date/date/include -I/work/rabbitmq-core/src  -O2 -g -DNDEBUG -isysroot /opt/osxcross/target/SDK/MacOSX10.15.sdk   -o CMakeFiles/it-test-rabbitmq.dir/src/uri.c.o   -c /work/rabbitmq-fmu/src/uri.c
Scanning dependencies of target unit-test-rabbitmq
make[2]: Leaving directory '/work/build/darwin-x64'
make -f rabbitmq-fmu/CMakeFiles/unit-test-rabbitmq.dir/build.make rabbitmq-fmu/CMakeFiles/unit-test-rabbitmq.dir/build
make[2]: Entering directory '/work/build/darwin-x64'
[ 54%] Building C object rabbitmq-fmu/CMakeFiles/unit-test-rabbitmq.dir/src/uri.c.o
cd /work/build/darwin-x64/rabbitmq-fmu && /opt/osxcross/target/bin/o64-clang -DAMQP_STATIC -DFMI_COSIMULATION -I/work/rabbitmq-fmu/../thirdparty/fmi/include -I/work/thirdparty/rapidjson/include -isystem /work/thirdparty/googletest/googletest/include -I/work/rabbitmq-fmu/src -isystem /work/thirdparty/googletest/googletest -isystem /work/build/external/darwin-x86_64/include -I/work/thirdparty/rabbitmq-c/rabbitmq-c/librabbitmq -I/work/thirdparty/date/date -I/work/thirdparty/date/date/include -I/work/rabbitmq-core/src  -O2 -g -DNDEBUG -isysroot /opt/osxcross/target/SDK/MacOSX10.15.sdk   -o CMakeFiles/unit-test-rabbitmq.dir/src/uri.c.o   -c /work/rabbitmq-fmu/src/uri.c
[ 54%] Building CXX object rabbitmq-fmu/CMakeFiles/it-test-rabbitmq.dir/src/FmuContainer.cpp.o
cd /work/build/darwin-x64/rabbitmq-fmu && /opt/osxcross/target/bin/o64-clang++  -DAMQP_STATIC -DFMI_COSIMULATION -I/work/rabbitmq-fmu/../thirdparty/fmi/include -I/work/thirdparty/rapidjson/include -isystem /work/thirdparty/googletest/googletest/include -I/work/rabbitmq-fmu/src -isystem /work/thirdparty/googletest/googletest -isystem /work/build/external/darwin-x86_64/include -I/work/thirdparty/rabbitmq-c/rabbitmq-c/librabbitmq -I/work/thirdparty/date/date -I/work/thirdparty/date/date/include -I/work/rabbitmq-core/src  -O2 -g -DNDEBUG -isysroot /opt/osxcross/target/SDK/MacOSX10.15.sdk   -std=gnu++1z -o CMakeFiles/it-test-rabbitmq.dir/src/FmuContainer.cpp.o -c /work/rabbitmq-fmu/src/FmuContainer.cpp
/work/rabbitmq-fmu/src/main.cpp: In function 'int main()':
/work/rabbitmq-fmu/src/main.cpp:204:80: error: 'setprecision' was not declared in this scope
                     cout << "Ref: '" << vr[i] << "' Value '" << setprecision(10) << value[i] << "'" << endl;
                                                                                ^
[ 54%] Building CXX object rabbitmq-fmu/CMakeFiles/unit-test-rabbitmq.dir/src/FmuContainer.cpp.o
cd /work/build/darwin-x64/rabbitmq-fmu && /opt/osxcross/target/bin/o64-clang++  -DAMQP_STATIC -DFMI_COSIMULATION -I/work/rabbitmq-fmu/../thirdparty/fmi/include -I/work/thirdparty/rapidjson/include -isystem /work/thirdparty/googletest/googletest/include -I/work/rabbitmq-fmu/src -isystem /work/thirdparty/googletest/googletest -isystem /work/build/external/darwin-x86_64/include -I/work/thirdparty/rabbitmq-c/rabbitmq-c/librabbitmq -I/work/thirdparty/date/date -I/work/thirdparty/date/date/include -I/work/rabbitmq-core/src  -O2 -g -DNDEBUG -isysroot /opt/osxcross/target/SDK/MacOSX10.15.sdk   -std=gnu++1z -o CMakeFiles/unit-test-rabbitmq.dir/src/FmuContainer.cpp.o -c /work/rabbitmq-fmu/src/FmuContainer.cpp
[ 58%] Building CXX object rabbitmq-fmu/CMakeFiles/it-test-rabbitmq.dir/src/Iso8601TimeParser.cpp.o
cd /work/build/darwin-x64/rabbitmq-fmu && /opt/osxcross/target/bin/o64-clang++  -DAMQP_STATIC -DFMI_COSIMULATION -I/work/rabbitmq-fmu/../thirdparty/fmi/include -I/work/thirdparty/rapidjson/include -isystem /work/thirdparty/googletest/googletest/include -I/work/rabbitmq-fmu/src -isystem /work/thirdparty/googletest/googletest -isystem /work/build/external/darwin-x86_64/include -I/work/thirdparty/rabbitmq-c/rabbitmq-c/librabbitmq -I/work/thirdparty/date/date -I/work/thirdparty/date/date/include -I/work/rabbitmq-core/src  -O2 -g -DNDEBUG -isysroot /opt/osxcross/target/SDK/MacOSX10.15.sdk   -std=gnu++1z -o CMakeFiles/it-test-rabbitmq.dir/src/Iso8601TimeParser.cpp.o -c /work/rabbitmq-fmu/src/Iso8601TimeParser.cpp
rabbitmq-fmu/CMakeFiles/rabbitmq-main.dir/build.make:169: recipe for target 'rabbitmq-fmu/CMakeFiles/rabbitmq-main.dir/src/main.cpp.o' failed
make[2]: *** [rabbitmq-fmu/CMakeFiles/rabbitmq-main.dir/src/main.cpp.o] Error 1
make[2]: *** Waiting for unfinished jobs....
[ 58%] Building CXX object rabbitmq-fmu/CMakeFiles/it-test-rabbitmq.dir/src/Iso8601TimeParser.cpp.o
cd /work/build/linux-x86/rabbitmq-fmu && /usr/i686-linux-gnu/bin/i686-linux-gnu-g++  -DAMQP_STATIC -DFMI_COSIMULATION -I/work/rabbitmq-fmu/../thirdparty/fmi/include -I/work/thirdparty/rapidjson/include -I/work/rabbitmq-fmu/src -I/work/thirdparty/rabbitmq-c/rabbitmq-c/librabbitmq -I/work/thirdparty/date/date -I/work/thirdparty/date/date/include -I/work/rabbitmq-core/src -isystem /work/thirdparty/googletest/googletest/include -isystem /work/thirdparty/googletest/googletest -isystem /work/build/external/linux-i386/include  -O2 -g -DNDEBUG   -std=gnu++1z -o CMakeFiles/it-test-rabbitmq.dir/src/Iso8601TimeParser.cpp.o -c /work/rabbitmq-fmu/src/Iso8601TimeParser.cpp
/work/rabbitmq-core/src/FmuContainerCore.cpp: In member function 'double FmuContainerCore::getTimeDiscrepancyOutput(int)':
/work/rabbitmq-core/src/FmuContainerCore.cpp:434:1: warning: control reaches end of non-void function [-Wreturn-type]
  434 | }
      | ^
make[2]: Leaving directory '/work/build/linux-x86'
CMakeFiles/Makefile2:5115: recipe for target 'rabbitmq-fmu/CMakeFiles/rabbitmq-main.dir/all' failed
make[1]: *** [rabbitmq-fmu/CMakeFiles/rabbitmq-main.dir/all] Error 2
make[1]: *** Waiting for unfinished jobs....
[ 58%] Building CXX object rabbitmq-fmu/CMakeFiles/it-test-rabbitmq.dir/src/fmu.cpp.o
cd /work/build/linux-x86/rabbitmq-fmu && /usr/i686-linux-gnu/bin/i686-linux-gnu-g++  -DAMQP_STATIC -DFMI_COSIMULATION -I/work/rabbitmq-fmu/../thirdparty/fmi/include -I/work/thirdparty/rapidjson/include -I/work/rabbitmq-fmu/src -I/work/thirdparty/rabbitmq-c/rabbitmq-c/librabbitmq -I/work/thirdparty/date/date -I/work/thirdparty/date/date/include -I/work/rabbitmq-core/src -isystem /work/thirdparty/googletest/googletest/include -isystem /work/thirdparty/googletest/googletest -isystem /work/build/external/linux-i386/include  -O2 -g -DNDEBUG   -std=gnu++1z -o CMakeFiles/it-test-rabbitmq.dir/src/fmu.cpp.o -c /work/rabbitmq-fmu/src/fmu.cpp
[ 67%] Linking CXX static library ../../../lib/libgmock_main.a
cd /work/build/linux-x64/thirdparty/googletest/googlemock && /usr/bin/cmake -P CMakeFiles/gmock_main.dir/cmake_clean_target.cmake
cd /work/build/linux-x64/thirdparty/googletest/googlemock && /usr/bin/cmake -E cmake_link_script CMakeFiles/gmock_main.dir/link.txt --verbose=1
/usr/bin/x86_64-linux-gnu-ar qc ../../../lib/libgmock_main.a  CMakeFiles/gmock_main.dir/src/gmock_main.cc.o
/usr/bin/x86_64-linux-gnu-ranlib ../../../lib/libgmock_main.a
make[2]: Leaving directory '/work/build/linux-x64'
[ 67%] Built target gmock_main
[ 18%] Linking CXX static library librabbitmq-core.a
cd /work/build/win-x86/rabbitmq-core && /usr/src/mxe/usr/x86_64-pc-linux-gnu/bin/cmake -P CMakeFiles/rabbitmq-core.dir/cmake_clean_target.cmake
cd /work/build/win-x86/rabbitmq-core && /usr/src/mxe/usr/x86_64-pc-linux-gnu/bin/cmake -E cmake_link_script CMakeFiles/rabbitmq-core.dir/link.txt --verbose=1
/usr/src/mxe/usr/bin/i686-w64-mingw32.static-ar qc librabbitmq-core.a  CMakeFiles/rabbitmq-core.dir/src/FmuContainerCore.cpp.obj
/usr/src/mxe/usr/bin/i686-w64-mingw32.static-ranlib librabbitmq-core.a
make[2]: Leaving directory '/work/build/win-x86'
[ 70%] Building CXX object rabbitmq-fmu/CMakeFiles/unit-test-rabbitmq.dir/src/message/MessageParser.cpp.o
cd /work/build/linux-x64/rabbitmq-fmu && /usr/bin/x86_64-linux-gnu-g++  -DAMQP_STATIC -DFMI_COSIMULATION -I/work/rabbitmq-fmu/../thirdparty/fmi/include -I/work/thirdparty/rapidjson/include -I/work/rabbitmq-fmu/src -I/work/thirdparty/rabbitmq-c/rabbitmq-c/librabbitmq -I/work/thirdparty/date/date -I/work/thirdparty/date/date/include -I/work/rabbitmq-core/src -isystem /work/thirdparty/googletest/googletest/include -isystem /work/thirdparty/googletest/googletest -isystem /work/build/external/linux-x86_64/include  -O2 -g -DNDEBUG   -std=gnu++1z -o CMakeFiles/unit-test-rabbitmq.dir/src/message/MessageParser.cpp.o -c /work/rabbitmq-fmu/src/message/MessageParser.cpp
[ 18%] Built target rabbitmq-core
make -f rabbitmq-fmu/CMakeFiles/rabbitmq.dir/build.make rabbitmq-fmu/CMakeFiles/rabbitmq.dir/depend
make -f rabbitmq-fmu/CMakeFiles/rabbitmq-main.dir/build.make rabbitmq-fmu/CMakeFiles/rabbitmq-main.dir/depend
make[2]: Entering directory '/work/build/win-x86'
cd /work/build/win-x86 && /usr/src/mxe/usr/x86_64-pc-linux-gnu/bin/cmake -E cmake_depends "Unix Makefiles" /work /work/rabbitmq-fmu /work/build/win-x86 /work/build/win-x86/rabbitmq-fmu /work/build/win-x86/rabbitmq-fmu/CMakeFiles/rabbitmq.dir/DependInfo.cmake --color=
make[2]: Entering directory '/work/build/win-x86'
cd /work/build/win-x86 && /usr/src/mxe/usr/x86_64-pc-linux-gnu/bin/cmake -E cmake_depends "Unix Makefiles" /work /work/rabbitmq-fmu /work/build/win-x86 /work/build/win-x86/rabbitmq-fmu /work/build/win-x86/rabbitmq-fmu/CMakeFiles/rabbitmq-main.dir/DependInfo.cmake --color=
Scanning dependencies of target rabbitmq-main
make[2]: Leaving directory '/work/build/win-x86'
make -f rabbitmq-fmu/CMakeFiles/rabbitmq-main.dir/build.make rabbitmq-fmu/CMakeFiles/rabbitmq-main.dir/build
Scanning dependencies of target rabbitmq
make[2]: Entering directory '/work/build/win-x86'
[ 21%] Building CXX object rabbitmq-fmu/CMakeFiles/rabbitmq-main.dir/src/fmu.cpp.obj
make[2]: Leaving directory '/work/build/win-x86'
cd /work/build/win-x86/rabbitmq-fmu && /usr/src/mxe/usr/bin/i686-w64-mingw32.static-g++  -DAMQP_STATIC -DFMI_COSIMULATION @CMakeFiles/rabbitmq-main.dir/includes_CXX.rsp -O3 -DNDEBUG   -std=gnu++17 -o CMakeFiles/rabbitmq-main.dir/src/fmu.cpp.obj -c /work/rabbitmq-fmu/src/fmu.cpp
make -f rabbitmq-fmu/CMakeFiles/rabbitmq.dir/build.make rabbitmq-fmu/CMakeFiles/rabbitmq.dir/build
make[2]: Entering directory '/work/build/win-x86'
[ 21%] Building CXX object rabbitmq-fmu/CMakeFiles/rabbitmq-main.dir/src/message/MessageParser.cpp.obj
[ 21%] Building CXX object rabbitmq-fmu/CMakeFiles/rabbitmq-main.dir/src/Iso8601TimeParser.cpp.obj
[ 24%] Building CXX object rabbitmq-fmu/CMakeFiles/rabbitmq-main.dir/src/FmuContainer.cpp.obj
[ 27%] Building CXX object rabbitmq-fmu/CMakeFiles/rabbitmq-main.dir/src/modeldescription/ModelDescriptionParser.cpp.obj
cd /work/build/win-x86/rabbitmq-fmu && /usr/src/mxe/usr/bin/i686-w64-mingw32.static-g++  -DAMQP_STATIC -DFMI_COSIMULATION @CMakeFiles/rabbitmq-main.dir/includes_CXX.rsp -O3 -DNDEBUG   -std=gnu++17 -o CMakeFiles/rabbitmq-main.dir/src/modeldescription/ModelDescriptionParser.cpp.obj -c /work/rabbitmq-fmu/src/modeldescription/ModelDescriptionParser.cpp
[ 21%] Building C object rabbitmq-fmu/CMakeFiles/rabbitmq-main.dir/src/uri.c.obj
cd /work/build/win-x86/rabbitmq-fmu && /usr/src/mxe/usr/bin/i686-w64-mingw32.static-gcc -DAMQP_STATIC -DFMI_COSIMULATION @CMakeFiles/rabbitmq-main.dir/includes_C.rsp -O3 -DNDEBUG   -o CMakeFiles/rabbitmq-main.dir/src/uri.c.obj   -c /work/rabbitmq-fmu/src/uri.c
cd /work/build/win-x86/rabbitmq-fmu && /usr/src/mxe/usr/bin/i686-w64-mingw32.static-g++  -DAMQP_STATIC -DFMI_COSIMULATION @CMakeFiles/rabbitmq-main.dir/includes_CXX.rsp -O3 -DNDEBUG   -std=gnu++17 -o CMakeFiles/rabbitmq-main.dir/src/message/MessageParser.cpp.obj -c /work/rabbitmq-fmu/src/message/MessageParser.cpp
cd /work/build/win-x86/rabbitmq-fmu && /usr/src/mxe/usr/bin/i686-w64-mingw32.static-g++  -DAMQP_STATIC -DFMI_COSIMULATION @CMakeFiles/rabbitmq-main.dir/includes_CXX.rsp -O3 -DNDEBUG   -std=gnu++17 -o CMakeFiles/rabbitmq-main.dir/src/FmuContainer.cpp.obj -c /work/rabbitmq-fmu/src/FmuContainer.cpp
[ 29%] Building C object rabbitmq-fmu/CMakeFiles/rabbitmq.dir/src/uri.c.obj
cd /work/build/win-x86/rabbitmq-fmu && /usr/src/mxe/usr/bin/i686-w64-mingw32.static-g++  -DAMQP_STATIC -DFMI_COSIMULATION @CMakeFiles/rabbitmq-main.dir/includes_CXX.rsp -O3 -DNDEBUG   -std=gnu++17 -o CMakeFiles/rabbitmq-main.dir/src/Iso8601TimeParser.cpp.obj -c /work/rabbitmq-fmu/src/Iso8601TimeParser.cpp
cd /work/build/win-x86/rabbitmq-fmu && /usr/src/mxe/usr/bin/i686-w64-mingw32.static-gcc -DAMQP_STATIC -DFMI_COSIMULATION -Drabbitmq_EXPORTS @CMakeFiles/rabbitmq.dir/includes_C.rsp -O3 -DNDEBUG   -o CMakeFiles/rabbitmq.dir/src/uri.c.obj   -c /work/rabbitmq-fmu/src/uri.c
[ 16%] Linking CXX static library libtz.a
cd /work/build/win-x64/thirdparty/date/date && /usr/src/mxe/usr/x86_64-pc-linux-gnu/bin/cmake -P CMakeFiles/tz.dir/cmake_clean_target.cmake
cd /work/build/win-x64/thirdparty/date/date && /usr/src/mxe/usr/x86_64-pc-linux-gnu/bin/cmake -E cmake_link_script CMakeFiles/tz.dir/link.txt --verbose=1
/usr/src/mxe/usr/bin/x86_64-w64-mingw32.static-ar qc libtz.a  CMakeFiles/tz.dir/src/tz.cpp.obj
/usr/src/mxe/usr/bin/x86_64-w64-mingw32.static-ranlib libtz.a
make[2]: Leaving directory '/work/build/win-x64'
[ 16%] Built target tz
make -f rabbitmq-core/CMakeFiles/rabbitmq-core.dir/build.make rabbitmq-core/CMakeFiles/rabbitmq-core.dir/depend
make[2]: Entering directory '/work/build/win-x64'
cd /work/build/win-x64 && /usr/src/mxe/usr/x86_64-pc-linux-gnu/bin/cmake -E cmake_depends "Unix Makefiles" /work /work/rabbitmq-core /work/build/win-x64 /work/build/win-x64/rabbitmq-core /work/build/win-x64/rabbitmq-core/CMakeFiles/rabbitmq-core.dir/DependInfo.cmake --color=
Scanning dependencies of target rabbitmq-core
make[2]: Leaving directory '/work/build/win-x64'
make -f rabbitmq-core/CMakeFiles/rabbitmq-core.dir/build.make rabbitmq-core/CMakeFiles/rabbitmq-core.dir/build
make[2]: Entering directory '/work/build/win-x64'
[ 16%] Building CXX object rabbitmq-core/CMakeFiles/rabbitmq-core.dir/src/FmuContainerCore.cpp.obj
cd /work/build/win-x64/rabbitmq-core && /usr/src/mxe/usr/bin/x86_64-w64-mingw32.static-g++   @CMakeFiles/rabbitmq-core.dir/includes_CXX.rsp -O3 -DNDEBUG   -std=gnu++17 -o CMakeFiles/rabbitmq-core.dir/src/FmuContainerCore.cpp.obj -c /work/rabbitmq-core/src/FmuContainerCore.cpp
[ 29%] Building CXX object rabbitmq-fmu/CMakeFiles/rabbitmq.dir/src/FmuContainer.cpp.obj
cd /work/build/win-x86/rabbitmq-fmu && /usr/src/mxe/usr/bin/i686-w64-mingw32.static-g++  -DAMQP_STATIC -DFMI_COSIMULATION -Drabbitmq_EXPORTS @CMakeFiles/rabbitmq.dir/includes_CXX.rsp -O3 -DNDEBUG   -std=gnu++17 -o CMakeFiles/rabbitmq.dir/src/FmuContainer.cpp.obj -c /work/rabbitmq-fmu/src/FmuContainer.cpp
[ 29%] Building CXX object rabbitmq-fmu/CMakeFiles/rabbitmq-main.dir/src/rabbitmq/RabbitMqHandlerException.cpp.obj
cd /work/build/win-x86/rabbitmq-fmu && /usr/src/mxe/usr/bin/i686-w64-mingw32.static-g++  -DAMQP_STATIC -DFMI_COSIMULATION @CMakeFiles/rabbitmq-main.dir/includes_CXX.rsp -O3 -DNDEBUG   -std=gnu++17 -o CMakeFiles/rabbitmq-main.dir/src/rabbitmq/RabbitMqHandlerException.cpp.obj -c /work/rabbitmq-fmu/src/rabbitmq/RabbitMqHandlerException.cpp
/work/rabbitmq-core/src/FmuContainerCore.cpp:434:1: warning: control may reach end of non-void function [-Wreturn-type]
}
^
[ 58%] Linking CXX shared library rabbitmq.dylib
cd /work/build/darwin-x64/rabbitmq-fmu && /usr/bin/cmake -E cmake_link_script CMakeFiles/rabbitmq.dir/link.txt --verbose=1
/opt/osxcross/target/bin/o64-clang++ -O2 -g -DNDEBUG -isysroot /opt/osxcross/target/SDK/MacOSX10.15.sdk -dynamiclib -Wl,-headerpad_max_install_names  -o rabbitmq.dylib -install_name /work/build/darwin-x64/rabbitmq-fmu/rabbitmq.dylib CMakeFiles/rabbitmq.dir/src/uri.c.o CMakeFiles/rabbitmq.dir/src/FmuContainer.cpp.o CMakeFiles/rabbitmq.dir/src/Iso8601TimeParser.cpp.o CMakeFiles/rabbitmq.dir/src/fmu.cpp.o CMakeFiles/rabbitmq.dir/src/message/MessageParser.cpp.o CMakeFiles/rabbitmq.dir/src/modeldescription/ModelDescriptionParser.cpp.o CMakeFiles/rabbitmq.dir/src/rabbitmq/RabbitMqHandlerException.cpp.o CMakeFiles/rabbitmq.dir/src/rabbitmq/RabbitmqHandler.cpp.o ../thirdparty/rabbitmq-c/rabbitmq-c/librabbitmq/librabbitmq.a ../thirdparty/date/date/libtz.a ../rabbitmq-core/librabbitmq-core.a ../../external/darwin-x86_64/lib/libxerces-c-3.2.a ../thirdparty/date/date/libtz.a 
make[2]: Leaving directory '/work/build/linux-x86'
[ 58%] Built target rabbitmq
[ 58%] Building CXX object rabbitmq-core/CMakeFiles/unit-test-rabbitmq-core.dir/test/FmuContainerCore_test.cpp.o
cd /work/build/linux-x86/rabbitmq-core && /usr/i686-linux-gnu/bin/i686-linux-gnu-g++   -I/work/rabbitmq-core/src -I/work/thirdparty/date/date -I/work/thirdparty/date/date/include -isystem /work/thirdparty/googletest/googletest/include -isystem /work/thirdparty/googletest/googletest  -O2 -g -DNDEBUG   -std=gnu++1z -o CMakeFiles/unit-test-rabbitmq-core.dir/test/FmuContainerCore_test.cpp.o -c /work/rabbitmq-core/test/FmuContainerCore_test.cpp
/work/rabbitmq-core/src/FmuContainerCore.cpp:434:1: warning: control may reach end of non-void function [-Wreturn-type]
}
^
/work/rabbitmq-core/src/FmuContainerCore.cpp: In member function 'double FmuContainerCore::getTimeDiscrepancyOutput(int)':
/work/rabbitmq-core/src/FmuContainerCore.cpp:434:1: warning: control reaches end of non-void function [-Wreturn-type]
  434 | }
      | ^
[ 32%] Building CXX object rabbitmq-fmu/CMakeFiles/rabbitmq-main.dir/src/rabbitmq/RabbitmqHandler.cpp.obj
cd /work/build/win-x86/rabbitmq-fmu && /usr/src/mxe/usr/bin/i686-w64-mingw32.static-g++  -DAMQP_STATIC -DFMI_COSIMULATION @CMakeFiles/rabbitmq-main.dir/includes_CXX.rsp -O3 -DNDEBUG   -std=gnu++17 -o CMakeFiles/rabbitmq-main.dir/src/rabbitmq/RabbitmqHandler.cpp.obj -c /work/rabbitmq-fmu/src/rabbitmq/RabbitmqHandler.cpp
[ 32%] Linking CXX static library ../../../lib/libgtest.a
cd /work/build/win-x86/thirdparty/googletest/googletest && /usr/src/mxe/usr/x86_64-pc-linux-gnu/bin/cmake -P CMakeFiles/gtest.dir/cmake_clean_target.cmake
make[2]: Leaving directory '/work/build/darwin-x64'
[ 58%] Built target rabbitmq
[ 58%] Building CXX object rabbitmq-fmu/CMakeFiles/it-test-rabbitmq.dir/src/fmu.cpp.o
cd /work/build/darwin-x64/rabbitmq-fmu && /opt/osxcross/target/bin/o64-clang++  -DAMQP_STATIC -DFMI_COSIMULATION -I/work/rabbitmq-fmu/../thirdparty/fmi/include -I/work/thirdparty/rapidjson/include -isystem /work/thirdparty/googletest/googletest/include -I/work/rabbitmq-fmu/src -isystem /work/thirdparty/googletest/googletest -isystem /work/build/external/darwin-x86_64/include -I/work/thirdparty/rabbitmq-c/rabbitmq-c/librabbitmq -I/work/thirdparty/date/date -I/work/thirdparty/date/date/include -I/work/rabbitmq-core/src  -O2 -g -DNDEBUG -isysroot /opt/osxcross/target/SDK/MacOSX10.15.sdk   -std=gnu++1z -o CMakeFiles/it-test-rabbitmq.dir/src/fmu.cpp.o -c /work/rabbitmq-fmu/src/fmu.cpp
cd /work/build/win-x86/thirdparty/googletest/googletest && /usr/src/mxe/usr/x86_64-pc-linux-gnu/bin/cmake -E cmake_link_script CMakeFiles/gtest.dir/link.txt --verbose=1
/usr/src/mxe/usr/bin/i686-w64-mingw32.static-ar qc ../../../lib/libgtest.a  CMakeFiles/gtest.dir/src/gtest-all.cc.obj
[ 18%] Linking CXX static library librabbitmq-core.a
cd /work/build/win-x64/rabbitmq-core && /usr/src/mxe/usr/x86_64-pc-linux-gnu/bin/cmake -P CMakeFiles/rabbitmq-core.dir/cmake_clean_target.cmake
cd /work/build/win-x64/rabbitmq-core && /usr/src/mxe/usr/x86_64-pc-linux-gnu/bin/cmake -E cmake_link_script CMakeFiles/rabbitmq-core.dir/link.txt --verbose=1
/usr/src/mxe/usr/bin/x86_64-w64-mingw32.static-ar qc librabbitmq-core.a  CMakeFiles/rabbitmq-core.dir/src/FmuContainerCore.cpp.obj
/usr/src/mxe/usr/bin/x86_64-w64-mingw32.static-ranlib librabbitmq-core.a
make[2]: Leaving directory '/work/build/win-x64'
/usr/src/mxe/usr/bin/i686-w64-mingw32.static-ranlib ../../../lib/libgtest.a
[ 18%] Built target rabbitmq-core
make -f rabbitmq-fmu/CMakeFiles/rabbitmq.dir/build.make rabbitmq-fmu/CMakeFiles/rabbitmq.dir/depend
make -f rabbitmq-fmu/CMakeFiles/rabbitmq-main.dir/build.make rabbitmq-fmu/CMakeFiles/rabbitmq-main.dir/depend
make[2]: Entering directory '/work/build/win-x64'
cd /work/build/win-x64 && /usr/src/mxe/usr/x86_64-pc-linux-gnu/bin/cmake -E cmake_depends "Unix Makefiles" /work /work/rabbitmq-fmu /work/build/win-x64 /work/build/win-x64/rabbitmq-fmu /work/build/win-x64/rabbitmq-fmu/CMakeFiles/rabbitmq.dir/DependInfo.cmake --color=
make[2]: Entering directory '/work/build/win-x64'
cd /work/build/win-x64 && /usr/src/mxe/usr/x86_64-pc-linux-gnu/bin/cmake -E cmake_depends "Unix Makefiles" /work /work/rabbitmq-fmu /work/build/win-x64 /work/build/win-x64/rabbitmq-fmu /work/build/win-x64/rabbitmq-fmu/CMakeFiles/rabbitmq-main.dir/DependInfo.cmake --color=
make[2]: Leaving directory '/work/build/win-x86'
[ 32%] Built target gtest
make -f thirdparty/googletest/googlemock/CMakeFiles/gmock.dir/build.make thirdparty/googletest/googlemock/CMakeFiles/gmock.dir/depend
make[2]: Entering directory '/work/build/win-x86'
cd /work/build/win-x86 && /usr/src/mxe/usr/x86_64-pc-linux-gnu/bin/cmake -E cmake_depends "Unix Makefiles" /work /work/thirdparty/googletest/googlemock /work/build/win-x86 /work/build/win-x86/thirdparty/googletest/googlemock /work/build/win-x86/thirdparty/googletest/googlemock/CMakeFiles/gmock.dir/DependInfo.cmake --color=
Scanning dependencies of target gmock
make[2]: Leaving directory '/work/build/win-x86'
make -f thirdparty/googletest/googlemock/CMakeFiles/gmock.dir/build.make thirdparty/googletest/googlemock/CMakeFiles/gmock.dir/build
make[2]: Entering directory '/work/build/win-x86'
[ 70%] Building CXX object rabbitmq-fmu/CMakeFiles/unit-test-rabbitmq.dir/src/modeldescription/ModelDescriptionParser.cpp.o
cd /work/build/linux-x64/rabbitmq-fmu && /usr/bin/x86_64-linux-gnu-g++  -DAMQP_STATIC -DFMI_COSIMULATION -I/work/rabbitmq-fmu/../thirdparty/fmi/include -I/work/thirdparty/rapidjson/include -I/work/rabbitmq-fmu/src -I/work/thirdparty/rabbitmq-c/rabbitmq-c/librabbitmq -I/work/thirdparty/date/date -I/work/thirdparty/date/date/include -I/work/rabbitmq-core/src -isystem /work/thirdparty/googletest/googletest/include -isystem /work/thirdparty/googletest/googletest -isystem /work/build/external/linux-x86_64/include  -O2 -g -DNDEBUG   -std=gnu++1z -o CMakeFiles/unit-test-rabbitmq.dir/src/modeldescription/ModelDescriptionParser.cpp.o -c /work/rabbitmq-fmu/src/modeldescription/ModelDescriptionParser.cpp
Scanning dependencies of target rabbitmq-main
Scanning dependencies of target rabbitmq
make[2]: Leaving directory '/work/build/win-x64'
make[2]: Leaving directory '/work/build/win-x64'
make -f rabbitmq-fmu/CMakeFiles/rabbitmq-main.dir/build.make rabbitmq-fmu/CMakeFiles/rabbitmq-main.dir/build
make -f rabbitmq-fmu/CMakeFiles/rabbitmq.dir/build.make rabbitmq-fmu/CMakeFiles/rabbitmq.dir/build
make[2]: Entering directory '/work/build/win-x64'
make[2]: Entering directory '/work/build/win-x64'
[ 18%] Building CXX object rabbitmq-fmu/CMakeFiles/rabbitmq-main.dir/src/Iso8601TimeParser.cpp.obj
[ 21%] Building C object rabbitmq-fmu/CMakeFiles/rabbitmq.dir/src/uri.c.obj
[ 32%] Building CXX object thirdparty/googletest/googlemock/CMakeFiles/gmock.dir/src/gmock-all.cc.obj
cd /work/build/win-x86/thirdparty/googletest/googlemock && /usr/src/mxe/usr/bin/i686-w64-mingw32.static-g++   @CMakeFiles/gmock.dir/includes_CXX.rsp -O3 -DNDEBUG   -Wall -Wshadow -Werror -Wno-error=dangling-else -DGTEST_HAS_PTHREAD=0 -fexceptions -Wextra -Wno-unused-parameter -Wno-missing-field-initializers -std=c++11 -o CMakeFiles/gmock.dir/src/gmock-all.cc.obj -c /work/thirdparty/googletest/googlemock/src/gmock-all.cc
[ 21%] Building CXX object rabbitmq-fmu/CMakeFiles/rabbitmq.dir/src/FmuContainer.cpp.obj
cd /work/build/win-x64/rabbitmq-fmu && /usr/src/mxe/usr/bin/x86_64-w64-mingw32.static-gcc -DAMQP_STATIC -DFMI_COSIMULATION -Drabbitmq_EXPORTS @CMakeFiles/rabbitmq.dir/includes_C.rsp -O3 -DNDEBUG   -o CMakeFiles/rabbitmq.dir/src/uri.c.obj   -c /work/rabbitmq-fmu/src/uri.c
cd /work/build/win-x64/rabbitmq-fmu && /usr/src/mxe/usr/bin/x86_64-w64-mingw32.static-g++  -DAMQP_STATIC -DFMI_COSIMULATION @CMakeFiles/rabbitmq-main.dir/includes_CXX.rsp -O3 -DNDEBUG   -std=gnu++17 -o CMakeFiles/rabbitmq-main.dir/src/Iso8601TimeParser.cpp.obj -c /work/rabbitmq-fmu/src/Iso8601TimeParser.cpp
[ 24%] Building CXX object rabbitmq-fmu/CMakeFiles/rabbitmq-main.dir/src/fmu.cpp.obj
[ 24%] Building C object rabbitmq-fmu/CMakeFiles/rabbitmq-main.dir/src/uri.c.obj
[ 27%] Building CXX object rabbitmq-fmu/CMakeFiles/rabbitmq-main.dir/src/FmuContainer.cpp.obj
cd /work/build/win-x64/rabbitmq-fmu && /usr/src/mxe/usr/bin/x86_64-w64-mingw32.static-g++  -DAMQP_STATIC -DFMI_COSIMULATION @CMakeFiles/rabbitmq-main.dir/includes_CXX.rsp -O3 -DNDEBUG   -std=gnu++17 -o CMakeFiles/rabbitmq-main.dir/src/fmu.cpp.obj -c /work/rabbitmq-fmu/src/fmu.cpp
cd /work/build/win-x64/rabbitmq-fmu && /usr/src/mxe/usr/bin/x86_64-w64-mingw32.static-gcc -DAMQP_STATIC -DFMI_COSIMULATION @CMakeFiles/rabbitmq-main.dir/includes_C.rsp -O3 -DNDEBUG   -o CMakeFiles/rabbitmq-main.dir/src/uri.c.obj   -c /work/rabbitmq-fmu/src/uri.c
[ 21%] Building CXX object rabbitmq-fmu/CMakeFiles/rabbitmq-main.dir/src/message/MessageParser.cpp.obj
cd /work/build/win-x64/rabbitmq-fmu && /usr/src/mxe/usr/bin/x86_64-w64-mingw32.static-g++  -DAMQP_STATIC -DFMI_COSIMULATION @CMakeFiles/rabbitmq-main.dir/includes_CXX.rsp -O3 -DNDEBUG   -std=gnu++17 -o CMakeFiles/rabbitmq-main.dir/src/FmuContainer.cpp.obj -c /work/rabbitmq-fmu/src/FmuContainer.cpp
cd /work/build/win-x64/rabbitmq-fmu && /usr/src/mxe/usr/bin/x86_64-w64-mingw32.static-g++  -DAMQP_STATIC -DFMI_COSIMULATION @CMakeFiles/rabbitmq-main.dir/includes_CXX.rsp -O3 -DNDEBUG   -std=gnu++17 -o CMakeFiles/rabbitmq-main.dir/src/message/MessageParser.cpp.obj -c /work/rabbitmq-fmu/src/message/MessageParser.cpp
cd /work/build/win-x64/rabbitmq-fmu && /usr/src/mxe/usr/bin/x86_64-w64-mingw32.static-g++  -DAMQP_STATIC -DFMI_COSIMULATION -Drabbitmq_EXPORTS @CMakeFiles/rabbitmq.dir/includes_CXX.rsp -O3 -DNDEBUG   -std=gnu++17 -o CMakeFiles/rabbitmq.dir/src/FmuContainer.cpp.obj -c /work/rabbitmq-fmu/src/FmuContainer.cpp
[ 29%] Building CXX object rabbitmq-fmu/CMakeFiles/rabbitmq-main.dir/src/modeldescription/ModelDescriptionParser.cpp.obj
cd /work/build/win-x64/rabbitmq-fmu && /usr/src/mxe/usr/bin/x86_64-w64-mingw32.static-g++  -DAMQP_STATIC -DFMI_COSIMULATION @CMakeFiles/rabbitmq-main.dir/includes_CXX.rsp -O3 -DNDEBUG   -std=gnu++17 -o CMakeFiles/rabbitmq-main.dir/src/modeldescription/ModelDescriptionParser.cpp.obj -c /work/rabbitmq-fmu/src/modeldescription/ModelDescriptionParser.cpp
[ 32%] Building CXX object rabbitmq-fmu/CMakeFiles/rabbitmq.dir/src/Iso8601TimeParser.cpp.obj
cd /work/build/win-x64/rabbitmq-fmu && /usr/src/mxe/usr/bin/x86_64-w64-mingw32.static-g++  -DAMQP_STATIC -DFMI_COSIMULATION -Drabbitmq_EXPORTS @CMakeFiles/rabbitmq.dir/includes_CXX.rsp -O3 -DNDEBUG   -std=gnu++17 -o CMakeFiles/rabbitmq.dir/src/Iso8601TimeParser.cpp.obj -c /work/rabbitmq-fmu/src/Iso8601TimeParser.cpp
[ 32%] Linking CXX static library ../../../lib/libgtest.a
cd /work/build/win-x64/thirdparty/googletest/googletest && /usr/src/mxe/usr/x86_64-pc-linux-gnu/bin/cmake -P CMakeFiles/gtest.dir/cmake_clean_target.cmake
cd /work/build/win-x64/thirdparty/googletest/googletest && /usr/src/mxe/usr/x86_64-pc-linux-gnu/bin/cmake -E cmake_link_script CMakeFiles/gtest.dir/link.txt --verbose=1
/usr/src/mxe/usr/bin/x86_64-w64-mingw32.static-ar qc ../../../lib/libgtest.a  CMakeFiles/gtest.dir/src/gtest-all.cc.obj
/usr/src/mxe/usr/bin/x86_64-w64-mingw32.static-ranlib ../../../lib/libgtest.a
make[2]: Leaving directory '/work/build/win-x64'
[ 32%] Built target gtest
[ 32%] Building CXX object rabbitmq-fmu/CMakeFiles/rabbitmq.dir/src/fmu.cpp.obj
cd /work/build/win-x64/rabbitmq-fmu && /usr/src/mxe/usr/bin/x86_64-w64-mingw32.static-g++  -DAMQP_STATIC -DFMI_COSIMULATION -Drabbitmq_EXPORTS @CMakeFiles/rabbitmq.dir/includes_CXX.rsp -O3 -DNDEBUG   -std=gnu++17 -o CMakeFiles/rabbitmq.dir/src/fmu.cpp.obj -c /work/rabbitmq-fmu/src/fmu.cpp
[ 74%] Building CXX object rabbitmq-fmu/CMakeFiles/unit-test-rabbitmq.dir/src/rabbitmq/RabbitMqHandlerException.cpp.o
cd /work/build/linux-x64/rabbitmq-fmu && /usr/bin/x86_64-linux-gnu-g++  -DAMQP_STATIC -DFMI_COSIMULATION -I/work/rabbitmq-fmu/../thirdparty/fmi/include -I/work/thirdparty/rapidjson/include -I/work/rabbitmq-fmu/src -I/work/thirdparty/rabbitmq-c/rabbitmq-c/librabbitmq -I/work/thirdparty/date/date -I/work/thirdparty/date/date/include -I/work/rabbitmq-core/src -isystem /work/thirdparty/googletest/googletest/include -isystem /work/thirdparty/googletest/googletest -isystem /work/build/external/linux-x86_64/include  -O2 -g -DNDEBUG   -std=gnu++1z -o CMakeFiles/unit-test-rabbitmq.dir/src/rabbitmq/RabbitMqHandlerException.cpp.o -c /work/rabbitmq-fmu/src/rabbitmq/RabbitMqHandlerException.cpp
[ 61%] Linking CXX static library ../../../lib/libgmock.a
cd /work/build/linux-x86/thirdparty/googletest/googlemock && /usr/bin/cmake -P CMakeFiles/gmock.dir/cmake_clean_target.cmake
cd /work/build/linux-x86/thirdparty/googletest/googlemock && /usr/bin/cmake -E cmake_link_script CMakeFiles/gmock.dir/link.txt --verbose=1
/usr/i686-linux-gnu/bin/i686-linux-gnu-ar qc ../../../lib/libgmock.a  CMakeFiles/gmock.dir/src/gmock-all.cc.o
make[2]: Leaving directory '/work/build/linux-x86'
[ 61%] Built target gmock
[ 64%] Building CXX object rabbitmq-fmu/CMakeFiles/it-test-rabbitmq.dir/src/message/MessageParser.cpp.o
cd /work/build/linux-x86/rabbitmq-fmu && /usr/i686-linux-gnu/bin/i686-linux-gnu-g++  -DAMQP_STATIC -DFMI_COSIMULATION -I/work/rabbitmq-fmu/../thirdparty/fmi/include -I/work/thirdparty/rapidjson/include -I/work/rabbitmq-fmu/src -I/work/thirdparty/rabbitmq-c/rabbitmq-c/librabbitmq -I/work/thirdparty/date/date -I/work/thirdparty/date/date/include -I/work/rabbitmq-core/src -isystem /work/thirdparty/googletest/googletest/include -isystem /work/thirdparty/googletest/googletest -isystem /work/build/external/linux-i386/include  -O2 -g -DNDEBUG   -std=gnu++1z -o CMakeFiles/it-test-rabbitmq.dir/src/message/MessageParser.cpp.o -c /work/rabbitmq-fmu/src/message/MessageParser.cpp
[ 77%] Linking CXX executable unit-test-rabbitmq-core
cd /work/build/linux-x64/rabbitmq-core && /usr/bin/cmake -E cmake_link_script CMakeFiles/unit-test-rabbitmq-core.dir/link.txt --verbose=1
/usr/bin/x86_64-linux-gnu-g++  -O2 -g -DNDEBUG   CMakeFiles/unit-test-rabbitmq-core.dir/src/FmuContainerCore.cpp.o CMakeFiles/unit-test-rabbitmq-core.dir/test/FmuContainerCore_test.cpp.o  -o unit-test-rabbitmq-core ../lib/libgtest_main.a ../thirdparty/date/date/libtz.a ../lib/libgtest.a -lpthread 
[ 77%] Building CXX object rabbitmq-fmu/CMakeFiles/unit-test-rabbitmq.dir/src/rabbitmq/RabbitmqHandler.cpp.o
cd /work/build/linux-x64/rabbitmq-fmu && /usr/bin/x86_64-linux-gnu-g++  -DAMQP_STATIC -DFMI_COSIMULATION -I/work/rabbitmq-fmu/../thirdparty/fmi/include -I/work/thirdparty/rapidjson/include -I/work/rabbitmq-fmu/src -I/work/thirdparty/rabbitmq-c/rabbitmq-c/librabbitmq -I/work/thirdparty/date/date -I/work/thirdparty/date/date/include -I/work/rabbitmq-core/src -isystem /work/thirdparty/googletest/googletest/include -isystem /work/thirdparty/googletest/googletest -isystem /work/build/external/linux-x86_64/include  -O2 -g -DNDEBUG   -std=gnu++1z -o CMakeFiles/unit-test-rabbitmq.dir/src/rabbitmq/RabbitmqHandler.cpp.o -c /work/rabbitmq-fmu/src/rabbitmq/RabbitmqHandler.cpp
make[2]: Leaving directory '/work/build/linux-x64'
[ 77%] Built target unit-test-rabbitmq-core
[ 80%] Building CXX object rabbitmq-fmu/CMakeFiles/it-test-rabbitmq.dir/src/message/MessageParser.cpp.o
cd /work/build/linux-x64/rabbitmq-fmu && /usr/bin/x86_64-linux-gnu-g++  -DAMQP_STATIC -DFMI_COSIMULATION -I/work/rabbitmq-fmu/../thirdparty/fmi/include -I/work/thirdparty/rapidjson/include -I/work/rabbitmq-fmu/src -I/work/thirdparty/rabbitmq-c/rabbitmq-c/librabbitmq -I/work/thirdparty/date/date -I/work/thirdparty/date/date/include -I/work/rabbitmq-core/src -isystem /work/thirdparty/googletest/googletest/include -isystem /work/thirdparty/googletest/googletest -isystem /work/build/external/linux-x86_64/include  -O2 -g -DNDEBUG   -std=gnu++1z -o CMakeFiles/it-test-rabbitmq.dir/src/message/MessageParser.cpp.o -c /work/rabbitmq-fmu/src/message/MessageParser.cpp
[ 80%] Building CXX object rabbitmq-fmu/CMakeFiles/unit-test-rabbitmq.dir/test/FmuContainerCore_test.cpp.o
cd /work/build/linux-x64/rabbitmq-fmu && /usr/bin/x86_64-linux-gnu-g++  -DAMQP_STATIC -DFMI_COSIMULATION -I/work/rabbitmq-fmu/../thirdparty/fmi/include -I/work/thirdparty/rapidjson/include -I/work/rabbitmq-fmu/src -I/work/thirdparty/rabbitmq-c/rabbitmq-c/librabbitmq -I/work/thirdparty/date/date -I/work/thirdparty/date/date/include -I/work/rabbitmq-core/src -isystem /work/thirdparty/googletest/googletest/include -isystem /work/thirdparty/googletest/googletest -isystem /work/build/external/linux-x86_64/include  -O2 -g -DNDEBUG   -std=gnu++1z -o CMakeFiles/unit-test-rabbitmq.dir/test/FmuContainerCore_test.cpp.o -c /work/rabbitmq-fmu/test/FmuContainerCore_test.cpp
[ 32%] Building CXX object rabbitmq-fmu/CMakeFiles/rabbitmq-main.dir/src/main.cpp.obj
cd /work/build/win-x86/rabbitmq-fmu && /usr/src/mxe/usr/bin/i686-w64-mingw32.static-g++  -DAMQP_STATIC -DFMI_COSIMULATION @CMakeFiles/rabbitmq-main.dir/includes_CXX.rsp -O3 -DNDEBUG   -std=gnu++17 -o CMakeFiles/rabbitmq-main.dir/src/main.cpp.obj -c /work/rabbitmq-fmu/src/main.cpp
[ 64%] Building CXX object rabbitmq-fmu/CMakeFiles/it-test-rabbitmq.dir/src/modeldescription/ModelDescriptionParser.cpp.o
cd /work/build/linux-x86/rabbitmq-fmu && /usr/i686-linux-gnu/bin/i686-linux-gnu-g++  -DAMQP_STATIC -DFMI_COSIMULATION -I/work/rabbitmq-fmu/../thirdparty/fmi/include -I/work/thirdparty/rapidjson/include -I/work/rabbitmq-fmu/src -I/work/thirdparty/rabbitmq-c/rabbitmq-c/librabbitmq -I/work/thirdparty/date/date -I/work/thirdparty/date/date/include -I/work/rabbitmq-core/src -isystem /work/thirdparty/googletest/googletest/include -isystem /work/thirdparty/googletest/googletest -isystem /work/build/external/linux-i386/include  -O2 -g -DNDEBUG   -std=gnu++1z -o CMakeFiles/it-test-rabbitmq.dir/src/modeldescription/ModelDescriptionParser.cpp.o -c /work/rabbitmq-fmu/src/modeldescription/ModelDescriptionParser.cpp
[ 80%] Building CXX object rabbitmq-fmu/CMakeFiles/it-test-rabbitmq.dir/src/modeldescription/ModelDescriptionParser.cpp.o
cd /work/build/linux-x64/rabbitmq-fmu && /usr/bin/x86_64-linux-gnu-g++  -DAMQP_STATIC -DFMI_COSIMULATION -I/work/rabbitmq-fmu/../thirdparty/fmi/include -I/work/thirdparty/rapidjson/include -I/work/rabbitmq-fmu/src -I/work/thirdparty/rabbitmq-c/rabbitmq-c/librabbitmq -I/work/thirdparty/date/date -I/work/thirdparty/date/date/include -I/work/rabbitmq-core/src -isystem /work/thirdparty/googletest/googletest/include -isystem /work/thirdparty/googletest/googletest -isystem /work/build/external/linux-x86_64/include  -O2 -g -DNDEBUG   -std=gnu++1z -o CMakeFiles/it-test-rabbitmq.dir/src/modeldescription/ModelDescriptionParser.cpp.o -c /work/rabbitmq-fmu/src/modeldescription/ModelDescriptionParser.cpp
1 warning generated.
[ 61%] Building CXX object rabbitmq-fmu/CMakeFiles/it-test-rabbitmq.dir/src/message/MessageParser.cpp.o
[ 61%] Building CXX object rabbitmq-fmu/CMakeFiles/it-test-rabbitmq.dir/src/modeldescription/ModelDescriptionParser.cpp.o
[ 64%] Linking CXX static library ../../../lib/libgmock.a
cd /work/build/darwin-x64/rabbitmq-fmu && /opt/osxcross/target/bin/o64-clang++  -DAMQP_STATIC -DFMI_COSIMULATION -I/work/rabbitmq-fmu/../thirdparty/fmi/include -I/work/thirdparty/rapidjson/include -isystem /work/thirdparty/googletest/googletest/include -I/work/rabbitmq-fmu/src -isystem /work/thirdparty/googletest/googletest -isystem /work/build/external/darwin-x86_64/include -I/work/thirdparty/rabbitmq-c/rabbitmq-c/librabbitmq -I/work/thirdparty/date/date -I/work/thirdparty/date/date/include -I/work/rabbitmq-core/src  -O2 -g -DNDEBUG -isysroot /opt/osxcross/target/SDK/MacOSX10.15.sdk   -std=gnu++1z -o CMakeFiles/it-test-rabbitmq.dir/src/modeldescription/ModelDescriptionParser.cpp.o -c /work/rabbitmq-fmu/src/modeldescription/ModelDescriptionParser.cpp
cd /work/build/darwin-x64/rabbitmq-fmu && /opt/osxcross/target/bin/o64-clang++  -DAMQP_STATIC -DFMI_COSIMULATION -I/work/rabbitmq-fmu/../thirdparty/fmi/include -I/work/thirdparty/rapidjson/include -isystem /work/thirdparty/googletest/googletest/include -I/work/rabbitmq-fmu/src -isystem /work/thirdparty/googletest/googletest -isystem /work/build/external/darwin-x86_64/include -I/work/thirdparty/rabbitmq-c/rabbitmq-c/librabbitmq -I/work/thirdparty/date/date -I/work/thirdparty/date/date/include -I/work/rabbitmq-core/src  -O2 -g -DNDEBUG -isysroot /opt/osxcross/target/SDK/MacOSX10.15.sdk   -std=gnu++1z -o CMakeFiles/it-test-rabbitmq.dir/src/message/MessageParser.cpp.o -c /work/rabbitmq-fmu/src/message/MessageParser.cpp
cd /work/build/darwin-x64/thirdparty/googletest/googlemock && /usr/bin/cmake -P CMakeFiles/gmock.dir/cmake_clean_target.cmake
cd /work/build/darwin-x64/thirdparty/googletest/googlemock && /usr/bin/cmake -E cmake_link_script CMakeFiles/gmock.dir/link.txt --verbose=1
/opt/osxcross/target/bin/x86_64-apple-darwin19-ar qc ../../../lib/libgmock.a  CMakeFiles/gmock.dir/src/gmock-all.cc.o
/opt/osxcross/target/bin/x86_64-apple-darwin19-ranlib ../../../lib/libgmock.a
make[2]: Leaving directory '/work/build/darwin-x64'
[ 64%] Built target gmock
[ 64%] Building CXX object rabbitmq-fmu/CMakeFiles/it-test-rabbitmq.dir/src/rabbitmq/RabbitMqHandlerException.cpp.o
cd /work/build/darwin-x64/rabbitmq-fmu && /opt/osxcross/target/bin/o64-clang++  -DAMQP_STATIC -DFMI_COSIMULATION -I/work/rabbitmq-fmu/../thirdparty/fmi/include -I/work/thirdparty/rapidjson/include -isystem /work/thirdparty/googletest/googletest/include -I/work/rabbitmq-fmu/src -isystem /work/thirdparty/googletest/googletest -isystem /work/build/external/darwin-x86_64/include -I/work/thirdparty/rabbitmq-c/rabbitmq-c/librabbitmq -I/work/thirdparty/date/date -I/work/thirdparty/date/date/include -I/work/rabbitmq-core/src  -O2 -g -DNDEBUG -isysroot /opt/osxcross/target/SDK/MacOSX10.15.sdk   -std=gnu++1z -o CMakeFiles/it-test-rabbitmq.dir/src/rabbitmq/RabbitMqHandlerException.cpp.o -c /work/rabbitmq-fmu/src/rabbitmq/RabbitMqHandlerException.cpp
[ 83%] Building CXX object rabbitmq-fmu/CMakeFiles/unit-test-rabbitmq.dir/test/FmuContainer_test.cpp.o
cd /work/build/linux-x64/rabbitmq-fmu && /usr/bin/x86_64-linux-gnu-g++  -DAMQP_STATIC -DFMI_COSIMULATION -I/work/rabbitmq-fmu/../thirdparty/fmi/include -I/work/thirdparty/rapidjson/include -I/work/rabbitmq-fmu/src -I/work/thirdparty/rabbitmq-c/rabbitmq-c/librabbitmq -I/work/thirdparty/date/date -I/work/thirdparty/date/date/include -I/work/rabbitmq-core/src -isystem /work/thirdparty/googletest/googletest/include -isystem /work/thirdparty/googletest/googletest -isystem /work/build/external/linux-x86_64/include  -O2 -g -DNDEBUG   -std=gnu++1z -o CMakeFiles/unit-test-rabbitmq.dir/test/FmuContainer_test.cpp.o -c /work/rabbitmq-fmu/test/FmuContainer_test.cpp
[ 64%] Linking CXX executable it-test-rabbitmq-core
cd /work/build/linux-x86/rabbitmq-core && /usr/bin/cmake -E cmake_link_script CMakeFiles/it-test-rabbitmq-core.dir/link.txt --verbose=1
/usr/i686-linux-gnu/bin/i686-linux-gnu-g++  -O2 -g -DNDEBUG   CMakeFiles/it-test-rabbitmq-core.dir/src/FmuContainerCore.cpp.o  -o it-test-rabbitmq-core ../lib/libgtest_main.a ../thirdparty/date/date/libtz.a ../lib/libgtest.a -lpthread 
[ 64%] Building CXX object rabbitmq-fmu/CMakeFiles/it-test-rabbitmq.dir/src/rabbitmq/RabbitMqHandlerException.cpp.o
cd /work/build/linux-x86/rabbitmq-fmu && /usr/i686-linux-gnu/bin/i686-linux-gnu-g++  -DAMQP_STATIC -DFMI_COSIMULATION -I/work/rabbitmq-fmu/../thirdparty/fmi/include -I/work/thirdparty/rapidjson/include -I/work/rabbitmq-fmu/src -I/work/thirdparty/rabbitmq-c/rabbitmq-c/librabbitmq -I/work/thirdparty/date/date -I/work/thirdparty/date/date/include -I/work/rabbitmq-core/src -isystem /work/thirdparty/googletest/googletest/include -isystem /work/thirdparty/googletest/googletest -isystem /work/build/external/linux-i386/include  -O2 -g -DNDEBUG   -std=gnu++1z -o CMakeFiles/it-test-rabbitmq.dir/src/rabbitmq/RabbitMqHandlerException.cpp.o -c /work/rabbitmq-fmu/src/rabbitmq/RabbitMqHandlerException.cpp
make[2]: Leaving directory '/work/build/linux-x86'
[ 64%] Built target it-test-rabbitmq-core
[ 67%] Building CXX object rabbitmq-fmu/CMakeFiles/unit-test-rabbitmq.dir/src/Iso8601TimeParser.cpp.o
cd /work/build/linux-x86/rabbitmq-fmu && /usr/i686-linux-gnu/bin/i686-linux-gnu-g++  -DAMQP_STATIC -DFMI_COSIMULATION -I/work/rabbitmq-fmu/../thirdparty/fmi/include -I/work/thirdparty/rapidjson/include -I/work/rabbitmq-fmu/src -I/work/thirdparty/rabbitmq-c/rabbitmq-c/librabbitmq -I/work/thirdparty/date/date -I/work/thirdparty/date/date/include -I/work/rabbitmq-core/src -isystem /work/thirdparty/googletest/googletest/include -isystem /work/thirdparty/googletest/googletest -isystem /work/build/external/linux-i386/include  -O2 -g -DNDEBUG   -std=gnu++1z -o CMakeFiles/unit-test-rabbitmq.dir/src/Iso8601TimeParser.cpp.o -c /work/rabbitmq-fmu/src/Iso8601TimeParser.cpp
1 warning generated.
[ 64%] Linking CXX executable it-test-rabbitmq-core
cd /work/build/darwin-x64/rabbitmq-core && /usr/bin/cmake -E cmake_link_script CMakeFiles/it-test-rabbitmq-core.dir/link.txt --verbose=1
/opt/osxcross/target/bin/o64-clang++  -O2 -g -DNDEBUG -isysroot /opt/osxcross/target/SDK/MacOSX10.15.sdk -Wl,-headerpad_max_install_names  CMakeFiles/it-test-rabbitmq-core.dir/src/FmuContainerCore.cpp.o  -o it-test-rabbitmq-core ../lib/libgtest_main.a ../thirdparty/date/date/libtz.a ../lib/libgtest.a 
make[2]: Leaving directory '/work/build/darwin-x64'
[ 64%] Built target it-test-rabbitmq-core
[ 67%] Building CXX object rabbitmq-fmu/CMakeFiles/unit-test-rabbitmq.dir/src/Iso8601TimeParser.cpp.o
cd /work/build/darwin-x64/rabbitmq-fmu && /opt/osxcross/target/bin/o64-clang++  -DAMQP_STATIC -DFMI_COSIMULATION -I/work/rabbitmq-fmu/../thirdparty/fmi/include -I/work/thirdparty/rapidjson/include -isystem /work/thirdparty/googletest/googletest/include -I/work/rabbitmq-fmu/src -isystem /work/thirdparty/googletest/googletest -isystem /work/build/external/darwin-x86_64/include -I/work/thirdparty/rabbitmq-c/rabbitmq-c/librabbitmq -I/work/thirdparty/date/date -I/work/thirdparty/date/date/include -I/work/rabbitmq-core/src  -O2 -g -DNDEBUG -isysroot /opt/osxcross/target/SDK/MacOSX10.15.sdk   -std=gnu++1z -o CMakeFiles/unit-test-rabbitmq.dir/src/Iso8601TimeParser.cpp.o -c /work/rabbitmq-fmu/src/Iso8601TimeParser.cpp
[ 70%] Building CXX object rabbitmq-fmu/CMakeFiles/it-test-rabbitmq.dir/src/rabbitmq/RabbitmqHandler.cpp.o
cd /work/build/darwin-x64/rabbitmq-fmu && /opt/osxcross/target/bin/o64-clang++  -DAMQP_STATIC -DFMI_COSIMULATION -I/work/rabbitmq-fmu/../thirdparty/fmi/include -I/work/thirdparty/rapidjson/include -isystem /work/thirdparty/googletest/googletest/include -I/work/rabbitmq-fmu/src -isystem /work/thirdparty/googletest/googletest -isystem /work/build/external/darwin-x86_64/include -I/work/thirdparty/rabbitmq-c/rabbitmq-c/librabbitmq -I/work/thirdparty/date/date -I/work/thirdparty/date/date/include -I/work/rabbitmq-core/src  -O2 -g -DNDEBUG -isysroot /opt/osxcross/target/SDK/MacOSX10.15.sdk   -std=gnu++1z -o CMakeFiles/it-test-rabbitmq.dir/src/rabbitmq/RabbitmqHandler.cpp.o -c /work/rabbitmq-fmu/src/rabbitmq/RabbitmqHandler.cpp
[ 70%] Building CXX object rabbitmq-fmu/CMakeFiles/it-test-rabbitmq.dir/src/rabbitmq/RabbitmqHandler.cpp.o
cd /work/build/linux-x86/rabbitmq-fmu && /usr/i686-linux-gnu/bin/i686-linux-gnu-g++  -DAMQP_STATIC -DFMI_COSIMULATION -I/work/rabbitmq-fmu/../thirdparty/fmi/include -I/work/thirdparty/rapidjson/include -I/work/rabbitmq-fmu/src -I/work/thirdparty/rabbitmq-c/rabbitmq-c/librabbitmq -I/work/thirdparty/date/date -I/work/thirdparty/date/date/include -I/work/rabbitmq-core/src -isystem /work/thirdparty/googletest/googletest/include -isystem /work/thirdparty/googletest/googletest -isystem /work/build/external/linux-i386/include  -O2 -g -DNDEBUG   -std=gnu++1z -o CMakeFiles/it-test-rabbitmq.dir/src/rabbitmq/RabbitmqHandler.cpp.o -c /work/rabbitmq-fmu/src/rabbitmq/RabbitmqHandler.cpp
[ 70%] Building CXX object rabbitmq-fmu/CMakeFiles/it-test-rabbitmq.dir/test/fmu_test_it.cpp.o
cd /work/build/linux-x86/rabbitmq-fmu && /usr/i686-linux-gnu/bin/i686-linux-gnu-g++  -DAMQP_STATIC -DFMI_COSIMULATION -I/work/rabbitmq-fmu/../thirdparty/fmi/include -I/work/thirdparty/rapidjson/include -I/work/rabbitmq-fmu/src -I/work/thirdparty/rabbitmq-c/rabbitmq-c/librabbitmq -I/work/thirdparty/date/date -I/work/thirdparty/date/date/include -I/work/rabbitmq-core/src -isystem /work/thirdparty/googletest/googletest/include -isystem /work/thirdparty/googletest/googletest -isystem /work/build/external/linux-i386/include  -O2 -g -DNDEBUG   -std=gnu++1z -o CMakeFiles/it-test-rabbitmq.dir/test/fmu_test_it.cpp.o -c /work/rabbitmq-fmu/test/fmu_test_it.cpp
make -f thirdparty/googletest/googletest/CMakeFiles/gtest_main.dir/build.make thirdparty/googletest/googletest/CMakeFiles/gtest_main.dir/depend
make[2]: Entering directory '/work/build/win-x86'
cd /work/build/win-x86 && /usr/src/mxe/usr/x86_64-pc-linux-gnu/bin/cmake -E cmake_depends "Unix Makefiles" /work /work/thirdparty/googletest/googletest /work/build/win-x86 /work/build/win-x86/thirdparty/googletest/googletest /work/build/win-x86/thirdparty/googletest/googletest/CMakeFiles/gtest_main.dir/DependInfo.cmake --color=
Scanning dependencies of target gtest_main
make[2]: Leaving directory '/work/build/win-x86'
make -f thirdparty/googletest/googletest/CMakeFiles/gtest_main.dir/build.make thirdparty/googletest/googletest/CMakeFiles/gtest_main.dir/build
make[2]: Entering directory '/work/build/win-x86'
[ 35%] Building CXX object thirdparty/googletest/googletest/CMakeFiles/gtest_main.dir/src/gtest_main.cc.obj
cd /work/build/win-x86/thirdparty/googletest/googletest && /usr/src/mxe/usr/bin/i686-w64-mingw32.static-g++   @CMakeFiles/gtest_main.dir/includes_CXX.rsp -O3 -DNDEBUG   -Wall -Wshadow -Werror -Wno-error=dangling-else -DGTEST_HAS_PTHREAD=0 -fexceptions -Wextra -Wno-unused-parameter -Wno-missing-field-initializers -std=c++11 -o CMakeFiles/gtest_main.dir/src/gtest_main.cc.obj -c /work/thirdparty/googletest/googletest/src/gtest_main.cc
[ 37%] Building CXX object rabbitmq-fmu/CMakeFiles/rabbitmq.dir/src/Iso8601TimeParser.cpp.obj
cd /work/build/win-x86/rabbitmq-fmu && /usr/src/mxe/usr/bin/i686-w64-mingw32.static-g++  -DAMQP_STATIC -DFMI_COSIMULATION -Drabbitmq_EXPORTS @CMakeFiles/rabbitmq.dir/includes_CXX.rsp -O3 -DNDEBUG   -std=gnu++17 -o CMakeFiles/rabbitmq.dir/src/Iso8601TimeParser.cpp.obj -c /work/rabbitmq-fmu/src/Iso8601TimeParser.cpp
/work/rabbitmq-fmu/src/main.cpp: In function 'int main()':
/work/rabbitmq-fmu/src/main.cpp:204:65: error: 'setprecision' was not declared in this scope
  204 |                     cout << "Ref: '" << vr[i] << "' Value '" << setprecision(10) << value[i] << "'" << endl;
      |                                                                 ^~~~~~~~~~~~
[ 83%] Building CXX object rabbitmq-fmu/CMakeFiles/unit-test-rabbitmq.dir/test/json_test.cpp.o
cd /work/build/linux-x64/rabbitmq-fmu && /usr/bin/x86_64-linux-gnu-g++  -DAMQP_STATIC -DFMI_COSIMULATION -I/work/rabbitmq-fmu/../thirdparty/fmi/include -I/work/thirdparty/rapidjson/include -I/work/rabbitmq-fmu/src -I/work/thirdparty/rabbitmq-c/rabbitmq-c/librabbitmq -I/work/thirdparty/date/date -I/work/thirdparty/date/date/include -I/work/rabbitmq-core/src -isystem /work/thirdparty/googletest/googletest/include -isystem /work/thirdparty/googletest/googletest -isystem /work/build/external/linux-x86_64/include  -O2 -g -DNDEBUG   -std=gnu++1z -o CMakeFiles/unit-test-rabbitmq.dir/test/json_test.cpp.o -c /work/rabbitmq-fmu/test/json_test.cpp
rabbitmq-fmu/CMakeFiles/rabbitmq-main.dir/build.make:178: recipe for target 'rabbitmq-fmu/CMakeFiles/rabbitmq-main.dir/src/main.cpp.obj' failed
make[2]: *** [rabbitmq-fmu/CMakeFiles/rabbitmq-main.dir/src/main.cpp.obj] Error 1
make[2]: *** Waiting for unfinished jobs....
[ 37%] Building CXX object rabbitmq-fmu/CMakeFiles/rabbitmq.dir/src/fmu.cpp.obj
cd /work/build/win-x86/rabbitmq-fmu && /usr/src/mxe/usr/bin/i686-w64-mingw32.static-g++  -DAMQP_STATIC -DFMI_COSIMULATION -Drabbitmq_EXPORTS @CMakeFiles/rabbitmq.dir/includes_CXX.rsp -O3 -DNDEBUG   -std=gnu++17 -o CMakeFiles/rabbitmq.dir/src/fmu.cpp.obj -c /work/rabbitmq-fmu/src/fmu.cpp
[ 87%] Building CXX object rabbitmq-fmu/CMakeFiles/unit-test-rabbitmq.dir/test/message_parser_test.cpp.o
cd /work/build/linux-x64/rabbitmq-fmu && /usr/bin/x86_64-linux-gnu-g++  -DAMQP_STATIC -DFMI_COSIMULATION -I/work/rabbitmq-fmu/../thirdparty/fmi/include -I/work/thirdparty/rapidjson/include -I/work/rabbitmq-fmu/src -I/work/thirdparty/rabbitmq-c/rabbitmq-c/librabbitmq -I/work/thirdparty/date/date -I/work/thirdparty/date/date/include -I/work/rabbitmq-core/src -isystem /work/thirdparty/googletest/googletest/include -isystem /work/thirdparty/googletest/googletest -isystem /work/build/external/linux-x86_64/include  -O2 -g -DNDEBUG   -std=gnu++1z -o CMakeFiles/unit-test-rabbitmq.dir/test/message_parser_test.cpp.o -c /work/rabbitmq-fmu/test/message_parser_test.cpp
[ 87%] Building CXX object rabbitmq-fmu/CMakeFiles/it-test-rabbitmq.dir/src/rabbitmq/RabbitMqHandlerException.cpp.o
cd /work/build/linux-x64/rabbitmq-fmu && /usr/bin/x86_64-linux-gnu-g++  -DAMQP_STATIC -DFMI_COSIMULATION -I/work/rabbitmq-fmu/../thirdparty/fmi/include -I/work/thirdparty/rapidjson/include -I/work/rabbitmq-fmu/src -I/work/thirdparty/rabbitmq-c/rabbitmq-c/librabbitmq -I/work/thirdparty/date/date -I/work/thirdparty/date/date/include -I/work/rabbitmq-core/src -isystem /work/thirdparty/googletest/googletest/include -isystem /work/thirdparty/googletest/googletest -isystem /work/build/external/linux-x86_64/include  -O2 -g -DNDEBUG   -std=gnu++1z -o CMakeFiles/it-test-rabbitmq.dir/src/rabbitmq/RabbitMqHandlerException.cpp.o -c /work/rabbitmq-fmu/src/rabbitmq/RabbitMqHandlerException.cpp
[ 74%] Linking CXX executable unit-test-rabbitmq-core
cd /work/build/darwin-x64/rabbitmq-core && /usr/bin/cmake -E cmake_link_script CMakeFiles/unit-test-rabbitmq-core.dir/link.txt --verbose=1
/opt/osxcross/target/bin/o64-clang++  -O2 -g -DNDEBUG -isysroot /opt/osxcross/target/SDK/MacOSX10.15.sdk -Wl,-headerpad_max_install_names  CMakeFiles/unit-test-rabbitmq-core.dir/src/FmuContainerCore.cpp.o CMakeFiles/unit-test-rabbitmq-core.dir/test/FmuContainerCore_test.cpp.o  -o unit-test-rabbitmq-core ../lib/libgtest_main.a ../thirdparty/date/date/libtz.a ../lib/libgtest.a 
make[2]: Leaving directory '/work/build/darwin-x64'
[ 74%] Built target unit-test-rabbitmq-core
make -f thirdparty/googletest/googlemock/CMakeFiles/gmock_main.dir/build.make thirdparty/googletest/googlemock/CMakeFiles/gmock_main.dir/depend
make[2]: Entering directory '/work/build/darwin-x64'
cd /work/build/darwin-x64 && /usr/bin/cmake -E cmake_depends "Unix Makefiles" /work /work/thirdparty/googletest/googlemock /work/build/darwin-x64 /work/build/darwin-x64/thirdparty/googletest/googlemock /work/build/darwin-x64/thirdparty/googletest/googlemock/CMakeFiles/gmock_main.dir/DependInfo.cmake --color=
[ 74%] Building CXX object rabbitmq-fmu/CMakeFiles/it-test-rabbitmq.dir/test/fmu_test_it.cpp.o
cd /work/build/darwin-x64/rabbitmq-fmu && /opt/osxcross/target/bin/o64-clang++  -DAMQP_STATIC -DFMI_COSIMULATION -I/work/rabbitmq-fmu/../thirdparty/fmi/include -I/work/thirdparty/rapidjson/include -isystem /work/thirdparty/googletest/googletest/include -I/work/rabbitmq-fmu/src -isystem /work/thirdparty/googletest/googletest -isystem /work/build/external/darwin-x86_64/include -I/work/thirdparty/rabbitmq-c/rabbitmq-c/librabbitmq -I/work/thirdparty/date/date -I/work/thirdparty/date/date/include -I/work/rabbitmq-core/src  -O2 -g -DNDEBUG -isysroot /opt/osxcross/target/SDK/MacOSX10.15.sdk   -std=gnu++1z -o CMakeFiles/it-test-rabbitmq.dir/test/fmu_test_it.cpp.o -c /work/rabbitmq-fmu/test/fmu_test_it.cpp
Scanning dependencies of target gmock_main
make[2]: Leaving directory '/work/build/darwin-x64'
make -f thirdparty/googletest/googlemock/CMakeFiles/gmock_main.dir/build.make thirdparty/googletest/googlemock/CMakeFiles/gmock_main.dir/build
make[2]: Entering directory '/work/build/darwin-x64'
[ 74%] Building CXX object thirdparty/googletest/googlemock/CMakeFiles/gmock_main.dir/src/gmock_main.cc.o
cd /work/build/darwin-x64/thirdparty/googletest/googlemock && /opt/osxcross/target/bin/o64-clang++   -isystem /work/thirdparty/googletest/googlemock/include -isystem /work/thirdparty/googletest/googlemock -isystem /work/thirdparty/googletest/googletest/include -isystem /work/thirdparty/googletest/googletest  -O2 -g -DNDEBUG -isysroot /opt/osxcross/target/SDK/MacOSX10.15.sdk   -Wall -Wshadow -Werror -Wconversion -DGTEST_HAS_PTHREAD=1 -fexceptions -W -Wpointer-arith -Wreturn-type -Wcast-qual -Wwrite-strings -Wswitch -Wunused-parameter -Wcast-align -Wchar-subscripts -Winline -Wredundant-decls -std=c++11 -o CMakeFiles/gmock_main.dir/src/gmock_main.cc.o -c /work/thirdparty/googletest/googlemock/src/gmock_main.cc
[ 74%] Building CXX object rabbitmq-fmu/CMakeFiles/it-test-rabbitmq.dir/test/rabbitmq_test_it.cpp.o
cd /work/build/linux-x86/rabbitmq-fmu && /usr/i686-linux-gnu/bin/i686-linux-gnu-g++  -DAMQP_STATIC -DFMI_COSIMULATION -I/work/rabbitmq-fmu/../thirdparty/fmi/include -I/work/thirdparty/rapidjson/include -I/work/rabbitmq-fmu/src -I/work/thirdparty/rabbitmq-c/rabbitmq-c/librabbitmq -I/work/thirdparty/date/date -I/work/thirdparty/date/date/include -I/work/rabbitmq-core/src -isystem /work/thirdparty/googletest/googletest/include -isystem /work/thirdparty/googletest/googletest -isystem /work/build/external/linux-i386/include  -O2 -g -DNDEBUG   -std=gnu++1z -o CMakeFiles/it-test-rabbitmq.dir/test/rabbitmq_test_it.cpp.o -c /work/rabbitmq-fmu/test/rabbitmq_test_it.cpp
[ 87%] Building CXX object rabbitmq-fmu/CMakeFiles/unit-test-rabbitmq.dir/test/modeldescription_test.cpp.o
cd /work/build/linux-x64/rabbitmq-fmu && /usr/bin/x86_64-linux-gnu-g++  -DAMQP_STATIC -DFMI_COSIMULATION -I/work/rabbitmq-fmu/../thirdparty/fmi/include -I/work/thirdparty/rapidjson/include -I/work/rabbitmq-fmu/src -I/work/thirdparty/rabbitmq-c/rabbitmq-c/librabbitmq -I/work/thirdparty/date/date -I/work/thirdparty/date/date/include -I/work/rabbitmq-core/src -isystem /work/thirdparty/googletest/googletest/include -isystem /work/thirdparty/googletest/googletest -isystem /work/build/external/linux-x86_64/include  -O2 -g -DNDEBUG   -std=gnu++1z -o CMakeFiles/unit-test-rabbitmq.dir/test/modeldescription_test.cpp.o -c /work/rabbitmq-fmu/test/modeldescription_test.cpp
[ 40%] Building CXX object rabbitmq-fmu/CMakeFiles/rabbitmq.dir/src/message/MessageParser.cpp.obj
cd /work/build/win-x86/rabbitmq-fmu && /usr/src/mxe/usr/bin/i686-w64-mingw32.static-g++  -DAMQP_STATIC -DFMI_COSIMULATION -Drabbitmq_EXPORTS @CMakeFiles/rabbitmq.dir/includes_CXX.rsp -O3 -DNDEBUG   -std=gnu++17 -o CMakeFiles/rabbitmq.dir/src/message/MessageParser.cpp.obj -c /work/rabbitmq-fmu/src/message/MessageParser.cpp
[ 90%] Building CXX object rabbitmq-fmu/CMakeFiles/it-test-rabbitmq.dir/src/rabbitmq/RabbitmqHandler.cpp.o
cd /work/build/linux-x64/rabbitmq-fmu && /usr/bin/x86_64-linux-gnu-g++  -DAMQP_STATIC -DFMI_COSIMULATION -I/work/rabbitmq-fmu/../thirdparty/fmi/include -I/work/thirdparty/rapidjson/include -I/work/rabbitmq-fmu/src -I/work/thirdparty/rabbitmq-c/rabbitmq-c/librabbitmq -I/work/thirdparty/date/date -I/work/thirdparty/date/date/include -I/work/rabbitmq-core/src -isystem /work/thirdparty/googletest/googletest/include -isystem /work/thirdparty/googletest/googletest -isystem /work/build/external/linux-x86_64/include  -O2 -g -DNDEBUG   -std=gnu++1z -o CMakeFiles/it-test-rabbitmq.dir/src/rabbitmq/RabbitmqHandler.cpp.o -c /work/rabbitmq-fmu/src/rabbitmq/RabbitmqHandler.cpp
[ 90%] Building CXX object rabbitmq-fmu/CMakeFiles/unit-test-rabbitmq.dir/test/timetamp_test.cpp.o
cd /work/build/linux-x64/rabbitmq-fmu && /usr/bin/x86_64-linux-gnu-g++  -DAMQP_STATIC -DFMI_COSIMULATION -I/work/rabbitmq-fmu/../thirdparty/fmi/include -I/work/thirdparty/rapidjson/include -I/work/rabbitmq-fmu/src -I/work/thirdparty/rabbitmq-c/rabbitmq-c/librabbitmq -I/work/thirdparty/date/date -I/work/thirdparty/date/date/include -I/work/rabbitmq-core/src -isystem /work/thirdparty/googletest/googletest/include -isystem /work/thirdparty/googletest/googletest -isystem /work/build/external/linux-x86_64/include  -O2 -g -DNDEBUG   -std=gnu++1z -o CMakeFiles/unit-test-rabbitmq.dir/test/timetamp_test.cpp.o -c /work/rabbitmq-fmu/test/timetamp_test.cpp
[ 77%] Building CXX object rabbitmq-fmu/CMakeFiles/it-test-rabbitmq.dir/test/rabbitmq_test_it.cpp.o
cd /work/build/darwin-x64/rabbitmq-fmu && /opt/osxcross/target/bin/o64-clang++  -DAMQP_STATIC -DFMI_COSIMULATION -I/work/rabbitmq-fmu/../thirdparty/fmi/include -I/work/thirdparty/rapidjson/include -isystem /work/thirdparty/googletest/googletest/include -I/work/rabbitmq-fmu/src -isystem /work/thirdparty/googletest/googletest -isystem /work/build/external/darwin-x86_64/include -I/work/thirdparty/rabbitmq-c/rabbitmq-c/librabbitmq -I/work/thirdparty/date/date -I/work/thirdparty/date/date/include -I/work/rabbitmq-core/src  -O2 -g -DNDEBUG -isysroot /opt/osxcross/target/SDK/MacOSX10.15.sdk   -std=gnu++1z -o CMakeFiles/it-test-rabbitmq.dir/test/rabbitmq_test_it.cpp.o -c /work/rabbitmq-fmu/test/rabbitmq_test_it.cpp
[ 40%] Linking CXX static library ../../../lib/libgtest_main.a
cd /work/build/win-x86/thirdparty/googletest/googletest && /usr/src/mxe/usr/x86_64-pc-linux-gnu/bin/cmake -P CMakeFiles/gtest_main.dir/cmake_clean_target.cmake
[ 40%] Building CXX object rabbitmq-fmu/CMakeFiles/rabbitmq.dir/src/modeldescription/ModelDescriptionParser.cpp.obj
cd /work/build/win-x86/rabbitmq-fmu && /usr/src/mxe/usr/bin/i686-w64-mingw32.static-g++  -DAMQP_STATIC -DFMI_COSIMULATION -Drabbitmq_EXPORTS @CMakeFiles/rabbitmq.dir/includes_CXX.rsp -O3 -DNDEBUG   -std=gnu++17 -o CMakeFiles/rabbitmq.dir/src/modeldescription/ModelDescriptionParser.cpp.obj -c /work/rabbitmq-fmu/src/modeldescription/ModelDescriptionParser.cpp
cd /work/build/win-x86/thirdparty/googletest/googletest && /usr/src/mxe/usr/x86_64-pc-linux-gnu/bin/cmake -E cmake_link_script CMakeFiles/gtest_main.dir/link.txt --verbose=1
/usr/src/mxe/usr/bin/i686-w64-mingw32.static-ar qc ../../../lib/libgtest_main.a  CMakeFiles/gtest_main.dir/src/gtest_main.cc.obj
/usr/src/mxe/usr/bin/i686-w64-mingw32.static-ranlib ../../../lib/libgtest_main.a
make[2]: Leaving directory '/work/build/win-x86'
[ 40%] Built target gtest_main
make -f rabbitmq-core/CMakeFiles/unit-test-rabbitmq-core.dir/build.make rabbitmq-core/CMakeFiles/unit-test-rabbitmq-core.dir/depend
make[2]: Entering directory '/work/build/win-x86'
cd /work/build/win-x86 && /usr/src/mxe/usr/x86_64-pc-linux-gnu/bin/cmake -E cmake_depends "Unix Makefiles" /work /work/rabbitmq-core /work/build/win-x86 /work/build/win-x86/rabbitmq-core /work/build/win-x86/rabbitmq-core/CMakeFiles/unit-test-rabbitmq-core.dir/DependInfo.cmake --color=
[ 32%] Building CXX object rabbitmq-fmu/CMakeFiles/rabbitmq-main.dir/src/rabbitmq/RabbitMqHandlerException.cpp.obj
cd /work/build/win-x64/rabbitmq-fmu && /usr/src/mxe/usr/bin/x86_64-w64-mingw32.static-g++  -DAMQP_STATIC -DFMI_COSIMULATION @CMakeFiles/rabbitmq-main.dir/includes_CXX.rsp -O3 -DNDEBUG   -std=gnu++17 -o CMakeFiles/rabbitmq-main.dir/src/rabbitmq/RabbitMqHandlerException.cpp.obj -c /work/rabbitmq-fmu/src/rabbitmq/RabbitMqHandlerException.cpp
[ 32%] Building CXX object rabbitmq-fmu/CMakeFiles/rabbitmq.dir/src/modeldescription/ModelDescriptionParser.cpp.obj
[ 35%] Building CXX object rabbitmq-fmu/CMakeFiles/rabbitmq.dir/src/message/MessageParser.cpp.obj
cd /work/build/win-x64/rabbitmq-fmu && /usr/src/mxe/usr/bin/x86_64-w64-mingw32.static-g++  -DAMQP_STATIC -DFMI_COSIMULATION -Drabbitmq_EXPORTS @CMakeFiles/rabbitmq.dir/includes_CXX.rsp -O3 -DNDEBUG   -std=gnu++17 -o CMakeFiles/rabbitmq.dir/src/message/MessageParser.cpp.obj -c /work/rabbitmq-fmu/src/message/MessageParser.cpp
cd /work/build/win-x64/rabbitmq-fmu && /usr/src/mxe/usr/bin/x86_64-w64-mingw32.static-g++  -DAMQP_STATIC -DFMI_COSIMULATION -Drabbitmq_EXPORTS @CMakeFiles/rabbitmq.dir/includes_CXX.rsp -O3 -DNDEBUG   -std=gnu++17 -o CMakeFiles/rabbitmq.dir/src/modeldescription/ModelDescriptionParser.cpp.obj -c /work/rabbitmq-fmu/src/modeldescription/ModelDescriptionParser.cpp
[ 37%] Building CXX object rabbitmq-fmu/CMakeFiles/rabbitmq.dir/src/rabbitmq/RabbitMqHandlerException.cpp.obj
cd /work/build/win-x64/rabbitmq-fmu && /usr/src/mxe/usr/bin/x86_64-w64-mingw32.static-g++  -DAMQP_STATIC -DFMI_COSIMULATION -Drabbitmq_EXPORTS @CMakeFiles/rabbitmq.dir/includes_CXX.rsp -O3 -DNDEBUG   -std=gnu++17 -o CMakeFiles/rabbitmq.dir/src/rabbitmq/RabbitMqHandlerException.cpp.obj -c /work/rabbitmq-fmu/src/rabbitmq/RabbitMqHandlerException.cpp
Scanning dependencies of target unit-test-rabbitmq-core
make[2]: Leaving directory '/work/build/win-x86'
make -f rabbitmq-core/CMakeFiles/unit-test-rabbitmq-core.dir/build.make rabbitmq-core/CMakeFiles/unit-test-rabbitmq-core.dir/build
make[2]: Entering directory '/work/build/win-x86'
[ 43%] Building CXX object rabbitmq-core/CMakeFiles/unit-test-rabbitmq-core.dir/src/FmuContainerCore.cpp.obj
cd /work/build/win-x86/rabbitmq-core && /usr/src/mxe/usr/bin/i686-w64-mingw32.static-g++   @CMakeFiles/unit-test-rabbitmq-core.dir/includes_CXX.rsp -O3 -DNDEBUG   -std=gnu++17 -o CMakeFiles/unit-test-rabbitmq-core.dir/src/FmuContainerCore.cpp.obj -c /work/rabbitmq-core/src/FmuContainerCore.cpp
[ 40%] Building CXX object rabbitmq-fmu/CMakeFiles/rabbitmq-main.dir/src/rabbitmq/RabbitmqHandler.cpp.obj
cd /work/build/win-x64/rabbitmq-fmu && /usr/src/mxe/usr/bin/x86_64-w64-mingw32.static-g++  -DAMQP_STATIC -DFMI_COSIMULATION @CMakeFiles/rabbitmq-main.dir/includes_CXX.rsp -O3 -DNDEBUG   -std=gnu++17 -o CMakeFiles/rabbitmq-main.dir/src/rabbitmq/RabbitmqHandler.cpp.obj -c /work/rabbitmq-fmu/src/rabbitmq/RabbitmqHandler.cpp
[ 77%] Building CXX object rabbitmq-fmu/CMakeFiles/it-test-rabbitmq.dir/test/rabbitmqhandler_test_it.cpp.o
cd /work/build/darwin-x64/rabbitmq-fmu && /opt/osxcross/target/bin/o64-clang++  -DAMQP_STATIC -DFMI_COSIMULATION -I/work/rabbitmq-fmu/../thirdparty/fmi/include -I/work/thirdparty/rapidjson/include -isystem /work/thirdparty/googletest/googletest/include -I/work/rabbitmq-fmu/src -isystem /work/thirdparty/googletest/googletest -isystem /work/build/external/darwin-x86_64/include -I/work/thirdparty/rabbitmq-c/rabbitmq-c/librabbitmq -I/work/thirdparty/date/date -I/work/thirdparty/date/date/include -I/work/rabbitmq-core/src  -O2 -g -DNDEBUG -isysroot /opt/osxcross/target/SDK/MacOSX10.15.sdk   -std=gnu++1z -o CMakeFiles/it-test-rabbitmq.dir/test/rabbitmqhandler_test_it.cpp.o -c /work/rabbitmq-fmu/test/rabbitmqhandler_test_it.cpp
[ 93%] Building CXX object rabbitmq-fmu/CMakeFiles/unit-test-rabbitmq.dir/test/xml_test.cpp.o
cd /work/build/linux-x64/rabbitmq-fmu && /usr/bin/x86_64-linux-gnu-g++  -DAMQP_STATIC -DFMI_COSIMULATION -I/work/rabbitmq-fmu/../thirdparty/fmi/include -I/work/thirdparty/rapidjson/include -I/work/rabbitmq-fmu/src -I/work/thirdparty/rabbitmq-c/rabbitmq-c/librabbitmq -I/work/thirdparty/date/date -I/work/thirdparty/date/date/include -I/work/rabbitmq-core/src -isystem /work/thirdparty/googletest/googletest/include -isystem /work/thirdparty/googletest/googletest -isystem /work/build/external/linux-x86_64/include  -O2 -g -DNDEBUG   -std=gnu++1z -o CMakeFiles/unit-test-rabbitmq.dir/test/xml_test.cpp.o -c /work/rabbitmq-fmu/test/xml_test.cpp
[ 93%] Building CXX object rabbitmq-fmu/CMakeFiles/it-test-rabbitmq.dir/test/fmu_test_it.cpp.o
cd /work/build/linux-x64/rabbitmq-fmu && /usr/bin/x86_64-linux-gnu-g++  -DAMQP_STATIC -DFMI_COSIMULATION -I/work/rabbitmq-fmu/../thirdparty/fmi/include -I/work/thirdparty/rapidjson/include -I/work/rabbitmq-fmu/src -I/work/thirdparty/rabbitmq-c/rabbitmq-c/librabbitmq -I/work/thirdparty/date/date -I/work/thirdparty/date/date/include -I/work/rabbitmq-core/src -isystem /work/thirdparty/googletest/googletest/include -isystem /work/thirdparty/googletest/googletest -isystem /work/build/external/linux-x86_64/include  -O2 -g -DNDEBUG   -std=gnu++1z -o CMakeFiles/it-test-rabbitmq.dir/test/fmu_test_it.cpp.o -c /work/rabbitmq-fmu/test/fmu_test_it.cpp
[ 77%] Building CXX object rabbitmq-fmu/CMakeFiles/unit-test-rabbitmq.dir/src/fmu.cpp.o
cd /work/build/darwin-x64/rabbitmq-fmu && /opt/osxcross/target/bin/o64-clang++  -DAMQP_STATIC -DFMI_COSIMULATION -I/work/rabbitmq-fmu/../thirdparty/fmi/include -I/work/thirdparty/rapidjson/include -isystem /work/thirdparty/googletest/googletest/include -I/work/rabbitmq-fmu/src -isystem /work/thirdparty/googletest/googletest -isystem /work/build/external/darwin-x86_64/include -I/work/thirdparty/rabbitmq-c/rabbitmq-c/librabbitmq -I/work/thirdparty/date/date -I/work/thirdparty/date/date/include -I/work/rabbitmq-core/src  -O2 -g -DNDEBUG -isysroot /opt/osxcross/target/SDK/MacOSX10.15.sdk   -std=gnu++1z -o CMakeFiles/unit-test-rabbitmq.dir/src/fmu.cpp.o -c /work/rabbitmq-fmu/src/fmu.cpp
[ 80%] Building CXX object rabbitmq-fmu/CMakeFiles/unit-test-rabbitmq.dir/src/message/MessageParser.cpp.o
[ 74%] Building CXX object rabbitmq-fmu/CMakeFiles/it-test-rabbitmq.dir/test/rabbitmqhandler_test_it.cpp.o
cd /work/build/linux-x86/rabbitmq-fmu && /usr/i686-linux-gnu/bin/i686-linux-gnu-g++  -DAMQP_STATIC -DFMI_COSIMULATION -I/work/rabbitmq-fmu/../thirdparty/fmi/include -I/work/thirdparty/rapidjson/include -I/work/rabbitmq-fmu/src -I/work/thirdparty/rabbitmq-c/rabbitmq-c/librabbitmq -I/work/thirdparty/date/date -I/work/thirdparty/date/date/include -I/work/rabbitmq-core/src -isystem /work/thirdparty/googletest/googletest/include -isystem /work/thirdparty/googletest/googletest -isystem /work/build/external/linux-i386/include  -O2 -g -DNDEBUG   -std=gnu++1z -o CMakeFiles/it-test-rabbitmq.dir/test/rabbitmqhandler_test_it.cpp.o -c /work/rabbitmq-fmu/test/rabbitmqhandler_test_it.cpp
cd /work/build/darwin-x64/rabbitmq-fmu && /opt/osxcross/target/bin/o64-clang++  -DAMQP_STATIC -DFMI_COSIMULATION -I/work/rabbitmq-fmu/../thirdparty/fmi/include -I/work/thirdparty/rapidjson/include -isystem /work/thirdparty/googletest/googletest/include -I/work/rabbitmq-fmu/src -isystem /work/thirdparty/googletest/googletest -isystem /work/build/external/darwin-x86_64/include -I/work/thirdparty/rabbitmq-c/rabbitmq-c/librabbitmq -I/work/thirdparty/date/date -I/work/thirdparty/date/date/include -I/work/rabbitmq-core/src  -O2 -g -DNDEBUG -isysroot /opt/osxcross/target/SDK/MacOSX10.15.sdk   -std=gnu++1z -o CMakeFiles/unit-test-rabbitmq.dir/src/message/MessageParser.cpp.o -c /work/rabbitmq-fmu/src/message/MessageParser.cpp
[ 96%] Building CXX object rabbitmq-fmu/CMakeFiles/it-test-rabbitmq.dir/test/rabbitmq_test_it.cpp.o
cd /work/build/linux-x64/rabbitmq-fmu && /usr/bin/x86_64-linux-gnu-g++  -DAMQP_STATIC -DFMI_COSIMULATION -I/work/rabbitmq-fmu/../thirdparty/fmi/include -I/work/thirdparty/rapidjson/include -I/work/rabbitmq-fmu/src -I/work/thirdparty/rabbitmq-c/rabbitmq-c/librabbitmq -I/work/thirdparty/date/date -I/work/thirdparty/date/date/include -I/work/rabbitmq-core/src -isystem /work/thirdparty/googletest/googletest/include -isystem /work/thirdparty/googletest/googletest -isystem /work/build/external/linux-x86_64/include  -O2 -g -DNDEBUG   -std=gnu++1z -o CMakeFiles/it-test-rabbitmq.dir/test/rabbitmq_test_it.cpp.o -c /work/rabbitmq-fmu/test/rabbitmq_test_it.cpp
[ 40%] Building CXX object rabbitmq-fmu/CMakeFiles/rabbitmq-main.dir/src/main.cpp.obj
cd /work/build/win-x64/rabbitmq-fmu && /usr/src/mxe/usr/bin/x86_64-w64-mingw32.static-g++  -DAMQP_STATIC -DFMI_COSIMULATION @CMakeFiles/rabbitmq-main.dir/includes_CXX.rsp -O3 -DNDEBUG   -std=gnu++17 -o CMakeFiles/rabbitmq-main.dir/src/main.cpp.obj -c /work/rabbitmq-fmu/src/main.cpp
[ 40%] Building CXX object rabbitmq-fmu/CMakeFiles/rabbitmq.dir/src/rabbitmq/RabbitmqHandler.cpp.obj
cd /work/build/win-x64/rabbitmq-fmu && /usr/src/mxe/usr/bin/x86_64-w64-mingw32.static-g++  -DAMQP_STATIC -DFMI_COSIMULATION -Drabbitmq_EXPORTS @CMakeFiles/rabbitmq.dir/includes_CXX.rsp -O3 -DNDEBUG   -std=gnu++17 -o CMakeFiles/rabbitmq.dir/src/rabbitmq/RabbitmqHandler.cpp.obj -c /work/rabbitmq-fmu/src/rabbitmq/RabbitmqHandler.cpp
make -f thirdparty/googletest/googlemock/CMakeFiles/gmock.dir/build.make thirdparty/googletest/googlemock/CMakeFiles/gmock.dir/depend
make[2]: Entering directory '/work/build/win-x64'
cd /work/build/win-x64 && /usr/src/mxe/usr/x86_64-pc-linux-gnu/bin/cmake -E cmake_depends "Unix Makefiles" /work /work/thirdparty/googletest/googlemock /work/build/win-x64 /work/build/win-x64/thirdparty/googletest/googlemock /work/build/win-x64/thirdparty/googletest/googlemock/CMakeFiles/gmock.dir/DependInfo.cmake --color=
Scanning dependencies of target gmock
make[2]: Leaving directory '/work/build/win-x64'
make -f thirdparty/googletest/googlemock/CMakeFiles/gmock.dir/build.make thirdparty/googletest/googlemock/CMakeFiles/gmock.dir/build
make[2]: Entering directory '/work/build/win-x64'
[ 40%] Building CXX object thirdparty/googletest/googlemock/CMakeFiles/gmock.dir/src/gmock-all.cc.obj
cd /work/build/win-x64/thirdparty/googletest/googlemock && /usr/src/mxe/usr/bin/x86_64-w64-mingw32.static-g++   @CMakeFiles/gmock.dir/includes_CXX.rsp -O3 -DNDEBUG   -Wall -Wshadow -Werror -Wno-error=dangling-else -DGTEST_HAS_PTHREAD=0 -fexceptions -Wextra -Wno-unused-parameter -Wno-missing-field-initializers -std=c++11 -o CMakeFiles/gmock.dir/src/gmock-all.cc.obj -c /work/thirdparty/googletest/googlemock/src/gmock-all.cc
make -f thirdparty/googletest/googletest/CMakeFiles/gtest_main.dir/build.make thirdparty/googletest/googletest/CMakeFiles/gtest_main.dir/depend
make[2]: Entering directory '/work/build/win-x64'
cd /work/build/win-x64 && /usr/src/mxe/usr/x86_64-pc-linux-gnu/bin/cmake -E cmake_depends "Unix Makefiles" /work /work/thirdparty/googletest/googletest /work/build/win-x64 /work/build/win-x64/thirdparty/googletest/googletest /work/build/win-x64/thirdparty/googletest/googletest/CMakeFiles/gtest_main.dir/DependInfo.cmake --color=
Scanning dependencies of target gtest_main
make[2]: Leaving directory '/work/build/win-x64'
make -f thirdparty/googletest/googletest/CMakeFiles/gtest_main.dir/build.make thirdparty/googletest/googletest/CMakeFiles/gtest_main.dir/build
make[2]: Entering directory '/work/build/win-x64'
[ 43%] Building CXX object thirdparty/googletest/googletest/CMakeFiles/gtest_main.dir/src/gtest_main.cc.obj
cd /work/build/win-x64/thirdparty/googletest/googletest && /usr/src/mxe/usr/bin/x86_64-w64-mingw32.static-g++   @CMakeFiles/gtest_main.dir/includes_CXX.rsp -O3 -DNDEBUG   -Wall -Wshadow -Werror -Wno-error=dangling-else -DGTEST_HAS_PTHREAD=0 -fexceptions -Wextra -Wno-unused-parameter -Wno-missing-field-initializers -std=c++11 -o CMakeFiles/gtest_main.dir/src/gtest_main.cc.obj -c /work/thirdparty/googletest/googletest/src/gtest_main.cc
[ 74%] Building CXX object rabbitmq-fmu/CMakeFiles/unit-test-rabbitmq.dir/src/fmu.cpp.o
cd /work/build/linux-x86/rabbitmq-fmu && /usr/i686-linux-gnu/bin/i686-linux-gnu-g++  -DAMQP_STATIC -DFMI_COSIMULATION -I/work/rabbitmq-fmu/../thirdparty/fmi/include -I/work/thirdparty/rapidjson/include -I/work/rabbitmq-fmu/src -I/work/thirdparty/rabbitmq-c/rabbitmq-c/librabbitmq -I/work/thirdparty/date/date -I/work/thirdparty/date/date/include -I/work/rabbitmq-core/src -isystem /work/thirdparty/googletest/googletest/include -isystem /work/thirdparty/googletest/googletest -isystem /work/build/external/linux-i386/include  -O2 -g -DNDEBUG   -std=gnu++1z -o CMakeFiles/unit-test-rabbitmq.dir/src/fmu.cpp.o -c /work/rabbitmq-fmu/src/fmu.cpp
[ 74%] Building CXX object rabbitmq-fmu/CMakeFiles/unit-test-rabbitmq.dir/src/modeldescription/ModelDescriptionParser.cpp.o
cd /work/build/linux-x86/rabbitmq-fmu && /usr/i686-linux-gnu/bin/i686-linux-gnu-g++  -DAMQP_STATIC -DFMI_COSIMULATION -I/work/rabbitmq-fmu/../thirdparty/fmi/include -I/work/thirdparty/rapidjson/include -I/work/rabbitmq-fmu/src -I/work/thirdparty/rabbitmq-c/rabbitmq-c/librabbitmq -I/work/thirdparty/date/date -I/work/thirdparty/date/date/include -I/work/rabbitmq-core/src -isystem /work/thirdparty/googletest/googletest/include -isystem /work/thirdparty/googletest/googletest -isystem /work/build/external/linux-i386/include  -O2 -g -DNDEBUG   -std=gnu++1z -o CMakeFiles/unit-test-rabbitmq.dir/src/modeldescription/ModelDescriptionParser.cpp.o -c /work/rabbitmq-fmu/src/modeldescription/ModelDescriptionParser.cpp
[ 77%] Building CXX object rabbitmq-fmu/CMakeFiles/unit-test-rabbitmq.dir/src/message/MessageParser.cpp.o
cd /work/build/linux-x86/rabbitmq-fmu && /usr/i686-linux-gnu/bin/i686-linux-gnu-g++  -DAMQP_STATIC -DFMI_COSIMULATION -I/work/rabbitmq-fmu/../thirdparty/fmi/include -I/work/thirdparty/rapidjson/include -I/work/rabbitmq-fmu/src -I/work/thirdparty/rabbitmq-c/rabbitmq-c/librabbitmq -I/work/thirdparty/date/date -I/work/thirdparty/date/date/include -I/work/rabbitmq-core/src -isystem /work/thirdparty/googletest/googletest/include -isystem /work/thirdparty/googletest/googletest -isystem /work/build/external/linux-i386/include  -O2 -g -DNDEBUG   -std=gnu++1z -o CMakeFiles/unit-test-rabbitmq.dir/src/message/MessageParser.cpp.o -c /work/rabbitmq-fmu/src/message/MessageParser.cpp
[ 80%] Building CXX object rabbitmq-fmu/CMakeFiles/unit-test-rabbitmq.dir/src/rabbitmq/RabbitMqHandlerException.cpp.o
cd /work/build/linux-x86/rabbitmq-fmu && /usr/i686-linux-gnu/bin/i686-linux-gnu-g++  -DAMQP_STATIC -DFMI_COSIMULATION -I/work/rabbitmq-fmu/../thirdparty/fmi/include -I/work/thirdparty/rapidjson/include -I/work/rabbitmq-fmu/src -I/work/thirdparty/rabbitmq-c/rabbitmq-c/librabbitmq -I/work/thirdparty/date/date -I/work/thirdparty/date/date/include -I/work/rabbitmq-core/src -isystem /work/thirdparty/googletest/googletest/include -isystem /work/thirdparty/googletest/googletest -isystem /work/build/external/linux-i386/include  -O2 -g -DNDEBUG   -std=gnu++1z -o CMakeFiles/unit-test-rabbitmq.dir/src/rabbitmq/RabbitMqHandlerException.cpp.o -c /work/rabbitmq-fmu/src/rabbitmq/RabbitMqHandlerException.cpp
[ 80%] Building CXX object rabbitmq-fmu/CMakeFiles/unit-test-rabbitmq.dir/src/rabbitmq/RabbitmqHandler.cpp.o
cd /work/build/linux-x86/rabbitmq-fmu && /usr/i686-linux-gnu/bin/i686-linux-gnu-g++  -DAMQP_STATIC -DFMI_COSIMULATION -I/work/rabbitmq-fmu/../thirdparty/fmi/include -I/work/thirdparty/rapidjson/include -I/work/rabbitmq-fmu/src -I/work/thirdparty/rabbitmq-c/rabbitmq-c/librabbitmq -I/work/thirdparty/date/date -I/work/thirdparty/date/date/include -I/work/rabbitmq-core/src -isystem /work/thirdparty/googletest/googletest/include -isystem /work/thirdparty/googletest/googletest -isystem /work/build/external/linux-i386/include  -O2 -g -DNDEBUG   -std=gnu++1z -o CMakeFiles/unit-test-rabbitmq.dir/src/rabbitmq/RabbitmqHandler.cpp.o -c /work/rabbitmq-fmu/src/rabbitmq/RabbitmqHandler.cpp
[ 96%] Building CXX object rabbitmq-fmu/CMakeFiles/it-test-rabbitmq.dir/test/rabbitmqhandler_test_it.cpp.o
cd /work/build/linux-x64/rabbitmq-fmu && /usr/bin/x86_64-linux-gnu-g++  -DAMQP_STATIC -DFMI_COSIMULATION -I/work/rabbitmq-fmu/../thirdparty/fmi/include -I/work/thirdparty/rapidjson/include -I/work/rabbitmq-fmu/src -I/work/thirdparty/rabbitmq-c/rabbitmq-c/librabbitmq -I/work/thirdparty/date/date -I/work/thirdparty/date/date/include -I/work/rabbitmq-core/src -isystem /work/thirdparty/googletest/googletest/include -isystem /work/thirdparty/googletest/googletest -isystem /work/build/external/linux-x86_64/include  -O2 -g -DNDEBUG   -std=gnu++1z -o CMakeFiles/it-test-rabbitmq.dir/test/rabbitmqhandler_test_it.cpp.o -c /work/rabbitmq-fmu/test/rabbitmqhandler_test_it.cpp
[ 83%] Linking CXX static library ../../../lib/libgmock_main.a
cd /work/build/darwin-x64/thirdparty/googletest/googlemock && /usr/bin/cmake -P CMakeFiles/gmock_main.dir/cmake_clean_target.cmake
cd /work/build/darwin-x64/thirdparty/googletest/googlemock && /usr/bin/cmake -E cmake_link_script CMakeFiles/gmock_main.dir/link.txt --verbose=1
/opt/osxcross/target/bin/x86_64-apple-darwin19-ar qc ../../../lib/libgmock_main.a  CMakeFiles/gmock_main.dir/src/gmock_main.cc.o
/opt/osxcross/target/bin/x86_64-apple-darwin19-ranlib ../../../lib/libgmock_main.a
make[2]: Leaving directory '/work/build/darwin-x64'
[ 83%] Built target gmock_main
[ 83%] Building CXX object rabbitmq-fmu/CMakeFiles/unit-test-rabbitmq.dir/src/modeldescription/ModelDescriptionParser.cpp.o
cd /work/build/darwin-x64/rabbitmq-fmu && /opt/osxcross/target/bin/o64-clang++  -DAMQP_STATIC -DFMI_COSIMULATION -I/work/rabbitmq-fmu/../thirdparty/fmi/include -I/work/thirdparty/rapidjson/include -isystem /work/thirdparty/googletest/googletest/include -I/work/rabbitmq-fmu/src -isystem /work/thirdparty/googletest/googletest -isystem /work/build/external/darwin-x86_64/include -I/work/thirdparty/rabbitmq-c/rabbitmq-c/librabbitmq -I/work/thirdparty/date/date -I/work/thirdparty/date/date/include -I/work/rabbitmq-core/src  -O2 -g -DNDEBUG -isysroot /opt/osxcross/target/SDK/MacOSX10.15.sdk   -std=gnu++1z -o CMakeFiles/unit-test-rabbitmq.dir/src/modeldescription/ModelDescriptionParser.cpp.o -c /work/rabbitmq-fmu/src/modeldescription/ModelDescriptionParser.cpp
[ 87%] Building CXX object rabbitmq-fmu/CMakeFiles/unit-test-rabbitmq.dir/src/rabbitmq/RabbitMqHandlerException.cpp.o
cd /work/build/darwin-x64/rabbitmq-fmu && /opt/osxcross/target/bin/o64-clang++  -DAMQP_STATIC -DFMI_COSIMULATION -I/work/rabbitmq-fmu/../thirdparty/fmi/include -I/work/thirdparty/rapidjson/include -isystem /work/thirdparty/googletest/googletest/include -I/work/rabbitmq-fmu/src -isystem /work/thirdparty/googletest/googletest -isystem /work/build/external/darwin-x86_64/include -I/work/thirdparty/rabbitmq-c/rabbitmq-c/librabbitmq -I/work/thirdparty/date/date -I/work/thirdparty/date/date/include -I/work/rabbitmq-core/src  -O2 -g -DNDEBUG -isysroot /opt/osxcross/target/SDK/MacOSX10.15.sdk   -std=gnu++1z -o CMakeFiles/unit-test-rabbitmq.dir/src/rabbitmq/RabbitMqHandlerException.cpp.o -c /work/rabbitmq-fmu/src/rabbitmq/RabbitMqHandlerException.cpp
make[2]: Leaving directory '/work/build/win-x86'
CMakeFiles/Makefile2:3405: recipe for target 'rabbitmq-fmu/CMakeFiles/rabbitmq-main.dir/all' failed
make[1]: *** [rabbitmq-fmu/CMakeFiles/rabbitmq-main.dir/all] Error 2
make[1]: *** Waiting for unfinished jobs....
[ 43%] Building CXX object rabbitmq-core/CMakeFiles/unit-test-rabbitmq-core.dir/test/FmuContainerCore_test.cpp.obj
cd /work/build/win-x86/rabbitmq-core && /usr/src/mxe/usr/bin/i686-w64-mingw32.static-g++   @CMakeFiles/unit-test-rabbitmq-core.dir/includes_CXX.rsp -O3 -DNDEBUG   -std=gnu++17 -o CMakeFiles/unit-test-rabbitmq-core.dir/test/FmuContainerCore_test.cpp.obj -c /work/rabbitmq-core/test/FmuContainerCore_test.cpp
[ 87%] Building CXX object rabbitmq-fmu/CMakeFiles/unit-test-rabbitmq.dir/src/rabbitmq/RabbitmqHandler.cpp.o
cd /work/build/darwin-x64/rabbitmq-fmu && /opt/osxcross/target/bin/o64-clang++  -DAMQP_STATIC -DFMI_COSIMULATION -I/work/rabbitmq-fmu/../thirdparty/fmi/include -I/work/thirdparty/rapidjson/include -isystem /work/thirdparty/googletest/googletest/include -I/work/rabbitmq-fmu/src -isystem /work/thirdparty/googletest/googletest -isystem /work/build/external/darwin-x86_64/include -I/work/thirdparty/rabbitmq-c/rabbitmq-c/librabbitmq -I/work/thirdparty/date/date -I/work/thirdparty/date/date/include -I/work/rabbitmq-core/src  -O2 -g -DNDEBUG -isysroot /opt/osxcross/target/SDK/MacOSX10.15.sdk   -std=gnu++1z -o CMakeFiles/unit-test-rabbitmq.dir/src/rabbitmq/RabbitmqHandler.cpp.o -c /work/rabbitmq-fmu/src/rabbitmq/RabbitmqHandler.cpp
[ 80%] Building CXX object rabbitmq-fmu/CMakeFiles/unit-test-rabbitmq.dir/test/FmuContainerCore_test.cpp.o
cd /work/build/linux-x86/rabbitmq-fmu && /usr/i686-linux-gnu/bin/i686-linux-gnu-g++  -DAMQP_STATIC -DFMI_COSIMULATION -I/work/rabbitmq-fmu/../thirdparty/fmi/include -I/work/thirdparty/rapidjson/include -I/work/rabbitmq-fmu/src -I/work/thirdparty/rabbitmq-c/rabbitmq-c/librabbitmq -I/work/thirdparty/date/date -I/work/thirdparty/date/date/include -I/work/rabbitmq-core/src -isystem /work/thirdparty/googletest/googletest/include -isystem /work/thirdparty/googletest/googletest -isystem /work/build/external/linux-i386/include  -O2 -g -DNDEBUG   -std=gnu++1z -o CMakeFiles/unit-test-rabbitmq.dir/test/FmuContainerCore_test.cpp.o -c /work/rabbitmq-fmu/test/FmuContainerCore_test.cpp
[ 83%] Building CXX object rabbitmq-fmu/CMakeFiles/unit-test-rabbitmq.dir/test/FmuContainer_test.cpp.o
cd /work/build/linux-x86/rabbitmq-fmu && /usr/i686-linux-gnu/bin/i686-linux-gnu-g++  -DAMQP_STATIC -DFMI_COSIMULATION -I/work/rabbitmq-fmu/../thirdparty/fmi/include -I/work/thirdparty/rapidjson/include -I/work/rabbitmq-fmu/src -I/work/thirdparty/rabbitmq-c/rabbitmq-c/librabbitmq -I/work/thirdparty/date/date -I/work/thirdparty/date/date/include -I/work/rabbitmq-core/src -isystem /work/thirdparty/googletest/googletest/include -isystem /work/thirdparty/googletest/googletest -isystem /work/build/external/linux-i386/include  -O2 -g -DNDEBUG   -std=gnu++1z -o CMakeFiles/unit-test-rabbitmq.dir/test/FmuContainer_test.cpp.o -c /work/rabbitmq-fmu/test/FmuContainer_test.cpp
[ 45%] Linking CXX static library ../../../lib/libgmock.a
cd /work/build/win-x86/thirdparty/googletest/googlemock && /usr/src/mxe/usr/x86_64-pc-linux-gnu/bin/cmake -P CMakeFiles/gmock.dir/cmake_clean_target.cmake
cd /work/build/win-x86/thirdparty/googletest/googlemock && /usr/src/mxe/usr/x86_64-pc-linux-gnu/bin/cmake -E cmake_link_script CMakeFiles/gmock.dir/link.txt --verbose=1
/usr/src/mxe/usr/bin/i686-w64-mingw32.static-ar qc ../../../lib/libgmock.a  CMakeFiles/gmock.dir/src/gmock-all.cc.obj
/usr/src/mxe/usr/bin/i686-w64-mingw32.static-ranlib ../../../lib/libgmock.a
make[2]: Leaving directory '/work/build/win-x86'
[ 87%] Building CXX object rabbitmq-fmu/CMakeFiles/unit-test-rabbitmq.dir/test/FmuContainerCore_test.cpp.o
cd /work/build/darwin-x64/rabbitmq-fmu && /opt/osxcross/target/bin/o64-clang++  -DAMQP_STATIC -DFMI_COSIMULATION -I/work/rabbitmq-fmu/../thirdparty/fmi/include -I/work/thirdparty/rapidjson/include -isystem /work/thirdparty/googletest/googletest/include -I/work/rabbitmq-fmu/src -isystem /work/thirdparty/googletest/googletest -isystem /work/build/external/darwin-x86_64/include -I/work/thirdparty/rabbitmq-c/rabbitmq-c/librabbitmq -I/work/thirdparty/date/date -I/work/thirdparty/date/date/include -I/work/rabbitmq-core/src  -O2 -g -DNDEBUG -isysroot /opt/osxcross/target/SDK/MacOSX10.15.sdk   -std=gnu++1z -o CMakeFiles/unit-test-rabbitmq.dir/test/FmuContainerCore_test.cpp.o -c /work/rabbitmq-fmu/test/FmuContainerCore_test.cpp
[ 90%] Building CXX object rabbitmq-fmu/CMakeFiles/unit-test-rabbitmq.dir/test/FmuContainer_test.cpp.o
cd /work/build/darwin-x64/rabbitmq-fmu && /opt/osxcross/target/bin/o64-clang++  -DAMQP_STATIC -DFMI_COSIMULATION -I/work/rabbitmq-fmu/../thirdparty/fmi/include -I/work/thirdparty/rapidjson/include -isystem /work/thirdparty/googletest/googletest/include -I/work/rabbitmq-fmu/src -isystem /work/thirdparty/googletest/googletest -isystem /work/build/external/darwin-x86_64/include -I/work/thirdparty/rabbitmq-c/rabbitmq-c/librabbitmq -I/work/thirdparty/date/date -I/work/thirdparty/date/date/include -I/work/rabbitmq-core/src  -O2 -g -DNDEBUG -isysroot /opt/osxcross/target/SDK/MacOSX10.15.sdk   -std=gnu++1z -o CMakeFiles/unit-test-rabbitmq.dir/test/FmuContainer_test.cpp.o -c /work/rabbitmq-fmu/test/FmuContainer_test.cpp
[ 45%] Built target gmock
[ 48%] Building CXX object rabbitmq-fmu/CMakeFiles/rabbitmq.dir/src/rabbitmq/RabbitMqHandlerException.cpp.obj
cd /work/build/win-x86/rabbitmq-fmu && /usr/src/mxe/usr/bin/i686-w64-mingw32.static-g++  -DAMQP_STATIC -DFMI_COSIMULATION -Drabbitmq_EXPORTS @CMakeFiles/rabbitmq.dir/includes_CXX.rsp -O3 -DNDEBUG   -std=gnu++17 -o CMakeFiles/rabbitmq.dir/src/rabbitmq/RabbitMqHandlerException.cpp.obj -c /work/rabbitmq-fmu/src/rabbitmq/RabbitMqHandlerException.cpp
[ 48%] Building CXX object rabbitmq-fmu/CMakeFiles/rabbitmq.dir/src/rabbitmq/RabbitmqHandler.cpp.obj
cd /work/build/win-x86/rabbitmq-fmu && /usr/src/mxe/usr/bin/i686-w64-mingw32.static-g++  -DAMQP_STATIC -DFMI_COSIMULATION -Drabbitmq_EXPORTS @CMakeFiles/rabbitmq.dir/includes_CXX.rsp -O3 -DNDEBUG   -std=gnu++17 -o CMakeFiles/rabbitmq.dir/src/rabbitmq/RabbitmqHandler.cpp.obj -c /work/rabbitmq-fmu/src/rabbitmq/RabbitmqHandler.cpp
[ 87%] Linking CXX executable unit-test-rabbitmq-core
[ 90%] Linking CXX executable it-test-rabbitmq
cd /work/build/linux-x86/rabbitmq-core && /usr/bin/cmake -E cmake_link_script CMakeFiles/unit-test-rabbitmq-core.dir/link.txt --verbose=1
cd /work/build/linux-x86/rabbitmq-fmu && /usr/bin/cmake -E cmake_link_script CMakeFiles/it-test-rabbitmq.dir/link.txt --verbose=1
/usr/i686-linux-gnu/bin/i686-linux-gnu-g++  -O2 -g -DNDEBUG   CMakeFiles/unit-test-rabbitmq-core.dir/src/FmuContainerCore.cpp.o CMakeFiles/unit-test-rabbitmq-core.dir/test/FmuContainerCore_test.cpp.o  -o unit-test-rabbitmq-core ../lib/libgtest_main.a ../thirdparty/date/date/libtz.a ../lib/libgtest.a -lpthread 
/usr/i686-linux-gnu/bin/i686-linux-gnu-g++  -O2 -g -DNDEBUG   CMakeFiles/it-test-rabbitmq.dir/src/uri.c.o CMakeFiles/it-test-rabbitmq.dir/src/FmuContainer.cpp.o CMakeFiles/it-test-rabbitmq.dir/src/Iso8601TimeParser.cpp.o CMakeFiles/it-test-rabbitmq.dir/src/fmu.cpp.o CMakeFiles/it-test-rabbitmq.dir/src/message/MessageParser.cpp.o CMakeFiles/it-test-rabbitmq.dir/src/modeldescription/ModelDescriptionParser.cpp.o CMakeFiles/it-test-rabbitmq.dir/src/rabbitmq/RabbitMqHandlerException.cpp.o CMakeFiles/it-test-rabbitmq.dir/src/rabbitmq/RabbitmqHandler.cpp.o CMakeFiles/it-test-rabbitmq.dir/test/fmu_test_it.cpp.o CMakeFiles/it-test-rabbitmq.dir/test/rabbitmq_test_it.cpp.o CMakeFiles/it-test-rabbitmq.dir/test/rabbitmqhandler_test_it.cpp.o  -o it-test-rabbitmq ../lib/libgtest_main.a ../thirdparty/rabbitmq-c/rabbitmq-c/librabbitmq/librabbitmq.a ../thirdparty/date/date/libtz.a ../rabbitmq-core/librabbitmq-core.a ../lib/libgtest.a ../../external/linux-i386/lib/libxerces-c-3.2.a -lrt ../thirdparty/date/date/libtz.a -lpthread 
[ 43%] Linking CXX static library ../../../lib/libgtest_main.a
cd /work/build/win-x64/thirdparty/googletest/googletest && /usr/src/mxe/usr/x86_64-pc-linux-gnu/bin/cmake -P CMakeFiles/gtest_main.dir/cmake_clean_target.cmake
cd /work/build/win-x64/thirdparty/googletest/googletest && /usr/src/mxe/usr/x86_64-pc-linux-gnu/bin/cmake -E cmake_link_script CMakeFiles/gtest_main.dir/link.txt --verbose=1
/usr/src/mxe/usr/bin/x86_64-w64-mingw32.static-ar qc ../../../lib/libgtest_main.a  CMakeFiles/gtest_main.dir/src/gtest_main.cc.obj
/usr/src/mxe/usr/bin/x86_64-w64-mingw32.static-ranlib ../../../lib/libgtest_main.a
make[2]: Leaving directory '/work/build/win-x64'
[ 43%] Built target gtest_main
make -f rabbitmq-core/CMakeFiles/unit-test-rabbitmq-core.dir/build.make rabbitmq-core/CMakeFiles/unit-test-rabbitmq-core.dir/depend
make -f rabbitmq-core/CMakeFiles/it-test-rabbitmq-core.dir/build.make rabbitmq-core/CMakeFiles/it-test-rabbitmq-core.dir/depend
make -f rabbitmq-fmu/CMakeFiles/unit-test-rabbitmq.dir/build.make rabbitmq-fmu/CMakeFiles/unit-test-rabbitmq.dir/depend
make[2]: Entering directory '/work/build/win-x64'
cd /work/build/win-x64 && /usr/src/mxe/usr/x86_64-pc-linux-gnu/bin/cmake -E cmake_depends "Unix Makefiles" /work /work/rabbitmq-core /work/build/win-x64 /work/build/win-x64/rabbitmq-core /work/build/win-x64/rabbitmq-core/CMakeFiles/unit-test-rabbitmq-core.dir/DependInfo.cmake --color=
make[2]: Entering directory '/work/build/win-x64'
cd /work/build/win-x64 && /usr/src/mxe/usr/x86_64-pc-linux-gnu/bin/cmake -E cmake_depends "Unix Makefiles" /work /work/rabbitmq-fmu /work/build/win-x64 /work/build/win-x64/rabbitmq-fmu /work/build/win-x64/rabbitmq-fmu/CMakeFiles/unit-test-rabbitmq.dir/DependInfo.cmake --color=
[ 90%] Building CXX object rabbitmq-fmu/CMakeFiles/unit-test-rabbitmq.dir/test/json_test.cpp.o
cd /work/build/darwin-x64/rabbitmq-fmu && /opt/osxcross/target/bin/o64-clang++  -DAMQP_STATIC -DFMI_COSIMULATION -I/work/rabbitmq-fmu/../thirdparty/fmi/include -I/work/thirdparty/rapidjson/include -isystem /work/thirdparty/googletest/googletest/include -I/work/rabbitmq-fmu/src -isystem /work/thirdparty/googletest/googletest -isystem /work/build/external/darwin-x86_64/include -I/work/thirdparty/rabbitmq-c/rabbitmq-c/librabbitmq -I/work/thirdparty/date/date -I/work/thirdparty/date/date/include -I/work/rabbitmq-core/src  -O2 -g -DNDEBUG -isysroot /opt/osxcross/target/SDK/MacOSX10.15.sdk   -std=gnu++1z -o CMakeFiles/unit-test-rabbitmq.dir/test/json_test.cpp.o -c /work/rabbitmq-fmu/test/json_test.cpp
[ 93%] Linking CXX executable it-test-rabbitmq
cd /work/build/darwin-x64/rabbitmq-fmu && /usr/bin/cmake -E cmake_link_script CMakeFiles/it-test-rabbitmq.dir/link.txt --verbose=1
/opt/osxcross/target/bin/o64-clang++  -O2 -g -DNDEBUG -isysroot /opt/osxcross/target/SDK/MacOSX10.15.sdk -Wl,-headerpad_max_install_names  CMakeFiles/it-test-rabbitmq.dir/src/uri.c.o CMakeFiles/it-test-rabbitmq.dir/src/FmuContainer.cpp.o CMakeFiles/it-test-rabbitmq.dir/src/Iso8601TimeParser.cpp.o CMakeFiles/it-test-rabbitmq.dir/src/fmu.cpp.o CMakeFiles/it-test-rabbitmq.dir/src/message/MessageParser.cpp.o CMakeFiles/it-test-rabbitmq.dir/src/modeldescription/ModelDescriptionParser.cpp.o CMakeFiles/it-test-rabbitmq.dir/src/rabbitmq/RabbitMqHandlerException.cpp.o CMakeFiles/it-test-rabbitmq.dir/src/rabbitmq/RabbitmqHandler.cpp.o CMakeFiles/it-test-rabbitmq.dir/test/fmu_test_it.cpp.o CMakeFiles/it-test-rabbitmq.dir/test/rabbitmq_test_it.cpp.o CMakeFiles/it-test-rabbitmq.dir/test/rabbitmqhandler_test_it.cpp.o  -o it-test-rabbitmq ../lib/libgtest_main.a ../thirdparty/rabbitmq-c/rabbitmq-c/librabbitmq/librabbitmq.a ../thirdparty/date/date/libtz.a ../rabbitmq-core/librabbitmq-core.a ../lib/libgtest.a ../../external/darwin-x86_64/lib/libxerces-c-3.2.a ../thirdparty/date/date/libtz.a 
make[2]: Entering directory '/work/build/win-x64'
cd /work/build/win-x64 && /usr/src/mxe/usr/x86_64-pc-linux-gnu/bin/cmake -E cmake_depends "Unix Makefiles" /work /work/rabbitmq-core /work/build/win-x64 /work/build/win-x64/rabbitmq-core /work/build/win-x64/rabbitmq-core/CMakeFiles/it-test-rabbitmq-core.dir/DependInfo.cmake --color=
Scanning dependencies of target it-test-rabbitmq-core
make[2]: Leaving directory '/work/build/win-x64'
make -f rabbitmq-core/CMakeFiles/it-test-rabbitmq-core.dir/build.make rabbitmq-core/CMakeFiles/it-test-rabbitmq-core.dir/build
make[2]: Entering directory '/work/build/win-x64'
/work/rabbitmq-fmu/src/main.cpp: In function 'int main()':
/work/rabbitmq-fmu/src/main.cpp:204:65: error: 'setprecision' was not declared in this scope
  204 |                     cout << "Ref: '" << vr[i] << "' Value '" << setprecision(10) << value[i] << "'" << endl;
      |                                                                 ^~~~~~~~~~~~
[ 45%] Building CXX object rabbitmq-core/CMakeFiles/it-test-rabbitmq-core.dir/src/FmuContainerCore.cpp.obj
cd /work/build/win-x64/rabbitmq-core && /usr/src/mxe/usr/bin/x86_64-w64-mingw32.static-g++   @CMakeFiles/it-test-rabbitmq-core.dir/includes_CXX.rsp -O3 -DNDEBUG   -std=gnu++17 -o CMakeFiles/it-test-rabbitmq-core.dir/src/FmuContainerCore.cpp.obj -c /work/rabbitmq-core/src/FmuContainerCore.cpp
Scanning dependencies of target unit-test-rabbitmq-core
make[2]: Leaving directory '/work/build/win-x64'
make -f rabbitmq-core/CMakeFiles/unit-test-rabbitmq-core.dir/build.make rabbitmq-core/CMakeFiles/unit-test-rabbitmq-core.dir/build
make[2]: Entering directory '/work/build/win-x64'
[ 48%] Building CXX object rabbitmq-core/CMakeFiles/unit-test-rabbitmq-core.dir/src/FmuContainerCore.cpp.obj
cd /work/build/win-x64/rabbitmq-core && /usr/src/mxe/usr/bin/x86_64-w64-mingw32.static-g++   @CMakeFiles/unit-test-rabbitmq-core.dir/includes_CXX.rsp -O3 -DNDEBUG   -std=gnu++17 -o CMakeFiles/unit-test-rabbitmq-core.dir/src/FmuContainerCore.cpp.obj -c /work/rabbitmq-core/src/FmuContainerCore.cpp
[ 90%] Building CXX object rabbitmq-fmu/CMakeFiles/unit-test-rabbitmq.dir/test/json_test.cpp.o
cd /work/build/linux-x86/rabbitmq-fmu && /usr/i686-linux-gnu/bin/i686-linux-gnu-g++  -DAMQP_STATIC -DFMI_COSIMULATION -I/work/rabbitmq-fmu/../thirdparty/fmi/include -I/work/thirdparty/rapidjson/include -I/work/rabbitmq-fmu/src -I/work/thirdparty/rabbitmq-c/rabbitmq-c/librabbitmq -I/work/thirdparty/date/date -I/work/thirdparty/date/date/include -I/work/rabbitmq-core/src -isystem /work/thirdparty/googletest/googletest/include -isystem /work/thirdparty/googletest/googletest -isystem /work/build/external/linux-i386/include  -O2 -g -DNDEBUG   -std=gnu++1z -o CMakeFiles/unit-test-rabbitmq.dir/test/json_test.cpp.o -c /work/rabbitmq-fmu/test/json_test.cpp
make[2]: Leaving directory '/work/build/linux-x86'
make -f rabbitmq-fmu/CMakeFiles/it-test-rabbitmq.dir/build.make rabbitmq-fmu/CMakeFiles/it-test-rabbitmq.dir/depend
[ 90%] Built target unit-test-rabbitmq-core
[ 93%] Building CXX object rabbitmq-fmu/CMakeFiles/unit-test-rabbitmq.dir/test/message_parser_test.cpp.o
/work/rabbitmq-core/src/FmuContainerCore.cpp: In member function 'double FmuContainerCore::getTimeDiscrepancyOutput(int)':
/work/rabbitmq-core/src/FmuContainerCore.cpp:434:1: warning: control reaches end of non-void function [-Wreturn-type]
  434 | }
      | ^
make[2]: Entering directory '/work/build/win-x64'
cd /work/build/win-x64 && /usr/src/mxe/usr/x86_64-pc-linux-gnu/bin/cmake -E cmake_depends "Unix Makefiles" /work /work/rabbitmq-fmu /work/build/win-x64 /work/build/win-x64/rabbitmq-fmu /work/build/win-x64/rabbitmq-fmu/CMakeFiles/it-test-rabbitmq.dir/DependInfo.cmake --color=
cd /work/build/linux-x86/rabbitmq-fmu && /usr/i686-linux-gnu/bin/i686-linux-gnu-g++  -DAMQP_STATIC -DFMI_COSIMULATION -I/work/rabbitmq-fmu/../thirdparty/fmi/include -I/work/thirdparty/rapidjson/include -I/work/rabbitmq-fmu/src -I/work/thirdparty/rabbitmq-c/rabbitmq-c/librabbitmq -I/work/thirdparty/date/date -I/work/thirdparty/date/date/include -I/work/rabbitmq-core/src -isystem /work/thirdparty/googletest/googletest/include -isystem /work/thirdparty/googletest/googletest -isystem /work/build/external/linux-i386/include  -O2 -g -DNDEBUG   -std=gnu++1z -o CMakeFiles/unit-test-rabbitmq.dir/test/message_parser_test.cpp.o -c /work/rabbitmq-fmu/test/message_parser_test.cpp
Scanning dependencies of target unit-test-rabbitmq
make[2]: Leaving directory '/work/build/win-x64'
make -f rabbitmq-fmu/CMakeFiles/unit-test-rabbitmq.dir/build.make rabbitmq-fmu/CMakeFiles/unit-test-rabbitmq.dir/build
make[2]: Entering directory '/work/build/win-x64'
Scanning dependencies of target it-test-rabbitmq
make[2]: Leaving directory '/work/build/win-x64'
make -f rabbitmq-fmu/CMakeFiles/it-test-rabbitmq.dir/build.make rabbitmq-fmu/CMakeFiles/it-test-rabbitmq.dir/build
make[2]: Entering directory '/work/build/win-x64'
[ 51%] Building C object rabbitmq-fmu/CMakeFiles/unit-test-rabbitmq.dir/src/uri.c.obj
cd /work/build/win-x64/rabbitmq-fmu && /usr/src/mxe/usr/bin/x86_64-w64-mingw32.static-gcc -DAMQP_STATIC -DFMI_COSIMULATION @CMakeFiles/unit-test-rabbitmq.dir/includes_C.rsp -O3 -DNDEBUG   -o CMakeFiles/unit-test-rabbitmq.dir/src/uri.c.obj   -c /work/rabbitmq-fmu/src/uri.c
[ 54%] Building C object rabbitmq-fmu/CMakeFiles/it-test-rabbitmq.dir/src/uri.c.obj
cd /work/build/win-x64/rabbitmq-fmu && /usr/src/mxe/usr/bin/x86_64-w64-mingw32.static-gcc -DAMQP_STATIC -DFMI_COSIMULATION @CMakeFiles/it-test-rabbitmq.dir/includes_C.rsp -O3 -DNDEBUG   -o CMakeFiles/it-test-rabbitmq.dir/src/uri.c.obj   -c /work/rabbitmq-fmu/src/uri.c
[ 96%] Linking CXX executable unit-test-rabbitmq
cd /work/build/linux-x64/rabbitmq-fmu && /usr/bin/cmake -E cmake_link_script CMakeFiles/unit-test-rabbitmq.dir/link.txt --verbose=1
/usr/bin/x86_64-linux-gnu-g++  -O2 -g -DNDEBUG   CMakeFiles/unit-test-rabbitmq.dir/src/uri.c.o CMakeFiles/unit-test-rabbitmq.dir/src/FmuContainer.cpp.o CMakeFiles/unit-test-rabbitmq.dir/src/Iso8601TimeParser.cpp.o CMakeFiles/unit-test-rabbitmq.dir/src/fmu.cpp.o CMakeFiles/unit-test-rabbitmq.dir/src/message/MessageParser.cpp.o CMakeFiles/unit-test-rabbitmq.dir/src/modeldescription/ModelDescriptionParser.cpp.o CMakeFiles/unit-test-rabbitmq.dir/src/rabbitmq/RabbitMqHandlerException.cpp.o CMakeFiles/unit-test-rabbitmq.dir/src/rabbitmq/RabbitmqHandler.cpp.o CMakeFiles/unit-test-rabbitmq.dir/test/FmuContainerCore_test.cpp.o CMakeFiles/unit-test-rabbitmq.dir/test/FmuContainer_test.cpp.o CMakeFiles/unit-test-rabbitmq.dir/test/json_test.cpp.o CMakeFiles/unit-test-rabbitmq.dir/test/message_parser_test.cpp.o CMakeFiles/unit-test-rabbitmq.dir/test/modeldescription_test.cpp.o CMakeFiles/unit-test-rabbitmq.dir/test/timetamp_test.cpp.o CMakeFiles/unit-test-rabbitmq.dir/test/xml_test.cpp.o  -o unit-test-rabbitmq ../lib/libgtest_main.a ../thirdparty/rabbitmq-c/rabbitmq-c/librabbitmq/librabbitmq.a ../thirdparty/date/date/libtz.a ../rabbitmq-core/librabbitmq-core.a ../lib/libgtest.a ../../external/linux-x86_64/lib/libxerces-c-3.2.a -lrt ../thirdparty/date/date/libtz.a -lpthread 
[100%] Linking CXX executable it-test-rabbitmq
cd /work/build/linux-x64/rabbitmq-fmu && /usr/bin/cmake -E cmake_link_script CMakeFiles/it-test-rabbitmq.dir/link.txt --verbose=1
/usr/bin/x86_64-linux-gnu-g++  -O2 -g -DNDEBUG   CMakeFiles/it-test-rabbitmq.dir/src/uri.c.o CMakeFiles/it-test-rabbitmq.dir/src/FmuContainer.cpp.o CMakeFiles/it-test-rabbitmq.dir/src/Iso8601TimeParser.cpp.o CMakeFiles/it-test-rabbitmq.dir/src/fmu.cpp.o CMakeFiles/it-test-rabbitmq.dir/src/message/MessageParser.cpp.o CMakeFiles/it-test-rabbitmq.dir/src/modeldescription/ModelDescriptionParser.cpp.o CMakeFiles/it-test-rabbitmq.dir/src/rabbitmq/RabbitMqHandlerException.cpp.o CMakeFiles/it-test-rabbitmq.dir/src/rabbitmq/RabbitmqHandler.cpp.o CMakeFiles/it-test-rabbitmq.dir/test/fmu_test_it.cpp.o CMakeFiles/it-test-rabbitmq.dir/test/rabbitmq_test_it.cpp.o CMakeFiles/it-test-rabbitmq.dir/test/rabbitmqhandler_test_it.cpp.o  -o it-test-rabbitmq ../lib/libgtest_main.a ../thirdparty/rabbitmq-c/rabbitmq-c/librabbitmq/librabbitmq.a ../thirdparty/date/date/libtz.a ../rabbitmq-core/librabbitmq-core.a ../lib/libgtest.a ../../external/linux-x86_64/lib/libxerces-c-3.2.a -lrt ../thirdparty/date/date/libtz.a -lpthread 
[ 54%] Building CXX object rabbitmq-fmu/CMakeFiles/unit-test-rabbitmq.dir/src/FmuContainer.cpp.obj
cd /work/build/win-x64/rabbitmq-fmu && /usr/src/mxe/usr/bin/x86_64-w64-mingw32.static-g++  -DAMQP_STATIC -DFMI_COSIMULATION @CMakeFiles/unit-test-rabbitmq.dir/includes_CXX.rsp -O3 -DNDEBUG   -std=gnu++17 -o CMakeFiles/unit-test-rabbitmq.dir/src/FmuContainer.cpp.obj -c /work/rabbitmq-fmu/src/FmuContainer.cpp
[ 54%] Building CXX object rabbitmq-fmu/CMakeFiles/it-test-rabbitmq.dir/src/FmuContainer.cpp.obj
cd /work/build/win-x64/rabbitmq-fmu && /usr/src/mxe/usr/bin/x86_64-w64-mingw32.static-g++  -DAMQP_STATIC -DFMI_COSIMULATION @CMakeFiles/it-test-rabbitmq.dir/includes_CXX.rsp -O3 -DNDEBUG   -std=gnu++17 -o CMakeFiles/it-test-rabbitmq.dir/src/FmuContainer.cpp.obj -c /work/rabbitmq-fmu/src/FmuContainer.cpp
[ 96%] Building CXX object rabbitmq-fmu/CMakeFiles/unit-test-rabbitmq.dir/test/message_parser_test.cpp.o
cd /work/build/darwin-x64/rabbitmq-fmu && /opt/osxcross/target/bin/o64-clang++  -DAMQP_STATIC -DFMI_COSIMULATION -I/work/rabbitmq-fmu/../thirdparty/fmi/include -I/work/thirdparty/rapidjson/include -isystem /work/thirdparty/googletest/googletest/include -I/work/rabbitmq-fmu/src -isystem /work/thirdparty/googletest/googletest -isystem /work/build/external/darwin-x86_64/include -I/work/thirdparty/rabbitmq-c/rabbitmq-c/librabbitmq -I/work/thirdparty/date/date -I/work/thirdparty/date/date/include -I/work/rabbitmq-core/src  -O2 -g -DNDEBUG -isysroot /opt/osxcross/target/SDK/MacOSX10.15.sdk   -std=gnu++1z -o CMakeFiles/unit-test-rabbitmq.dir/test/message_parser_test.cpp.o -c /work/rabbitmq-fmu/test/message_parser_test.cpp
make[2]: Leaving directory '/work/build/linux-x64'
[100%] Built target it-test-rabbitmq
make[2]: Leaving directory '/work/build/linux-x64'
[100%] Built target unit-test-rabbitmq
make[1]: Leaving directory '/work/build/linux-x64'
Makefile:143: recipe for target 'all' failed
make: *** [all] Error 2
make: Leaving directory '/work/build/linux-x64'
rabbitmq-fmu/CMakeFiles/rabbitmq-main.dir/build.make:178: recipe for target 'rabbitmq-fmu/CMakeFiles/rabbitmq-main.dir/src/main.cpp.obj' failed
make[2]: *** [rabbitmq-fmu/CMakeFiles/rabbitmq-main.dir/src/main.cpp.obj] Error 1
make[2]: Leaving directory '/work/build/win-x64'
CMakeFiles/Makefile2:3405: recipe for target 'rabbitmq-fmu/CMakeFiles/rabbitmq-main.dir/all' failed
make[1]: *** [rabbitmq-fmu/CMakeFiles/rabbitmq-main.dir/all] Error 2
make[1]: *** Waiting for unfinished jobs....
[ 56%] Building CXX object rabbitmq-fmu/CMakeFiles/it-test-rabbitmq.dir/src/Iso8601TimeParser.cpp.obj
cd /work/build/win-x64/rabbitmq-fmu && /usr/src/mxe/usr/bin/x86_64-w64-mingw32.static-g++  -DAMQP_STATIC -DFMI_COSIMULATION @CMakeFiles/it-test-rabbitmq.dir/includes_CXX.rsp -O3 -DNDEBUG   -std=gnu++17 -o CMakeFiles/it-test-rabbitmq.dir/src/Iso8601TimeParser.cpp.obj -c /work/rabbitmq-fmu/src/Iso8601TimeParser.cpp
make[2]: Leaving directory '/work/build/darwin-x64'
[ 96%] Built target it-test-rabbitmq
[ 96%] Building CXX object rabbitmq-fmu/CMakeFiles/unit-test-rabbitmq.dir/test/modeldescription_test.cpp.o
cd /work/build/darwin-x64/rabbitmq-fmu && /opt/osxcross/target/bin/o64-clang++  -DAMQP_STATIC -DFMI_COSIMULATION -I/work/rabbitmq-fmu/../thirdparty/fmi/include -I/work/thirdparty/rapidjson/include -isystem /work/thirdparty/googletest/googletest/include -I/work/rabbitmq-fmu/src -isystem /work/thirdparty/googletest/googletest -isystem /work/build/external/darwin-x86_64/include -I/work/thirdparty/rabbitmq-c/rabbitmq-c/librabbitmq -I/work/thirdparty/date/date -I/work/thirdparty/date/date/include -I/work/rabbitmq-core/src  -O2 -g -DNDEBUG -isysroot /opt/osxcross/target/SDK/MacOSX10.15.sdk   -std=gnu++1z -o CMakeFiles/unit-test-rabbitmq.dir/test/modeldescription_test.cpp.o -c /work/rabbitmq-fmu/test/modeldescription_test.cpp
[ 51%] Linking CXX shared library rabbitmq.dll
cd /work/build/win-x86/rabbitmq-fmu && /usr/src/mxe/usr/x86_64-pc-linux-gnu/bin/cmake -E cmake_link_script CMakeFiles/rabbitmq.dir/link.txt --verbose=1
/usr/src/mxe/usr/x86_64-pc-linux-gnu/bin/cmake -E remove -f CMakeFiles/rabbitmq.dir/objects.a
/usr/src/mxe/usr/bin/i686-w64-mingw32.static-ar cr CMakeFiles/rabbitmq.dir/objects.a @CMakeFiles/rabbitmq.dir/objects1.rsp
/usr/src/mxe/usr/bin/i686-w64-mingw32.static-g++  -O3 -DNDEBUG -static-libgcc -static-libstdc++ -shared -o rabbitmq.dll -Wl,--out-implib,librabbitmq.dll.a -Wl,--major-image-version,0,--minor-image-version,0 -Wl,--whole-archive CMakeFiles/rabbitmq.dir/objects.a -Wl,--no-whole-archive @CMakeFiles/rabbitmq.dir/linklibs.rsp
[ 59%] Building CXX object rabbitmq-fmu/CMakeFiles/unit-test-rabbitmq.dir/src/Iso8601TimeParser.cpp.obj
cd /work/build/win-x64/rabbitmq-fmu && /usr/src/mxe/usr/bin/x86_64-w64-mingw32.static-g++  -DAMQP_STATIC -DFMI_COSIMULATION @CMakeFiles/unit-test-rabbitmq.dir/includes_CXX.rsp -O3 -DNDEBUG   -std=gnu++17 -o CMakeFiles/unit-test-rabbitmq.dir/src/Iso8601TimeParser.cpp.obj -c /work/rabbitmq-fmu/src/Iso8601TimeParser.cpp
[Pipeline] }
[Pipeline] // stage
[Pipeline] }
Failed in branch Xcompile linux64
make[2]: Leaving directory '/work/build/win-x86'
[ 51%] Built target rabbitmq
[ 54%] Linking CXX executable unit-test-rabbitmq-core.exe
cd /work/build/win-x86/rabbitmq-core && /usr/src/mxe/usr/x86_64-pc-linux-gnu/bin/cmake -E cmake_link_script CMakeFiles/unit-test-rabbitmq-core.dir/link.txt --verbose=1
/usr/src/mxe/usr/x86_64-pc-linux-gnu/bin/cmake -E remove -f CMakeFiles/unit-test-rabbitmq-core.dir/objects.a
/usr/src/mxe/usr/bin/i686-w64-mingw32.static-ar cr CMakeFiles/unit-test-rabbitmq-core.dir/objects.a @CMakeFiles/unit-test-rabbitmq-core.dir/objects1.rsp
/usr/src/mxe/usr/bin/i686-w64-mingw32.static-g++ -O3 -DNDEBUG   -Wl,--whole-archive CMakeFiles/unit-test-rabbitmq-core.dir/objects.a -Wl,--no-whole-archive  -o unit-test-rabbitmq-core.exe -Wl,--out-implib,libunit-test-rabbitmq-core.dll.a -Wl,--major-image-version,0,--minor-image-version,0 @CMakeFiles/unit-test-rabbitmq-core.dir/linklibs.rsp
[ 96%] Building CXX object rabbitmq-fmu/CMakeFiles/unit-test-rabbitmq.dir/test/timetamp_test.cpp.o
cd /work/build/darwin-x64/rabbitmq-fmu && /opt/osxcross/target/bin/o64-clang++  -DAMQP_STATIC -DFMI_COSIMULATION -I/work/rabbitmq-fmu/../thirdparty/fmi/include -I/work/thirdparty/rapidjson/include -isystem /work/thirdparty/googletest/googletest/include -I/work/rabbitmq-fmu/src -isystem /work/thirdparty/googletest/googletest -isystem /work/build/external/darwin-x86_64/include -I/work/thirdparty/rabbitmq-c/rabbitmq-c/librabbitmq -I/work/thirdparty/date/date -I/work/thirdparty/date/date/include -I/work/rabbitmq-core/src  -O2 -g -DNDEBUG -isysroot /opt/osxcross/target/SDK/MacOSX10.15.sdk   -std=gnu++1z -o CMakeFiles/unit-test-rabbitmq.dir/test/timetamp_test.cpp.o -c /work/rabbitmq-fmu/test/timetamp_test.cpp
[ 93%] Building CXX object rabbitmq-fmu/CMakeFiles/unit-test-rabbitmq.dir/test/modeldescription_test.cpp.o
cd /work/build/linux-x86/rabbitmq-fmu && /usr/i686-linux-gnu/bin/i686-linux-gnu-g++  -DAMQP_STATIC -DFMI_COSIMULATION -I/work/rabbitmq-fmu/../thirdparty/fmi/include -I/work/thirdparty/rapidjson/include -I/work/rabbitmq-fmu/src -I/work/thirdparty/rabbitmq-c/rabbitmq-c/librabbitmq -I/work/thirdparty/date/date -I/work/thirdparty/date/date/include -I/work/rabbitmq-core/src -isystem /work/thirdparty/googletest/googletest/include -isystem /work/thirdparty/googletest/googletest -isystem /work/build/external/linux-i386/include  -O2 -g -DNDEBUG   -std=gnu++1z -o CMakeFiles/unit-test-rabbitmq.dir/test/modeldescription_test.cpp.o -c /work/rabbitmq-fmu/test/modeldescription_test.cpp
[ 93%] Building CXX object rabbitmq-fmu/CMakeFiles/unit-test-rabbitmq.dir/test/timetamp_test.cpp.o
cd /work/build/linux-x86/rabbitmq-fmu && /usr/i686-linux-gnu/bin/i686-linux-gnu-g++  -DAMQP_STATIC -DFMI_COSIMULATION -I/work/rabbitmq-fmu/../thirdparty/fmi/include -I/work/thirdparty/rapidjson/include -I/work/rabbitmq-fmu/src -I/work/thirdparty/rabbitmq-c/rabbitmq-c/librabbitmq -I/work/thirdparty/date/date -I/work/thirdparty/date/date/include -I/work/rabbitmq-core/src -isystem /work/thirdparty/googletest/googletest/include -isystem /work/thirdparty/googletest/googletest -isystem /work/build/external/linux-i386/include  -O2 -g -DNDEBUG   -std=gnu++1z -o CMakeFiles/unit-test-rabbitmq.dir/test/timetamp_test.cpp.o -c /work/rabbitmq-fmu/test/timetamp_test.cpp
make[2]: Leaving directory '/work/build/win-x86'
[ 54%] Built target unit-test-rabbitmq-core
make[1]: Leaving directory '/work/build/win-x86'
make: *** [all] Error 2
Makefile:143: recipe for target 'all' failed
make: Leaving directory '/work/build/win-x86'
make[2]: Leaving directory '/work/build/linux-x86'
[ 93%] Built target it-test-rabbitmq
[ 96%] Building CXX object rabbitmq-fmu/CMakeFiles/unit-test-rabbitmq.dir/test/xml_test.cpp.o
cd /work/build/linux-x86/rabbitmq-fmu && /usr/i686-linux-gnu/bin/i686-linux-gnu-g++  -DAMQP_STATIC -DFMI_COSIMULATION -I/work/rabbitmq-fmu/../thirdparty/fmi/include -I/work/thirdparty/rapidjson/include -I/work/rabbitmq-fmu/src -I/work/thirdparty/rabbitmq-c/rabbitmq-c/librabbitmq -I/work/thirdparty/date/date -I/work/thirdparty/date/date/include -I/work/rabbitmq-core/src -isystem /work/thirdparty/googletest/googletest/include -isystem /work/thirdparty/googletest/googletest -isystem /work/build/external/linux-i386/include  -O2 -g -DNDEBUG   -std=gnu++1z -o CMakeFiles/unit-test-rabbitmq.dir/test/xml_test.cpp.o -c /work/rabbitmq-fmu/test/xml_test.cpp
[100%] Building CXX object rabbitmq-fmu/CMakeFiles/unit-test-rabbitmq.dir/test/xml_test.cpp.o
cd /work/build/darwin-x64/rabbitmq-fmu && /opt/osxcross/target/bin/o64-clang++  -DAMQP_STATIC -DFMI_COSIMULATION -I/work/rabbitmq-fmu/../thirdparty/fmi/include -I/work/thirdparty/rapidjson/include -isystem /work/thirdparty/googletest/googletest/include -I/work/rabbitmq-fmu/src -isystem /work/thirdparty/googletest/googletest -isystem /work/build/external/darwin-x86_64/include -I/work/thirdparty/rabbitmq-c/rabbitmq-c/librabbitmq -I/work/thirdparty/date/date -I/work/thirdparty/date/date/include -I/work/rabbitmq-core/src  -O2 -g -DNDEBUG -isysroot /opt/osxcross/target/SDK/MacOSX10.15.sdk   -std=gnu++1z -o CMakeFiles/unit-test-rabbitmq.dir/test/xml_test.cpp.o -c /work/rabbitmq-fmu/test/xml_test.cpp
[Pipeline] }
[Pipeline] // stage
[Pipeline] }
Failed in branch Xcompile win32
/work/rabbitmq-core/src/FmuContainerCore.cpp: In member function 'double FmuContainerCore::getTimeDiscrepancyOutput(int)':
/work/rabbitmq-core/src/FmuContainerCore.cpp:434:1: warning: control reaches end of non-void function [-Wreturn-type]
  434 | }
      | ^
/work/rabbitmq-core/src/FmuContainerCore.cpp: In member function 'double FmuContainerCore::getTimeDiscrepancyOutput(int)':
/work/rabbitmq-core/src/FmuContainerCore.cpp:434:1: warning: control reaches end of non-void function [-Wreturn-type]
  434 | }
      | ^
[ 62%] Linking CXX shared library rabbitmq.dll
cd /work/build/win-x64/rabbitmq-fmu && /usr/src/mxe/usr/x86_64-pc-linux-gnu/bin/cmake -E cmake_link_script CMakeFiles/rabbitmq.dir/link.txt --verbose=1
/usr/src/mxe/usr/x86_64-pc-linux-gnu/bin/cmake -E remove -f CMakeFiles/rabbitmq.dir/objects.a
/usr/src/mxe/usr/bin/x86_64-w64-mingw32.static-ar cr CMakeFiles/rabbitmq.dir/objects.a @CMakeFiles/rabbitmq.dir/objects1.rsp
/usr/src/mxe/usr/bin/x86_64-w64-mingw32.static-g++  -O3 -DNDEBUG -static-libgcc -static-libstdc++ -shared -o rabbitmq.dll -Wl,--out-implib,librabbitmq.dll.a -Wl,--major-image-version,0,--minor-image-version,0 -Wl,--whole-archive CMakeFiles/rabbitmq.dir/objects.a -Wl,--no-whole-archive @CMakeFiles/rabbitmq.dir/linklibs.rsp
[100%] Linking CXX executable unit-test-rabbitmq
cd /work/build/darwin-x64/rabbitmq-fmu && /usr/bin/cmake -E cmake_link_script CMakeFiles/unit-test-rabbitmq.dir/link.txt --verbose=1
/opt/osxcross/target/bin/o64-clang++  -O2 -g -DNDEBUG -isysroot /opt/osxcross/target/SDK/MacOSX10.15.sdk -Wl,-headerpad_max_install_names  CMakeFiles/unit-test-rabbitmq.dir/src/uri.c.o CMakeFiles/unit-test-rabbitmq.dir/src/FmuContainer.cpp.o CMakeFiles/unit-test-rabbitmq.dir/src/Iso8601TimeParser.cpp.o CMakeFiles/unit-test-rabbitmq.dir/src/fmu.cpp.o CMakeFiles/unit-test-rabbitmq.dir/src/message/MessageParser.cpp.o CMakeFiles/unit-test-rabbitmq.dir/src/modeldescription/ModelDescriptionParser.cpp.o CMakeFiles/unit-test-rabbitmq.dir/src/rabbitmq/RabbitMqHandlerException.cpp.o CMakeFiles/unit-test-rabbitmq.dir/src/rabbitmq/RabbitmqHandler.cpp.o CMakeFiles/unit-test-rabbitmq.dir/test/FmuContainerCore_test.cpp.o CMakeFiles/unit-test-rabbitmq.dir/test/FmuContainer_test.cpp.o CMakeFiles/unit-test-rabbitmq.dir/test/json_test.cpp.o CMakeFiles/unit-test-rabbitmq.dir/test/message_parser_test.cpp.o CMakeFiles/unit-test-rabbitmq.dir/test/modeldescription_test.cpp.o CMakeFiles/unit-test-rabbitmq.dir/test/timetamp_test.cpp.o CMakeFiles/unit-test-rabbitmq.dir/test/xml_test.cpp.o  -o unit-test-rabbitmq ../lib/libgtest_main.a ../thirdparty/rabbitmq-c/rabbitmq-c/librabbitmq/librabbitmq.a ../thirdparty/date/date/libtz.a ../rabbitmq-core/librabbitmq-core.a ../lib/libgtest.a ../../external/darwin-x86_64/lib/libxerces-c-3.2.a ../thirdparty/date/date/libtz.a 
make[2]: Leaving directory '/work/build/darwin-x64'
[100%] Built target unit-test-rabbitmq
make[1]: Leaving directory '/work/build/darwin-x64'
/usr/bin/cmake -E cmake_progress_start /work/build/darwin-x64/CMakeFiles 0
make: Leaving directory '/work/build/darwin-x64'
[ 96%] Linking CXX executable unit-test-rabbitmq
cd /work/build/linux-x86/rabbitmq-fmu && /usr/bin/cmake -E cmake_link_script CMakeFiles/unit-test-rabbitmq.dir/link.txt --verbose=1
/usr/i686-linux-gnu/bin/i686-linux-gnu-g++  -O2 -g -DNDEBUG   CMakeFiles/unit-test-rabbitmq.dir/src/uri.c.o CMakeFiles/unit-test-rabbitmq.dir/src/FmuContainer.cpp.o CMakeFiles/unit-test-rabbitmq.dir/src/Iso8601TimeParser.cpp.o CMakeFiles/unit-test-rabbitmq.dir/src/fmu.cpp.o CMakeFiles/unit-test-rabbitmq.dir/src/message/MessageParser.cpp.o CMakeFiles/unit-test-rabbitmq.dir/src/modeldescription/ModelDescriptionParser.cpp.o CMakeFiles/unit-test-rabbitmq.dir/src/rabbitmq/RabbitMqHandlerException.cpp.o CMakeFiles/unit-test-rabbitmq.dir/src/rabbitmq/RabbitmqHandler.cpp.o CMakeFiles/unit-test-rabbitmq.dir/test/FmuContainerCore_test.cpp.o CMakeFiles/unit-test-rabbitmq.dir/test/FmuContainer_test.cpp.o CMakeFiles/unit-test-rabbitmq.dir/test/json_test.cpp.o CMakeFiles/unit-test-rabbitmq.dir/test/message_parser_test.cpp.o CMakeFiles/unit-test-rabbitmq.dir/test/modeldescription_test.cpp.o CMakeFiles/unit-test-rabbitmq.dir/test/timetamp_test.cpp.o CMakeFiles/unit-test-rabbitmq.dir/test/xml_test.cpp.o  -o unit-test-rabbitmq ../lib/libgtest_main.a ../thirdparty/rabbitmq-c/rabbitmq-c/librabbitmq/librabbitmq.a ../thirdparty/date/date/libtz.a ../rabbitmq-core/librabbitmq-core.a ../lib/libgtest.a ../../external/linux-i386/lib/libxerces-c-3.2.a -lrt ../thirdparty/date/date/libtz.a -lpthread 
[ 64%] Linking CXX static library ../../../lib/libgmock.a
cd /work/build/win-x64/thirdparty/googletest/googlemock && /usr/src/mxe/usr/x86_64-pc-linux-gnu/bin/cmake -P CMakeFiles/gmock.dir/cmake_clean_target.cmake
cd /work/build/win-x64/thirdparty/googletest/googlemock && /usr/src/mxe/usr/x86_64-pc-linux-gnu/bin/cmake -E cmake_link_script CMakeFiles/gmock.dir/link.txt --verbose=1
/usr/src/mxe/usr/bin/x86_64-w64-mingw32.static-ar qc ../../../lib/libgmock.a  CMakeFiles/gmock.dir/src/gmock-all.cc.obj
/usr/src/mxe/usr/bin/x86_64-w64-mingw32.static-ranlib ../../../lib/libgmock.a
make[2]: Leaving directory '/work/build/win-x64'
[ 64%] Built target gmock
[ 64%] Building CXX object rabbitmq-fmu/CMakeFiles/unit-test-rabbitmq.dir/src/fmu.cpp.obj
cd /work/build/win-x64/rabbitmq-fmu && /usr/src/mxe/usr/bin/x86_64-w64-mingw32.static-g++  -DAMQP_STATIC -DFMI_COSIMULATION @CMakeFiles/unit-test-rabbitmq.dir/includes_CXX.rsp -O3 -DNDEBUG   -std=gnu++17 -o CMakeFiles/unit-test-rabbitmq.dir/src/fmu.cpp.obj -c /work/rabbitmq-fmu/src/fmu.cpp
[ 64%] Building CXX object rabbitmq-core/CMakeFiles/unit-test-rabbitmq-core.dir/test/FmuContainerCore_test.cpp.obj
cd /work/build/win-x64/rabbitmq-core && /usr/src/mxe/usr/bin/x86_64-w64-mingw32.static-g++   @CMakeFiles/unit-test-rabbitmq-core.dir/includes_CXX.rsp -O3 -DNDEBUG   -std=gnu++17 -o CMakeFiles/unit-test-rabbitmq-core.dir/test/FmuContainerCore_test.cpp.obj -c /work/rabbitmq-core/test/FmuContainerCore_test.cpp
[ 64%] Linking CXX executable it-test-rabbitmq-core.exe
cd /work/build/win-x64/rabbitmq-core && /usr/src/mxe/usr/x86_64-pc-linux-gnu/bin/cmake -E cmake_link_script CMakeFiles/it-test-rabbitmq-core.dir/link.txt --verbose=1
/usr/src/mxe/usr/x86_64-pc-linux-gnu/bin/cmake -E remove -f CMakeFiles/it-test-rabbitmq-core.dir/objects.a
make[2]: Leaving directory '/work/build/linux-x86'
[ 96%] Built target unit-test-rabbitmq
make[1]: Leaving directory '/work/build/linux-x86'
/usr/src/mxe/usr/bin/x86_64-w64-mingw32.static-ar cr CMakeFiles/it-test-rabbitmq-core.dir/objects.a @CMakeFiles/it-test-rabbitmq-core.dir/objects1.rsp
/usr/src/mxe/usr/bin/x86_64-w64-mingw32.static-g++ -O3 -DNDEBUG   -Wl,--whole-archive CMakeFiles/it-test-rabbitmq-core.dir/objects.a -Wl,--no-whole-archive  -o it-test-rabbitmq-core.exe -Wl,--out-implib,libit-test-rabbitmq-core.dll.a -Wl,--major-image-version,0,--minor-image-version,0 @CMakeFiles/it-test-rabbitmq-core.dir/linklibs.rsp
[ 67%] Building CXX object rabbitmq-fmu/CMakeFiles/unit-test-rabbitmq.dir/src/message/MessageParser.cpp.obj
cd /work/build/win-x64/rabbitmq-fmu && /usr/src/mxe/usr/bin/x86_64-w64-mingw32.static-g++  -DAMQP_STATIC -DFMI_COSIMULATION @CMakeFiles/unit-test-rabbitmq.dir/includes_CXX.rsp -O3 -DNDEBUG   -std=gnu++17 -o CMakeFiles/unit-test-rabbitmq.dir/src/message/MessageParser.cpp.obj -c /work/rabbitmq-fmu/src/message/MessageParser.cpp
make: *** [all] Error 2
Makefile:131: recipe for target 'all' failed
make: Leaving directory '/work/build/linux-x86'
[ 67%] Building CXX object rabbitmq-fmu/CMakeFiles/unit-test-rabbitmq.dir/src/modeldescription/ModelDescriptionParser.cpp.obj
cd /work/build/win-x64/rabbitmq-fmu && /usr/src/mxe/usr/bin/x86_64-w64-mingw32.static-g++  -DAMQP_STATIC -DFMI_COSIMULATION @CMakeFiles/unit-test-rabbitmq.dir/includes_CXX.rsp -O3 -DNDEBUG   -std=gnu++17 -o CMakeFiles/unit-test-rabbitmq.dir/src/modeldescription/ModelDescriptionParser.cpp.obj -c /work/rabbitmq-fmu/src/modeldescription/ModelDescriptionParser.cpp
make[2]: Leaving directory '/work/build/win-x64'
[ 67%] Built target rabbitmq
[ 67%] Building CXX object rabbitmq-fmu/CMakeFiles/it-test-rabbitmq.dir/src/fmu.cpp.obj
cd /work/build/win-x64/rabbitmq-fmu && /usr/src/mxe/usr/bin/x86_64-w64-mingw32.static-g++  -DAMQP_STATIC -DFMI_COSIMULATION @CMakeFiles/it-test-rabbitmq.dir/includes_CXX.rsp -O3 -DNDEBUG   -std=gnu++17 -o CMakeFiles/it-test-rabbitmq.dir/src/fmu.cpp.obj -c /work/rabbitmq-fmu/src/fmu.cpp
[ 70%] Building CXX object rabbitmq-fmu/CMakeFiles/unit-test-rabbitmq.dir/src/rabbitmq/RabbitMqHandlerException.cpp.obj
[ 72%] Building CXX object rabbitmq-fmu/CMakeFiles/it-test-rabbitmq.dir/src/message/MessageParser.cpp.obj
[ 72%] Building CXX object rabbitmq-fmu/CMakeFiles/unit-test-rabbitmq.dir/src/rabbitmq/RabbitmqHandler.cpp.obj
cd /work/build/win-x64/rabbitmq-fmu && /usr/src/mxe/usr/bin/x86_64-w64-mingw32.static-g++  -DAMQP_STATIC -DFMI_COSIMULATION @CMakeFiles/it-test-rabbitmq.dir/includes_CXX.rsp -O3 -DNDEBUG   -std=gnu++17 -o CMakeFiles/it-test-rabbitmq.dir/src/message/MessageParser.cpp.obj -c /work/rabbitmq-fmu/src/message/MessageParser.cpp
cd /work/build/win-x64/rabbitmq-fmu && /usr/src/mxe/usr/bin/x86_64-w64-mingw32.static-g++  -DAMQP_STATIC -DFMI_COSIMULATION @CMakeFiles/unit-test-rabbitmq.dir/includes_CXX.rsp -O3 -DNDEBUG   -std=gnu++17 -o CMakeFiles/unit-test-rabbitmq.dir/src/rabbitmq/RabbitMqHandlerException.cpp.obj -c /work/rabbitmq-fmu/src/rabbitmq/RabbitMqHandlerException.cpp
cd /work/build/win-x64/rabbitmq-fmu && /usr/src/mxe/usr/bin/x86_64-w64-mingw32.static-g++  -DAMQP_STATIC -DFMI_COSIMULATION @CMakeFiles/unit-test-rabbitmq.dir/includes_CXX.rsp -O3 -DNDEBUG   -std=gnu++17 -o CMakeFiles/unit-test-rabbitmq.dir/src/rabbitmq/RabbitmqHandler.cpp.obj -c /work/rabbitmq-fmu/src/rabbitmq/RabbitmqHandler.cpp
make[2]: Leaving directory '/work/build/win-x64'
[ 72%] Built target it-test-rabbitmq-core
[ 72%] Building CXX object rabbitmq-fmu/CMakeFiles/it-test-rabbitmq.dir/src/modeldescription/ModelDescriptionParser.cpp.obj
cd /work/build/win-x64/rabbitmq-fmu && /usr/src/mxe/usr/bin/x86_64-w64-mingw32.static-g++  -DAMQP_STATIC -DFMI_COSIMULATION @CMakeFiles/it-test-rabbitmq.dir/includes_CXX.rsp -O3 -DNDEBUG   -std=gnu++17 -o CMakeFiles/it-test-rabbitmq.dir/src/modeldescription/ModelDescriptionParser.cpp.obj -c /work/rabbitmq-fmu/src/modeldescription/ModelDescriptionParser.cpp
[ 75%] Building CXX object rabbitmq-fmu/CMakeFiles/it-test-rabbitmq.dir/src/rabbitmq/RabbitMqHandlerException.cpp.obj
cd /work/build/win-x64/rabbitmq-fmu && /usr/src/mxe/usr/bin/x86_64-w64-mingw32.static-g++  -DAMQP_STATIC -DFMI_COSIMULATION @CMakeFiles/it-test-rabbitmq.dir/includes_CXX.rsp -O3 -DNDEBUG   -std=gnu++17 -o CMakeFiles/it-test-rabbitmq.dir/src/rabbitmq/RabbitMqHandlerException.cpp.obj -c /work/rabbitmq-fmu/src/rabbitmq/RabbitMqHandlerException.cpp
[Pipeline] }
[Pipeline] // stage
[Pipeline] }
Failed in branch Xcompile linux32
[ 75%] Building CXX object rabbitmq-fmu/CMakeFiles/it-test-rabbitmq.dir/src/rabbitmq/RabbitmqHandler.cpp.obj
cd /work/build/win-x64/rabbitmq-fmu && /usr/src/mxe/usr/bin/x86_64-w64-mingw32.static-g++  -DAMQP_STATIC -DFMI_COSIMULATION @CMakeFiles/it-test-rabbitmq.dir/includes_CXX.rsp -O3 -DNDEBUG   -std=gnu++17 -o CMakeFiles/it-test-rabbitmq.dir/src/rabbitmq/RabbitmqHandler.cpp.obj -c /work/rabbitmq-fmu/src/rabbitmq/RabbitmqHandler.cpp
[ 78%] Building CXX object rabbitmq-fmu/CMakeFiles/unit-test-rabbitmq.dir/test/FmuContainerCore_test.cpp.obj
cd /work/build/win-x64/rabbitmq-fmu && /usr/src/mxe/usr/bin/x86_64-w64-mingw32.static-g++  -DAMQP_STATIC -DFMI_COSIMULATION @CMakeFiles/unit-test-rabbitmq.dir/includes_CXX.rsp -O3 -DNDEBUG   -std=gnu++17 -o CMakeFiles/unit-test-rabbitmq.dir/test/FmuContainerCore_test.cpp.obj -c /work/rabbitmq-fmu/test/FmuContainerCore_test.cpp
[ 78%] Building CXX object rabbitmq-fmu/CMakeFiles/unit-test-rabbitmq.dir/test/FmuContainer_test.cpp.obj
cd /work/build/win-x64/rabbitmq-fmu && /usr/src/mxe/usr/bin/x86_64-w64-mingw32.static-g++  -DAMQP_STATIC -DFMI_COSIMULATION @CMakeFiles/unit-test-rabbitmq.dir/includes_CXX.rsp -O3 -DNDEBUG   -std=gnu++17 -o CMakeFiles/unit-test-rabbitmq.dir/test/FmuContainer_test.cpp.obj -c /work/rabbitmq-fmu/test/FmuContainer_test.cpp
[ 81%] Linking CXX executable unit-test-rabbitmq-core.exe
cd /work/build/win-x64/rabbitmq-core && /usr/src/mxe/usr/x86_64-pc-linux-gnu/bin/cmake -E cmake_link_script CMakeFiles/unit-test-rabbitmq-core.dir/link.txt --verbose=1
/usr/src/mxe/usr/x86_64-pc-linux-gnu/bin/cmake -E remove -f CMakeFiles/unit-test-rabbitmq-core.dir/objects.a
/usr/src/mxe/usr/bin/x86_64-w64-mingw32.static-ar cr CMakeFiles/unit-test-rabbitmq-core.dir/objects.a @CMakeFiles/unit-test-rabbitmq-core.dir/objects1.rsp
[ 83%] Building CXX object rabbitmq-fmu/CMakeFiles/unit-test-rabbitmq.dir/test/json_test.cpp.obj
cd /work/build/win-x64/rabbitmq-fmu && /usr/src/mxe/usr/bin/x86_64-w64-mingw32.static-g++  -DAMQP_STATIC -DFMI_COSIMULATION @CMakeFiles/unit-test-rabbitmq.dir/includes_CXX.rsp -O3 -DNDEBUG   -std=gnu++17 -o CMakeFiles/unit-test-rabbitmq.dir/test/json_test.cpp.obj -c /work/rabbitmq-fmu/test/json_test.cpp
[ 86%] Building CXX object rabbitmq-fmu/CMakeFiles/it-test-rabbitmq.dir/test/fmu_test_it.cpp.obj
cd /work/build/win-x64/rabbitmq-fmu && /usr/src/mxe/usr/bin/x86_64-w64-mingw32.static-g++  -DAMQP_STATIC -DFMI_COSIMULATION @CMakeFiles/it-test-rabbitmq.dir/includes_CXX.rsp -O3 -DNDEBUG   -std=gnu++17 -o CMakeFiles/it-test-rabbitmq.dir/test/fmu_test_it.cpp.obj -c /work/rabbitmq-fmu/test/fmu_test_it.cpp
/usr/src/mxe/usr/bin/x86_64-w64-mingw32.static-g++ -O3 -DNDEBUG   -Wl,--whole-archive CMakeFiles/unit-test-rabbitmq-core.dir/objects.a -Wl,--no-whole-archive  -o unit-test-rabbitmq-core.exe -Wl,--out-implib,libunit-test-rabbitmq-core.dll.a -Wl,--major-image-version,0,--minor-image-version,0 @CMakeFiles/unit-test-rabbitmq-core.dir/linklibs.rsp
make[2]: Leaving directory '/work/build/win-x64'
[ 86%] Building CXX object rabbitmq-fmu/CMakeFiles/unit-test-rabbitmq.dir/test/message_parser_test.cpp.obj
[ 86%] Built target unit-test-rabbitmq-core
cd /work/build/win-x64/rabbitmq-fmu && /usr/src/mxe/usr/bin/x86_64-w64-mingw32.static-g++  -DAMQP_STATIC -DFMI_COSIMULATION @CMakeFiles/unit-test-rabbitmq.dir/includes_CXX.rsp -O3 -DNDEBUG   -std=gnu++17 -o CMakeFiles/unit-test-rabbitmq.dir/test/message_parser_test.cpp.obj -c /work/rabbitmq-fmu/test/message_parser_test.cpp
[ 86%] Building CXX object rabbitmq-fmu/CMakeFiles/it-test-rabbitmq.dir/test/rabbitmq_test_it.cpp.obj
cd /work/build/win-x64/rabbitmq-fmu && /usr/src/mxe/usr/bin/x86_64-w64-mingw32.static-g++  -DAMQP_STATIC -DFMI_COSIMULATION @CMakeFiles/it-test-rabbitmq.dir/includes_CXX.rsp -O3 -DNDEBUG   -std=gnu++17 -o CMakeFiles/it-test-rabbitmq.dir/test/rabbitmq_test_it.cpp.obj -c /work/rabbitmq-fmu/test/rabbitmq_test_it.cpp
[ 89%] Building CXX object rabbitmq-fmu/CMakeFiles/it-test-rabbitmq.dir/test/rabbitmqhandler_test_it.cpp.obj
cd /work/build/win-x64/rabbitmq-fmu && /usr/src/mxe/usr/bin/x86_64-w64-mingw32.static-g++  -DAMQP_STATIC -DFMI_COSIMULATION @CMakeFiles/it-test-rabbitmq.dir/includes_CXX.rsp -O3 -DNDEBUG   -std=gnu++17 -o CMakeFiles/it-test-rabbitmq.dir/test/rabbitmqhandler_test_it.cpp.obj -c /work/rabbitmq-fmu/test/rabbitmqhandler_test_it.cpp
make: Entering directory '/work/build/darwin-x64/rabbitmq-fmu'
cd /work/build/darwin-x64 && /usr/bin/cmake -H/work -B/work/build/darwin-x64 --check-build-system CMakeFiles/Makefile.cmake 0
cd /work/build/darwin-x64 && /usr/bin/cmake -E cmake_progress_start /work/build/darwin-x64/CMakeFiles /work/build/darwin-x64/rabbitmq-fmu/CMakeFiles/progress.marks
cd /work/build/darwin-x64 && make -f CMakeFiles/Makefile2 rabbitmq-fmu/all
make[1]: Entering directory '/work/build/darwin-x64'
make -f thirdparty/date/date/CMakeFiles/tz.dir/build.make thirdparty/date/date/CMakeFiles/tz.dir/depend
make[2]: Entering directory '/work/build/darwin-x64'
cd /work/build/darwin-x64 && /usr/bin/cmake -E cmake_depends "Unix Makefiles" /work /work/thirdparty/date/date /work/build/darwin-x64 /work/build/darwin-x64/thirdparty/date/date /work/build/darwin-x64/thirdparty/date/date/CMakeFiles/tz.dir/DependInfo.cmake --color=
make[2]: Leaving directory '/work/build/darwin-x64'
make -f thirdparty/date/date/CMakeFiles/tz.dir/build.make thirdparty/date/date/CMakeFiles/tz.dir/build
make[2]: Entering directory '/work/build/darwin-x64'
make[2]: Nothing to be done for 'thirdparty/date/date/CMakeFiles/tz.dir/build'.
make[2]: Leaving directory '/work/build/darwin-x64'
[  3%] Built target tz
make -f rabbitmq-core/CMakeFiles/rabbitmq-core.dir/build.make rabbitmq-core/CMakeFiles/rabbitmq-core.dir/depend
make[2]: Entering directory '/work/build/darwin-x64'
cd /work/build/darwin-x64 && /usr/bin/cmake -E cmake_depends "Unix Makefiles" /work /work/rabbitmq-core /work/build/darwin-x64 /work/build/darwin-x64/rabbitmq-core /work/build/darwin-x64/rabbitmq-core/CMakeFiles/rabbitmq-core.dir/DependInfo.cmake --color=
make[2]: Leaving directory '/work/build/darwin-x64'
make -f rabbitmq-core/CMakeFiles/rabbitmq-core.dir/build.make rabbitmq-core/CMakeFiles/rabbitmq-core.dir/build
make[2]: Entering directory '/work/build/darwin-x64'
make[2]: Nothing to be done for 'rabbitmq-core/CMakeFiles/rabbitmq-core.dir/build'.
make[2]: Leaving directory '/work/build/darwin-x64'
[  7%] Built target rabbitmq-core
make -f thirdparty/rabbitmq-c/rabbitmq-c/librabbitmq/CMakeFiles/rabbitmq-static.dir/build.make thirdparty/rabbitmq-c/rabbitmq-c/librabbitmq/CMakeFiles/rabbitmq-static.dir/depend
make[2]: Entering directory '/work/build/darwin-x64'
cd /work/build/darwin-x64 && /usr/bin/cmake -E cmake_depends "Unix Makefiles" /work /work/thirdparty/rabbitmq-c/rabbitmq-c/librabbitmq /work/build/darwin-x64 /work/build/darwin-x64/thirdparty/rabbitmq-c/rabbitmq-c/librabbitmq /work/build/darwin-x64/thirdparty/rabbitmq-c/rabbitmq-c/librabbitmq/CMakeFiles/rabbitmq-static.dir/DependInfo.cmake --color=
make[2]: Leaving directory '/work/build/darwin-x64'
make -f thirdparty/rabbitmq-c/rabbitmq-c/librabbitmq/CMakeFiles/rabbitmq-static.dir/build.make thirdparty/rabbitmq-c/rabbitmq-c/librabbitmq/CMakeFiles/rabbitmq-static.dir/build
make[2]: Entering directory '/work/build/darwin-x64'
make[2]: Nothing to be done for 'thirdparty/rabbitmq-c/rabbitmq-c/librabbitmq/CMakeFiles/rabbitmq-static.dir/build'.
make[2]: Leaving directory '/work/build/darwin-x64'
[ 25%] Built target rabbitmq-static
make -f rabbitmq-fmu/CMakeFiles/rabbitmq.dir/build.make rabbitmq-fmu/CMakeFiles/rabbitmq.dir/depend
make[2]: Entering directory '/work/build/darwin-x64'
cd /work/build/darwin-x64 && /usr/bin/cmake -E cmake_depends "Unix Makefiles" /work /work/rabbitmq-fmu /work/build/darwin-x64 /work/build/darwin-x64/rabbitmq-fmu /work/build/darwin-x64/rabbitmq-fmu/CMakeFiles/rabbitmq.dir/DependInfo.cmake --color=
make[2]: Leaving directory '/work/build/darwin-x64'
make -f rabbitmq-fmu/CMakeFiles/rabbitmq.dir/build.make rabbitmq-fmu/CMakeFiles/rabbitmq.dir/build
make[2]: Entering directory '/work/build/darwin-x64'
make[2]: Nothing to be done for 'rabbitmq-fmu/CMakeFiles/rabbitmq.dir/build'.
make[2]: Leaving directory '/work/build/darwin-x64'
[ 40%] Built target rabbitmq
make -f rabbitmq-fmu/CMakeFiles/rabbitmq-main.dir/build.make rabbitmq-fmu/CMakeFiles/rabbitmq-main.dir/depend
make[2]: Entering directory '/work/build/darwin-x64'
cd /work/build/darwin-x64 && /usr/bin/cmake -E cmake_depends "Unix Makefiles" /work /work/rabbitmq-fmu /work/build/darwin-x64 /work/build/darwin-x64/rabbitmq-fmu /work/build/darwin-x64/rabbitmq-fmu/CMakeFiles/rabbitmq-main.dir/DependInfo.cmake --color=
make[2]: Leaving directory '/work/build/darwin-x64'
make -f rabbitmq-fmu/CMakeFiles/rabbitmq-main.dir/build.make rabbitmq-fmu/CMakeFiles/rabbitmq-main.dir/build
make[2]: Entering directory '/work/build/darwin-x64'
make[2]: Nothing to be done for 'rabbitmq-fmu/CMakeFiles/rabbitmq-main.dir/build'.
make[2]: Leaving directory '/work/build/darwin-x64'
[ 55%] Built target rabbitmq-main
make -f thirdparty/googletest/googletest/CMakeFiles/gtest.dir/build.make thirdparty/googletest/googletest/CMakeFiles/gtest.dir/depend
make[2]: Entering directory '/work/build/darwin-x64'
cd /work/build/darwin-x64 && /usr/bin/cmake -E cmake_depends "Unix Makefiles" /work /work/thirdparty/googletest/googletest /work/build/darwin-x64 /work/build/darwin-x64/thirdparty/googletest/googletest /work/build/darwin-x64/thirdparty/googletest/googletest/CMakeFiles/gtest.dir/DependInfo.cmake --color=
make[2]: Leaving directory '/work/build/darwin-x64'
make -f thirdparty/googletest/googletest/CMakeFiles/gtest.dir/build.make thirdparty/googletest/googletest/CMakeFiles/gtest.dir/build
make[2]: Entering directory '/work/build/darwin-x64'
make[2]: Nothing to be done for 'thirdparty/googletest/googletest/CMakeFiles/gtest.dir/build'.
make[2]: Leaving directory '/work/build/darwin-x64'
[ 59%] Built target gtest
make -f thirdparty/googletest/googletest/CMakeFiles/gtest_main.dir/build.make thirdparty/googletest/googletest/CMakeFiles/gtest_main.dir/depend
make[2]: Entering directory '/work/build/darwin-x64'
cd /work/build/darwin-x64 && /usr/bin/cmake -E cmake_depends "Unix Makefiles" /work /work/thirdparty/googletest/googletest /work/build/darwin-x64 /work/build/darwin-x64/thirdparty/googletest/googletest /work/build/darwin-x64/thirdparty/googletest/googletest/CMakeFiles/gtest_main.dir/DependInfo.cmake --color=
make[2]: Leaving directory '/work/build/darwin-x64'
make -f thirdparty/googletest/googletest/CMakeFiles/gtest_main.dir/build.make thirdparty/googletest/googletest/CMakeFiles/gtest_main.dir/build
make[2]: Entering directory '/work/build/darwin-x64'
make[2]: Nothing to be done for 'thirdparty/googletest/googletest/CMakeFiles/gtest_main.dir/build'.
make[2]: Leaving directory '/work/build/darwin-x64'
[ 59%] Built target gtest_main
make -f rabbitmq-fmu/CMakeFiles/unit-test-rabbitmq.dir/build.make rabbitmq-fmu/CMakeFiles/unit-test-rabbitmq.dir/depend
make[2]: Entering directory '/work/build/darwin-x64'
cd /work/build/darwin-x64 && /usr/bin/cmake -E cmake_depends "Unix Makefiles" /work /work/rabbitmq-fmu /work/build/darwin-x64 /work/build/darwin-x64/rabbitmq-fmu /work/build/darwin-x64/rabbitmq-fmu/CMakeFiles/unit-test-rabbitmq.dir/DependInfo.cmake --color=
make[2]: Leaving directory '/work/build/darwin-x64'
make -f rabbitmq-fmu/CMakeFiles/unit-test-rabbitmq.dir/build.make rabbitmq-fmu/CMakeFiles/unit-test-rabbitmq.dir/build
make[2]: Entering directory '/work/build/darwin-x64'
make[2]: Nothing to be done for 'rabbitmq-fmu/CMakeFiles/unit-test-rabbitmq.dir/build'.
make[2]: Leaving directory '/work/build/darwin-x64'
[ 81%] Built target unit-test-rabbitmq
make -f rabbitmq-fmu/CMakeFiles/it-test-rabbitmq.dir/build.make rabbitmq-fmu/CMakeFiles/it-test-rabbitmq.dir/depend
make[2]: Entering directory '/work/build/darwin-x64'
cd /work/build/darwin-x64 && /usr/bin/cmake -E cmake_depends "Unix Makefiles" /work /work/rabbitmq-fmu /work/build/darwin-x64 /work/build/darwin-x64/rabbitmq-fmu /work/build/darwin-x64/rabbitmq-fmu/CMakeFiles/it-test-rabbitmq.dir/DependInfo.cmake --color=
make[2]: Leaving directory '/work/build/darwin-x64'
make -f rabbitmq-fmu/CMakeFiles/it-test-rabbitmq.dir/build.make rabbitmq-fmu/CMakeFiles/it-test-rabbitmq.dir/build
make[2]: Entering directory '/work/build/darwin-x64'
make[2]: Nothing to be done for 'rabbitmq-fmu/CMakeFiles/it-test-rabbitmq.dir/build'.
make[2]: Leaving directory '/work/build/darwin-x64'
[100%] Built target it-test-rabbitmq
make[1]: Leaving directory '/work/build/darwin-x64'
/usr/bin/cmake -E cmake_progress_start /work/build/darwin-x64/CMakeFiles 0
cd /work/build/darwin-x64 && make -f CMakeFiles/Makefile2 rabbitmq-fmu/preinstall
make[1]: Entering directory '/work/build/darwin-x64'
make[1]: Nothing to be done for 'rabbitmq-fmu/preinstall'.
make[1]: Leaving directory '/work/build/darwin-x64'
Install the project...
/usr/bin/cmake -P cmake_install.cmake
-- Install configuration: "RelWithDebInfo"
-- Installing: /work/build/install/rabbitmqfmu/binaries/darwin64/rabbitmq.dylib
-- Installing: /work/build/install/rabbitmqfmu/resources/modelDescription.xml
-- Installing: /work/build/install/rabbitmqfmu/modelDescription.xml
make: Leaving directory '/work/build/darwin-x64/rabbitmq-fmu'
[ 91%] Building CXX object rabbitmq-fmu/CMakeFiles/unit-test-rabbitmq.dir/test/modeldescription_test.cpp.obj
cd /work/build/win-x64/rabbitmq-fmu && /usr/src/mxe/usr/bin/x86_64-w64-mingw32.static-g++  -DAMQP_STATIC -DFMI_COSIMULATION @CMakeFiles/unit-test-rabbitmq.dir/includes_CXX.rsp -O3 -DNDEBUG   -std=gnu++17 -o CMakeFiles/unit-test-rabbitmq.dir/test/modeldescription_test.cpp.obj -c /work/rabbitmq-fmu/test/modeldescription_test.cpp
[ 91%] Building CXX object rabbitmq-fmu/CMakeFiles/unit-test-rabbitmq.dir/test/timetamp_test.cpp.obj
cd /work/build/win-x64/rabbitmq-fmu && /usr/src/mxe/usr/bin/x86_64-w64-mingw32.static-g++  -DAMQP_STATIC -DFMI_COSIMULATION @CMakeFiles/unit-test-rabbitmq.dir/includes_CXX.rsp -O3 -DNDEBUG   -std=gnu++17 -o CMakeFiles/unit-test-rabbitmq.dir/test/timetamp_test.cpp.obj -c /work/rabbitmq-fmu/test/timetamp_test.cpp
Done
[Pipeline] }
[Pipeline] // stage
[Pipeline] }
[ 94%] Building CXX object rabbitmq-fmu/CMakeFiles/unit-test-rabbitmq.dir/test/xml_test.cpp.obj
cd /work/build/win-x64/rabbitmq-fmu && /usr/src/mxe/usr/bin/x86_64-w64-mingw32.static-g++  -DAMQP_STATIC -DFMI_COSIMULATION @CMakeFiles/unit-test-rabbitmq.dir/includes_CXX.rsp -O3 -DNDEBUG   -std=gnu++17 -o CMakeFiles/unit-test-rabbitmq.dir/test/xml_test.cpp.obj -c /work/rabbitmq-fmu/test/xml_test.cpp
[ 94%] Linking CXX executable it-test-rabbitmq.exe
cd /work/build/win-x64/rabbitmq-fmu && /usr/src/mxe/usr/x86_64-pc-linux-gnu/bin/cmake -E cmake_link_script CMakeFiles/it-test-rabbitmq.dir/link.txt --verbose=1
/usr/src/mxe/usr/x86_64-pc-linux-gnu/bin/cmake -E remove -f CMakeFiles/it-test-rabbitmq.dir/objects.a
/usr/src/mxe/usr/bin/x86_64-w64-mingw32.static-ar cr CMakeFiles/it-test-rabbitmq.dir/objects.a @CMakeFiles/it-test-rabbitmq.dir/objects1.rsp
/usr/src/mxe/usr/bin/x86_64-w64-mingw32.static-g++ -O3 -DNDEBUG   -static-libstdc++ -static-libgcc -Wl,--whole-archive CMakeFiles/it-test-rabbitmq.dir/objects.a -Wl,--no-whole-archive  -o it-test-rabbitmq.exe -Wl,--out-implib,libit-test-rabbitmq.dll.a -Wl,--major-image-version,0,--minor-image-version,0 @CMakeFiles/it-test-rabbitmq.dir/linklibs.rsp
[ 94%] Linking CXX executable unit-test-rabbitmq.exe
cd /work/build/win-x64/rabbitmq-fmu && /usr/src/mxe/usr/x86_64-pc-linux-gnu/bin/cmake -E cmake_link_script CMakeFiles/unit-test-rabbitmq.dir/link.txt --verbose=1
/usr/src/mxe/usr/x86_64-pc-linux-gnu/bin/cmake -E remove -f CMakeFiles/unit-test-rabbitmq.dir/objects.a
/usr/src/mxe/usr/bin/x86_64-w64-mingw32.static-ar cr CMakeFiles/unit-test-rabbitmq.dir/objects.a @CMakeFiles/unit-test-rabbitmq.dir/objects1.rsp
/usr/src/mxe/usr/bin/x86_64-w64-mingw32.static-g++ -O3 -DNDEBUG   -static-libstdc++ -static-libgcc -Wl,--whole-archive CMakeFiles/unit-test-rabbitmq.dir/objects.a -Wl,--no-whole-archive  -o unit-test-rabbitmq.exe -Wl,--out-implib,libunit-test-rabbitmq.dll.a -Wl,--major-image-version,0,--minor-image-version,0 @CMakeFiles/unit-test-rabbitmq.dir/linklibs.rsp
make[2]: Leaving directory '/work/build/win-x64'
[ 94%] Built target it-test-rabbitmq
make[2]: Leaving directory '/work/build/win-x64'
[ 94%] Built target unit-test-rabbitmq
make[1]: Leaving directory '/work/build/win-x64'
Makefile:143: recipe for target 'all' failed
make: *** [all] Error 2
make: Leaving directory '/work/build/win-x64'
[Pipeline] }
[Pipeline] // stage
[Pipeline] }
Failed in branch Xcompile win64
[Pipeline] // parallel
[Pipeline] }
[Pipeline] // stage
[Pipeline] stage
[Pipeline] { (Pack FMU)
Stage "Pack FMU" skipped due to earlier failure(s)
[Pipeline] }
[Pipeline] // stage
[Pipeline] stage
[Pipeline] { (Publish)
Stage "Publish" skipped due to earlier failure(s)
[Pipeline] }
[Pipeline] // stage
[Pipeline] }
[Pipeline] // withEnv
[Pipeline] }
[Pipeline] // node
[Pipeline] End of Pipeline

GitHub has been notified of this commit’s build result

ERROR: script returned exit code 2
Finished: FAILURE