FailedConsole Output

Skipping 4,967 KB.. Full Log
++/6/bits/stl_pair.h:254:26: note: candidate: template<class _U1, class _U2, typename std::enable_if<(_ConstructiblePair<_U1, _U2>() && (! _ImplicitlyConvertiblePair<_U1, _U2>())), bool>::type <anonymous> > constexpr std::pair<_T1, _T2>::pair(const _T1&, const _T2&)
       explicit constexpr pair(const _T1& __a, const _T2& __b)
                          ^~~~
/usr/include/c++/6/bits/stl_pair.h:254:26: note:   template argument deduction/substitution failed:
In file included from /usr/include/c++/6/bits/unique_ptr.h:37:0,
                 from /usr/include/c++/6/bits/locale_conv.h:41,
                 from /usr/include/c++/6/locale:43,
                 from /work/thirdparty/date/date/include/date/date.h:57,
                 from /work/rabbitmq-core/src/FmuContainerCore.h:11,
                 from /work/rabbitmq-core/src/FmuContainerCore.cpp:5:
/usr/include/c++/6/tuple:1590:70: note:   candidate expects 2 arguments, 0 provided
         second(std::forward<_Args2>(std::get<_Indexes2>(__tuple2))...)
                                                                      ^
In file included from /usr/include/c++/6/bits/stl_algobase.h:64:0,
                 from /usr/include/c++/6/list:60,
                 from /work/rabbitmq-core/src/FmuContainerCore.h:9,
                 from /work/rabbitmq-core/src/FmuContainerCore.cpp:5:
/usr/include/c++/6/bits/stl_pair.h:245:17: note: candidate: template<class _U1, class _U2, typename std::enable_if<(_ConstructiblePair<_U1, _U2>() && _ImplicitlyConvertiblePair<_U1, _U2>()), bool>::type <anonymous> > constexpr std::pair<_T1, _T2>::pair(const _T1&, const _T2&)
       constexpr pair(const _T1& __a, const _T2& __b)
                 ^~~~
/usr/include/c++/6/bits/stl_pair.h:245:17: note:   template argument deduction/substitution failed:
In file included from /usr/include/c++/6/bits/unique_ptr.h:37:0,
                 from /usr/include/c++/6/bits/locale_conv.h:41,
                 from /usr/include/c++/6/locale:43,
                 from /work/thirdparty/date/date/include/date/date.h:57,
                 from /work/rabbitmq-core/src/FmuContainerCore.h:11,
                 from /work/rabbitmq-core/src/FmuContainerCore.cpp:5:
/usr/include/c++/6/tuple:1590:70: note:   candidate expects 2 arguments, 0 provided
         second(std::forward<_Args2>(std::get<_Indexes2>(__tuple2))...)
                                                                      ^
In file included from /usr/include/c++/6/bits/stl_algobase.h:64:0,
                 from /usr/include/c++/6/list:60,
                 from /work/rabbitmq-core/src/FmuContainerCore.h:9,
                 from /work/rabbitmq-core/src/FmuContainerCore.cpp:5:
/usr/include/c++/6/bits/stl_pair.h:227:26: note: candidate: template<class _U1, class _U2, typename std::enable_if<std::__and_<std::is_default_constructible<_Tp>, std::is_default_constructible<_U2>, std::__not_<std::__and_<std::__is_implicitly_default_constructible<_U1>, std::__is_implicitly_default_constructible<_U2> > > >::value, bool>::type <anonymous> > constexpr std::pair<_T1, _T2>::pair()
       explicit constexpr pair()
                          ^~~~
/usr/include/c++/6/bits/stl_pair.h:227:26: note:   template argument deduction/substitution failed:
/usr/include/c++/6/bits/stl_pair.h:226:59: error: no type named 'type' in 'struct std::enable_if<false, bool>'
                                    ::value, bool>::type = false>
                                                           ^~~~~
/usr/include/c++/6/bits/stl_pair.h:226:59: note: invalid template non-type parameter
/usr/include/c++/6/bits/stl_pair.h:214:26: note: candidate: template<class _U1, class _U2, typename std::enable_if<std::__and_<std::__is_implicitly_default_constructible<_U1>, std::__is_implicitly_default_constructible<_U2> >::value, bool>::type <anonymous> > constexpr std::pair<_T1, _T2>::pair()
       _GLIBCXX_CONSTEXPR pair()
                          ^~~~
/usr/include/c++/6/bits/stl_pair.h:214:26: note:   template argument deduction/substitution failed:
/usr/include/c++/6/bits/stl_pair.h:212:59: error: no type named 'type' in 'struct std::enable_if<false, bool>'
                                    ::value, bool>::type = true>
                                                           ^~~~
/usr/include/c++/6/bits/stl_pair.h:212:59: note: invalid template non-type parameter
make[2]: *** [rabbitmq-core/CMakeFiles/rabbitmq-core.dir/src/FmuContainerCore.cpp.o] Error 1
rabbitmq-core/CMakeFiles/rabbitmq-core.dir/build.make:65: recipe for target 'rabbitmq-core/CMakeFiles/rabbitmq-core.dir/src/FmuContainerCore.cpp.o' failed
make[2]: Leaving directory '/work/build/linux-x64'
make[1]: *** [rabbitmq-core/CMakeFiles/rabbitmq-core.dir/all] Error 2
make[1]: *** Waiting for unfinished jobs....
CMakeFiles/Makefile2:4995: recipe for target 'rabbitmq-core/CMakeFiles/rabbitmq-core.dir/all' failed
Compiling
Compiling
Compiling
[ 24%] Linking CXX static library ../../../lib/libgtest.a
cd /work/build/linux-x86/thirdparty/googletest/googletest && /usr/bin/cmake -P CMakeFiles/gtest.dir/cmake_clean_target.cmake
cd /work/build/linux-x86/thirdparty/googletest/googletest && /usr/bin/cmake -E cmake_link_script CMakeFiles/gtest.dir/link.txt --verbose=1
/usr/i686-linux-gnu/bin/i686-linux-gnu-ar qc ../../../lib/libgtest.a  CMakeFiles/gtest.dir/src/gtest-all.cc.o
make[2]: Leaving directory '/work/build/linux-x86'
make: *** [all] Error 2
[ 24%] Built target gtest
make[1]: Leaving directory '/work/build/linux-x86'
Makefile:131: recipe for target 'all' failed
make: Leaving directory '/work/build/linux-x86'
[ 24%] Linking CXX static library ../../../lib/libgtest.a
cd /work/build/linux-x64/thirdparty/googletest/googletest && /usr/bin/cmake -P CMakeFiles/gtest.dir/cmake_clean_target.cmake
cd /work/build/linux-x64/thirdparty/googletest/googletest && /usr/bin/cmake -E cmake_link_script CMakeFiles/gtest.dir/link.txt --verbose=1
/usr/bin/x86_64-linux-gnu-ar qc ../../../lib/libgtest.a  CMakeFiles/gtest.dir/src/gtest-all.cc.o
/usr/bin/x86_64-linux-gnu-ranlib ../../../lib/libgtest.a
make[2]: Leaving directory '/work/build/linux-x64'
[ 24%] Built target gtest
make[1]: Leaving directory '/work/build/linux-x64'
make: *** [all] Error 2
Makefile:143: recipe for target 'all' failed
make: Leaving directory '/work/build/linux-x64'
[Pipeline] }
[Pipeline] }
[Pipeline] // stage
[Pipeline] // stage
[Pipeline] }
Failed in branch Xcompile linux32
[Pipeline] }
Failed in branch Xcompile linux64
make: Entering directory '/work/build/darwin-x64'
/usr/bin/cmake -H/work -B/work/build/darwin-x64 --check-build-system CMakeFiles/Makefile.cmake 0
/usr/bin/cmake -E cmake_progress_start /work/build/darwin-x64/CMakeFiles /work/build/darwin-x64/CMakeFiles/progress.marks
make -f CMakeFiles/Makefile2 all
make[1]: Entering directory '/work/build/darwin-x64'
make -f thirdparty/googletest/googletest/CMakeFiles/gtest.dir/build.make thirdparty/googletest/googletest/CMakeFiles/gtest.dir/depend
make -f thirdparty/rabbitmq-c/rabbitmq-c/librabbitmq/CMakeFiles/rabbitmq-static.dir/build.make thirdparty/rabbitmq-c/rabbitmq-c/librabbitmq/CMakeFiles/rabbitmq-static.dir/depend
make -f thirdparty/date/date/CMakeFiles/tz.dir/build.make thirdparty/date/date/CMakeFiles/tz.dir/depend
make[2]: Entering directory '/work/build/darwin-x64'
cd /work/build/darwin-x64 && /usr/bin/cmake -E cmake_depends "Unix Makefiles" /work /work/thirdparty/googletest/googletest /work/build/darwin-x64 /work/build/darwin-x64/thirdparty/googletest/googletest /work/build/darwin-x64/thirdparty/googletest/googletest/CMakeFiles/gtest.dir/DependInfo.cmake --color=
make[2]: Entering directory '/work/build/darwin-x64'
cd /work/build/darwin-x64 && /usr/bin/cmake -E cmake_depends "Unix Makefiles" /work /work/thirdparty/rabbitmq-c/rabbitmq-c/librabbitmq /work/build/darwin-x64 /work/build/darwin-x64/thirdparty/rabbitmq-c/rabbitmq-c/librabbitmq /work/build/darwin-x64/thirdparty/rabbitmq-c/rabbitmq-c/librabbitmq/CMakeFiles/rabbitmq-static.dir/DependInfo.cmake --color=
make[2]: Entering directory '/work/build/darwin-x64'
cd /work/build/darwin-x64 && /usr/bin/cmake -E cmake_depends "Unix Makefiles" /work /work/thirdparty/date/date /work/build/darwin-x64 /work/build/darwin-x64/thirdparty/date/date /work/build/darwin-x64/thirdparty/date/date/CMakeFiles/tz.dir/DependInfo.cmake --color=
Scanning dependencies of target rabbitmq-static
make[2]: Leaving directory '/work/build/darwin-x64'
make -f thirdparty/rabbitmq-c/rabbitmq-c/librabbitmq/CMakeFiles/rabbitmq-static.dir/build.make thirdparty/rabbitmq-c/rabbitmq-c/librabbitmq/CMakeFiles/rabbitmq-static.dir/build
make[2]: Entering directory '/work/build/darwin-x64'
Scanning dependencies of target tz
Scanning dependencies of target gtest
make[2]: Leaving directory '/work/build/darwin-x64'
make -f thirdparty/date/date/CMakeFiles/tz.dir/build.make thirdparty/date/date/CMakeFiles/tz.dir/build
make[2]: Leaving directory '/work/build/darwin-x64'
make -f thirdparty/googletest/googletest/CMakeFiles/gtest.dir/build.make thirdparty/googletest/googletest/CMakeFiles/gtest.dir/build
make[2]: Entering directory '/work/build/darwin-x64'
[  0%] Building C object thirdparty/rabbitmq-c/rabbitmq-c/librabbitmq/CMakeFiles/rabbitmq-static.dir/amqp_table.c.o
[  3%] Building C object thirdparty/rabbitmq-c/rabbitmq-c/librabbitmq/CMakeFiles/rabbitmq-static.dir/amqp_framing.c.o
cd /work/build/darwin-x64/thirdparty/rabbitmq-c/rabbitmq-c/librabbitmq && /opt/osxcross/target/bin/o64-clang -DAMQP_BUILD -DAMQP_STATIC -DHAVE_CONFIG_H -I/work/build/darwin-x64/thirdparty/rabbitmq-c/rabbitmq-c/librabbitmq -I/work/thirdparty/rabbitmq-c/rabbitmq-c/librabbitmq -I/work/thirdparty/rabbitmq-c/rabbitmq-c/librabbitmq/unix  -Wall -Wextra -Wstrict-prototypes -Wno-unused-function -fno-common -fvisibility=hidden  -std=gnu90 -O2 -g -DNDEBUG -isysroot /opt/osxcross/target/SDK/MacOSX10.15.sdk -fPIC   -o CMakeFiles/rabbitmq-static.dir/amqp_framing.c.o   -c /work/thirdparty/rabbitmq-c/rabbitmq-c/librabbitmq/amqp_framing.c
cd /work/build/darwin-x64/thirdparty/rabbitmq-c/rabbitmq-c/librabbitmq && /opt/osxcross/target/bin/o64-clang -DAMQP_BUILD -DAMQP_STATIC -DHAVE_CONFIG_H -I/work/build/darwin-x64/thirdparty/rabbitmq-c/rabbitmq-c/librabbitmq -I/work/thirdparty/rabbitmq-c/rabbitmq-c/librabbitmq -I/work/thirdparty/rabbitmq-c/rabbitmq-c/librabbitmq/unix  -Wall -Wextra -Wstrict-prototypes -Wno-unused-function -fno-common -fvisibility=hidden  -std=gnu90 -O2 -g -DNDEBUG -isysroot /opt/osxcross/target/SDK/MacOSX10.15.sdk -fPIC   -o CMakeFiles/rabbitmq-static.dir/amqp_table.c.o   -c /work/thirdparty/rabbitmq-c/rabbitmq-c/librabbitmq/amqp_table.c
[  6%] Building C object thirdparty/rabbitmq-c/rabbitmq-c/librabbitmq/CMakeFiles/rabbitmq-static.dir/amqp_socket.c.o
cd /work/build/darwin-x64/thirdparty/rabbitmq-c/rabbitmq-c/librabbitmq && /opt/osxcross/target/bin/o64-clang -DAMQP_BUILD -DAMQP_STATIC -DHAVE_CONFIG_H -I/work/build/darwin-x64/thirdparty/rabbitmq-c/rabbitmq-c/librabbitmq -I/work/thirdparty/rabbitmq-c/rabbitmq-c/librabbitmq -I/work/thirdparty/rabbitmq-c/rabbitmq-c/librabbitmq/unix  -Wall -Wextra -Wstrict-prototypes -Wno-unused-function -fno-common -fvisibility=hidden  -std=gnu90 -O2 -g -DNDEBUG -isysroot /opt/osxcross/target/SDK/MacOSX10.15.sdk -fPIC   -o CMakeFiles/rabbitmq-static.dir/amqp_socket.c.o   -c /work/thirdparty/rabbitmq-c/rabbitmq-c/librabbitmq/amqp_socket.c
make[2]: Entering directory '/work/build/darwin-x64'
[  6%] Building C object thirdparty/rabbitmq-c/rabbitmq-c/librabbitmq/CMakeFiles/rabbitmq-static.dir/amqp_api.c.o
[  9%] Building C object thirdparty/rabbitmq-c/rabbitmq-c/librabbitmq/CMakeFiles/rabbitmq-static.dir/amqp_connection.c.o
cd /work/build/darwin-x64/thirdparty/rabbitmq-c/rabbitmq-c/librabbitmq && /opt/osxcross/target/bin/o64-clang -DAMQP_BUILD -DAMQP_STATIC -DHAVE_CONFIG_H -I/work/build/darwin-x64/thirdparty/rabbitmq-c/rabbitmq-c/librabbitmq -I/work/thirdparty/rabbitmq-c/rabbitmq-c/librabbitmq -I/work/thirdparty/rabbitmq-c/rabbitmq-c/librabbitmq/unix  -Wall -Wextra -Wstrict-prototypes -Wno-unused-function -fno-common -fvisibility=hidden  -std=gnu90 -O2 -g -DNDEBUG -isysroot /opt/osxcross/target/SDK/MacOSX10.15.sdk -fPIC   -o CMakeFiles/rabbitmq-static.dir/amqp_connection.c.o   -c /work/thirdparty/rabbitmq-c/rabbitmq-c/librabbitmq/amqp_connection.c
cd /work/build/darwin-x64/thirdparty/rabbitmq-c/rabbitmq-c/librabbitmq && /opt/osxcross/target/bin/o64-clang -DAMQP_BUILD -DAMQP_STATIC -DHAVE_CONFIG_H -I/work/build/darwin-x64/thirdparty/rabbitmq-c/rabbitmq-c/librabbitmq -I/work/thirdparty/rabbitmq-c/rabbitmq-c/librabbitmq -I/work/thirdparty/rabbitmq-c/rabbitmq-c/librabbitmq/unix  -Wall -Wextra -Wstrict-prototypes -Wno-unused-function -fno-common -fvisibility=hidden  -std=gnu90 -O2 -g -DNDEBUG -isysroot /opt/osxcross/target/SDK/MacOSX10.15.sdk -fPIC   -o CMakeFiles/rabbitmq-static.dir/amqp_api.c.o   -c /work/thirdparty/rabbitmq-c/rabbitmq-c/librabbitmq/amqp_api.c
[  9%] Building CXX object thirdparty/date/date/CMakeFiles/tz.dir/src/tz.cpp.o
cd /work/build/darwin-x64/thirdparty/date/date && /opt/osxcross/target/bin/o64-clang++  -DHAS_REMOTE_API=0 -DUSE_AUTOLOAD=0 -DUSE_OS_TZDB=1 -I/work/thirdparty/date/date -I/work/thirdparty/date/date/include -I/work/thirdparty/date/date/include/date  -O2 -g -DNDEBUG -isysroot /opt/osxcross/target/SDK/MacOSX10.15.sdk   -std=gnu++1z -o CMakeFiles/tz.dir/src/tz.cpp.o -c /work/thirdparty/date/date/src/tz.cpp
[  9%] Building C object thirdparty/rabbitmq-c/rabbitmq-c/librabbitmq/CMakeFiles/rabbitmq-static.dir/amqp_mem.c.o
cd /work/build/darwin-x64/thirdparty/rabbitmq-c/rabbitmq-c/librabbitmq && /opt/osxcross/target/bin/o64-clang -DAMQP_BUILD -DAMQP_STATIC -DHAVE_CONFIG_H -I/work/build/darwin-x64/thirdparty/rabbitmq-c/rabbitmq-c/librabbitmq -I/work/thirdparty/rabbitmq-c/rabbitmq-c/librabbitmq -I/work/thirdparty/rabbitmq-c/rabbitmq-c/librabbitmq/unix  -Wall -Wextra -Wstrict-prototypes -Wno-unused-function -fno-common -fvisibility=hidden  -std=gnu90 -O2 -g -DNDEBUG -isysroot /opt/osxcross/target/SDK/MacOSX10.15.sdk -fPIC   -o CMakeFiles/rabbitmq-static.dir/amqp_mem.c.o   -c /work/thirdparty/rabbitmq-c/rabbitmq-c/librabbitmq/amqp_mem.c
[  9%] Building CXX object thirdparty/googletest/googletest/CMakeFiles/gtest.dir/src/gtest-all.cc.o
cd /work/build/darwin-x64/thirdparty/googletest/googletest && /opt/osxcross/target/bin/o64-clang++   -I/work/thirdparty/googletest/googletest/include -I/work/thirdparty/googletest/googletest  -O2 -g -DNDEBUG -isysroot /opt/osxcross/target/SDK/MacOSX10.15.sdk   -Wall -Wshadow -Werror -Wconversion -DGTEST_HAS_PTHREAD=1 -fexceptions -W -Wpointer-arith -Wreturn-type -Wcast-qual -Wwrite-strings -Wswitch -Wunused-parameter -Wcast-align -Wchar-subscripts -Winline -Wredundant-decls -std=c++11 -o CMakeFiles/gtest.dir/src/gtest-all.cc.o -c /work/thirdparty/googletest/googletest/src/gtest-all.cc
[  9%] Building C object thirdparty/rabbitmq-c/rabbitmq-c/librabbitmq/CMakeFiles/rabbitmq-static.dir/amqp_url.c.o
cd /work/build/darwin-x64/thirdparty/rabbitmq-c/rabbitmq-c/librabbitmq && /opt/osxcross/target/bin/o64-clang -DAMQP_BUILD -DAMQP_STATIC -DHAVE_CONFIG_H -I/work/build/darwin-x64/thirdparty/rabbitmq-c/rabbitmq-c/librabbitmq -I/work/thirdparty/rabbitmq-c/rabbitmq-c/librabbitmq -I/work/thirdparty/rabbitmq-c/rabbitmq-c/librabbitmq/unix  -Wall -Wextra -Wstrict-prototypes -Wno-unused-function -fno-common -fvisibility=hidden  -std=gnu90 -O2 -g -DNDEBUG -isysroot /opt/osxcross/target/SDK/MacOSX10.15.sdk -fPIC   -o CMakeFiles/rabbitmq-static.dir/amqp_url.c.o   -c /work/thirdparty/rabbitmq-c/rabbitmq-c/librabbitmq/amqp_url.c
[ 12%] Building C object thirdparty/rabbitmq-c/rabbitmq-c/librabbitmq/CMakeFiles/rabbitmq-static.dir/amqp_tcp_socket.c.o
cd /work/build/darwin-x64/thirdparty/rabbitmq-c/rabbitmq-c/librabbitmq && /opt/osxcross/target/bin/o64-clang -DAMQP_BUILD -DAMQP_STATIC -DHAVE_CONFIG_H -I/work/build/darwin-x64/thirdparty/rabbitmq-c/rabbitmq-c/librabbitmq -I/work/thirdparty/rabbitmq-c/rabbitmq-c/librabbitmq -I/work/thirdparty/rabbitmq-c/rabbitmq-c/librabbitmq/unix  -Wall -Wextra -Wstrict-prototypes -Wno-unused-function -fno-common -fvisibility=hidden  -std=gnu90 -O2 -g -DNDEBUG -isysroot /opt/osxcross/target/SDK/MacOSX10.15.sdk -fPIC   -o CMakeFiles/rabbitmq-static.dir/amqp_tcp_socket.c.o   -c /work/thirdparty/rabbitmq-c/rabbitmq-c/librabbitmq/amqp_tcp_socket.c
[ 12%] Building C object thirdparty/rabbitmq-c/rabbitmq-c/librabbitmq/CMakeFiles/rabbitmq-static.dir/amqp_time.c.o
cd /work/build/darwin-x64/thirdparty/rabbitmq-c/rabbitmq-c/librabbitmq && /opt/osxcross/target/bin/o64-clang -DAMQP_BUILD -DAMQP_STATIC -DHAVE_CONFIG_H -I/work/build/darwin-x64/thirdparty/rabbitmq-c/rabbitmq-c/librabbitmq -I/work/thirdparty/rabbitmq-c/rabbitmq-c/librabbitmq -I/work/thirdparty/rabbitmq-c/rabbitmq-c/librabbitmq/unix  -Wall -Wextra -Wstrict-prototypes -Wno-unused-function -fno-common -fvisibility=hidden  -std=gnu90 -O2 -g -DNDEBUG -isysroot /opt/osxcross/target/SDK/MacOSX10.15.sdk -fPIC   -o CMakeFiles/rabbitmq-static.dir/amqp_time.c.o   -c /work/thirdparty/rabbitmq-c/rabbitmq-c/librabbitmq/amqp_time.c
[ 15%] Building C object thirdparty/rabbitmq-c/rabbitmq-c/librabbitmq/CMakeFiles/rabbitmq-static.dir/amqp_consumer.c.o
cd /work/build/darwin-x64/thirdparty/rabbitmq-c/rabbitmq-c/librabbitmq && /opt/osxcross/target/bin/o64-clang -DAMQP_BUILD -DAMQP_STATIC -DHAVE_CONFIG_H -I/work/build/darwin-x64/thirdparty/rabbitmq-c/rabbitmq-c/librabbitmq -I/work/thirdparty/rabbitmq-c/rabbitmq-c/librabbitmq -I/work/thirdparty/rabbitmq-c/rabbitmq-c/librabbitmq/unix  -Wall -Wextra -Wstrict-prototypes -Wno-unused-function -fno-common -fvisibility=hidden  -std=gnu90 -O2 -g -DNDEBUG -isysroot /opt/osxcross/target/SDK/MacOSX10.15.sdk -fPIC   -o CMakeFiles/rabbitmq-static.dir/amqp_consumer.c.o   -c /work/thirdparty/rabbitmq-c/rabbitmq-c/librabbitmq/amqp_consumer.c
make: Entering directory '/work/build/win-x86'
/usr/src/mxe/usr/x86_64-pc-linux-gnu/bin/cmake -S/work -B/work/build/win-x86 --check-build-system CMakeFiles/Makefile.cmake 0
/usr/src/mxe/usr/x86_64-pc-linux-gnu/bin/cmake -E cmake_progress_start /work/build/win-x86/CMakeFiles /work/build/win-x86/CMakeFiles/progress.marks
make -f CMakeFiles/Makefile2 all
make[1]: Entering directory '/work/build/win-x86'
make -f thirdparty/googletest/googletest/CMakeFiles/gtest.dir/build.make thirdparty/googletest/googletest/CMakeFiles/gtest.dir/depend
make -f thirdparty/rabbitmq-c/rabbitmq-c/librabbitmq/CMakeFiles/rabbitmq-static.dir/build.make thirdparty/rabbitmq-c/rabbitmq-c/librabbitmq/CMakeFiles/rabbitmq-static.dir/depend
make -f thirdparty/date/date/CMakeFiles/tz.dir/build.make thirdparty/date/date/CMakeFiles/tz.dir/depend
make[2]: Entering directory '/work/build/win-x86'
make[2]: Entering directory '/work/build/win-x86'
cd /work/build/win-x86 && /usr/src/mxe/usr/x86_64-pc-linux-gnu/bin/cmake -E cmake_depends "Unix Makefiles" /work /work/thirdparty/rabbitmq-c/rabbitmq-c/librabbitmq /work/build/win-x86 /work/build/win-x86/thirdparty/rabbitmq-c/rabbitmq-c/librabbitmq /work/build/win-x86/thirdparty/rabbitmq-c/rabbitmq-c/librabbitmq/CMakeFiles/rabbitmq-static.dir/DependInfo.cmake --color=
make[2]: Entering directory '/work/build/win-x86'
cd /work/build/win-x86 && /usr/src/mxe/usr/x86_64-pc-linux-gnu/bin/cmake -E cmake_depends "Unix Makefiles" /work /work/thirdparty/date/date /work/build/win-x86 /work/build/win-x86/thirdparty/date/date /work/build/win-x86/thirdparty/date/date/CMakeFiles/tz.dir/DependInfo.cmake --color=
cd /work/build/win-x86 && /usr/src/mxe/usr/x86_64-pc-linux-gnu/bin/cmake -E cmake_depends "Unix Makefiles" /work /work/thirdparty/googletest/googletest /work/build/win-x86 /work/build/win-x86/thirdparty/googletest/googletest /work/build/win-x86/thirdparty/googletest/googletest/CMakeFiles/gtest.dir/DependInfo.cmake --color=
Scanning dependencies of target tz
make[2]: Leaving directory '/work/build/win-x86'
make -f thirdparty/date/date/CMakeFiles/tz.dir/build.make thirdparty/date/date/CMakeFiles/tz.dir/build
Scanning dependencies of target rabbitmq-static
Scanning dependencies of target gtest
make[2]: Leaving directory '/work/build/win-x86'
make[2]: Entering directory '/work/build/win-x86'
make -f thirdparty/rabbitmq-c/rabbitmq-c/librabbitmq/CMakeFiles/rabbitmq-static.dir/build.make thirdparty/rabbitmq-c/rabbitmq-c/librabbitmq/CMakeFiles/rabbitmq-static.dir/build
make[2]: Leaving directory '/work/build/win-x86'
make -f thirdparty/googletest/googletest/CMakeFiles/gtest.dir/build.make thirdparty/googletest/googletest/CMakeFiles/gtest.dir/build
[  0%] Building CXX object thirdparty/date/date/CMakeFiles/tz.dir/src/tz.cpp.obj
make[2]: Entering directory '/work/build/win-x86'
cd /work/build/win-x86/thirdparty/date/date && /usr/src/mxe/usr/bin/i686-w64-mingw32.static-g++  -DHAS_REMOTE_API=0 -DUSE_AUTOLOAD=0 @CMakeFiles/tz.dir/includes_CXX.rsp -O3 -DNDEBUG   -std=gnu++17 -o CMakeFiles/tz.dir/src/tz.cpp.obj -c /work/thirdparty/date/date/src/tz.cpp
make[2]: Entering directory '/work/build/win-x86'
[  0%] Building C object thirdparty/rabbitmq-c/rabbitmq-c/librabbitmq/CMakeFiles/rabbitmq-static.dir/amqp_api.c.obj
[  0%] Building CXX object thirdparty/googletest/googletest/CMakeFiles/gtest.dir/src/gtest-all.cc.obj
cd /work/build/win-x86/thirdparty/rabbitmq-c/rabbitmq-c/librabbitmq && /usr/src/mxe/usr/bin/i686-w64-mingw32.static-gcc -DAMQP_BUILD -DAMQP_STATIC -DHAVE_CONFIG_H @CMakeFiles/rabbitmq-static.dir/includes_C.rsp -Wall -Wextra -Wstrict-prototypes -Wno-unused-function -fno-common -fvisibility=hidden  -std=gnu90 -O3 -DNDEBUG   -o CMakeFiles/rabbitmq-static.dir/amqp_api.c.obj   -c /work/thirdparty/rabbitmq-c/rabbitmq-c/librabbitmq/amqp_api.c
[  0%] Building C object thirdparty/rabbitmq-c/rabbitmq-c/librabbitmq/CMakeFiles/rabbitmq-static.dir/amqp_table.c.obj
cd /work/build/win-x86/thirdparty/rabbitmq-c/rabbitmq-c/librabbitmq && /usr/src/mxe/usr/bin/i686-w64-mingw32.static-gcc -DAMQP_BUILD -DAMQP_STATIC -DHAVE_CONFIG_H @CMakeFiles/rabbitmq-static.dir/includes_C.rsp -Wall -Wextra -Wstrict-prototypes -Wno-unused-function -fno-common -fvisibility=hidden  -std=gnu90 -O3 -DNDEBUG   -o CMakeFiles/rabbitmq-static.dir/amqp_table.c.obj   -c /work/thirdparty/rabbitmq-c/rabbitmq-c/librabbitmq/amqp_table.c
[  2%] Building C object thirdparty/rabbitmq-c/rabbitmq-c/librabbitmq/CMakeFiles/rabbitmq-static.dir/amqp_connection.c.obj
[  2%] Building C object thirdparty/rabbitmq-c/rabbitmq-c/librabbitmq/CMakeFiles/rabbitmq-static.dir/amqp_mem.c.obj
cd /work/build/win-x86/thirdparty/googletest/googletest && /usr/src/mxe/usr/bin/i686-w64-mingw32.static-g++   @CMakeFiles/gtest.dir/includes_CXX.rsp -O3 -DNDEBUG   -Wall -Wshadow -Werror -Wno-error=dangling-else -DGTEST_HAS_PTHREAD=0 -fexceptions -Wextra -Wno-unused-parameter -Wno-missing-field-initializers -std=c++11 -o CMakeFiles/gtest.dir/src/gtest-all.cc.obj -c /work/thirdparty/googletest/googletest/src/gtest-all.cc
[  5%] Building C object thirdparty/rabbitmq-c/rabbitmq-c/librabbitmq/CMakeFiles/rabbitmq-static.dir/amqp_framing.c.obj
cd /work/build/win-x86/thirdparty/rabbitmq-c/rabbitmq-c/librabbitmq && /usr/src/mxe/usr/bin/i686-w64-mingw32.static-gcc -DAMQP_BUILD -DAMQP_STATIC -DHAVE_CONFIG_H @CMakeFiles/rabbitmq-static.dir/includes_C.rsp -Wall -Wextra -Wstrict-prototypes -Wno-unused-function -fno-common -fvisibility=hidden  -std=gnu90 -O3 -DNDEBUG   -o CMakeFiles/rabbitmq-static.dir/amqp_connection.c.obj   -c /work/thirdparty/rabbitmq-c/rabbitmq-c/librabbitmq/amqp_connection.c
[  8%] Building C object thirdparty/rabbitmq-c/rabbitmq-c/librabbitmq/CMakeFiles/rabbitmq-static.dir/amqp_socket.c.obj
cd /work/build/win-x86/thirdparty/rabbitmq-c/rabbitmq-c/librabbitmq && /usr/src/mxe/usr/bin/i686-w64-mingw32.static-gcc -DAMQP_BUILD -DAMQP_STATIC -DHAVE_CONFIG_H @CMakeFiles/rabbitmq-static.dir/includes_C.rsp -Wall -Wextra -Wstrict-prototypes -Wno-unused-function -fno-common -fvisibility=hidden  -std=gnu90 -O3 -DNDEBUG   -o CMakeFiles/rabbitmq-static.dir/amqp_framing.c.obj   -c /work/thirdparty/rabbitmq-c/rabbitmq-c/librabbitmq/amqp_framing.c
cd /work/build/win-x86/thirdparty/rabbitmq-c/rabbitmq-c/librabbitmq && /usr/src/mxe/usr/bin/i686-w64-mingw32.static-gcc -DAMQP_BUILD -DAMQP_STATIC -DHAVE_CONFIG_H @CMakeFiles/rabbitmq-static.dir/includes_C.rsp -Wall -Wextra -Wstrict-prototypes -Wno-unused-function -fno-common -fvisibility=hidden  -std=gnu90 -O3 -DNDEBUG   -o CMakeFiles/rabbitmq-static.dir/amqp_mem.c.obj   -c /work/thirdparty/rabbitmq-c/rabbitmq-c/librabbitmq/amqp_mem.c
cd /work/build/win-x86/thirdparty/rabbitmq-c/rabbitmq-c/librabbitmq && /usr/src/mxe/usr/bin/i686-w64-mingw32.static-gcc -DAMQP_BUILD -DAMQP_STATIC -DHAVE_CONFIG_H @CMakeFiles/rabbitmq-static.dir/includes_C.rsp -Wall -Wextra -Wstrict-prototypes -Wno-unused-function -fno-common -fvisibility=hidden  -std=gnu90 -O3 -DNDEBUG   -o CMakeFiles/rabbitmq-static.dir/amqp_socket.c.obj   -c /work/thirdparty/rabbitmq-c/rabbitmq-c/librabbitmq/amqp_socket.c
/work/thirdparty/rabbitmq-c/rabbitmq-c/librabbitmq/amqp_connection.c: In function 'amqp_handle_input':
/work/thirdparty/rabbitmq-c/rabbitmq-c/librabbitmq/amqp_connection.c:267:10: warning: this statement may fall through [-Wimplicit-fallthrough=]
  267 |       if (memcmp(raw_frame, "AMQP", 4) == 0) {
      |          ^
/work/thirdparty/rabbitmq-c/rabbitmq-c/librabbitmq/amqp_connection.c:287:5: note: here
  287 |     case CONNECTION_STATE_HEADER: {
      |     ^~~~
/work/thirdparty/rabbitmq-c/rabbitmq-c/librabbitmq/amqp_connection.c:287:35: warning: this statement may fall through [-Wimplicit-fallthrough=]
  287 |     case CONNECTION_STATE_HEADER: {
      |                                   ^
/work/thirdparty/rabbitmq-c/rabbitmq-c/librabbitmq/amqp_connection.c:334:5: note: here
  334 |     case CONNECTION_STATE_BODY: {
      |     ^~~~
[ 10%] Building C object thirdparty/rabbitmq-c/rabbitmq-c/librabbitmq/CMakeFiles/rabbitmq-static.dir/amqp_url.c.obj
cd /work/build/win-x86/thirdparty/rabbitmq-c/rabbitmq-c/librabbitmq && /usr/src/mxe/usr/bin/i686-w64-mingw32.static-gcc -DAMQP_BUILD -DAMQP_STATIC -DHAVE_CONFIG_H @CMakeFiles/rabbitmq-static.dir/includes_C.rsp -Wall -Wextra -Wstrict-prototypes -Wno-unused-function -fno-common -fvisibility=hidden  -std=gnu90 -O3 -DNDEBUG   -o CMakeFiles/rabbitmq-static.dir/amqp_url.c.obj   -c /work/thirdparty/rabbitmq-c/rabbitmq-c/librabbitmq/amqp_url.c
[ 10%] Building C object thirdparty/rabbitmq-c/rabbitmq-c/librabbitmq/CMakeFiles/rabbitmq-static.dir/amqp_tcp_socket.c.obj
cd /work/build/win-x86/thirdparty/rabbitmq-c/rabbitmq-c/librabbitmq && /usr/src/mxe/usr/bin/i686-w64-mingw32.static-gcc -DAMQP_BUILD -DAMQP_STATIC -DHAVE_CONFIG_H @CMakeFiles/rabbitmq-static.dir/includes_C.rsp -Wall -Wextra -Wstrict-prototypes -Wno-unused-function -fno-common -fvisibility=hidden  -std=gnu90 -O3 -DNDEBUG   -o CMakeFiles/rabbitmq-static.dir/amqp_tcp_socket.c.obj   -c /work/thirdparty/rabbitmq-c/rabbitmq-c/librabbitmq/amqp_tcp_socket.c
[ 15%] Linking C static library librabbitmq.a
cd /work/build/darwin-x64/thirdparty/rabbitmq-c/rabbitmq-c/librabbitmq && /usr/bin/cmake -P CMakeFiles/rabbitmq-static.dir/cmake_clean_target.cmake
cd /work/build/darwin-x64/thirdparty/rabbitmq-c/rabbitmq-c/librabbitmq && /usr/bin/cmake -E cmake_link_script CMakeFiles/rabbitmq-static.dir/link.txt --verbose=1
/opt/osxcross/target/bin/x86_64-apple-darwin19-ar qc librabbitmq.a  CMakeFiles/rabbitmq-static.dir/amqp_framing.c.o CMakeFiles/rabbitmq-static.dir/amqp_api.c.o CMakeFiles/rabbitmq-static.dir/amqp_connection.c.o CMakeFiles/rabbitmq-static.dir/amqp_mem.c.o CMakeFiles/rabbitmq-static.dir/amqp_socket.c.o CMakeFiles/rabbitmq-static.dir/amqp_table.c.o CMakeFiles/rabbitmq-static.dir/amqp_url.c.o CMakeFiles/rabbitmq-static.dir/amqp_tcp_socket.c.o CMakeFiles/rabbitmq-static.dir/amqp_time.c.o CMakeFiles/rabbitmq-static.dir/amqp_consumer.c.o
/opt/osxcross/target/bin/x86_64-apple-darwin19-ranlib librabbitmq.a
make[2]: Leaving directory '/work/build/darwin-x64'
[ 13%] Building C object thirdparty/rabbitmq-c/rabbitmq-c/librabbitmq/CMakeFiles/rabbitmq-static.dir/amqp_time.c.obj
cd /work/build/win-x86/thirdparty/rabbitmq-c/rabbitmq-c/librabbitmq && /usr/src/mxe/usr/bin/i686-w64-mingw32.static-gcc -DAMQP_BUILD -DAMQP_STATIC -DHAVE_CONFIG_H @CMakeFiles/rabbitmq-static.dir/includes_C.rsp -Wall -Wextra -Wstrict-prototypes -Wno-unused-function -fno-common -fvisibility=hidden  -std=gnu90 -O3 -DNDEBUG   -o CMakeFiles/rabbitmq-static.dir/amqp_time.c.obj   -c /work/thirdparty/rabbitmq-c/rabbitmq-c/librabbitmq/amqp_time.c
[ 15%] Built target rabbitmq-static
/work/thirdparty/rabbitmq-c/rabbitmq-c/librabbitmq/amqp_socket.c: In function 'connect_socket':
/work/thirdparty/rabbitmq-c/rabbitmq-c/librabbitmq/amqp_socket.c:341:52: warning: passing argument 3 of 'ioctlsocket' from incompatible pointer type [-Wincompatible-pointer-types]
  341 |   if (SOCKET_ERROR == ioctlsocket(sockfd, FIONBIO, &one)) {
      |                                                    ^~~~
      |                                                    |
      |                                                    int *
In file included from /work/thirdparty/rabbitmq-c/rabbitmq-c/librabbitmq/amqp_private.h:62,
                 from /work/thirdparty/rabbitmq-c/rabbitmq-c/librabbitmq/amqp_socket.c:44:
/usr/src/mxe/usr/i686-w64-mingw32.static/include/winsock2.h:977:76: note: expected 'u_long *' {aka 'long unsigned int *'} but argument is of type 'int *'
  977 |   WINSOCK_API_LINKAGE int WSAAPI ioctlsocket(SOCKET s,__LONG32 cmd,u_long *argp);
      |                                                                    ~~~~~~~~^~~~
[ 13%] Building C object thirdparty/rabbitmq-c/rabbitmq-c/librabbitmq/CMakeFiles/rabbitmq-static.dir/amqp_consumer.c.obj
cd /work/build/win-x86/thirdparty/rabbitmq-c/rabbitmq-c/librabbitmq && /usr/src/mxe/usr/bin/i686-w64-mingw32.static-gcc -DAMQP_BUILD -DAMQP_STATIC -DHAVE_CONFIG_H @CMakeFiles/rabbitmq-static.dir/includes_C.rsp -Wall -Wextra -Wstrict-prototypes -Wno-unused-function -fno-common -fvisibility=hidden  -std=gnu90 -O3 -DNDEBUG   -o CMakeFiles/rabbitmq-static.dir/amqp_consumer.c.obj   -c /work/thirdparty/rabbitmq-c/rabbitmq-c/librabbitmq/amqp_consumer.c
/work/thirdparty/rabbitmq-c/rabbitmq-c/librabbitmq/amqp_tcp_socket.c: In function 'amqp_tcp_socket_send':
/work/thirdparty/rabbitmq-c/rabbitmq-c/librabbitmq/amqp_tcp_socket.c:52:41: warning: unused parameter 'flags' [-Wunused-parameter]
   52 |                                     int flags) {
      |                                     ~~~~^~~~~
make: Entering directory '/work/build/win-x64'
/usr/src/mxe/usr/x86_64-pc-linux-gnu/bin/cmake -S/work -B/work/build/win-x64 --check-build-system CMakeFiles/Makefile.cmake 0
/usr/src/mxe/usr/x86_64-pc-linux-gnu/bin/cmake -E cmake_progress_start /work/build/win-x64/CMakeFiles /work/build/win-x64/CMakeFiles/progress.marks
make -f CMakeFiles/Makefile2 all
make[1]: Entering directory '/work/build/win-x64'
make -f thirdparty/googletest/googletest/CMakeFiles/gtest.dir/build.make thirdparty/googletest/googletest/CMakeFiles/gtest.dir/depend
make -f thirdparty/rabbitmq-c/rabbitmq-c/librabbitmq/CMakeFiles/rabbitmq-static.dir/build.make thirdparty/rabbitmq-c/rabbitmq-c/librabbitmq/CMakeFiles/rabbitmq-static.dir/depend
make -f thirdparty/date/date/CMakeFiles/tz.dir/build.make thirdparty/date/date/CMakeFiles/tz.dir/depend
make[2]: Entering directory '/work/build/win-x64'
cd /work/build/win-x64 && /usr/src/mxe/usr/x86_64-pc-linux-gnu/bin/cmake -E cmake_depends "Unix Makefiles" /work /work/thirdparty/googletest/googletest /work/build/win-x64 /work/build/win-x64/thirdparty/googletest/googletest /work/build/win-x64/thirdparty/googletest/googletest/CMakeFiles/gtest.dir/DependInfo.cmake --color=
make[2]: Entering directory '/work/build/win-x64'
cd /work/build/win-x64 && /usr/src/mxe/usr/x86_64-pc-linux-gnu/bin/cmake -E cmake_depends "Unix Makefiles" /work /work/thirdparty/rabbitmq-c/rabbitmq-c/librabbitmq /work/build/win-x64 /work/build/win-x64/thirdparty/rabbitmq-c/rabbitmq-c/librabbitmq /work/build/win-x64/thirdparty/rabbitmq-c/rabbitmq-c/librabbitmq/CMakeFiles/rabbitmq-static.dir/DependInfo.cmake --color=
make[2]: Entering directory '/work/build/win-x64'
cd /work/build/win-x64 && /usr/src/mxe/usr/x86_64-pc-linux-gnu/bin/cmake -E cmake_depends "Unix Makefiles" /work /work/thirdparty/date/date /work/build/win-x64 /work/build/win-x64/thirdparty/date/date /work/build/win-x64/thirdparty/date/date/CMakeFiles/tz.dir/DependInfo.cmake --color=
Scanning dependencies of target gtest
make[2]: Leaving directory '/work/build/win-x64'
make -f thirdparty/googletest/googletest/CMakeFiles/gtest.dir/build.make thirdparty/googletest/googletest/CMakeFiles/gtest.dir/build
make[2]: Entering directory '/work/build/win-x64'
Scanning dependencies of target tz
make[2]: Leaving directory '/work/build/win-x64'
make -f thirdparty/date/date/CMakeFiles/tz.dir/build.make thirdparty/date/date/CMakeFiles/tz.dir/build
[  0%] Building CXX object thirdparty/googletest/googletest/CMakeFiles/gtest.dir/src/gtest-all.cc.obj
cd /work/build/win-x64/thirdparty/googletest/googletest && /usr/src/mxe/usr/bin/x86_64-w64-mingw32.static-g++   @CMakeFiles/gtest.dir/includes_CXX.rsp -O3 -DNDEBUG   -Wall -Wshadow -Werror -Wno-error=dangling-else -DGTEST_HAS_PTHREAD=0 -fexceptions -Wextra -Wno-unused-parameter -Wno-missing-field-initializers -std=c++11 -o CMakeFiles/gtest.dir/src/gtest-all.cc.obj -c /work/thirdparty/googletest/googletest/src/gtest-all.cc
make[2]: Entering directory '/work/build/win-x64'
Scanning dependencies of target rabbitmq-static
make[2]: Leaving directory '/work/build/win-x64'
make -f thirdparty/rabbitmq-c/rabbitmq-c/librabbitmq/CMakeFiles/rabbitmq-static.dir/build.make thirdparty/rabbitmq-c/rabbitmq-c/librabbitmq/CMakeFiles/rabbitmq-static.dir/build
[  0%] Building CXX object thirdparty/date/date/CMakeFiles/tz.dir/src/tz.cpp.obj
cd /work/build/win-x64/thirdparty/date/date && /usr/src/mxe/usr/bin/x86_64-w64-mingw32.static-g++  -DHAS_REMOTE_API=0 -DUSE_AUTOLOAD=0 @CMakeFiles/tz.dir/includes_CXX.rsp -O3 -DNDEBUG   -std=gnu++17 -o CMakeFiles/tz.dir/src/tz.cpp.obj -c /work/thirdparty/date/date/src/tz.cpp
make[2]: Entering directory '/work/build/win-x64'
[  2%] Building C object thirdparty/rabbitmq-c/rabbitmq-c/librabbitmq/CMakeFiles/rabbitmq-static.dir/amqp_framing.c.obj
cd /work/build/win-x64/thirdparty/rabbitmq-c/rabbitmq-c/librabbitmq && /usr/src/mxe/usr/bin/x86_64-w64-mingw32.static-gcc -DAMQP_BUILD -DAMQP_STATIC -DHAVE_CONFIG_H @CMakeFiles/rabbitmq-static.dir/includes_C.rsp -Wall -Wextra -Wstrict-prototypes -Wno-unused-function -fno-common -fvisibility=hidden  -std=gnu90 -O3 -DNDEBUG   -o CMakeFiles/rabbitmq-static.dir/amqp_framing.c.obj   -c /work/thirdparty/rabbitmq-c/rabbitmq-c/librabbitmq/amqp_framing.c
[  5%] Building C object thirdparty/rabbitmq-c/rabbitmq-c/librabbitmq/CMakeFiles/rabbitmq-static.dir/amqp_table.c.obj
cd /work/build/win-x64/thirdparty/rabbitmq-c/rabbitmq-c/librabbitmq && /usr/src/mxe/usr/bin/x86_64-w64-mingw32.static-gcc -DAMQP_BUILD -DAMQP_STATIC -DHAVE_CONFIG_H @CMakeFiles/rabbitmq-static.dir/includes_C.rsp -Wall -Wextra -Wstrict-prototypes -Wno-unused-function -fno-common -fvisibility=hidden  -std=gnu90 -O3 -DNDEBUG   -o CMakeFiles/rabbitmq-static.dir/amqp_table.c.obj   -c /work/thirdparty/rabbitmq-c/rabbitmq-c/librabbitmq/amqp_table.c
[  8%] Building C object thirdparty/rabbitmq-c/rabbitmq-c/librabbitmq/CMakeFiles/rabbitmq-static.dir/amqp_connection.c.obj
[  8%] Building C object thirdparty/rabbitmq-c/rabbitmq-c/librabbitmq/CMakeFiles/rabbitmq-static.dir/amqp_api.c.obj
cd /work/build/win-x64/thirdparty/rabbitmq-c/rabbitmq-c/librabbitmq && /usr/src/mxe/usr/bin/x86_64-w64-mingw32.static-gcc -DAMQP_BUILD -DAMQP_STATIC -DHAVE_CONFIG_H @CMakeFiles/rabbitmq-static.dir/includes_C.rsp -Wall -Wextra -Wstrict-prototypes -Wno-unused-function -fno-common -fvisibility=hidden  -std=gnu90 -O3 -DNDEBUG   -o CMakeFiles/rabbitmq-static.dir/amqp_api.c.obj   -c /work/thirdparty/rabbitmq-c/rabbitmq-c/librabbitmq/amqp_api.c
[  5%] Building C object thirdparty/rabbitmq-c/rabbitmq-c/librabbitmq/CMakeFiles/rabbitmq-static.dir/amqp_socket.c.obj
[  8%] Building C object thirdparty/rabbitmq-c/rabbitmq-c/librabbitmq/CMakeFiles/rabbitmq-static.dir/amqp_mem.c.obj
cd /work/build/win-x64/thirdparty/rabbitmq-c/rabbitmq-c/librabbitmq && /usr/src/mxe/usr/bin/x86_64-w64-mingw32.static-gcc -DAMQP_BUILD -DAMQP_STATIC -DHAVE_CONFIG_H @CMakeFiles/rabbitmq-static.dir/includes_C.rsp -Wall -Wextra -Wstrict-prototypes -Wno-unused-function -fno-common -fvisibility=hidden  -std=gnu90 -O3 -DNDEBUG   -o CMakeFiles/rabbitmq-static.dir/amqp_connection.c.obj   -c /work/thirdparty/rabbitmq-c/rabbitmq-c/librabbitmq/amqp_connection.c
cd /work/build/win-x64/thirdparty/rabbitmq-c/rabbitmq-c/librabbitmq && /usr/src/mxe/usr/bin/x86_64-w64-mingw32.static-gcc -DAMQP_BUILD -DAMQP_STATIC -DHAVE_CONFIG_H @CMakeFiles/rabbitmq-static.dir/includes_C.rsp -Wall -Wextra -Wstrict-prototypes -Wno-unused-function -fno-common -fvisibility=hidden  -std=gnu90 -O3 -DNDEBUG   -o CMakeFiles/rabbitmq-static.dir/amqp_socket.c.obj   -c /work/thirdparty/rabbitmq-c/rabbitmq-c/librabbitmq/amqp_socket.c
cd /work/build/win-x64/thirdparty/rabbitmq-c/rabbitmq-c/librabbitmq && /usr/src/mxe/usr/bin/x86_64-w64-mingw32.static-gcc -DAMQP_BUILD -DAMQP_STATIC -DHAVE_CONFIG_H @CMakeFiles/rabbitmq-static.dir/includes_C.rsp -Wall -Wextra -Wstrict-prototypes -Wno-unused-function -fno-common -fvisibility=hidden  -std=gnu90 -O3 -DNDEBUG   -o CMakeFiles/rabbitmq-static.dir/amqp_mem.c.obj   -c /work/thirdparty/rabbitmq-c/rabbitmq-c/librabbitmq/amqp_mem.c
[ 16%] Linking C static library liblibrabbitmq.4.a
cd /work/build/win-x86/thirdparty/rabbitmq-c/rabbitmq-c/librabbitmq && /usr/src/mxe/usr/x86_64-pc-linux-gnu/bin/cmake -P CMakeFiles/rabbitmq-static.dir/cmake_clean_target.cmake
cd /work/build/win-x86/thirdparty/rabbitmq-c/rabbitmq-c/librabbitmq && /usr/src/mxe/usr/x86_64-pc-linux-gnu/bin/cmake -E cmake_link_script CMakeFiles/rabbitmq-static.dir/link.txt --verbose=1
/usr/src/mxe/usr/bin/i686-w64-mingw32.static-ar qc liblibrabbitmq.4.a  CMakeFiles/rabbitmq-static.dir/amqp_framing.c.obj CMakeFiles/rabbitmq-static.dir/amqp_api.c.obj CMakeFiles/rabbitmq-static.dir/amqp_connection.c.obj CMakeFiles/rabbitmq-static.dir/amqp_mem.c.obj CMakeFiles/rabbitmq-static.dir/amqp_socket.c.obj CMakeFiles/rabbitmq-static.dir/amqp_table.c.obj CMakeFiles/rabbitmq-static.dir/amqp_url.c.obj CMakeFiles/rabbitmq-static.dir/amqp_tcp_socket.c.obj CMakeFiles/rabbitmq-static.dir/amqp_time.c.obj CMakeFiles/rabbitmq-static.dir/amqp_consumer.c.obj
/usr/src/mxe/usr/bin/i686-w64-mingw32.static-ranlib liblibrabbitmq.4.a
/work/thirdparty/rabbitmq-c/rabbitmq-c/librabbitmq/amqp_connection.c: In function 'amqp_handle_input':
/work/thirdparty/rabbitmq-c/rabbitmq-c/librabbitmq/amqp_connection.c:267:10: warning: this statement may fall through [-Wimplicit-fallthrough=]
  267 |       if (memcmp(raw_frame, "AMQP", 4) == 0) {
      |          ^
/work/thirdparty/rabbitmq-c/rabbitmq-c/librabbitmq/amqp_connection.c:287:5: note: here
  287 |     case CONNECTION_STATE_HEADER: {
      |     ^~~~
/work/thirdparty/rabbitmq-c/rabbitmq-c/librabbitmq/amqp_connection.c:287:35: warning: this statement may fall through [-Wimplicit-fallthrough=]
  287 |     case CONNECTION_STATE_HEADER: {
      |                                   ^
/work/thirdparty/rabbitmq-c/rabbitmq-c/librabbitmq/amqp_connection.c:334:5: note: here
  334 |     case CONNECTION_STATE_BODY: {
      |     ^~~~
make[2]: Leaving directory '/work/build/win-x86'
[ 16%] Built target rabbitmq-static
[ 10%] Building C object thirdparty/rabbitmq-c/rabbitmq-c/librabbitmq/CMakeFiles/rabbitmq-static.dir/amqp_url.c.obj
cd /work/build/win-x64/thirdparty/rabbitmq-c/rabbitmq-c/librabbitmq && /usr/src/mxe/usr/bin/x86_64-w64-mingw32.static-gcc -DAMQP_BUILD -DAMQP_STATIC -DHAVE_CONFIG_H @CMakeFiles/rabbitmq-static.dir/includes_C.rsp -Wall -Wextra -Wstrict-prototypes -Wno-unused-function -fno-common -fvisibility=hidden  -std=gnu90 -O3 -DNDEBUG   -o CMakeFiles/rabbitmq-static.dir/amqp_url.c.obj   -c /work/thirdparty/rabbitmq-c/rabbitmq-c/librabbitmq/amqp_url.c
[ 10%] Building C object thirdparty/rabbitmq-c/rabbitmq-c/librabbitmq/CMakeFiles/rabbitmq-static.dir/amqp_tcp_socket.c.obj
cd /work/build/win-x64/thirdparty/rabbitmq-c/rabbitmq-c/librabbitmq && /usr/src/mxe/usr/bin/x86_64-w64-mingw32.static-gcc -DAMQP_BUILD -DAMQP_STATIC -DHAVE_CONFIG_H @CMakeFiles/rabbitmq-static.dir/includes_C.rsp -Wall -Wextra -Wstrict-prototypes -Wno-unused-function -fno-common -fvisibility=hidden  -std=gnu90 -O3 -DNDEBUG   -o CMakeFiles/rabbitmq-static.dir/amqp_tcp_socket.c.obj   -c /work/thirdparty/rabbitmq-c/rabbitmq-c/librabbitmq/amqp_tcp_socket.c
/work/thirdparty/rabbitmq-c/rabbitmq-c/librabbitmq/amqp_socket.c: In function 'connect_socket':
/work/thirdparty/rabbitmq-c/rabbitmq-c/librabbitmq/amqp_socket.c:341:52: warning: passing argument 3 of 'ioctlsocket' from incompatible pointer type [-Wincompatible-pointer-types]
  341 |   if (SOCKET_ERROR == ioctlsocket(sockfd, FIONBIO, &one)) {
      |                                                    ^~~~
      |                                                    |
      |                                                    int *
In file included from /work/thirdparty/rabbitmq-c/rabbitmq-c/librabbitmq/amqp_private.h:62,
                 from /work/thirdparty/rabbitmq-c/rabbitmq-c/librabbitmq/amqp_socket.c:44:
/usr/src/mxe/usr/x86_64-w64-mingw32.static/include/winsock2.h:977:76: note: expected 'u_long *' {aka 'long unsigned int *'} but argument is of type 'int *'
  977 |   WINSOCK_API_LINKAGE int WSAAPI ioctlsocket(SOCKET s,__LONG32 cmd,u_long *argp);
      |                                                                    ~~~~~~~~^~~~
[ 13%] Building C object thirdparty/rabbitmq-c/rabbitmq-c/librabbitmq/CMakeFiles/rabbitmq-static.dir/amqp_time.c.obj
cd /work/build/win-x64/thirdparty/rabbitmq-c/rabbitmq-c/librabbitmq && /usr/src/mxe/usr/bin/x86_64-w64-mingw32.static-gcc -DAMQP_BUILD -DAMQP_STATIC -DHAVE_CONFIG_H @CMakeFiles/rabbitmq-static.dir/includes_C.rsp -Wall -Wextra -Wstrict-prototypes -Wno-unused-function -fno-common -fvisibility=hidden  -std=gnu90 -O3 -DNDEBUG   -o CMakeFiles/rabbitmq-static.dir/amqp_time.c.obj   -c /work/thirdparty/rabbitmq-c/rabbitmq-c/librabbitmq/amqp_time.c
[ 13%] Building C object thirdparty/rabbitmq-c/rabbitmq-c/librabbitmq/CMakeFiles/rabbitmq-static.dir/amqp_consumer.c.obj
cd /work/build/win-x64/thirdparty/rabbitmq-c/rabbitmq-c/librabbitmq && /usr/src/mxe/usr/bin/x86_64-w64-mingw32.static-gcc -DAMQP_BUILD -DAMQP_STATIC -DHAVE_CONFIG_H @CMakeFiles/rabbitmq-static.dir/includes_C.rsp -Wall -Wextra -Wstrict-prototypes -Wno-unused-function -fno-common -fvisibility=hidden  -std=gnu90 -O3 -DNDEBUG   -o CMakeFiles/rabbitmq-static.dir/amqp_consumer.c.obj   -c /work/thirdparty/rabbitmq-c/rabbitmq-c/librabbitmq/amqp_consumer.c
[ 18%] Linking CXX static library libtz.a
cd /work/build/darwin-x64/thirdparty/date/date && /usr/bin/cmake -P CMakeFiles/tz.dir/cmake_clean_target.cmake
cd /work/build/darwin-x64/thirdparty/date/date && /usr/bin/cmake -E cmake_link_script CMakeFiles/tz.dir/link.txt --verbose=1
/opt/osxcross/target/bin/x86_64-apple-darwin19-ar qc libtz.a  CMakeFiles/tz.dir/src/tz.cpp.o
/opt/osxcross/target/bin/x86_64-apple-darwin19-ranlib libtz.a
make[2]: Leaving directory '/work/build/darwin-x64'
[ 18%] Built target tz
make -f rabbitmq-core/CMakeFiles/rabbitmq-core.dir/build.make rabbitmq-core/CMakeFiles/rabbitmq-core.dir/depend
make[2]: Entering directory '/work/build/darwin-x64'
cd /work/build/darwin-x64 && /usr/bin/cmake -E cmake_depends "Unix Makefiles" /work /work/rabbitmq-core /work/build/darwin-x64 /work/build/darwin-x64/rabbitmq-core /work/build/darwin-x64/rabbitmq-core/CMakeFiles/rabbitmq-core.dir/DependInfo.cmake --color=
Scanning dependencies of target rabbitmq-core
make[2]: Leaving directory '/work/build/darwin-x64'
make -f rabbitmq-core/CMakeFiles/rabbitmq-core.dir/build.make rabbitmq-core/CMakeFiles/rabbitmq-core.dir/build
make[2]: Entering directory '/work/build/darwin-x64'
[ 21%] Building CXX object rabbitmq-core/CMakeFiles/rabbitmq-core.dir/src/FmuContainerCore.cpp.o
cd /work/build/darwin-x64/rabbitmq-core && /opt/osxcross/target/bin/o64-clang++   -I/work/thirdparty/googletest/googletest/include -I/work/rabbitmq-core/src -I/work/thirdparty/date/date -I/work/thirdparty/date/date/include  -O2 -g -DNDEBUG -isysroot /opt/osxcross/target/SDK/MacOSX10.15.sdk -fPIC   -std=gnu++1z -o CMakeFiles/rabbitmq-core.dir/src/FmuContainerCore.cpp.o -c /work/rabbitmq-core/src/FmuContainerCore.cpp
/work/thirdparty/rabbitmq-c/rabbitmq-c/librabbitmq/amqp_tcp_socket.c: In function 'amqp_tcp_socket_send':
/work/thirdparty/rabbitmq-c/rabbitmq-c/librabbitmq/amqp_tcp_socket.c:52:41: warning: unused parameter 'flags' [-Wunused-parameter]
   52 |                                     int flags) {
      |                                     ~~~~^~~~~
[ 16%] Linking C static library liblibrabbitmq.4.a
cd /work/build/win-x64/thirdparty/rabbitmq-c/rabbitmq-c/librabbitmq && /usr/src/mxe/usr/x86_64-pc-linux-gnu/bin/cmake -P CMakeFiles/rabbitmq-static.dir/cmake_clean_target.cmake
cd /work/build/win-x64/thirdparty/rabbitmq-c/rabbitmq-c/librabbitmq && /usr/src/mxe/usr/x86_64-pc-linux-gnu/bin/cmake -E cmake_link_script CMakeFiles/rabbitmq-static.dir/link.txt --verbose=1
/usr/src/mxe/usr/bin/x86_64-w64-mingw32.static-ar qc liblibrabbitmq.4.a  CMakeFiles/rabbitmq-static.dir/amqp_framing.c.obj CMakeFiles/rabbitmq-static.dir/amqp_api.c.obj CMakeFiles/rabbitmq-static.dir/amqp_connection.c.obj CMakeFiles/rabbitmq-static.dir/amqp_mem.c.obj CMakeFiles/rabbitmq-static.dir/amqp_socket.c.obj CMakeFiles/rabbitmq-static.dir/amqp_table.c.obj CMakeFiles/rabbitmq-static.dir/amqp_url.c.obj CMakeFiles/rabbitmq-static.dir/amqp_tcp_socket.c.obj CMakeFiles/rabbitmq-static.dir/amqp_time.c.obj CMakeFiles/rabbitmq-static.dir/amqp_consumer.c.obj
/usr/src/mxe/usr/bin/x86_64-w64-mingw32.static-ranlib liblibrabbitmq.4.a
make[2]: Leaving directory '/work/build/win-x64'
In file included from /work/rabbitmq-core/src/FmuContainerCore.cpp:5:
In file included from /work/rabbitmq-core/src/FmuContainerCore.h:9:
In file included from /opt/osxcross/target/bin/../SDK/MacOSX10.15.sdk/usr/include/c++/v1/list:183:
In file included from /opt/osxcross/target/bin/../SDK/MacOSX10.15.sdk/usr/include/c++/v1/memory:663:
/opt/osxcross/target/bin/../SDK/MacOSX10.15.sdk/usr/include/c++/v1/tuple:1343:7: error: no matching constructor for initialization of 'std::__1::pair<std::__1::chrono::time_point<std::__1::chrono::system_clock, std::__1::chrono::duration<long long, std::__1::ratio<1, 1000> > >, ScalarVariableBaseValue>'
      second(_VSTD::forward<_Args2>(_VSTD::get<_I2>(__second_args))...)
      ^
/opt/osxcross/target/bin/../SDK/MacOSX10.15.sdk/usr/include/c++/v1/utility:511:11: note: in instantiation of function template specialization 'std::__1::pair<const unsigned int, std::__1::pair<std::__1::chrono::time_point<std::__1::chrono::system_clock, std::__1::chrono::duration<long long, std::__1::ratio<1, 1000> > >, ScalarVariableBaseValue> >::pair<const unsigned int &, 0>' requested here
        : pair(__pc, __first_args, __second_args,
          ^
/opt/osxcross/target/bin/../SDK/MacOSX10.15.sdk/usr/include/c++/v1/memory:1826:31: note: in instantiation of function template specialization 'std::__1::pair<const unsigned int, std::__1::pair<std::__1::chrono::time_point<std::__1::chrono::system_clock, std::__1::chrono::duration<long long, std::__1::ratio<1, 1000> > >, ScalarVariableBaseValue> >::pair<const unsigned int &>' requested here
            ::new((void*)__p) _Up(_VSTD::forward<_Args>(__args)...);
                              ^
/opt/osxcross/target/bin/../SDK/MacOSX10.15.sdk/usr/include/c++/v1/memory:1718:18: note: in instantiation of function template specialization 'std::__1::allocator<std::__1::__tree_node<std::__1::__value_type<unsigned int, std::__1::pair<std::__1::chrono::time_point<std::__1::chrono::system_clock, std::__1::chrono::duration<long long, std::__1::ratio<1, 1000> > >, ScalarVariableBaseValue> >, void *> >::construct<std::__1::pair<const unsigned int, std::__1::pair<std::__1::chrono::time_point<std::__1::chrono::system_clock, std::__1::chrono::duration<long long, std::__1::ratio<1, 1000> > >, ScalarVariableBaseValue> >, const std::__1::piecewise_construct_t &, std::__1::tuple<const unsigned int &>, std::__1::tuple<> >' requested here
            {__a.construct(__p, _VSTD::forward<_Args>(__args)...);}
                 ^
/opt/osxcross/target/bin/../SDK/MacOSX10.15.sdk/usr/include/c++/v1/memory:1561:14: note: in instantiation of function template specialization 'std::__1::allocator_traits<std::__1::allocator<std::__1::__tree_node<std::__1::__value_type<unsigned int, std::__1::pair<std::__1::chrono::time_point<std::__1::chrono::system_clock, std::__1::chrono::duration<long long, std::__1::ratio<1, 1000> > >, ScalarVariableBaseValue> >, void *> > >::__construct<std::__1::pair<const unsigned int, std::__1::pair<std::__1::chrono::time_point<std::__1::chrono::system_clock, std::__1::chrono::duration<long long, std::__1::ratio<1, 1000> > >, ScalarVariableBaseValue> >, const std::__1::piecewise_construct_t &, std::__1::tuple<const unsigned int &>, std::__1::tuple<> >' requested here
            {__construct(__has_construct<allocator_type, _Tp*, _Args...>(),
             ^
/opt/osxcross/target/bin/../SDK/MacOSX10.15.sdk/usr/include/c++/v1/__tree:2212:20: note: in instantiation of function template specialization 'std::__1::allocator_traits<std::__1::allocator<std::__1::__tree_node<std::__1::__value_type<unsigned int, std::__1::pair<std::__1::chrono::time_point<std::__1::chrono::system_clock, std::__1::chrono::duration<long long, std::__1::ratio<1, 1000> > >, ScalarVariableBaseValue> >, void *> > >::construct<std::__1::pair<const unsigned int, std::__1::pair<std::__1::chrono::time_point<std::__1::chrono::system_clock, std::__1::chrono::duration<long long, std::__1::ratio<1, 1000> > >, ScalarVariableBaseValue> >, const std::__1::piecewise_construct_t &, std::__1::tuple<const unsigned int &>, std::__1::tuple<> >' requested here
    __node_traits::construct(__na, _NodeTypes::__get_ptr(__h->__value_), _VSTD::forward<_Args>(__args)...);
                   ^
/opt/osxcross/target/bin/../SDK/MacOSX10.15.sdk/usr/include/c++/v1/__tree:2157:29: note: in instantiation of function template specialization 'std::__1::__tree<std::__1::__value_type<unsigned int, std::__1::pair<std::__1::chrono::time_point<std::__1::chrono::system_clock, std::__1::chrono::duration<long long, std::__1::ratio<1, 1000> > >, ScalarVariableBaseValue> >, std::__1::__map_value_compare<unsigned int, std::__1::__value_type<unsigned int, std::__1::pair<std::__1::chrono::time_point<std::__1::chrono::system_clock, std::__1::chrono::duration<long long, std::__1::ratio<1, 1000> > >, ScalarVariableBaseValue> >, std::__1::less<unsigned int>, true>, std::__1::allocator<std::__1::__value_type<unsigned int, std::__1::pair<std::__1::chrono::time_point<std::__1::chrono::system_clock, std::__1::chrono::duration<long long, std::__1::ratio<1, 1000> > >, ScalarVariableBaseValue> > > >::__construct_node<const std::__1::piecewise_construct_t &, std::__1::tuple<const unsigned int &>, std::__1::tuple<> >' requested here
        __node_holder __h = __construct_node(_VSTD::forward<_Args>(__args)...);
                            ^
/opt/osxcross/target/bin/../SDK/MacOSX10.15.sdk/usr/include/c++/v1/map:1484:20: note: in instantiation of function template specialization 'std::__1::__tree<std::__1::__value_type<unsigned int, std::__1::pair<std::__1::chrono::time_point<std::__1::chrono::system_clock, std::__1::chrono::duration<long long, std::__1::ratio<1, 1000> > >, ScalarVariableBaseValue> >, std::__1::__map_value_compare<unsigned int, std::__1::__value_type<unsigned int, std::__1::pair<std::__1::chrono::time_point<std::__1::chrono::system_clock, std::__1::chrono::duration<long long, std::__1::ratio<1, 1000> > >, ScalarVariableBaseValue> >, std::__1::less<unsigned int>, true>, std::__1::allocator<std::__1::__value_type<unsigned int, std::__1::pair<std::__1::chrono::time_point<std::__1::chrono::system_clock, std::__1::chrono::duration<long long, std::__1::ratio<1, 1000> > >, ScalarVariableBaseValue> > > >::__emplace_unique_key_args<unsigned int, const std::__1::piecewise_construct_t &, std::__1::tuple<const unsigned int &>, std::__1::tuple<> >' requested here
    return __tree_.__emplace_unique_key_args(__k,
                   ^
/work/rabbitmq-core/src/FmuContainerCore.cpp:159:38: note: in instantiation of member function 'std::__1::map<unsigned int, std::__1::pair<std::__1::chrono::time_point<std::__1::chrono::system_clock, std::__1::chrono::duration<long long, std::__1::ratio<1, 1000> > >, ScalarVariableBaseValue>, std::__1::less<unsigned int>, std::__1::allocator<std::__1::pair<const unsigned int, std::__1::pair<std::__1::chrono::time_point<std::__1::chrono::system_clock, std::__1::chrono::duration<long long, std::__1::ratio<1, 1000> > >, ScalarVariableBaseValue> > > >::operator[]' requested here
                    this->currentData[id].first < timeValue->first) {
                                     ^
/work/rabbitmq-core/src/FmuContainerCore.cpp:220:5: note: in instantiation of function template specialization 'FmuContainerCore::processLookahead<(lambda at /work/rabbitmq-core/src/FmuContainerCore.cpp:212:22)>' requested here
    processLookahead(predicate);
    ^
/opt/osxcross/target/bin/../SDK/MacOSX10.15.sdk/usr/include/c++/v1/utility:353:41: note: candidate template ignored: disabled by 'enable_if' [with _Dummy = true]
    using _EnableB = typename enable_if<_Val, bool>::type;
                                        ^
/opt/osxcross/target/bin/../SDK/MacOSX10.15.sdk/usr/include/c++/v1/utility:421:14: note: candidate constructor template not viable: requires 2 arguments, but 0 were provided
    explicit pair(_T1 const& __t1, _T2 const& __t2)
             ^
/opt/osxcross/target/bin/../SDK/MacOSX10.15.sdk/usr/include/c++/v1/utility:430:5: note: candidate constructor template not viable: requires 2 arguments, but 0 were provided
    pair(_T1 const& __t1, _T2 const& __t2)
    ^
/opt/osxcross/target/bin/../SDK/MacOSX10.15.sdk/usr/include/c++/v1/utility:439:14: note: candidate constructor template not viable: requires 2 arguments, but 0 were provided
    explicit pair(_U1&& __u1, _U2&& __u2)
             ^
/opt/osxcross/target/bin/../SDK/MacOSX10.15.sdk/usr/include/c++/v1/utility:448:5: note: candidate constructor template not viable: requires 2 arguments, but 0 were provided
    pair(_U1&& __u1, _U2&& __u2)
    ^
/opt/osxcross/target/bin/../SDK/MacOSX10.15.sdk/usr/include/c++/v1/utility:457:14: note: candidate constructor template not viable: requires single argument '__p', but no arguments were provided
    explicit pair(pair<_U1, _U2> const& __p)
             ^
/opt/osxcross/target/bin/../SDK/MacOSX10.15.sdk/usr/include/c++/v1/utility:466:5: note: candidate constructor template not viable: requires single argument '__p', but no arguments were provided
    pair(pair<_U1, _U2> const& __p)
    ^
/opt/osxcross/target/bin/../SDK/MacOSX10.15.sdk/usr/include/c++/v1/utility:475:14: note: candidate constructor template not viable: requires single argument '__p', but no arguments were provided
    explicit pair(pair<_U1, _U2>&&__p)
             ^
/opt/osxcross/target/bin/../SDK/MacOSX10.15.sdk/usr/include/c++/v1/utility:484:5: note: candidate constructor template not viable: requires single argument '__p', but no arguments were provided
    pair(pair<_U1, _U2>&& __p)
    ^
/opt/osxcross/target/bin/../SDK/MacOSX10.15.sdk/usr/include/c++/v1/utility:493:14: note: candidate constructor template not viable: requires single argument '__p', but no arguments were provided
    explicit pair(_Tuple&& __p)
             ^
/opt/osxcross/target/bin/../SDK/MacOSX10.15.sdk/usr/include/c++/v1/utility:501:5: note: candidate constructor template not viable: requires single argument '__p', but no arguments were provided
    pair(_Tuple&& __p)
    ^
/opt/osxcross/target/bin/../SDK/MacOSX10.15.sdk/usr/include/c++/v1/utility:507:5: note: candidate constructor template not viable: requires 3 arguments, but 0 were provided
    pair(piecewise_construct_t __pc,
    ^
/opt/osxcross/target/bin/../SDK/MacOSX10.15.sdk/usr/include/c++/v1/utility:566:9: note: candidate constructor template not viable: requires 5 arguments, but 0 were provided
        pair(piecewise_construct_t,
        ^
/opt/osxcross/target/bin/../SDK/MacOSX10.15.sdk/usr/include/c++/v1/utility:328:5: note: candidate constructor not viable: requires 1 argument, but 0 were provided
    pair(pair const&) = default;
    ^
/opt/osxcross/target/bin/../SDK/MacOSX10.15.sdk/usr/include/c++/v1/utility:329:5: note: candidate constructor not viable: requires 1 argument, but 0 were provided
    pair(pair&&) = default;
    ^
1 error generated.
rabbitmq-core/CMakeFiles/rabbitmq-core.dir/build.make:65: recipe for target 'rabbitmq-core/CMakeFiles/rabbitmq-core.dir/src/FmuContainerCore.cpp.o' failed
make[2]: Leaving directory '/work/build/darwin-x64'
make[2]: *** [rabbitmq-core/CMakeFiles/rabbitmq-core.dir/src/FmuContainerCore.cpp.o] Error 1
CMakeFiles/Makefile2:4951: recipe for target 'rabbitmq-core/CMakeFiles/rabbitmq-core.dir/all' failed
make[1]: *** [rabbitmq-core/CMakeFiles/rabbitmq-core.dir/all] Error 2
make[1]: *** Waiting for unfinished jobs....
[ 16%] Built target rabbitmq-static
[ 24%] Linking CXX static library ../../../lib/libgtest.a
cd /work/build/darwin-x64/thirdparty/googletest/googletest && /usr/bin/cmake -P CMakeFiles/gtest.dir/cmake_clean_target.cmake
cd /work/build/darwin-x64/thirdparty/googletest/googletest && /usr/bin/cmake -E cmake_link_script CMakeFiles/gtest.dir/link.txt --verbose=1
/opt/osxcross/target/bin/x86_64-apple-darwin19-ar qc ../../../lib/libgtest.a  CMakeFiles/gtest.dir/src/gtest-all.cc.o
/opt/osxcross/target/bin/x86_64-apple-darwin19-ranlib ../../../lib/libgtest.a
make[2]: Leaving directory '/work/build/darwin-x64'
[ 24%] Built target gtest
make[1]: Leaving directory '/work/build/darwin-x64'
Makefile:131: recipe for target 'all' failed
make: *** [all] Error 2
make: Leaving directory '/work/build/darwin-x64'
[Pipeline] }
[Pipeline] // stage
[Pipeline] }
Failed in branch Xcompile darwin:
[ 18%] Linking CXX static library libtz.a
cd /work/build/win-x86/thirdparty/date/date && /usr/src/mxe/usr/x86_64-pc-linux-gnu/bin/cmake -P CMakeFiles/tz.dir/cmake_clean_target.cmake
cd /work/build/win-x86/thirdparty/date/date && /usr/src/mxe/usr/x86_64-pc-linux-gnu/bin/cmake -E cmake_link_script CMakeFiles/tz.dir/link.txt --verbose=1
/usr/src/mxe/usr/bin/i686-w64-mingw32.static-ar qc libtz.a  CMakeFiles/tz.dir/src/tz.cpp.obj
/usr/src/mxe/usr/bin/i686-w64-mingw32.static-ranlib libtz.a
make[2]: Leaving directory '/work/build/win-x86'
[ 18%] Built target tz
make -f rabbitmq-core/CMakeFiles/rabbitmq-core.dir/build.make rabbitmq-core/CMakeFiles/rabbitmq-core.dir/depend
make[2]: Entering directory '/work/build/win-x86'
cd /work/build/win-x86 && /usr/src/mxe/usr/x86_64-pc-linux-gnu/bin/cmake -E cmake_depends "Unix Makefiles" /work /work/rabbitmq-core /work/build/win-x86 /work/build/win-x86/rabbitmq-core /work/build/win-x86/rabbitmq-core/CMakeFiles/rabbitmq-core.dir/DependInfo.cmake --color=
Scanning dependencies of target rabbitmq-core
make[2]: Leaving directory '/work/build/win-x86'
make -f rabbitmq-core/CMakeFiles/rabbitmq-core.dir/build.make rabbitmq-core/CMakeFiles/rabbitmq-core.dir/build
make[2]: Entering directory '/work/build/win-x86'
[ 21%] Building CXX object rabbitmq-core/CMakeFiles/rabbitmq-core.dir/src/FmuContainerCore.cpp.obj
cd /work/build/win-x86/rabbitmq-core && /usr/src/mxe/usr/bin/i686-w64-mingw32.static-g++   @CMakeFiles/rabbitmq-core.dir/includes_CXX.rsp -O3 -DNDEBUG   -std=gnu++17 -o CMakeFiles/rabbitmq-core.dir/src/FmuContainerCore.cpp.obj -c /work/rabbitmq-core/src/FmuContainerCore.cpp
In file included from /usr/src/mxe/usr/lib/gcc/i686-w64-mingw32.static/9.2.0/include/c++/functional:54,
                 from /usr/src/mxe/usr/lib/gcc/i686-w64-mingw32.static/9.2.0/include/c++/pstl/glue_algorithm_defs.h:13,
                 from /usr/src/mxe/usr/lib/gcc/i686-w64-mingw32.static/9.2.0/include/c++/algorithm:71,
                 from /work/thirdparty/date/date/include/date/date.h:42,
                 from /work/rabbitmq-core/src/FmuContainerCore.h:11,
                 from /work/rabbitmq-core/src/FmuContainerCore.cpp:5:
/usr/src/mxe/usr/lib/gcc/i686-w64-mingw32.static/9.2.0/include/c++/tuple: In instantiation of 'std::pair<_T1, _T2>::pair(std::tuple<_Args1 ...>&, std::tuple<_Args2 ...>&, std::_Index_tuple<_Indexes1 ...>, std::_Index_tuple<_Indexes2 ...>) [with _Args1 = {const unsigned int&}; unsigned int ..._Indexes1 = {0}; _Args2 = {}; unsigned int ..._Indexes2 = {}; _T1 = const unsigned int; _T2 = std::pair<std::chrono::time_point<std::chrono::_V2::system_clock, std::chrono::duration<long long int, std::ratio<1, 1000> > >, ScalarVariableBaseValue>]':
/usr/src/mxe/usr/lib/gcc/i686-w64-mingw32.static/9.2.0/include/c++/tuple:1663:63:   required from 'std::pair<_T1, _T2>::pair(std::piecewise_construct_t, std::tuple<_Args1 ...>, std::tuple<_Args2 ...>) [with _Args1 = {const unsigned int&}; _Args2 = {}; _T1 = const unsigned int; _T2 = std::pair<std::chrono::time_point<std::chrono::_V2::system_clock, std::chrono::duration<long long int, std::ratio<1, 1000> > >, ScalarVariableBaseValue>]'
/usr/src/mxe/usr/lib/gcc/i686-w64-mingw32.static/9.2.0/include/c++/ext/new_allocator.h:147:4:   required from 'void __gnu_cxx::new_allocator<_Tp>::construct(_Up*, _Args&& ...) [with _Up = std::pair<const unsigned int, std::pair<std::chrono::time_point<std::chrono::_V2::system_clock, std::chrono::duration<long long int, std::ratio<1, 1000> > >, ScalarVariableBaseValue> >; _Args = {const std::piecewise_construct_t&, std::tuple<const unsigned int&>, std::tuple<>}; _Tp = std::_Rb_tree_node<std::pair<const unsigned int, std::pair<std::chrono::time_point<std::chrono::_V2::system_clock, std::chrono::duration<long long int, std::ratio<1, 1000> > >, ScalarVariableBaseValue> > >]'
/usr/src/mxe/usr/lib/gcc/i686-w64-mingw32.static/9.2.0/include/c++/bits/alloc_traits.h:484:4:   required from 'static void std::allocator_traits<std::allocator<_Tp1> >::construct(std::allocator_traits<std::allocator<_Tp1> >::allocator_type&, _Up*, _Args&& ...) [with _Up = std::pair<const unsigned int, std::pair<std::chrono::time_point<std::chrono::_V2::system_clock, std::chrono::duration<long long int, std::ratio<1, 1000> > >, ScalarVariableBaseValue> >; _Args = {const std::piecewise_construct_t&, std::tuple<const unsigned int&>, std::tuple<>}; _Tp = std::_Rb_tree_node<std::pair<const unsigned int, std::pair<std::chrono::time_point<std::chrono::_V2::system_clock, std::chrono::duration<long long int, std::ratio<1, 1000> > >, ScalarVariableBaseValue> > >; std::allocator_traits<std::allocator<_Tp1> >::allocator_type = std::allocator<std::_Rb_tree_node<std::pair<const unsigned int, std::pair<std::chrono::time_point<std::chrono::_V2::system_clock, std::chrono::duration<long long int, std::ratio<1, 1000> > >, ScalarVariableBaseValue> > > >]'
/usr/src/mxe/usr/lib/gcc/i686-w64-mingw32.static/9.2.0/include/c++/bits/stl_tree.h:614:32:   required from 'void std::_Rb_tree<_Key, _Val, _KeyOfValue, _Compare, _Alloc>::_M_construct_node(std::_Rb_tree<_Key, _Val, _KeyOfValue, _Compare, _Alloc>::_Link_type, _Args&& ...) [with _Args = {const std::piecewise_construct_t&, std::tuple<const unsigned int&>, std::tuple<>}; _Key = unsigned int; _Val = std::pair<const unsigned int, std::pair<std::chrono::time_point<std::chrono::_V2::system_clock, std::chrono::duration<long long int, std::ratio<1, 1000> > >, ScalarVariableBaseValue> >; _KeyOfValue = std::_Select1st<std::pair<const unsigned int, std::pair<std::chrono::time_point<std::chrono::_V2::system_clock, std::chrono::duration<long long int, std::ratio<1, 1000> > >, ScalarVariableBaseValue> > >; _Compare = std::less<unsigned int>; _Alloc = std::allocator<std::pair<const unsigned int, std::pair<std::chrono::time_point<std::chrono::_V2::system_clock, std::chrono::duration<long long int, std::ratio<1, 1000> > >, ScalarVariableBaseValue> > >; std::_Rb_tree<_Key, _Val, _KeyOfValue, _Compare, _Alloc>::_Link_type = std::_Rb_tree_node<std::pair<const unsigned int, std::pair<std::chrono::time_point<std::chrono::_V2::system_clock, std::chrono::duration<long long int, std::ratio<1, 1000> > >, ScalarVariableBaseValue> > >*]'
/usr/src/mxe/usr/lib/gcc/i686-w64-mingw32.static/9.2.0/include/c++/bits/stl_tree.h:631:4:   required from 'std::_Rb_tree_node<_Val>* std::_Rb_tree<_Key, _Val, _KeyOfValue, _Compare, _Alloc>::_M_create_node(_Args&& ...) [with _Args = {const std::piecewise_construct_t&, std::tuple<const unsigned int&>, std::tuple<>}; _Key = unsigned int; _Val = std::pair<const unsigned int, std::pair<std::chrono::time_point<std::chrono::_V2::system_clock, std::chrono::duration<long long int, std::ratio<1, 1000> > >, ScalarVariableBaseValue> >; _KeyOfValue = std::_Select1st<std::pair<const unsigned int, std::pair<std::chrono::time_point<std::chrono::_V2::system_clock, std::chrono::duration<long long int, std::ratio<1, 1000> > >, ScalarVariableBaseValue> > >; _Compare = std::less<unsigned int>; _Alloc = std::allocator<std::pair<const unsigned int, std::pair<std::chrono::time_point<std::chrono::_V2::system_clock, std::chrono::duration<long long int, std::ratio<1, 1000> > >, ScalarVariableBaseValue> > >; std::_Rb_tree<_Key, _Val, _KeyOfValue, _Compare, _Alloc>::_Link_type = std::_Rb_tree_node<std::pair<const unsigned int, std::pair<std::chrono::time_point<std::chrono::_V2::system_clock, std::chrono::duration<long long int, std::ratio<1, 1000> > >, ScalarVariableBaseValue> > >*]'
/usr/src/mxe/usr/lib/gcc/i686-w64-mingw32.static/9.2.0/include/c++/bits/stl_tree.h:2455:13:   required from 'std::_Rb_tree<_Key, _Val, _KeyOfValue, _Compare, _Alloc>::iterator std::_Rb_tree<_Key, _Val, _KeyOfValue, _Compare, _Alloc>::_M_emplace_hint_unique(std::_Rb_tree<_Key, _Val, _KeyOfValue, _Compare, _Alloc>::const_iterator, _Args&& ...) [with _Args = {const std::piecewise_construct_t&, std::tuple<const unsigned int&>, std::tuple<>}; _Key = unsigned int; _Val = std::pair<const unsigned int, std::pair<std::chrono::time_point<std::chrono::_V2::system_clock, std::chrono::duration<long long int, std::ratio<1, 1000> > >, ScalarVariableBaseValue> >; _KeyOfValue = std::_Select1st<std::pair<const unsigned int, std::pair<std::chrono::time_point<std::chrono::_V2::system_clock, std::chrono::duration<long long int, std::ratio<1, 1000> > >, ScalarVariableBaseValue> > >; _Compare = std::less<unsigned int>; _Alloc = std::allocator<std::pair<const unsigned int, std::pair<std::chrono::time_point<std::chrono::_V2::system_clock, std::chrono::duration<long long int, std::ratio<1, 1000> > >, ScalarVariableBaseValue> > >; std::_Rb_tree<_Key, _Val, _KeyOfValue, _Compare, _Alloc>::iterator = std::_Rb_tree_iterator<std::pair<const unsigned int, std::pair<std::chrono::time_point<std::chrono::_V2::system_clock, std::chrono::duration<long long int, std::ratio<1, 1000> > >, ScalarVariableBaseValue> > >; std::_Rb_tree<_Key, _Val, _KeyOfValue, _Compare, _Alloc>::const_iterator = std::_Rb_tree_const_iterator<std::pair<const unsigned int, std::pair<std::chrono::time_point<std::chrono::_V2::system_clock, std::chrono::duration<long long int, std::ratio<1, 1000> > >, ScalarVariableBaseValue> > >]'
/usr/src/mxe/usr/lib/gcc/i686-w64-mingw32.static/9.2.0/include/c++/bits/stl_map.h:499:8:   required from 'std::map<_Key, _Tp, _Compare, _Alloc>::mapped_type& std::map<_Key, _Tp, _Compare, _Alloc>::operator[](const key_type&) [with _Key = unsigned int; _Tp = std::pair<std::chrono::time_point<std::chrono::_V2::system_clock, std::chrono::duration<long long int, std::ratio<1, 1000> > >, ScalarVariableBaseValue>; _Compare = std::less<unsigned int>; _Alloc = std::allocator<std::pair<const unsigned int, std::pair<std::chrono::time_point<std::chrono::_V2::system_clock, std::chrono::duration<long long int, std::ratio<1, 1000> > >, ScalarVariableBaseValue> > >; std::map<_Key, _Tp, _Compare, _Alloc>::mapped_type = std::pair<std::chrono::time_point<std::chrono::_V2::system_clock, std::chrono::duration<long long int, std::ratio<1, 1000> > >, ScalarVariableBaseValue>; std::map<_Key, _Tp, _Compare, _Alloc>::key_type = unsigned int]'
/work/rabbitmq-core/src/FmuContainerCore.cpp:159:43:   required from 'void FmuContainerCore::processLookahead(Predicate) [with Predicate = FmuContainerCore::initialize()::<lambda(FmuContainerCore::TimedScalarBasicValue&)>]'
/work/rabbitmq-core/src/FmuContainerCore.cpp:220:31:   required from here
/usr/src/mxe/usr/lib/gcc/i686-w64-mingw32.static/9.2.0/include/c++/tuple:1674:70: error: no matching function for call to 'std::pair<std::chrono::time_point<std::chrono::_V2::system_clock, std::chrono::duration<long long int, std::ratio<1, 1000> > >, ScalarVariableBaseValue>::pair()'
 1674 |         second(std::forward<_Args2>(std::get<_Indexes2>(__tuple2))...)
      |                                                                      ^
In file included from /usr/src/mxe/usr/lib/gcc/i686-w64-mingw32.static/9.2.0/include/c++/bits/stl_algobase.h:64,
                 from /usr/src/mxe/usr/lib/gcc/i686-w64-mingw32.static/9.2.0/include/c++/list:60,
                 from /work/rabbitmq-core/src/FmuContainerCore.h:9,
                 from /work/rabbitmq-core/src/FmuContainerCore.cpp:5:
/usr/src/mxe/usr/lib/gcc/i686-w64-mingw32.static/9.2.0/include/c++/bits/stl_pair.h:436:9: note: candidate: 'template<class ... _Args1, unsigned int ..._Indexes1, class ... _Args2, unsigned int ..._Indexes2> std::pair<_T1, _T2>::pair(std::tuple<_Args1 ...>&, std::tuple<_Args2 ...>&, std::_Index_tuple<_Indexes1 ...>, std::_Index_tuple<_Indexes2 ...>)'
  436 |         pair(tuple<_Args1...>&, tuple<_Args2...>&,
      |         ^~~~
/usr/src/mxe/usr/lib/gcc/i686-w64-mingw32.static/9.2.0/include/c++/bits/stl_pair.h:436:9: note:   template argument deduction/substitution failed:
In file included from /usr/src/mxe/usr/lib/gcc/i686-w64-mingw32.static/9.2.0/include/c++/functional:54,
                 from /usr/src/mxe/usr/lib/gcc/i686-w64-mingw32.static/9.2.0/include/c++/pstl/glue_algorithm_defs.h:13,
                 from /usr/src/mxe/usr/lib/gcc/i686-w64-mingw32.static/9.2.0/include/c++/algorithm:71,
                 from /work/thirdparty/date/date/include/date/date.h:42,
                 from /work/rabbitmq-core/src/FmuContainerCore.h:11,
                 from /work/rabbitmq-core/src/FmuContainerCore.cpp:5:
/usr/src/mxe/usr/lib/gcc/i686-w64-mingw32.static/9.2.0/include/c++/tuple:1674:70: note:   candidate expects 4 arguments, 0 provided
 1674 |         second(std::forward<_Args2>(std::get<_Indexes2>(__tuple2))...)
      |                                                                      ^
In file included from /usr/src/mxe/usr/lib/gcc/i686-w64-mingw32.static/9.2.0/include/c++/bits/stl_algobase.h:64,
                 from /usr/src/mxe/usr/lib/gcc/i686-w64-mingw32.static/9.2.0/include/c++/list:60,
                 from /work/rabbitmq-core/src/FmuContainerCore.h:9,
                 from /work/rabbitmq-core/src/FmuContainerCore.cpp:5:
/usr/src/mxe/usr/lib/gcc/i686-w64-mingw32.static/9.2.0/include/c++/bits/stl_pair.h:375:9: note: candidate: 'template<class ... _Args1, class ... _Args2> std::pair<_T1, _T2>::pair(std::piecewise_construct_t, std::tuple<_Args1 ...>, std::tuple<_Args2 ...>)'
  375 |         pair(piecewise_construct_t, tuple<_Args1...>, tuple<_Args2...>);
      |         ^~~~
/usr/src/mxe/usr/lib/gcc/i686-w64-mingw32.static/9.2.0/include/c++/bits/stl_pair.h:375:9: note:   template argument deduction/substitution failed:
In file included from /usr/src/mxe/usr/lib/gcc/i686-w64-mingw32.static/9.2.0/include/c++/functional:54,
                 from /usr/src/mxe/usr/lib/gcc/i686-w64-mingw32.static/9.2.0/include/c++/pstl/glue_algorithm_defs.h:13,
                 from /usr/src/mxe/usr/lib/gcc/i686-w64-mingw32.static/9.2.0/include/c++/algorithm:71,
                 from /work/thirdparty/date/date/include/date/date.h:42,
                 from /work/rabbitmq-core/src/FmuContainerCore.h:11,
                 from /work/rabbitmq-core/src/FmuContainerCore.cpp:5:
/usr/src/mxe/usr/lib/gcc/i686-w64-mingw32.static/9.2.0/include/c++/tuple:1674:70: note:   candidate expects 3 arguments, 0 provided
 1674 |         second(std::forward<_Args2>(std::get<_Indexes2>(__tuple2))...)
      |                                                                      ^
In file included from /usr/src/mxe/usr/lib/gcc/i686-w64-mingw32.static/9.2.0/include/c++/bits/stl_algobase.h:64,
                 from /usr/src/mxe/usr/lib/gcc/i686-w64-mingw32.static/9.2.0/include/c++/list:60,
                 from /work/rabbitmq-core/src/FmuContainerCore.h:9,
                 from /work/rabbitmq-core/src/FmuContainerCore.cpp:5:
/usr/src/mxe/usr/lib/gcc/i686-w64-mingw32.static/9.2.0/include/c++/bits/stl_pair.h:370:21: note: candidate: 'template<class _U1, class _U2, typename std::enable_if<(std::_PCC<((! std::is_same<std::chrono::time_point<std::chrono::_V2::system_clock, std::chrono::duration<long long int, std::ratio<1, 1000> > >, _U1>::value) || (! std::is_same<ScalarVariableBaseValue, _U2>::value)), std::chrono::time_point<std::chrono::_V2::system_clock, std::chrono::duration<long long int, std::ratio<1, 1000> > >, ScalarVariableBaseValue>::_MoveConstructiblePair<_U1, _U2>() && (! std::_PCC<((! std::is_same<std::chrono::time_point<std::chrono::_V2::system_clock, std::chrono::duration<long long int, std::ratio<1, 1000> > >, _U1>::value) || (! std::is_same<ScalarVariableBaseValue, _U2>::value)), std::chrono::time_point<std::chrono::_V2::system_clock, std::chrono::duration<long long int, std::ratio<1, 1000> > >, ScalarVariableBaseValue>::_ImplicitlyMoveConvertiblePair<_U1, _U2>())), bool>::type <anonymous> > constexpr std::pair<_T1, _T2>::pair(std::pair<_U1, _U2>&&)'
  370 |  explicit constexpr pair(pair<_U1, _U2>&& __p)
      |                     ^~~~
/usr/src/mxe/usr/lib/gcc/i686-w64-mingw32.static/9.2.0/include/c++/bits/stl_pair.h:370:21: note:   template argument deduction/substitution failed:
In file included from /usr/src/mxe/usr/lib/gcc/i686-w64-mingw32.static/9.2.0/include/c++/functional:54,
                 from /usr/src/mxe/usr/lib/gcc/i686-w64-mingw32.static/9.2.0/include/c++/pstl/glue_algorithm_defs.h:13,
                 from /usr/src/mxe/usr/lib/gcc/i686-w64-mingw32.static/9.2.0/include/c++/algorithm:71,
                 from /work/thirdparty/date/date/include/date/date.h:42,
                 from /work/rabbitmq-core/src/FmuContainerCore.h:11,
                 from /work/rabbitmq-core/src/FmuContainerCore.cpp:5:
/usr/src/mxe/usr/lib/gcc/i686-w64-mingw32.static/9.2.0/include/c++/tuple:1674:70: note:   candidate expects 1 argument, 0 provided
 1674 |         second(std::forward<_Args2>(std::get<_Indexes2>(__tuple2))...)
      |                                                                      ^
In file included from /usr/src/mxe/usr/lib/gcc/i686-w64-mingw32.static/9.2.0/include/c++/bits/stl_algobase.h:64,
                 from /usr/src/mxe/usr/lib/gcc/i686-w64-mingw32.static/9.2.0/include/c++/list:60,
                 from /work/rabbitmq-core/src/FmuContainerCore.h:9,
                 from /work/rabbitmq-core/src/FmuContainerCore.cpp:5:
/usr/src/mxe/usr/lib/gcc/i686-w64-mingw32.static/9.2.0/include/c++/bits/stl_pair.h:360:12: note: candidate: 'template<class _U1, class _U2, typename std::enable_if<(std::_PCC<((! std::is_same<std::chrono::time_point<std::chrono::_V2::system_clock, std::chrono::duration<long long int, std::ratio<1, 1000> > >, _U1>::value) || (! std::is_same<ScalarVariableBaseValue, _U2>::value)), std::chrono::time_point<std::chrono::_V2::system_clock, std::chrono::duration<long long int, std::ratio<1, 1000> > >, ScalarVariableBaseValue>::_MoveConstructiblePair<_U1, _U2>() && std::_PCC<((! std::is_same<std::chrono::time_point<std::chrono::_V2::system_clock, std::chrono::duration<long long int, std::ratio<1, 1000> > >, _U1>::value) || (! std::is_same<ScalarVariableBaseValue, _U2>::value)), std::chrono::time_point<std::chrono::_V2::system_clock, std::chrono::duration<long long int, std::ratio<1, 1000> > >, ScalarVariableBaseValue>::_ImplicitlyMoveConvertiblePair<_U1, _U2>()), bool>::type <anonymous> > constexpr std::pair<_T1, _T2>::pair(std::pair<_U1, _U2>&&)'
  360 |  constexpr pair(pair<_U1, _U2>&& __p)
      |            ^~~~
/usr/src/mxe/usr/lib/gcc/i686-w64-mingw32.static/9.2.0/include/c++/bits/stl_pair.h:360:12: note:   template argument deduction/substitution failed:
In file included from /usr/src/mxe/usr/lib/gcc/i686-w64-mingw32.static/9.2.0/include/c++/functional:54,
                 from /usr/src/mxe/usr/lib/gcc/i686-w64-mingw32.static/9.2.0/include/c++/pstl/glue_algorithm_defs.h:13,
                 from /usr/src/mxe/usr/lib/gcc/i686-w64-mingw32.static/9.2.0/include/c++/algorithm:71,
                 from /work/thirdparty/date/date/include/date/date.h:42,
                 from /work/rabbitmq-core/src/FmuContainerCore.h:11,
                 from /work/rabbitmq-core/src/FmuContainerCore.cpp:5:
/usr/src/mxe/usr/lib/gcc/i686-w64-mingw32.static/9.2.0/include/c++/tuple:1674:70: note:   candidate expects 1 argument, 0 provided
 1674 |         second(std::forward<_Args2>(std::get<_Indexes2>(__tuple2))...)
      |                                                                      ^
In file included from /usr/src/mxe/usr/lib/gcc/i686-w64-mingw32.static/9.2.0/include/c++/bits/stl_algobase.h:64,
                 from /usr/src/mxe/usr/lib/gcc/i686-w64-mingw32.static/9.2.0/include/c++/list:60,
                 from /work/rabbitmq-core/src/FmuContainerCore.h:9,
                 from /work/rabbitmq-core/src/FmuContainerCore.cpp:5:
/usr/src/mxe/usr/lib/gcc/i686-w64-mingw32.static/9.2.0/include/c++/bits/stl_pair.h:350:21: note: candidate: 'template<class _U1, class _U2, typename std::enable_if<(_MoveConstructiblePair<_U1, _U2>() && (! _ImplicitlyMoveConvertiblePair<_U1, _U2>())), bool>::type <anonymous> > constexpr std::pair<_T1, _T2>::pair(_U1&&, _U2&&)'
  350 |  explicit constexpr pair(_U1&& __x, _U2&& __y)
      |                     ^~~~
/usr/src/mxe/usr/lib/gcc/i686-w64-mingw32.static/9.2.0/include/c++/bits/stl_pair.h:350:21: note:   template argument deduction/substitution failed:
In file included from /usr/src/mxe/usr/lib/gcc/i686-w64-mingw32.static/9.2.0/include/c++/functional:54,
                 from /usr/src/mxe/usr/lib/gcc/i686-w64-mingw32.static/9.2.0/include/c++/pstl/glue_algorithm_defs.h:13,
                 from /usr/src/mxe/usr/lib/gcc/i686-w64-mingw32.static/9.2.0/include/c++/algorithm:71,
                 from /work/thirdparty/date/date/include/date/date.h:42,
                 from /work/rabbitmq-core/src/FmuContainerCore.h:11,
                 from /work/rabbitmq-core/src/FmuContainerCore.cpp:5:
/usr/src/mxe/usr/lib/gcc/i686-w64-mingw32.static/9.2.0/include/c++/tuple:1674:70: note:   candidate expects 2 arguments, 0 provided
 1674 |         second(std::forward<_Args2>(std::get<_Indexes2>(__tuple2))...)
      |                                                                      ^
In file included from /usr/src/mxe/usr/lib/gcc/i686-w64-mingw32.static/9.2.0/include/c++/bits/stl_algobase.h:64,
                 from /usr/src/mxe/usr/lib/gcc/i686-w64-mingw32.static/9.2.0/include/c++/list:60,
                 from /work/rabbitmq-core/src/FmuContainerCore.h:9,
                 from /work/rabbitmq-core/src/FmuContainerCore.cpp:5:
/usr/src/mxe/usr/lib/gcc/i686-w64-mingw32.static/9.2.0/include/c++/bits/stl_pair.h:341:12: note: candidate: 'template<class _U1, class _U2, typename std::enable_if<(_MoveConstructiblePair<_U1, _U2>() && _ImplicitlyMoveConvertiblePair<_U1, _U2>()), bool>::type <anonymous> > constexpr std::pair<_T1, _T2>::pair(_U1&&, _U2&&)'
  341 |  constexpr pair(_U1&& __x, _U2&& __y)
      |            ^~~~
/usr/src/mxe/usr/lib/gcc/i686-w64-mingw32.static/9.2.0/include/c++/bits/stl_pair.h:341:12: note:   template argument deduction/substitution failed:
In file included from /usr/src/mxe/usr/lib/gcc/i686-w64-mingw32.static/9.2.0/include/c++/functional:54,
                 from /usr/src/mxe/usr/lib/gcc/i686-w64-mingw32.static/9.2.0/include/c++/pstl/glue_algorithm_defs.h:13,
                 from /usr/src/mxe/usr/lib/gcc/i686-w64-mingw32.static/9.2.0/include/c++/algorithm:71,
                 from /work/thirdparty/date/date/include/date/date.h:42,
                 from /work/rabbitmq-core/src/FmuContainerCore.h:11,
                 from /work/rabbitmq-core/src/FmuContainerCore.cpp:5:
/usr/src/mxe/usr/lib/gcc/i686-w64-mingw32.static/9.2.0/include/c++/tuple:1674:70: note:   candidate expects 2 arguments, 0 provided
 1674 |         second(std::forward<_Args2>(std::get<_Indexes2>(__tuple2))...)
      |                                                                      ^
In file included from /usr/src/mxe/usr/lib/gcc/i686-w64-mingw32.static/9.2.0/include/c++/bits/stl_algobase.h:64,
                 from /usr/src/mxe/usr/lib/gcc/i686-w64-mingw32.static/9.2.0/include/c++/list:60,
                 from /work/rabbitmq-core/src/FmuContainerCore.h:9,
                 from /work/rabbitmq-core/src/FmuContainerCore.cpp:5:
/usr/src/mxe/usr/lib/gcc/i686-w64-mingw32.static/9.2.0/include/c++/bits/stl_pair.h:332:17: note: candidate: 'template<class _U2, typename std::enable_if<_CopyMovePair<false, std::chrono::time_point<std::chrono::_V2::system_clock, std::chrono::duration<long long int, std::ratio<1, 1000> > >, _U2>(), bool>::type <anonymous> > std::pair<_T1, _T2>::pair(const _T1&, _U2&&)'
  332 |        explicit pair(const _T1& __x, _U2&& __y)
      |                 ^~~~
/usr/src/mxe/usr/lib/gcc/i686-w64-mingw32.static/9.2.0/include/c++/bits/stl_pair.h:332:17: note:   template argument deduction/substitution failed:
In file included from /usr/src/mxe/usr/lib/gcc/i686-w64-mingw32.static/9.2.0/include/c++/functional:54,
                 from /usr/src/mxe/usr/lib/gcc/i686-w64-mingw32.static/9.2.0/include/c++/pstl/glue_algorithm_defs.h:13,
                 from /usr/src/mxe/usr/lib/gcc/i686-w64-mingw32.static/9.2.0/include/c++/algorithm:71,
                 from /work/thirdparty/date/date/include/date/date.h:42,
                 from /work/rabbitmq-core/src/FmuContainerCore.h:11,
                 from /work/rabbitmq-core/src/FmuContainerCore.cpp:5:
/usr/src/mxe/usr/lib/gcc/i686-w64-mingw32.static/9.2.0/include/c++/tuple:1674:70: note:   candidate expects 2 arguments, 0 provided
 1674 |         second(std::forward<_Args2>(std::get<_Indexes2>(__tuple2))...)
      |                                                                      ^
In file included from /usr/src/mxe/usr/lib/gcc/i686-w64-mingw32.static/9.2.0/include/c++/bits/stl_algobase.h:64,
                 from /usr/src/mxe/usr/lib/gcc/i686-w64-mingw32.static/9.2.0/include/c++/list:60,
                 from /work/rabbitmq-core/src/FmuContainerCore.h:9,
                 from /work/rabbitmq-core/src/FmuContainerCore.cpp:5:
/usr/src/mxe/usr/lib/gcc/i686-w64-mingw32.static/9.2.0/include/c++/bits/stl_pair.h:325:18: note: candidate: 'template<class _U2, typename std::enable_if<_CopyMovePair<true, std::chrono::time_point<std::chrono::_V2::system_clock, std::chrono::duration<long long int, std::ratio<1, 1000> > >, _U2>(), bool>::type <anonymous> > constexpr std::pair<_T1, _T2>::pair(const _T1&, _U2&&)'
  325 |        constexpr pair(const _T1& __x, _U2&& __y)
      |                  ^~~~
/usr/src/mxe/usr/lib/gcc/i686-w64-mingw32.static/9.2.0/include/c++/bits/stl_pair.h:325:18: note:   template argument deduction/substitution failed:
In file included from /usr/src/mxe/usr/lib/gcc/i686-w64-mingw32.static/9.2.0/include/c++/functional:54,
                 from /usr/src/mxe/usr/lib/gcc/i686-w64-mingw32.static/9.2.0/include/c++/pstl/glue_algorithm_defs.h:13,
                 from /usr/src/mxe/usr/lib/gcc/i686-w64-mingw32.static/9.2.0/include/c++/algorithm:71,
                 from /work/thirdparty/date/date/include/date/date.h:42,
                 from /work/rabbitmq-core/src/FmuContainerCore.h:11,
                 from /work/rabbitmq-core/src/FmuContainerCore.cpp:5:
/usr/src/mxe/usr/lib/gcc/i686-w64-mingw32.static/9.2.0/include/c++/tuple:1674:70: note:   candidate expects 2 arguments, 0 provided
 1674 |         second(std::forward<_Args2>(std::get<_Indexes2>(__tuple2))...)
      |                                                                      ^
In file included from /usr/src/mxe/usr/lib/gcc/i686-w64-mingw32.static/9.2.0/include/c++/bits/stl_algobase.h:64,
                 from /usr/src/mxe/usr/lib/gcc/i686-w64-mingw32.static/9.2.0/include/c++/list:60,
                 from /work/rabbitmq-core/src/FmuContainerCore.h:9,
                 from /work/rabbitmq-core/src/FmuContainerCore.cpp:5:
/usr/src/mxe/usr/lib/gcc/i686-w64-mingw32.static/9.2.0/include/c++/bits/stl_pair.h:318:27: note: candidate: 'template<class _U1, typename std::enable_if<_MoveCopyPair<false, _U1, ScalarVariableBaseValue>(), bool>::type <anonymous> > constexpr std::pair<_T1, _T2>::pair(_U1&&, const _T2&)'
  318 |        explicit constexpr pair(_U1&& __x, const _T2& __y)
      |                           ^~~~
/usr/src/mxe/usr/lib/gcc/i686-w64-mingw32.static/9.2.0/include/c++/bits/stl_pair.h:318:27: note:   template argument deduction/substitution failed:
In file included from /usr/src/mxe/usr/lib/gcc/i686-w64-mingw32.static/9.2.0/include/c++/functional:54,
                 from /usr/src/mxe/usr/lib/gcc/i686-w64-mingw32.static/9.2.0/include/c++/pstl/glue_algorithm_defs.h:13,
                 from /usr/src/mxe/usr/lib/gcc/i686-w64-mingw32.static/9.2.0/include/c++/algorithm:71,
                 from /work/thirdparty/date/date/include/date/date.h:42,
                 from /work/rabbitmq-core/src/FmuContainerCore.h:11,
                 from /work/rabbitmq-core/src/FmuContainerCore.cpp:5:
/usr/src/mxe/usr/lib/gcc/i686-w64-mingw32.static/9.2.0/include/c++/tuple:1674:70: note:   candidate expects 2 arguments, 0 provided
 1674 |         second(std::forward<_Args2>(std::get<_Indexes2>(__tuple2))...)
      |                                                                      ^
In file included from /usr/src/mxe/usr/lib/gcc/i686-w64-mingw32.static/9.2.0/include/c++/bits/stl_algobase.h:64,
                 from /usr/src/mxe/usr/lib/gcc/i686-w64-mingw32.static/9.2.0/include/c++/list:60,
                 from /work/rabbitmq-core/src/FmuContainerCore.h:9,
                 from /work/rabbitmq-core/src/FmuContainerCore.cpp:5:
/usr/src/mxe/usr/lib/gcc/i686-w64-mingw32.static/9.2.0/include/c++/bits/stl_pair.h:311:18: note: candidate: 'template<class _U1, typename std::enable_if<_MoveCopyPair<true, _U1, ScalarVariableBaseValue>(), bool>::type <anonymous> > constexpr std::pair<_T1, _T2>::pair(_U1&&, const _T2&)'
  311 |        constexpr pair(_U1&& __x, const _T2& __y)
      |                  ^~~~
/usr/src/mxe/usr/lib/gcc/i686-w64-mingw32.static/9.2.0/include/c++/bits/stl_pair.h:311:18: note:   template argument deduction/substitution failed:
In file included from /usr/src/mxe/usr/lib/gcc/i686-w64-mingw32.static/9.2.0/include/c++/functional:54,
                 from /usr/src/mxe/usr/lib/gcc/i686-w64-mingw32.static/9.2.0/include/c++/pstl/glue_algorithm_defs.h:13,
                 from /usr/src/mxe/usr/lib/gcc/i686-w64-mingw32.static/9.2.0/include/c++/algorithm:71,
                 from /work/thirdparty/date/date/include/date/date.h:42,
                 from /work/rabbitmq-core/src/FmuContainerCore.h:11,
                 from /work/rabbitmq-core/src/FmuContainerCore.cpp:5:
/usr/src/mxe/usr/lib/gcc/i686-w64-mingw32.static/9.2.0/include/c++/tuple:1674:70: note:   candidate expects 2 arguments, 0 provided
 1674 |         second(std::forward<_Args2>(std::get<_Indexes2>(__tuple2))...)
      |                                                                      ^
In file included from /usr/src/mxe/usr/lib/gcc/i686-w64-mingw32.static/9.2.0/include/c++/bits/stl_algobase.h:64,
                 from /usr/src/mxe/usr/lib/gcc/i686-w64-mingw32.static/9.2.0/include/c++/list:60,
                 from /work/rabbitmq-core/src/FmuContainerCore.h:9,
                 from /work/rabbitmq-core/src/FmuContainerCore.cpp:5:
/usr/src/mxe/usr/lib/gcc/i686-w64-mingw32.static/9.2.0/include/c++/bits/stl_pair.h:304:17: note: candidate: 'std::pair<_T1, _T2>::pair(std::pair<_T1, _T2>&&) [with _T1 = std::chrono::time_point<std::chrono::_V2::system_clock, std::chrono::duration<long long int, std::ratio<1, 1000> > >; _T2 = ScalarVariableBaseValue]'
  304 |       constexpr pair(pair&&) = default;
      |                 ^~~~
/usr/src/mxe/usr/lib/gcc/i686-w64-mingw32.static/9.2.0/include/c++/bits/stl_pair.h:304:17: note:   candidate expects 1 argument, 0 provided
/usr/src/mxe/usr/lib/gcc/i686-w64-mingw32.static/9.2.0/include/c++/bits/stl_pair.h:303:17: note: candidate: 'std::pair<_T1, _T2>::pair(const std::pair<_T1, _T2>&) [with _T1 = std::chrono::time_point<std::chrono::_V2::system_clock, std::chrono::duration<long long int, std::ratio<1, 1000> > >; _T2 = ScalarVariableBaseValue]'
  303 |       constexpr pair(const pair&) = default;
      |                 ^~~~
/usr/src/mxe/usr/lib/gcc/i686-w64-mingw32.static/9.2.0/include/c++/bits/stl_pair.h:303:17: note:   candidate expects 1 argument, 0 provided
/usr/src/mxe/usr/lib/gcc/i686-w64-mingw32.static/9.2.0/include/c++/bits/stl_pair.h:300:21: note: candidate: 'template<class _U1, class _U2, typename std::enable_if<(std::_PCC<((! std::is_same<std::chrono::time_point<std::chrono::_V2::system_clock, std::chrono::duration<long long int, std::ratio<1, 1000> > >, _U1>::value) || (! std::is_same<ScalarVariableBaseValue, _U2>::value)), std::chrono::time_point<std::chrono::_V2::system_clock, std::chrono::duration<long long int, std::ratio<1, 1000> > >, ScalarVariableBaseValue>::_ConstructiblePair<_U1, _U2>() && (! std::_PCC<((! std::is_same<std::chrono::time_point<std::chrono::_V2::system_clock, std::chrono::duration<long long int, std::ratio<1, 1000> > >, _U1>::value) || (! std::is_same<ScalarVariableBaseValue, _U2>::value)), std::chrono::time_point<std::chrono::_V2::system_clock, std::chrono::duration<long long int, std::ratio<1, 1000> > >, ScalarVariableBaseValue>::_ImplicitlyConvertiblePair<_U1, _U2>())), bool>::type <anonymous> > constexpr std::pair<_T1, _T2>::pair(const std::pair<_U1, _U2>&)'
  300 |  explicit constexpr pair(const pair<_U1, _U2>& __p)
      |                     ^~~~
/usr/src/mxe/usr/lib/gcc/i686-w64-mingw32.static/9.2.0/include/c++/bits/stl_pair.h:300:21: note:   template argument deduction/substitution failed:
In file included from /usr/src/mxe/usr/lib/gcc/i686-w64-mingw32.static/9.2.0/include/c++/functional:54,
                 from /usr/src/mxe/usr/lib/gcc/i686-w64-mingw32.static/9.2.0/include/c++/pstl/glue_algorithm_defs.h:13,
                 from /usr/src/mxe/usr/lib/gcc/i686-w64-mingw32.static/9.2.0/include/c++/algorithm:71,
                 from /work/thirdparty/date/date/include/date/date.h:42,
                 from /work/rabbitmq-core/src/FmuContainerCore.h:11,
                 from /work/rabbitmq-core/src/FmuContainerCore.cpp:5:
/usr/src/mxe/usr/lib/gcc/i686-w64-mingw32.static/9.2.0/include/c++/tuple:1674:70: note:   candidate expects 1 argument, 0 provided
 1674 |         second(std::forward<_Args2>(std::get<_Indexes2>(__tuple2))...)
      |                                                                      ^
In file included from /usr/src/mxe/usr/lib/gcc/i686-w64-mingw32.static/9.2.0/include/c++/bits/stl_algobase.h:64,
                 from /usr/src/mxe/usr/lib/gcc/i686-w64-mingw32.static/9.2.0/include/c++/list:60,
                 from /work/rabbitmq-core/src/FmuContainerCore.h:9,
                 from /work/rabbitmq-core/src/FmuContainerCore.cpp:5:
/usr/src/mxe/usr/lib/gcc/i686-w64-mingw32.static/9.2.0/include/c++/bits/stl_pair.h:291:19: note: candidate: 'template<class _U1, class _U2, typename std::enable_if<(std::_PCC<((! std::is_same<std::chrono::time_point<std::chrono::_V2::system_clock, std::chrono::duration<long long int, std::ratio<1, 1000> > >, _U1>::value) || (! std::is_same<ScalarVariableBaseValue, _U2>::value)), std::chrono::time_point<std::chrono::_V2::system_clock, std::chrono::duration<long long int, std::ratio<1, 1000> > >, ScalarVariableBaseValue>::_ConstructiblePair<_U1, _U2>() && std::_PCC<((! std::is_same<std::chrono::time_point<std::chrono::_V2::system_clock, std::chrono::duration<long long int, std::ratio<1, 1000> > >, _U1>::value) || (! std::is_same<ScalarVariableBaseValue, _U2>::value)), std::chrono::time_point<std::chrono::_V2::system_clock, std::chrono::duration<long long int, std::ratio<1, 1000> > >, ScalarVariableBaseValue>::_ImplicitlyConvertiblePair<_U1, _U2>()), bool>::type <anonymous> > constexpr std::pair<_T1, _T2>::pair(const std::pair<_U1, _U2>&)'
  291 |         constexpr pair(const pair<_U1, _U2>& __p)
      |                   ^~~~
/usr/src/mxe/usr/lib/gcc/i686-w64-mingw32.static/9.2.0/include/c++/bits/stl_pair.h:291:19: note:   template argument deduction/substitution failed:
In file included from /usr/src/mxe/usr/lib/gcc/i686-w64-mingw32.static/9.2.0/include/c++/functional:54,
                 from /usr/src/mxe/usr/lib/gcc/i686-w64-mingw32.static/9.2.0/include/c++/pstl/glue_algorithm_defs.h:13,
                 from /usr/src/mxe/usr/lib/gcc/i686-w64-mingw32.static/9.2.0/include/c++/algorithm:71,
                 from /work/thirdparty/date/date/include/date/date.h:42,
                 from /work/rabbitmq-core/src/FmuContainerCore.h:11,
                 from /work/rabbitmq-core/src/FmuContainerCore.cpp:5:
/usr/src/mxe/usr/lib/gcc/i686-w64-mingw32.static/9.2.0/include/c++/tuple:1674:70: note:   candidate expects 1 argument, 0 provided
 1674 |         second(std::forward<_Args2>(std::get<_Indexes2>(__tuple2))...)
      |                                                                      ^
In file included from /usr/src/mxe/usr/lib/gcc/i686-w64-mingw32.static/9.2.0/include/c++/bits/stl_algobase.h:64,
                 from /usr/src/mxe/usr/lib/gcc/i686-w64-mingw32.static/9.2.0/include/c++/list:60,
                 from /work/rabbitmq-core/src/FmuContainerCore.h:9,
                 from /work/rabbitmq-core/src/FmuContainerCore.cpp:5:
/usr/src/mxe/usr/lib/gcc/i686-w64-mingw32.static/9.2.0/include/c++/bits/stl_pair.h:269:26: note: candidate: 'template<class _U1, class _U2, typename std::enable_if<(_ConstructiblePair<_U1, _U2>() && (! _ImplicitlyConvertiblePair<_U1, _U2>())), bool>::type <anonymous> > constexpr std::pair<_T1, _T2>::pair(const _T1&, const _T2&)'
  269 |       explicit constexpr pair(const _T1& __a, const _T2& __b)
      |                          ^~~~
/usr/src/mxe/usr/lib/gcc/i686-w64-mingw32.static/9.2.0/include/c++/bits/stl_pair.h:269:26: note:   template argument deduction/substitution failed:
In file included from /usr/src/mxe/usr/lib/gcc/i686-w64-mingw32.static/9.2.0/include/c++/functional:54,
                 from /usr/src/mxe/usr/lib/gcc/i686-w64-mingw32.static/9.2.0/include/c++/pstl/glue_algorithm_defs.h:13,
                 from /usr/src/mxe/usr/lib/gcc/i686-w64-mingw32.static/9.2.0/include/c++/algorithm:71,
                 from /work/thirdparty/date/date/include/date/date.h:42,
                 from /work/rabbitmq-core/src/FmuContainerCore.h:11,
                 from /work/rabbitmq-core/src/FmuContainerCore.cpp:5:
/usr/src/mxe/usr/lib/gcc/i686-w64-mingw32.static/9.2.0/include/c++/tuple:1674:70: note:   candidate expects 2 arguments, 0 provided
 1674 |         second(std::forward<_Args2>(std::get<_Indexes2>(__tuple2))...)
      |                                                                      ^
In file included from /usr/src/mxe/usr/lib/gcc/i686-w64-mingw32.static/9.2.0/include/c++/bits/stl_algobase.h:64,
                 from /usr/src/mxe/usr/lib/gcc/i686-w64-mingw32.static/9.2.0/include/c++/list:60,
                 from /work/rabbitmq-core/src/FmuContainerCore.h:9,
                 from /work/rabbitmq-core/src/FmuContainerCore.cpp:5:
/usr/src/mxe/usr/lib/gcc/i686-w64-mingw32.static/9.2.0/include/c++/bits/stl_pair.h:260:17: note: candidate: 'template<class _U1, class _U2, typename std::enable_if<(_ConstructiblePair<_U1, _U2>() && _ImplicitlyConvertiblePair<_U1, _U2>()), bool>::type <anonymous> > constexpr std::pair<_T1, _T2>::pair(const _T1&, const _T2&)'
  260 |       constexpr pair(const _T1& __a, const _T2& __b)
      |                 ^~~~
/usr/src/mxe/usr/lib/gcc/i686-w64-mingw32.static/9.2.0/include/c++/bits/stl_pair.h:260:17: note:   template argument deduction/substitution failed:
In file included from /usr/src/mxe/usr/lib/gcc/i686-w64-mingw32.static/9.2.0/include/c++/functional:54,
                 from /usr/src/mxe/usr/lib/gcc/i686-w64-mingw32.static/9.2.0/include/c++/pstl/glue_algorithm_defs.h:13,
                 from /usr/src/mxe/usr/lib/gcc/i686-w64-mingw32.static/9.2.0/include/c++/algorithm:71,
                 from /work/thirdparty/date/date/include/date/date.h:42,
                 from /work/rabbitmq-core/src/FmuContainerCore.h:11,
                 from /work/rabbitmq-core/src/FmuContainerCore.cpp:5:
/usr/src/mxe/usr/lib/gcc/i686-w64-mingw32.static/9.2.0/include/c++/tuple:1674:70: note:   candidate expects 2 arguments, 0 provided
 1674 |         second(std::forward<_Args2>(std::get<_Indexes2>(__tuple2))...)
      |                                                                      ^
In file included from /usr/src/mxe/usr/lib/gcc/i686-w64-mingw32.static/9.2.0/include/c++/bits/stl_algobase.h:64,
                 from /usr/src/mxe/usr/lib/gcc/i686-w64-mingw32.static/9.2.0/include/c++/list:60,
                 from /work/rabbitmq-core/src/FmuContainerCore.h:9,
                 from /work/rabbitmq-core/src/FmuContainerCore.cpp:5:
/usr/src/mxe/usr/lib/gcc/i686-w64-mingw32.static/9.2.0/include/c++/bits/stl_pair.h:242:26: note: candidate: 'template<class _U1, class _U2, typename std::enable_if<std::__and_<std::is_default_constructible<_Tp>, std::is_default_constructible<_U2>, std::__not_<std::__and_<std::__is_implicitly_default_constructible<_U1>, std::__is_implicitly_default_constructible<_U2> > > >::value, bool>::type <anonymous> > constexpr std::pair<_T1, _T2>::pair()'
  242 |       explicit constexpr pair()
      |                          ^~~~
/usr/src/mxe/usr/lib/gcc/i686-w64-mingw32.static/9.2.0/include/c++/bits/stl_pair.h:242:26: note:   template argument deduction/substitution failed:
/usr/src/mxe/usr/lib/gcc/i686-w64-mingw32.static/9.2.0/include/c++/bits/stl_pair.h:241:59: error: no type named 'type' in 'struct std::enable_if<false, bool>'
  241 |                                    ::value, bool>::type = false>
      |                                                           ^~~~~
/usr/src/mxe/usr/lib/gcc/i686-w64-mingw32.static/9.2.0/include/c++/bits/stl_pair.h:229:26: note: candidate: 'template<class _U1, class _U2, typename std::enable_if<std::__and_<std::__is_implicitly_default_constructible<_U1>, std::__is_implicitly_default_constructible<_U2> >::value, bool>::type <anonymous> > constexpr std::pair<_T1, _T2>::pair()'
  229 |       _GLIBCXX_CONSTEXPR pair()
      |                          ^~~~
/usr/src/mxe/usr/lib/gcc/i686-w64-mingw32.static/9.2.0/include/c++/bits/stl_pair.h:229:26: note:   template argument deduction/substitution failed:
/usr/src/mxe/usr/lib/gcc/i686-w64-mingw32.static/9.2.0/include/c++/bits/stl_pair.h:227:59: error: no type named 'type' in 'struct std::enable_if<false, bool>'
  227 |                                    ::value, bool>::type = true>
      |                                                           ^~~~
make[2]: *** [rabbitmq-core/CMakeFiles/rabbitmq-core.dir/src/FmuContainerCore.cpp.obj] Error 1
rabbitmq-core/CMakeFiles/rabbitmq-core.dir/build.make:66: recipe for target 'rabbitmq-core/CMakeFiles/rabbitmq-core.dir/src/FmuContainerCore.cpp.obj' failed
make[2]: Leaving directory '/work/build/win-x86'
CMakeFiles/Makefile2:3172: recipe for target 'rabbitmq-core/CMakeFiles/rabbitmq-core.dir/all' failed
make[1]: *** [rabbitmq-core/CMakeFiles/rabbitmq-core.dir/all] Error 2
make[1]: *** Waiting for unfinished jobs....
[ 24%] Linking CXX static library ../../../lib/libgtest.a
cd /work/build/win-x86/thirdparty/googletest/googletest && /usr/src/mxe/usr/x86_64-pc-linux-gnu/bin/cmake -P CMakeFiles/gtest.dir/cmake_clean_target.cmake
cd /work/build/win-x86/thirdparty/googletest/googletest && /usr/src/mxe/usr/x86_64-pc-linux-gnu/bin/cmake -E cmake_link_script CMakeFiles/gtest.dir/link.txt --verbose=1
/usr/src/mxe/usr/bin/i686-w64-mingw32.static-ar qc ../../../lib/libgtest.a  CMakeFiles/gtest.dir/src/gtest-all.cc.obj
/usr/src/mxe/usr/bin/i686-w64-mingw32.static-ranlib ../../../lib/libgtest.a
make[2]: Leaving directory '/work/build/win-x86'
[ 24%] Built target gtest
make[1]: Leaving directory '/work/build/win-x86'
make: *** [all] Error 2
Makefile:143: recipe for target 'all' failed
make: Leaving directory '/work/build/win-x86'
[ 18%] Linking CXX static library libtz.a
cd /work/build/win-x64/thirdparty/date/date && /usr/src/mxe/usr/x86_64-pc-linux-gnu/bin/cmake -P CMakeFiles/tz.dir/cmake_clean_target.cmake
cd /work/build/win-x64/thirdparty/date/date && /usr/src/mxe/usr/x86_64-pc-linux-gnu/bin/cmake -E cmake_link_script CMakeFiles/tz.dir/link.txt --verbose=1
/usr/src/mxe/usr/bin/x86_64-w64-mingw32.static-ar qc libtz.a  CMakeFiles/tz.dir/src/tz.cpp.obj
/usr/src/mxe/usr/bin/x86_64-w64-mingw32.static-ranlib libtz.a
make[2]: Leaving directory '/work/build/win-x64'
[ 18%] Built target tz
make -f rabbitmq-core/CMakeFiles/rabbitmq-core.dir/build.make rabbitmq-core/CMakeFiles/rabbitmq-core.dir/depend
make[2]: Entering directory '/work/build/win-x64'
cd /work/build/win-x64 && /usr/src/mxe/usr/x86_64-pc-linux-gnu/bin/cmake -E cmake_depends "Unix Makefiles" /work /work/rabbitmq-core /work/build/win-x64 /work/build/win-x64/rabbitmq-core /work/build/win-x64/rabbitmq-core/CMakeFiles/rabbitmq-core.dir/DependInfo.cmake --color=
Scanning dependencies of target rabbitmq-core
make[2]: Leaving directory '/work/build/win-x64'
make -f rabbitmq-core/CMakeFiles/rabbitmq-core.dir/build.make rabbitmq-core/CMakeFiles/rabbitmq-core.dir/build
make[2]: Entering directory '/work/build/win-x64'
[ 21%] Building CXX object rabbitmq-core/CMakeFiles/rabbitmq-core.dir/src/FmuContainerCore.cpp.obj
cd /work/build/win-x64/rabbitmq-core && /usr/src/mxe/usr/bin/x86_64-w64-mingw32.static-g++   @CMakeFiles/rabbitmq-core.dir/includes_CXX.rsp -O3 -DNDEBUG   -std=gnu++17 -o CMakeFiles/rabbitmq-core.dir/src/FmuContainerCore.cpp.obj -c /work/rabbitmq-core/src/FmuContainerCore.cpp
In file included from /usr/src/mxe/usr/lib/gcc/x86_64-w64-mingw32.static/9.2.0/include/c++/functional:54,
                 from /usr/src/mxe/usr/lib/gcc/x86_64-w64-mingw32.static/9.2.0/include/c++/pstl/glue_algorithm_defs.h:13,
                 from /usr/src/mxe/usr/lib/gcc/x86_64-w64-mingw32.static/9.2.0/include/c++/algorithm:71,
                 from /work/thirdparty/date/date/include/date/date.h:42,
                 from /work/rabbitmq-core/src/FmuContainerCore.h:11,
                 from /work/rabbitmq-core/src/FmuContainerCore.cpp:5:
/usr/src/mxe/usr/lib/gcc/x86_64-w64-mingw32.static/9.2.0/include/c++/tuple: In instantiation of 'std::pair<_T1, _T2>::pair(std::tuple<_Args1 ...>&, std::tuple<_Args2 ...>&, std::_Index_tuple<_Indexes1 ...>, std::_Index_tuple<_Indexes2 ...>) [with _Args1 = {const unsigned int&}; long long unsigned int ..._Indexes1 = {0}; _Args2 = {}; long long unsigned int ..._Indexes2 = {}; _T1 = const unsigned int; _T2 = std::pair<std::chrono::time_point<std::chrono::_V2::system_clock, std::chrono::duration<long long int, std::ratio<1, 1000> > >, ScalarVariableBaseValue>]':
/usr/src/mxe/usr/lib/gcc/x86_64-w64-mingw32.static/9.2.0/include/c++/tuple:1663:63:   required from 'std::pair<_T1, _T2>::pair(std::piecewise_construct_t, std::tuple<_Args1 ...>, std::tuple<_Args2 ...>) [with _Args1 = {const unsigned int&}; _Args2 = {}; _T1 = const unsigned int; _T2 = std::pair<std::chrono::time_point<std::chrono::_V2::system_clock, std::chrono::duration<long long int, std::ratio<1, 1000> > >, ScalarVariableBaseValue>]'
/usr/src/mxe/usr/lib/gcc/x86_64-w64-mingw32.static/9.2.0/include/c++/ext/new_allocator.h:147:4:   required from 'void __gnu_cxx::new_allocator<_Tp>::construct(_Up*, _Args&& ...) [with _Up = std::pair<const unsigned int, std::pair<std::chrono::time_point<std::chrono::_V2::system_clock, std::chrono::duration<long long int, std::ratio<1, 1000> > >, ScalarVariableBaseValue> >; _Args = {const std::piecewise_construct_t&, std::tuple<const unsigned int&>, std::tuple<>}; _Tp = std::_Rb_tree_node<std::pair<const unsigned int, std::pair<std::chrono::time_point<std::chrono::_V2::system_clock, std::chrono::duration<long long int, std::ratio<1, 1000> > >, ScalarVariableBaseValue> > >]'
/usr/src/mxe/usr/lib/gcc/x86_64-w64-mingw32.static/9.2.0/include/c++/bits/alloc_traits.h:484:4:   required from 'static void std::allocator_traits<std::allocator<_Tp1> >::construct(std::allocator_traits<std::allocator<_Tp1> >::allocator_type&, _Up*, _Args&& ...) [with _Up = std::pair<const unsigned int, std::pair<std::chrono::time_point<std::chrono::_V2::system_clock, std::chrono::duration<long long int, std::ratio<1, 1000> > >, ScalarVariableBaseValue> >; _Args = {const std::piecewise_construct_t&, std::tuple<const unsigned int&>, std::tuple<>}; _Tp = std::_Rb_tree_node<std::pair<const unsigned int, std::pair<std::chrono::time_point<std::chrono::_V2::system_clock, std::chrono::duration<long long int, std::ratio<1, 1000> > >, ScalarVariableBaseValue> > >; std::allocator_traits<std::allocator<_Tp1> >::allocator_type = std::allocator<std::_Rb_tree_node<std::pair<const unsigned int, std::pair<std::chrono::time_point<std::chrono::_V2::system_clock, std::chrono::duration<long long int, std::ratio<1, 1000> > >, ScalarVariableBaseValue> > > >]'
/usr/src/mxe/usr/lib/gcc/x86_64-w64-mingw32.static/9.2.0/include/c++/bits/stl_tree.h:614:32:   required from 'void std::_Rb_tree<_Key, _Val, _KeyOfValue, _Compare, _Alloc>::_M_construct_node(std::_Rb_tree<_Key, _Val, _KeyOfValue, _Compare, _Alloc>::_Link_type, _Args&& ...) [with _Args = {const std::piecewise_construct_t&, std::tuple<const unsigned int&>, std::tuple<>}; _Key = unsigned int; _Val = std::pair<const unsigned int, std::pair<std::chrono::time_point<std::chrono::_V2::system_clock, std::chrono::duration<long long int, std::ratio<1, 1000> > >, ScalarVariableBaseValue> >; _KeyOfValue = std::_Select1st<std::pair<const unsigned int, std::pair<std::chrono::time_point<std::chrono::_V2::system_clock, std::chrono::duration<long long int, std::ratio<1, 1000> > >, ScalarVariableBaseValue> > >; _Compare = std::less<unsigned int>; _Alloc = std::allocator<std::pair<const unsigned int, std::pair<std::chrono::time_point<std::chrono::_V2::system_clock, std::chrono::duration<long long int, std::ratio<1, 1000> > >, ScalarVariableBaseValue> > >; std::_Rb_tree<_Key, _Val, _KeyOfValue, _Compare, _Alloc>::_Link_type = std::_Rb_tree_node<std::pair<const unsigned int, std::pair<std::chrono::time_point<std::chrono::_V2::system_clock, std::chrono::duration<long long int, std::ratio<1, 1000> > >, ScalarVariableBaseValue> > >*]'
/usr/src/mxe/usr/lib/gcc/x86_64-w64-mingw32.static/9.2.0/include/c++/bits/stl_tree.h:631:4:   required from 'std::_Rb_tree_node<_Val>* std::_Rb_tree<_Key, _Val, _KeyOfValue, _Compare, _Alloc>::_M_create_node(_Args&& ...) [with _Args = {const std::piecewise_construct_t&, std::tuple<const unsigned int&>, std::tuple<>}; _Key = unsigned int; _Val = std::pair<const unsigned int, std::pair<std::chrono::time_point<std::chrono::_V2::system_clock, std::chrono::duration<long long int, std::ratio<1, 1000> > >, ScalarVariableBaseValue> >; _KeyOfValue = std::_Select1st<std::pair<const unsigned int, std::pair<std::chrono::time_point<std::chrono::_V2::system_clock, std::chrono::duration<long long int, std::ratio<1, 1000> > >, ScalarVariableBaseValue> > >; _Compare = std::less<unsigned int>; _Alloc = std::allocator<std::pair<const unsigned int, std::pair<std::chrono::time_point<std::chrono::_V2::system_clock, std::chrono::duration<long long int, std::ratio<1, 1000> > >, ScalarVariableBaseValue> > >; std::_Rb_tree<_Key, _Val, _KeyOfValue, _Compare, _Alloc>::_Link_type = std::_Rb_tree_node<std::pair<const unsigned int, std::pair<std::chrono::time_point<std::chrono::_V2::system_clock, std::chrono::duration<long long int, std::ratio<1, 1000> > >, ScalarVariableBaseValue> > >*]'
/usr/src/mxe/usr/lib/gcc/x86_64-w64-mingw32.static/9.2.0/include/c++/bits/stl_tree.h:2455:13:   required from 'std::_Rb_tree<_Key, _Val, _KeyOfValue, _Compare, _Alloc>::iterator std::_Rb_tree<_Key, _Val, _KeyOfValue, _Compare, _Alloc>::_M_emplace_hint_unique(std::_Rb_tree<_Key, _Val, _KeyOfValue, _Compare, _Alloc>::const_iterator, _Args&& ...) [with _Args = {const std::piecewise_construct_t&, std::tuple<const unsigned int&>, std::tuple<>}; _Key = unsigned int; _Val = std::pair<const unsigned int, std::pair<std::chrono::time_point<std::chrono::_V2::system_clock, std::chrono::duration<long long int, std::ratio<1, 1000> > >, ScalarVariableBaseValue> >; _KeyOfValue = std::_Select1st<std::pair<const unsigned int, std::pair<std::chrono::time_point<std::chrono::_V2::system_clock, std::chrono::duration<long long int, std::ratio<1, 1000> > >, ScalarVariableBaseValue> > >; _Compare = std::less<unsigned int>; _Alloc = std::allocator<std::pair<const unsigned int, std::pair<std::chrono::time_point<std::chrono::_V2::system_clock, std::chrono::duration<long long int, std::ratio<1, 1000> > >, ScalarVariableBaseValue> > >; std::_Rb_tree<_Key, _Val, _KeyOfValue, _Compare, _Alloc>::iterator = std::_Rb_tree_iterator<std::pair<const unsigned int, std::pair<std::chrono::time_point<std::chrono::_V2::system_clock, std::chrono::duration<long long int, std::ratio<1, 1000> > >, ScalarVariableBaseValue> > >; std::_Rb_tree<_Key, _Val, _KeyOfValue, _Compare, _Alloc>::const_iterator = std::_Rb_tree_const_iterator<std::pair<const unsigned int, std::pair<std::chrono::time_point<std::chrono::_V2::system_clock, std::chrono::duration<long long int, std::ratio<1, 1000> > >, ScalarVariableBaseValue> > >]'
/usr/src/mxe/usr/lib/gcc/x86_64-w64-mingw32.static/9.2.0/include/c++/bits/stl_map.h:499:8:   required from 'std::map<_Key, _Tp, _Compare, _Alloc>::mapped_type& std::map<_Key, _Tp, _Compare, _Alloc>::operator[](const key_type&) [with _Key = unsigned int; _Tp = std::pair<std::chrono::time_point<std::chrono::_V2::system_clock, std::chrono::duration<long long int, std::ratio<1, 1000> > >, ScalarVariableBaseValue>; _Compare = std::less<unsigned int>; _Alloc = std::allocator<std::pair<const unsigned int, std::pair<std::chrono::time_point<std::chrono::_V2::system_clock, std::chrono::duration<long long int, std::ratio<1, 1000> > >, ScalarVariableBaseValue> > >; std::map<_Key, _Tp, _Compare, _Alloc>::mapped_type = std::pair<std::chrono::time_point<std::chrono::_V2::system_clock, std::chrono::duration<long long int, std::ratio<1, 1000> > >, ScalarVariableBaseValue>; std::map<_Key, _Tp, _Compare, _Alloc>::key_type = unsigned int]'
/work/rabbitmq-core/src/FmuContainerCore.cpp:159:43:   required from 'void FmuContainerCore::processLookahead(Predicate) [with Predicate = FmuContainerCore::initialize()::<lambda(FmuContainerCore::TimedScalarBasicValue&)>]'
/work/rabbitmq-core/src/FmuContainerCore.cpp:220:31:   required from here
/usr/src/mxe/usr/lib/gcc/x86_64-w64-mingw32.static/9.2.0/include/c++/tuple:1674:70: error: no matching function for call to 'std::pair<std::chrono::time_point<std::chrono::_V2::system_clock, std::chrono::duration<long long int, std::ratio<1, 1000> > >, ScalarVariableBaseValue>::pair()'
 1674 |         second(std::forward<_Args2>(std::get<_Indexes2>(__tuple2))...)
      |                                                                      ^
In file included from /usr/src/mxe/usr/lib/gcc/x86_64-w64-mingw32.static/9.2.0/include/c++/bits/stl_algobase.h:64,
                 from /usr/src/mxe/usr/lib/gcc/x86_64-w64-mingw32.static/9.2.0/include/c++/list:60,
                 from /work/rabbitmq-core/src/FmuContainerCore.h:9,
                 from /work/rabbitmq-core/src/FmuContainerCore.cpp:5:
/usr/src/mxe/usr/lib/gcc/x86_64-w64-mingw32.static/9.2.0/include/c++/bits/stl_pair.h:436:9: note: candidate: 'template<class ... _Args1, long long unsigned int ..._Indexes1, class ... _Args2, long long unsigned int ..._Indexes2> std::pair<_T1, _T2>::pair(std::tuple<_Args1 ...>&, std::tuple<_Args2 ...>&, std::_Index_tuple<_Indexes1 ...>, std::_Index_tuple<_Indexes2 ...>)'
  436 |         pair(tuple<_Args1...>&, tuple<_Args2...>&,
      |         ^~~~
/usr/src/mxe/usr/lib/gcc/x86_64-w64-mingw32.static/9.2.0/include/c++/bits/stl_pair.h:436:9: note:   template argument deduction/substitution failed:
In file included from /usr/src/mxe/usr/lib/gcc/x86_64-w64-mingw32.static/9.2.0/include/c++/functional:54,
                 from /usr/src/mxe/usr/lib/gcc/x86_64-w64-mingw32.static/9.2.0/include/c++/pstl/glue_algorithm_defs.h:13,
                 from /usr/src/mxe/usr/lib/gcc/x86_64-w64-mingw32.static/9.2.0/include/c++/algorithm:71,
                 from /work/thirdparty/date/date/include/date/date.h:42,
                 from /work/rabbitmq-core/src/FmuContainerCore.h:11,
                 from /work/rabbitmq-core/src/FmuContainerCore.cpp:5:
/usr/src/mxe/usr/lib/gcc/x86_64-w64-mingw32.static/9.2.0/include/c++/tuple:1674:70: note:   candidate expects 4 arguments, 0 provided
 1674 |         second(std::forward<_Args2>(std::get<_Indexes2>(__tuple2))...)
      |                                                                      ^
In file included from /usr/src/mxe/usr/lib/gcc/x86_64-w64-mingw32.static/9.2.0/include/c++/bits/stl_algobase.h:64,
                 from /usr/src/mxe/usr/lib/gcc/x86_64-w64-mingw32.static/9.2.0/include/c++/list:60,
                 from /work/rabbitmq-core/src/FmuContainerCore.h:9,
                 from /work/rabbitmq-core/src/FmuContainerCore.cpp:5:
/usr/src/mxe/usr/lib/gcc/x86_64-w64-mingw32.static/9.2.0/include/c++/bits/stl_pair.h:375:9: note: candidate: 'template<class ... _Args1, class ... _Args2> std::pair<_T1, _T2>::pair(std::piecewise_construct_t, std::tuple<_Args1 ...>, std::tuple<_Args2 ...>)'
  375 |         pair(piecewise_construct_t, tuple<_Args1...>, tuple<_Args2...>);
      |         ^~~~
/usr/src/mxe/usr/lib/gcc/x86_64-w64-mingw32.static/9.2.0/include/c++/bits/stl_pair.h:375:9: note:   template argument deduction/substitution failed:
In file included from /usr/src/mxe/usr/lib/gcc/x86_64-w64-mingw32.static/9.2.0/include/c++/functional:54,
                 from /usr/src/mxe/usr/lib/gcc/x86_64-w64-mingw32.static/9.2.0/include/c++/pstl/glue_algorithm_defs.h:13,
                 from /usr/src/mxe/usr/lib/gcc/x86_64-w64-mingw32.static/9.2.0/include/c++/algorithm:71,
                 from /work/thirdparty/date/date/include/date/date.h:42,
                 from /work/rabbitmq-core/src/FmuContainerCore.h:11,
                 from /work/rabbitmq-core/src/FmuContainerCore.cpp:5:
/usr/src/mxe/usr/lib/gcc/x86_64-w64-mingw32.static/9.2.0/include/c++/tuple:1674:70: note:   candidate expects 3 arguments, 0 provided
 1674 |         second(std::forward<_Args2>(std::get<_Indexes2>(__tuple2))...)
      |                                                                      ^
In file included from /usr/src/mxe/usr/lib/gcc/x86_64-w64-mingw32.static/9.2.0/include/c++/bits/stl_algobase.h:64,
                 from /usr/src/mxe/usr/lib/gcc/x86_64-w64-mingw32.static/9.2.0/include/c++/list:60,
                 from /work/rabbitmq-core/src/FmuContainerCore.h:9,
                 from /work/rabbitmq-core/src/FmuContainerCore.cpp:5:
/usr/src/mxe/usr/lib/gcc/x86_64-w64-mingw32.static/9.2.0/include/c++/bits/stl_pair.h:370:21: note: candidate: 'template<class _U1, class _U2, typename std::enable_if<(std::_PCC<((! std::is_same<std::chrono::time_point<std::chrono::_V2::system_clock, std::chrono::duration<long long int, std::ratio<1, 1000> > >, _U1>::value) || (! std::is_same<ScalarVariableBaseValue, _U2>::value)), std::chrono::time_point<std::chrono::_V2::system_clock, std::chrono::duration<long long int, std::ratio<1, 1000> > >, ScalarVariableBaseValue>::_MoveConstructiblePair<_U1, _U2>() && (! std::_PCC<((! std::is_same<std::chrono::time_point<std::chrono::_V2::system_clock, std::chrono::duration<long long int, std::ratio<1, 1000> > >, _U1>::value) || (! std::is_same<ScalarVariableBaseValue, _U2>::value)), std::chrono::time_point<std::chrono::_V2::system_clock, std::chrono::duration<long long int, std::ratio<1, 1000> > >, ScalarVariableBaseValue>::_ImplicitlyMoveConvertiblePair<_U1, _U2>())), bool>::type <anonymous> > constexpr std::pair<_T1, _T2>::pair(std::pair<_U1, _U2>&&)'
  370 |  explicit constexpr pair(pair<_U1, _U2>&& __p)
      |                     ^~~~
/usr/src/mxe/usr/lib/gcc/x86_64-w64-mingw32.static/9.2.0/include/c++/bits/stl_pair.h:370:21: note:   template argument deduction/substitution failed:
In file included from /usr/src/mxe/usr/lib/gcc/x86_64-w64-mingw32.static/9.2.0/include/c++/functional:54,
                 from /usr/src/mxe/usr/lib/gcc/x86_64-w64-mingw32.static/9.2.0/include/c++/pstl/glue_algorithm_defs.h:13,
                 from /usr/src/mxe/usr/lib/gcc/x86_64-w64-mingw32.static/9.2.0/include/c++/algorithm:71,
                 from /work/thirdparty/date/date/include/date/date.h:42,
                 from /work/rabbitmq-core/src/FmuContainerCore.h:11,
                 from /work/rabbitmq-core/src/FmuContainerCore.cpp:5:
/usr/src/mxe/usr/lib/gcc/x86_64-w64-mingw32.static/9.2.0/include/c++/tuple:1674:70: note:   candidate expects 1 argument, 0 provided
 1674 |         second(std::forward<_Args2>(std::get<_Indexes2>(__tuple2))...)
      |                                                                      ^
In file included from /usr/src/mxe/usr/lib/gcc/x86_64-w64-mingw32.static/9.2.0/include/c++/bits/stl_algobase.h:64,
                 from /usr/src/mxe/usr/lib/gcc/x86_64-w64-mingw32.static/9.2.0/include/c++/list:60,
                 from /work/rabbitmq-core/src/FmuContainerCore.h:9,
                 from /work/rabbitmq-core/src/FmuContainerCore.cpp:5:
/usr/src/mxe/usr/lib/gcc/x86_64-w64-mingw32.static/9.2.0/include/c++/bits/stl_pair.h:360:12: note: candidate: 'template<class _U1, class _U2, typename std::enable_if<(std::_PCC<((! std::is_same<std::chrono::time_point<std::chrono::_V2::system_clock, std::chrono::duration<long long int, std::ratio<1, 1000> > >, _U1>::value) || (! std::is_same<ScalarVariableBaseValue, _U2>::value)), std::chrono::time_point<std::chrono::_V2::system_clock, std::chrono::duration<long long int, std::ratio<1, 1000> > >, ScalarVariableBaseValue>::_MoveConstructiblePair<_U1, _U2>() && std::_PCC<((! std::is_same<std::chrono::time_point<std::chrono::_V2::system_clock, std::chrono::duration<long long int, std::ratio<1, 1000> > >, _U1>::value) || (! std::is_same<ScalarVariableBaseValue, _U2>::value)), std::chrono::time_point<std::chrono::_V2::system_clock, std::chrono::duration<long long int, std::ratio<1, 1000> > >, ScalarVariableBaseValue>::_ImplicitlyMoveConvertiblePair<_U1, _U2>()), bool>::type <anonymous> > constexpr std::pair<_T1, _T2>::pair(std::pair<_U1, _U2>&&)'
  360 |  constexpr pair(pair<_U1, _U2>&& __p)
      |            ^~~~
/usr/src/mxe/usr/lib/gcc/x86_64-w64-mingw32.static/9.2.0/include/c++/bits/stl_pair.h:360:12: note:   template argument deduction/substitution failed:
In file included from /usr/src/mxe/usr/lib/gcc/x86_64-w64-mingw32.static/9.2.0/include/c++/functional:54,
                 from /usr/src/mxe/usr/lib/gcc/x86_64-w64-mingw32.static/9.2.0/include/c++/pstl/glue_algorithm_defs.h:13,
                 from /usr/src/mxe/usr/lib/gcc/x86_64-w64-mingw32.static/9.2.0/include/c++/algorithm:71,
                 from /work/thirdparty/date/date/include/date/date.h:42,
                 from /work/rabbitmq-core/src/FmuContainerCore.h:11,
                 from /work/rabbitmq-core/src/FmuContainerCore.cpp:5:
/usr/src/mxe/usr/lib/gcc/x86_64-w64-mingw32.static/9.2.0/include/c++/tuple:1674:70: note:   candidate expects 1 argument, 0 provided
 1674 |         second(std::forward<_Args2>(std::get<_Indexes2>(__tuple2))...)
      |                                                                      ^
In file included from /usr/src/mxe/usr/lib/gcc/x86_64-w64-mingw32.static/9.2.0/include/c++/bits/stl_algobase.h:64,
                 from /usr/src/mxe/usr/lib/gcc/x86_64-w64-mingw32.static/9.2.0/include/c++/list:60,
                 from /work/rabbitmq-core/src/FmuContainerCore.h:9,
                 from /work/rabbitmq-core/src/FmuContainerCore.cpp:5:
/usr/src/mxe/usr/lib/gcc/x86_64-w64-mingw32.static/9.2.0/include/c++/bits/stl_pair.h:350:21: note: candidate: 'template<class _U1, class _U2, typename std::enable_if<(_MoveConstructiblePair<_U1, _U2>() && (! _ImplicitlyMoveConvertiblePair<_U1, _U2>())), bool>::type <anonymous> > constexpr std::pair<_T1, _T2>::pair(_U1&&, _U2&&)'
  350 |  explicit constexpr pair(_U1&& __x, _U2&& __y)
      |                     ^~~~
/usr/src/mxe/usr/lib/gcc/x86_64-w64-mingw32.static/9.2.0/include/c++/bits/stl_pair.h:350:21: note:   template argument deduction/substitution failed:
In file included from /usr/src/mxe/usr/lib/gcc/x86_64-w64-mingw32.static/9.2.0/include/c++/functional:54,
                 from /usr/src/mxe/usr/lib/gcc/x86_64-w64-mingw32.static/9.2.0/include/c++/pstl/glue_algorithm_defs.h:13,
                 from /usr/src/mxe/usr/lib/gcc/x86_64-w64-mingw32.static/9.2.0/include/c++/algorithm:71,
                 from /work/thirdparty/date/date/include/date/date.h:42,
                 from /work/rabbitmq-core/src/FmuContainerCore.h:11,
                 from /work/rabbitmq-core/src/FmuContainerCore.cpp:5:
/usr/src/mxe/usr/lib/gcc/x86_64-w64-mingw32.static/9.2.0/include/c++/tuple:1674:70: note:   candidate expects 2 arguments, 0 provided
 1674 |         second(std::forward<_Args2>(std::get<_Indexes2>(__tuple2))...)
      |                                                                      ^
In file included from /usr/src/mxe/usr/lib/gcc/x86_64-w64-mingw32.static/9.2.0/include/c++/bits/stl_algobase.h:64,
                 from /usr/src/mxe/usr/lib/gcc/x86_64-w64-mingw32.static/9.2.0/include/c++/list:60,
                 from /work/rabbitmq-core/src/FmuContainerCore.h:9,
                 from /work/rabbitmq-core/src/FmuContainerCore.cpp:5:
/usr/src/mxe/usr/lib/gcc/x86_64-w64-mingw32.static/9.2.0/include/c++/bits/stl_pair.h:341:12: note: candidate: 'template<class _U1, class _U2, typename std::enable_if<(_MoveConstructiblePair<_U1, _U2>() && _ImplicitlyMoveConvertiblePair<_U1, _U2>()), bool>::type <anonymous> > constexpr std::pair<_T1, _T2>::pair(_U1&&, _U2&&)'
  341 |  constexpr pair(_U1&& __x, _U2&& __y)
      |            ^~~~
/usr/src/mxe/usr/lib/gcc/x86_64-w64-mingw32.static/9.2.0/include/c++/bits/stl_pair.h:341:12: note:   template argument deduction/substitution failed:
In file included from /usr/src/mxe/usr/lib/gcc/x86_64-w64-mingw32.static/9.2.0/include/c++/functional:54,
                 from /usr/src/mxe/usr/lib/gcc/x86_64-w64-mingw32.static/9.2.0/include/c++/pstl/glue_algorithm_defs.h:13,
                 from /usr/src/mxe/usr/lib/gcc/x86_64-w64-mingw32.static/9.2.0/include/c++/algorithm:71,
                 from /work/thirdparty/date/date/include/date/date.h:42,
                 from /work/rabbitmq-core/src/FmuContainerCore.h:11,
                 from /work/rabbitmq-core/src/FmuContainerCore.cpp:5:
/usr/src/mxe/usr/lib/gcc/x86_64-w64-mingw32.static/9.2.0/include/c++/tuple:1674:70: note:   candidate expects 2 arguments, 0 provided
 1674 |         second(std::forward<_Args2>(std::get<_Indexes2>(__tuple2))...)
      |                                                                      ^
In file included from /usr/src/mxe/usr/lib/gcc/x86_64-w64-mingw32.static/9.2.0/include/c++/bits/stl_algobase.h:64,
                 from /usr/src/mxe/usr/lib/gcc/x86_64-w64-mingw32.static/9.2.0/include/c++/list:60,
                 from /work/rabbitmq-core/src/FmuContainerCore.h:9,
                 from /work/rabbitmq-core/src/FmuContainerCore.cpp:5:
/usr/src/mxe/usr/lib/gcc/x86_64-w64-mingw32.static/9.2.0/include/c++/bits/stl_pair.h:332:17: note: candidate: 'template<class _U2, typename std::enable_if<_CopyMovePair<false, std::chrono::time_point<std::chrono::_V2::system_clock, std::chrono::duration<long long int, std::ratio<1, 1000> > >, _U2>(), bool>::type <anonymous> > std::pair<_T1, _T2>::pair(const _T1&, _U2&&)'
  332 |        explicit pair(const _T1& __x, _U2&& __y)
      |                 ^~~~
/usr/src/mxe/usr/lib/gcc/x86_64-w64-mingw32.static/9.2.0/include/c++/bits/stl_pair.h:332:17: note:   template argument deduction/substitution failed:
In file included from /usr/src/mxe/usr/lib/gcc/x86_64-w64-mingw32.static/9.2.0/include/c++/functional:54,
                 from /usr/src/mxe/usr/lib/gcc/x86_64-w64-mingw32.static/9.2.0/include/c++/pstl/glue_algorithm_defs.h:13,
                 from /usr/src/mxe/usr/lib/gcc/x86_64-w64-mingw32.static/9.2.0/include/c++/algorithm:71,
                 from /work/thirdparty/date/date/include/date/date.h:42,
                 from /work/rabbitmq-core/src/FmuContainerCore.h:11,
                 from /work/rabbitmq-core/src/FmuContainerCore.cpp:5:
/usr/src/mxe/usr/lib/gcc/x86_64-w64-mingw32.static/9.2.0/include/c++/tuple:1674:70: note:   candidate expects 2 arguments, 0 provided
 1674 |         second(std::forward<_Args2>(std::get<_Indexes2>(__tuple2))...)
      |                                                                      ^
In file included from /usr/src/mxe/usr/lib/gcc/x86_64-w64-mingw32.static/9.2.0/include/c++/bits/stl_algobase.h:64,
                 from /usr/src/mxe/usr/lib/gcc/x86_64-w64-mingw32.static/9.2.0/include/c++/list:60,
                 from /work/rabbitmq-core/src/FmuContainerCore.h:9,
                 from /work/rabbitmq-core/src/FmuContainerCore.cpp:5:
/usr/src/mxe/usr/lib/gcc/x86_64-w64-mingw32.static/9.2.0/include/c++/bits/stl_pair.h:325:18: note: candidate: 'template<class _U2, typename std::enable_if<_CopyMovePair<true, std::chrono::time_point<std::chrono::_V2::system_clock, std::chrono::duration<long long int, std::ratio<1, 1000> > >, _U2>(), bool>::type <anonymous> > constexpr std::pair<_T1, _T2>::pair(const _T1&, _U2&&)'
  325 |        constexpr pair(const _T1& __x, _U2&& __y)
      |                  ^~~~
/usr/src/mxe/usr/lib/gcc/x86_64-w64-mingw32.static/9.2.0/include/c++/bits/stl_pair.h:325:18: note:   template argument deduction/substitution failed:
In file included from /usr/src/mxe/usr/lib/gcc/x86_64-w64-mingw32.static/9.2.0/include/c++/functional:54,
                 from /usr/src/mxe/usr/lib/gcc/x86_64-w64-mingw32.static/9.2.0/include/c++/pstl/glue_algorithm_defs.h:13,
                 from /usr/src/mxe/usr/lib/gcc/x86_64-w64-mingw32.static/9.2.0/include/c++/algorithm:71,
                 from /work/thirdparty/date/date/include/date/date.h:42,
                 from /work/rabbitmq-core/src/FmuContainerCore.h:11,
                 from /work/rabbitmq-core/src/FmuContainerCore.cpp:5:
/usr/src/mxe/usr/lib/gcc/x86_64-w64-mingw32.static/9.2.0/include/c++/tuple:1674:70: note:   candidate expects 2 arguments, 0 provided
 1674 |         second(std::forward<_Args2>(std::get<_Indexes2>(__tuple2))...)
      |                                                                      ^
In file included from /usr/src/mxe/usr/lib/gcc/x86_64-w64-mingw32.static/9.2.0/include/c++/bits/stl_algobase.h:64,
                 from /usr/src/mxe/usr/lib/gcc/x86_64-w64-mingw32.static/9.2.0/include/c++/list:60,
                 from /work/rabbitmq-core/src/FmuContainerCore.h:9,
                 from /work/rabbitmq-core/src/FmuContainerCore.cpp:5:
/usr/src/mxe/usr/lib/gcc/x86_64-w64-mingw32.static/9.2.0/include/c++/bits/stl_pair.h:318:27: note: candidate: 'template<class _U1, typename std::enable_if<_MoveCopyPair<false, _U1, ScalarVariableBaseValue>(), bool>::type <anonymous> > constexpr std::pair<_T1, _T2>::pair(_U1&&, const _T2&)'
  318 |        explicit constexpr pair(_U1&& __x, const _T2& __y)
      |                           ^~~~
/usr/src/mxe/usr/lib/gcc/x86_64-w64-mingw32.static/9.2.0/include/c++/bits/stl_pair.h:318:27: note:   template argument deduction/substitution failed:
In file included from /usr/src/mxe/usr/lib/gcc/x86_64-w64-mingw32.static/9.2.0/include/c++/functional:54,
                 from /usr/src/mxe/usr/lib/gcc/x86_64-w64-mingw32.static/9.2.0/include/c++/pstl/glue_algorithm_defs.h:13,
                 from /usr/src/mxe/usr/lib/gcc/x86_64-w64-mingw32.static/9.2.0/include/c++/algorithm:71,
                 from /work/thirdparty/date/date/include/date/date.h:42,
                 from /work/rabbitmq-core/src/FmuContainerCore.h:11,
                 from /work/rabbitmq-core/src/FmuContainerCore.cpp:5:
/usr/src/mxe/usr/lib/gcc/x86_64-w64-mingw32.static/9.2.0/include/c++/tuple:1674:70: note:   candidate expects 2 arguments, 0 provided
 1674 |         second(std::forward<_Args2>(std::get<_Indexes2>(__tuple2))...)
      |                                                                      ^
In file included from /usr/src/mxe/usr/lib/gcc/x86_64-w64-mingw32.static/9.2.0/include/c++/bits/stl_algobase.h:64,
                 from /usr/src/mxe/usr/lib/gcc/x86_64-w64-mingw32.static/9.2.0/include/c++/list:60,
                 from /work/rabbitmq-core/src/FmuContainerCore.h:9,
                 from /work/rabbitmq-core/src/FmuContainerCore.cpp:5:
/usr/src/mxe/usr/lib/gcc/x86_64-w64-mingw32.static/9.2.0/include/c++/bits/stl_pair.h:311:18: note: candidate: 'template<class _U1, typename std::enable_if<_MoveCopyPair<true, _U1, ScalarVariableBaseValue>(), bool>::type <anonymous> > constexpr std::pair<_T1, _T2>::pair(_U1&&, const _T2&)'
  311 |        constexpr pair(_U1&& __x, const _T2& __y)
      |                  ^~~~
/usr/src/mxe/usr/lib/gcc/x86_64-w64-mingw32.static/9.2.0/include/c++/bits/stl_pair.h:311:18: note:   template argument deduction/substitution failed:
In file included from /usr/src/mxe/usr/lib/gcc/x86_64-w64-mingw32.static/9.2.0/include/c++/functional:54,
                 from /usr/src/mxe/usr/lib/gcc/x86_64-w64-mingw32.static/9.2.0/include/c++/pstl/glue_algorithm_defs.h:13,
                 from /usr/src/mxe/usr/lib/gcc/x86_64-w64-mingw32.static/9.2.0/include/c++/algorithm:71,
                 from /work/thirdparty/date/date/include/date/date.h:42,
                 from /work/rabbitmq-core/src/FmuContainerCore.h:11,
                 from /work/rabbitmq-core/src/FmuContainerCore.cpp:5:
/usr/src/mxe/usr/lib/gcc/x86_64-w64-mingw32.static/9.2.0/include/c++/tuple:1674:70: note:   candidate expects 2 arguments, 0 provided
 1674 |         second(std::forward<_Args2>(std::get<_Indexes2>(__tuple2))...)
      |                                                                      ^
In file included from /usr/src/mxe/usr/lib/gcc/x86_64-w64-mingw32.static/9.2.0/include/c++/bits/stl_algobase.h:64,
                 from /usr/src/mxe/usr/lib/gcc/x86_64-w64-mingw32.static/9.2.0/include/c++/list:60,
                 from /work/rabbitmq-core/src/FmuContainerCore.h:9,
                 from /work/rabbitmq-core/src/FmuContainerCore.cpp:5:
/usr/src/mxe/usr/lib/gcc/x86_64-w64-mingw32.static/9.2.0/include/c++/bits/stl_pair.h:304:17: note: candidate: 'std::pair<_T1, _T2>::pair(std::pair<_T1, _T2>&&) [with _T1 = std::chrono::time_point<std::chrono::_V2::system_clock, std::chrono::duration<long long int, std::ratio<1, 1000> > >; _T2 = ScalarVariableBaseValue]'
  304 |       constexpr pair(pair&&) = default;
      |                 ^~~~
/usr/src/mxe/usr/lib/gcc/x86_64-w64-mingw32.static/9.2.0/include/c++/bits/stl_pair.h:304:17: note:   candidate expects 1 argument, 0 provided
/usr/src/mxe/usr/lib/gcc/x86_64-w64-mingw32.static/9.2.0/include/c++/bits/stl_pair.h:303:17: note: candidate: 'std::pair<_T1, _T2>::pair(const std::pair<_T1, _T2>&) [with _T1 = std::chrono::time_point<std::chrono::_V2::system_clock, std::chrono::duration<long long int, std::ratio<1, 1000> > >; _T2 = ScalarVariableBaseValue]'
  303 |       constexpr pair(const pair&) = default;
      |                 ^~~~
/usr/src/mxe/usr/lib/gcc/x86_64-w64-mingw32.static/9.2.0/include/c++/bits/stl_pair.h:303:17: note:   candidate expects 1 argument, 0 provided
/usr/src/mxe/usr/lib/gcc/x86_64-w64-mingw32.static/9.2.0/include/c++/bits/stl_pair.h:300:21: note: candidate: 'template<class _U1, class _U2, typename std::enable_if<(std::_PCC<((! std::is_same<std::chrono::time_point<std::chrono::_V2::system_clock, std::chrono::duration<long long int, std::ratio<1, 1000> > >, _U1>::value) || (! std::is_same<ScalarVariableBaseValue, _U2>::value)), std::chrono::time_point<std::chrono::_V2::system_clock, std::chrono::duration<long long int, std::ratio<1, 1000> > >, ScalarVariableBaseValue>::_ConstructiblePair<_U1, _U2>() && (! std::_PCC<((! std::is_same<std::chrono::time_point<std::chrono::_V2::system_clock, std::chrono::duration<long long int, std::ratio<1, 1000> > >, _U1>::value) || (! std::is_same<ScalarVariableBaseValue, _U2>::value)), std::chrono::time_point<std::chrono::_V2::system_clock, std::chrono::duration<long long int, std::ratio<1, 1000> > >, ScalarVariableBaseValue>::_ImplicitlyConvertiblePair<_U1, _U2>())), bool>::type <anonymous> > constexpr std::pair<_T1, _T2>::pair(const std::pair<_U1, _U2>&)'
  300 |  explicit constexpr pair(const pair<_U1, _U2>& __p)
      |                     ^~~~
/usr/src/mxe/usr/lib/gcc/x86_64-w64-mingw32.static/9.2.0/include/c++/bits/stl_pair.h:300:21: note:   template argument deduction/substitution failed:
In file included from /usr/src/mxe/usr/lib/gcc/x86_64-w64-mingw32.static/9.2.0/include/c++/functional:54,
                 from /usr/src/mxe/usr/lib/gcc/x86_64-w64-mingw32.static/9.2.0/include/c++/pstl/glue_algorithm_defs.h:13,
                 from /usr/src/mxe/usr/lib/gcc/x86_64-w64-mingw32.static/9.2.0/include/c++/algorithm:71,
                 from /work/thirdparty/date/date/include/date/date.h:42,
                 from /work/rabbitmq-core/src/FmuContainerCore.h:11,
                 from /work/rabbitmq-core/src/FmuContainerCore.cpp:5:
/usr/src/mxe/usr/lib/gcc/x86_64-w64-mingw32.static/9.2.0/include/c++/tuple:1674:70: note:   candidate expects 1 argument, 0 provided
 1674 |         second(std::forward<_Args2>(std::get<_Indexes2>(__tuple2))...)
      |                                                                      ^
In file included from /usr/src/mxe/usr/lib/gcc/x86_64-w64-mingw32.static/9.2.0/include/c++/bits/stl_algobase.h:64,
                 from /usr/src/mxe/usr/lib/gcc/x86_64-w64-mingw32.static/9.2.0/include/c++/list:60,
                 from /work/rabbitmq-core/src/FmuContainerCore.h:9,
                 from /work/rabbitmq-core/src/FmuContainerCore.cpp:5:
/usr/src/mxe/usr/lib/gcc/x86_64-w64-mingw32.static/9.2.0/include/c++/bits/stl_pair.h:291:19: note: candidate: 'template<class _U1, class _U2, typename std::enable_if<(std::_PCC<((! std::is_same<std::chrono::time_point<std::chrono::_V2::system_clock, std::chrono::duration<long long int, std::ratio<1, 1000> > >, _U1>::value) || (! std::is_same<ScalarVariableBaseValue, _U2>::value)), std::chrono::time_point<std::chrono::_V2::system_clock, std::chrono::duration<long long int, std::ratio<1, 1000> > >, ScalarVariableBaseValue>::_ConstructiblePair<_U1, _U2>() && std::_PCC<((! std::is_same<std::chrono::time_point<std::chrono::_V2::system_clock, std::chrono::duration<long long int, std::ratio<1, 1000> > >, _U1>::value) || (! std::is_same<ScalarVariableBaseValue, _U2>::value)), std::chrono::time_point<std::chrono::_V2::system_clock, std::chrono::duration<long long int, std::ratio<1, 1000> > >, ScalarVariableBaseValue>::_ImplicitlyConvertiblePair<_U1, _U2>()), bool>::type <anonymous> > constexpr std::pair<_T1, _T2>::pair(const std::pair<_U1, _U2>&)'
  291 |         constexpr pair(const pair<_U1, _U2>& __p)
      |                   ^~~~
/usr/src/mxe/usr/lib/gcc/x86_64-w64-mingw32.static/9.2.0/include/c++/bits/stl_pair.h:291:19: note:   template argument deduction/substitution failed:
In file included from /usr/src/mxe/usr/lib/gcc/x86_64-w64-mingw32.static/9.2.0/include/c++/functional:54,
                 from /usr/src/mxe/usr/lib/gcc/x86_64-w64-mingw32.static/9.2.0/include/c++/pstl/glue_algorithm_defs.h:13,
                 from /usr/src/mxe/usr/lib/gcc/x86_64-w64-mingw32.static/9.2.0/include/c++/algorithm:71,
                 from /work/thirdparty/date/date/include/date/date.h:42,
                 from /work/rabbitmq-core/src/FmuContainerCore.h:11,
                 from /work/rabbitmq-core/src/FmuContainerCore.cpp:5:
/usr/src/mxe/usr/lib/gcc/x86_64-w64-mingw32.static/9.2.0/include/c++/tuple:1674:70: note:   candidate expects 1 argument, 0 provided
 1674 |         second(std::forward<_Args2>(std::get<_Indexes2>(__tuple2))...)
      |                                                                      ^
In file included from /usr/src/mxe/usr/lib/gcc/x86_64-w64-mingw32.static/9.2.0/include/c++/bits/stl_algobase.h:64,
                 from /usr/src/mxe/usr/lib/gcc/x86_64-w64-mingw32.static/9.2.0/include/c++/list:60,
                 from /work/rabbitmq-core/src/FmuContainerCore.h:9,
                 from /work/rabbitmq-core/src/FmuContainerCore.cpp:5:
/usr/src/mxe/usr/lib/gcc/x86_64-w64-mingw32.static/9.2.0/include/c++/bits/stl_pair.h:269:26: note: candidate: 'template<class _U1, class _U2, typename std::enable_if<(_ConstructiblePair<_U1, _U2>() && (! _ImplicitlyConvertiblePair<_U1, _U2>())), bool>::type <anonymous> > constexpr std::pair<_T1, _T2>::pair(const _T1&, const _T2&)'
  269 |       explicit constexpr pair(const _T1& __a, const _T2& __b)
      |                          ^~~~
/usr/src/mxe/usr/lib/gcc/x86_64-w64-mingw32.static/9.2.0/include/c++/bits/stl_pair.h:269:26: note:   template argument deduction/substitution failed:
In file included from /usr/src/mxe/usr/lib/gcc/x86_64-w64-mingw32.static/9.2.0/include/c++/functional:54,
                 from /usr/src/mxe/usr/lib/gcc/x86_64-w64-mingw32.static/9.2.0/include/c++/pstl/glue_algorithm_defs.h:13,
                 from /usr/src/mxe/usr/lib/gcc/x86_64-w64-mingw32.static/9.2.0/include/c++/algorithm:71,
                 from /work/thirdparty/date/date/include/date/date.h:42,
                 from /work/rabbitmq-core/src/FmuContainerCore.h:11,
                 from /work/rabbitmq-core/src/FmuContainerCore.cpp:5:
/usr/src/mxe/usr/lib/gcc/x86_64-w64-mingw32.static/9.2.0/include/c++/tuple:1674:70: note:   candidate expects 2 arguments, 0 provided
 1674 |         second(std::forward<_Args2>(std::get<_Indexes2>(__tuple2))...)
      |                                                                      ^
In file included from /usr/src/mxe/usr/lib/gcc/x86_64-w64-mingw32.static/9.2.0/include/c++/bits/stl_algobase.h:64,
                 from /usr/src/mxe/usr/lib/gcc/x86_64-w64-mingw32.static/9.2.0/include/c++/list:60,
                 from /work/rabbitmq-core/src/FmuContainerCore.h:9,
                 from /work/rabbitmq-core/src/FmuContainerCore.cpp:5:
/usr/src/mxe/usr/lib/gcc/x86_64-w64-mingw32.static/9.2.0/include/c++/bits/stl_pair.h:260:17: note: candidate: 'template<class _U1, class _U2, typename std::enable_if<(_ConstructiblePair<_U1, _U2>() && _ImplicitlyConvertiblePair<_U1, _U2>()), bool>::type <anonymous> > constexpr std::pair<_T1, _T2>::pair(const _T1&, const _T2&)'
  260 |       constexpr pair(const _T1& __a, const _T2& __b)
      |                 ^~~~
/usr/src/mxe/usr/lib/gcc/x86_64-w64-mingw32.static/9.2.0/include/c++/bits/stl_pair.h:260:17: note:   template argument deduction/substitution failed:
In file included from /usr/src/mxe/usr/lib/gcc/x86_64-w64-mingw32.static/9.2.0/include/c++/functional:54,
                 from /usr/src/mxe/usr/lib/gcc/x86_64-w64-mingw32.static/9.2.0/include/c++/pstl/glue_algorithm_defs.h:13,
                 from /usr/src/mxe/usr/lib/gcc/x86_64-w64-mingw32.static/9.2.0/include/c++/algorithm:71,
                 from /work/thirdparty/date/date/include/date/date.h:42,
                 from /work/rabbitmq-core/src/FmuContainerCore.h:11,
                 from /work/rabbitmq-core/src/FmuContainerCore.cpp:5:
/usr/src/mxe/usr/lib/gcc/x86_64-w64-mingw32.static/9.2.0/include/c++/tuple:1674:70: note:   candidate expects 2 arguments, 0 provided
 1674 |         second(std::forward<_Args2>(std::get<_Indexes2>(__tuple2))...)
      |                                                                      ^
In file included from /usr/src/mxe/usr/lib/gcc/x86_64-w64-mingw32.static/9.2.0/include/c++/bits/stl_algobase.h:64,
                 from /usr/src/mxe/usr/lib/gcc/x86_64-w64-mingw32.static/9.2.0/include/c++/list:60,
                 from /work/rabbitmq-core/src/FmuContainerCore.h:9,
                 from /work/rabbitmq-core/src/FmuContainerCore.cpp:5:
/usr/src/mxe/usr/lib/gcc/x86_64-w64-mingw32.static/9.2.0/include/c++/bits/stl_pair.h:242:26: note: candidate: 'template<class _U1, class _U2, typename std::enable_if<std::__and_<std::is_default_constructible<_Tp>, std::is_default_constructible<_U2>, std::__not_<std::__and_<std::__is_implicitly_default_constructible<_U1>, std::__is_implicitly_default_constructible<_U2> > > >::value, bool>::type <anonymous> > constexpr std::pair<_T1, _T2>::pair()'
  242 |       explicit constexpr pair()
      |                          ^~~~
/usr/src/mxe/usr/lib/gcc/x86_64-w64-mingw32.static/9.2.0/include/c++/bits/stl_pair.h:242:26: note:   template argument deduction/substitution failed:
/usr/src/mxe/usr/lib/gcc/x86_64-w64-mingw32.static/9.2.0/include/c++/bits/stl_pair.h:241:59: error: no type named 'type' in 'struct std::enable_if<false, bool>'
  241 |                                    ::value, bool>::type = false>
      |                                                           ^~~~~
/usr/src/mxe/usr/lib/gcc/x86_64-w64-mingw32.static/9.2.0/include/c++/bits/stl_pair.h:229:26: note: candidate: 'template<class _U1, class _U2, typename std::enable_if<std::__and_<std::__is_implicitly_default_constructible<_U1>, std::__is_implicitly_default_constructible<_U2> >::value, bool>::type <anonymous> > constexpr std::pair<_T1, _T2>::pair()'
  229 |       _GLIBCXX_CONSTEXPR pair()
      |                          ^~~~
/usr/src/mxe/usr/lib/gcc/x86_64-w64-mingw32.static/9.2.0/include/c++/bits/stl_pair.h:229:26: note:   template argument deduction/substitution failed:
/usr/src/mxe/usr/lib/gcc/x86_64-w64-mingw32.static/9.2.0/include/c++/bits/stl_pair.h:227:59: error: no type named 'type' in 'struct std::enable_if<false, bool>'
  227 |                                    ::value, bool>::type = true>
      |                                                           ^~~~
rabbitmq-core/CMakeFiles/rabbitmq-core.dir/build.make:66: recipe for target 'rabbitmq-core/CMakeFiles/rabbitmq-core.dir/src/FmuContainerCore.cpp.obj' failed
make[2]: Leaving directory '/work/build/win-x64'
CMakeFiles/Makefile2:3172: recipe for target 'rabbitmq-core/CMakeFiles/rabbitmq-core.dir/all' failed
make[2]: *** [rabbitmq-core/CMakeFiles/rabbitmq-core.dir/src/FmuContainerCore.cpp.obj] Error 1
make[1]: *** [rabbitmq-core/CMakeFiles/rabbitmq-core.dir/all] Error 2
make[1]: *** Waiting for unfinished jobs....
[ 24%] Linking CXX static library ../../../lib/libgtest.a
cd /work/build/win-x64/thirdparty/googletest/googletest && /usr/src/mxe/usr/x86_64-pc-linux-gnu/bin/cmake -P CMakeFiles/gtest.dir/cmake_clean_target.cmake
cd /work/build/win-x64/thirdparty/googletest/googletest && /usr/src/mxe/usr/x86_64-pc-linux-gnu/bin/cmake -E cmake_link_script CMakeFiles/gtest.dir/link.txt --verbose=1
/usr/src/mxe/usr/bin/x86_64-w64-mingw32.static-ar qc ../../../lib/libgtest.a  CMakeFiles/gtest.dir/src/gtest-all.cc.obj
/usr/src/mxe/usr/bin/x86_64-w64-mingw32.static-ranlib ../../../lib/libgtest.a
make[2]: Leaving directory '/work/build/win-x64'
[ 24%] Built target gtest
make[1]: Leaving directory '/work/build/win-x64'
Makefile:143: recipe for target 'all' failed
make: Leaving directory '/work/build/win-x64'
make: *** [all] Error 2
[Pipeline] }
[Pipeline] // stage
[Pipeline] }
Failed in branch Xcompile win32
[Pipeline] }
[Pipeline] // stage
[Pipeline] }
Failed in branch Xcompile win64
[Pipeline] // parallel
[Pipeline] }
[Pipeline] // stage
[Pipeline] stage
[Pipeline] { (Pack FMU)
Stage "Pack FMU" skipped due to earlier failure(s)
[Pipeline] }
[Pipeline] // stage
[Pipeline] stage
[Pipeline] { (Publish)
Stage "Publish" skipped due to earlier failure(s)
[Pipeline] }
[Pipeline] // stage
[Pipeline] }
[Pipeline] // withEnv
[Pipeline] }
[Pipeline] // node
[Pipeline] End of Pipeline

GitHub has been notified of this commit’s build result

ERROR: script returned exit code 2
Finished: FAILURE