FailedConsole Output

Skipping 191 KB.. Full Log
eInfo/TypeInfo.cpp:96:16: note: expanded from macro 'X'
#define X(str) XStr(str).unicodeForm()
               ^
/work/thirdparty/xerces-c/tests/src/DOM/TypeInfo/TypeInfo.cpp:532:65: warning: cast from 'const char16_t *' to 'char16_t *' drops const qualifier [-Wcast-qual]
    DOMTYPEINFOTEST(testAttr->getSchemaTypeInfo(), X("string"), SchemaSymbols::fgURI_SCHEMAFORSCHEMA, __LINE__);
                                                                ^
/work/thirdparty/xerces-c/tests/src/DOM/TypeInfo/TypeInfo.cpp:534:52: warning: cast from 'const char16_t *' to 'char16_t *' drops const qualifier [-Wcast-qual]
    DOMTYPEINFOTEST(testAttr->getSchemaTypeInfo(), X("decimal"), SchemaSymbols::fgURI_SCHEMAFORSCHEMA, __LINE__);
                                                   ^
/work/thirdparty/xerces-c/tests/src/DOM/TypeInfo/TypeInfo.cpp:96:16: note: expanded from macro 'X'
#define X(str) XStr(str).unicodeForm()
               ^
/work/thirdparty/xerces-c/tests/src/DOM/TypeInfo/TypeInfo.cpp:534:66: warning: cast from 'const char16_t *' to 'char16_t *' drops const qualifier [-Wcast-qual]
    DOMTYPEINFOTEST(testAttr->getSchemaTypeInfo(), X("decimal"), SchemaSymbols::fgURI_SCHEMAFORSCHEMA, __LINE__);
                                                                 ^
/work/thirdparty/xerces-c/tests/src/DOM/TypeInfo/TypeInfo.cpp:550:51: warning: cast from 'const char16_t *' to 'char16_t *' drops const qualifier [-Wcast-qual]
    DOMTYPEINFOTEST(testEle->getSchemaTypeInfo(), X("__AnonC1"), X(""), __LINE__);
                                                  ^
/work/thirdparty/xerces-c/tests/src/DOM/TypeInfo/TypeInfo.cpp:96:16: note: expanded from macro 'X'
#define X(str) XStr(str).unicodeForm()
               ^
/work/thirdparty/xerces-c/tests/src/DOM/TypeInfo/TypeInfo.cpp:550:66: warning: cast from 'const char16_t *' to 'char16_t *' drops const qualifier [-Wcast-qual]
    DOMTYPEINFOTEST(testEle->getSchemaTypeInfo(), X("__AnonC1"), X(""), __LINE__);
                                                                 ^
/work/thirdparty/xerces-c/tests/src/DOM/TypeInfo/TypeInfo.cpp:96:16: note: expanded from macro 'X'
#define X(str) XStr(str).unicodeForm()
               ^
/work/thirdparty/xerces-c/tests/src/DOM/TypeInfo/TypeInfo.cpp:553:52: warning: cast from 'const char16_t *' to 'char16_t *' drops const qualifier [-Wcast-qual]
    DOMTYPEINFOTEST(testAttr->getSchemaTypeInfo(), X("__AnonS7"), X(""), __LINE__);
                                                   ^
/work/thirdparty/xerces-c/tests/src/DOM/TypeInfo/TypeInfo.cpp:96:16: note: expanded from macro 'X'
#define X(str) XStr(str).unicodeForm()
               ^
/work/thirdparty/xerces-c/tests/src/DOM/TypeInfo/TypeInfo.cpp:553:67: warning: cast from 'const char16_t *' to 'char16_t *' drops const qualifier [-Wcast-qual]
    DOMTYPEINFOTEST(testAttr->getSchemaTypeInfo(), X("__AnonS7"), X(""), __LINE__);
                                                                  ^
/work/thirdparty/xerces-c/tests/src/DOM/TypeInfo/TypeInfo.cpp:96:16: note: expanded from macro 'X'
#define X(str) XStr(str).unicodeForm()
               ^
/work/thirdparty/xerces-c/tests/src/DOM/TypeInfo/TypeInfo.cpp:556:51: warning: cast from 'const char16_t *' to 'char16_t *' drops const qualifier [-Wcast-qual]
    DOMTYPEINFOTEST(testEle->getSchemaTypeInfo(), X("__AnonS2"), X(""), __LINE__);
                                                  ^
/work/thirdparty/xerces-c/tests/src/DOM/TypeInfo/TypeInfo.cpp:96:16: note: expanded from macro 'X'
#define X(str) XStr(str).unicodeForm()
               ^
/work/thirdparty/xerces-c/tests/src/DOM/TypeInfo/TypeInfo.cpp:556:66: warning: cast from 'const char16_t *' to 'char16_t *' drops const qualifier [-Wcast-qual]
    DOMTYPEINFOTEST(testEle->getSchemaTypeInfo(), X("__AnonS2"), X(""), __LINE__);
                                                                 ^
/work/thirdparty/xerces-c/tests/src/DOM/TypeInfo/TypeInfo.cpp:96:16: note: expanded from macro 'X'
#define X(str) XStr(str).unicodeForm()
               ^
/work/thirdparty/xerces-c/tests/src/DOM/TypeInfo/TypeInfo.cpp:559:51: warning: cast from 'const char16_t *' to 'char16_t *' drops const qualifier [-Wcast-qual]
    DOMTYPEINFOTEST(testEle->getSchemaTypeInfo(), X("__AnonS4"), X(""), __LINE__);
                                                  ^
/work/thirdparty/xerces-c/tests/src/DOM/TypeInfo/TypeInfo.cpp:96:16: note: expanded from macro 'X'
#define X(str) XStr(str).unicodeForm()
               ^
/work/thirdparty/xerces-c/tests/src/DOM/TypeInfo/TypeInfo.cpp:559:66: warning: cast from 'const char16_t *' to 'char16_t *' drops const qualifier [-Wcast-qual]
    DOMTYPEINFOTEST(testEle->getSchemaTypeInfo(), X("__AnonS4"), X(""), __LINE__);
                                                                 ^
/work/thirdparty/xerces-c/tests/src/DOM/TypeInfo/TypeInfo.cpp:96:16: note: expanded from macro 'X'
#define X(str) XStr(str).unicodeForm()
               ^
/work/thirdparty/xerces-c/tests/src/DOM/TypeInfo/TypeInfo.cpp:562:51: warning: cast from 'const char16_t *' to 'char16_t *' drops const qualifier [-Wcast-qual]
    DOMTYPEINFOTEST(testEle->getSchemaTypeInfo(), X("__AnonS6"), X(""), __LINE__);
                                                  ^
/work/thirdparty/xerces-c/tests/src/DOM/TypeInfo/TypeInfo.cpp:96:16: note: expanded from macro 'X'
#define X(str) XStr(str).unicodeForm()
               ^
/work/thirdparty/xerces-c/tests/src/DOM/TypeInfo/TypeInfo.cpp:562:66: warning: cast from 'const char16_t *' to 'char16_t *' drops const qualifier [-Wcast-qual]
    DOMTYPEINFOTEST(testEle->getSchemaTypeInfo(), X("__AnonS6"), X(""), __LINE__);
                                                                 ^
/work/thirdparty/xerces-c/tests/src/DOM/TypeInfo/TypeInfo.cpp:96:16: note: expanded from macro 'X'
#define X(str) XStr(str).unicodeForm()
               ^
/work/thirdparty/xerces-c/tests/src/DOM/TypeInfo/TypeInfo.cpp:578:51: warning: cast from 'const char16_t *' to 'char16_t *' drops const qualifier [-Wcast-qual]
    DOMTYPEINFOTEST(testEle->getSchemaTypeInfo(), X("base"), X(""), __LINE__);
                                                  ^
/work/thirdparty/xerces-c/tests/src/DOM/TypeInfo/TypeInfo.cpp:96:16: note: expanded from macro 'X'
#define X(str) XStr(str).unicodeForm()
               ^
/work/thirdparty/xerces-c/tests/src/DOM/TypeInfo/TypeInfo.cpp:578:62: warning: cast from 'const char16_t *' to 'char16_t *' drops const qualifier [-Wcast-qual]
    DOMTYPEINFOTEST(testEle->getSchemaTypeInfo(), X("base"), X(""), __LINE__);
                                                             ^
/work/thirdparty/xerces-c/tests/src/DOM/TypeInfo/TypeInfo.cpp:96:16: note: expanded from macro 'X'
#define X(str) XStr(str).unicodeForm()
               ^
/work/thirdparty/xerces-c/tests/src/DOM/TypeInfo/TypeInfo.cpp:581:51: warning: cast from 'const char16_t *' to 'char16_t *' drops const qualifier [-Wcast-qual]
    DOMTYPEINFOTEST(testEle->getSchemaTypeInfo(), X("level1"), X(""), __LINE__);
                                                  ^
/work/thirdparty/xerces-c/tests/src/DOM/TypeInfo/TypeInfo.cpp:96:16: note: expanded from macro 'X'
#define X(str) XStr(str).unicodeForm()
               ^
/work/thirdparty/xerces-c/tests/src/DOM/TypeInfo/TypeInfo.cpp:581:64: warning: cast from 'const char16_t *' to 'char16_t *' drops const qualifier [-Wcast-qual]
    DOMTYPEINFOTEST(testEle->getSchemaTypeInfo(), X("level1"), X(""), __LINE__);
                                                               ^
/work/thirdparty/xerces-c/tests/src/DOM/TypeInfo/TypeInfo.cpp:96:16: note: expanded from macro 'X'
#define X(str) XStr(str).unicodeForm()
               ^
/work/thirdparty/xerces-c/tests/src/DOM/TypeInfo/TypeInfo.cpp:584:51: warning: cast from 'const char16_t *' to 'char16_t *' drops const qualifier [-Wcast-qual]
    DOMTYPEINFOTEST(testEle->getSchemaTypeInfo(), X("level2"), X(""), __LINE__);
                                                  ^
/work/thirdparty/xerces-c/tests/src/DOM/TypeInfo/TypeInfo.cpp:96:16: note: expanded from macro 'X'
#define X(str) XStr(str).unicodeForm()
               ^
/work/thirdparty/xerces-c/tests/src/DOM/TypeInfo/TypeInfo.cpp:584:64: warning: cast from 'const char16_t *' to 'char16_t *' drops const qualifier [-Wcast-qual]
    DOMTYPEINFOTEST(testEle->getSchemaTypeInfo(), X("level2"), X(""), __LINE__);
                                                               ^
/work/thirdparty/xerces-c/tests/src/DOM/TypeInfo/TypeInfo.cpp:96:16: note: expanded from macro 'X'
#define X(str) XStr(str).unicodeForm()
               ^
/work/thirdparty/xerces-c/tests/src/DOM/TypeInfo/TypeInfo.cpp:587:51: warning: cast from 'const char16_t *' to 'char16_t *' drops const qualifier [-Wcast-qual]
    DOMTYPEINFOTEST(testEle->getSchemaTypeInfo(), X("baseComplex"), X(""), __LINE__);
                                                  ^
/work/thirdparty/xerces-c/tests/src/DOM/TypeInfo/TypeInfo.cpp:96:16: note: expanded from macro 'X'
#define X(str) XStr(str).unicodeForm()
               ^
/work/thirdparty/xerces-c/tests/src/DOM/TypeInfo/TypeInfo.cpp:587:69: warning: cast from 'const char16_t *' to 'char16_t *' drops const qualifier [-Wcast-qual]
    DOMTYPEINFOTEST(testEle->getSchemaTypeInfo(), X("baseComplex"), X(""), __LINE__);
                                                                    ^
/work/thirdparty/xerces-c/tests/src/DOM/TypeInfo/TypeInfo.cpp:96:16: note: expanded from macro 'X'
#define X(str) XStr(str).unicodeForm()
               ^
/work/thirdparty/xerces-c/tests/src/DOM/TypeInfo/TypeInfo.cpp:590:51: warning: cast from 'const char16_t *' to 'char16_t *' drops const qualifier [-Wcast-qual]
    DOMTYPEINFOTEST(testEle->getSchemaTypeInfo(), X("level1Complex"), X(""), __LINE__);
                                                  ^
/work/thirdparty/xerces-c/tests/src/DOM/TypeInfo/TypeInfo.cpp:96:16: note: expanded from macro 'X'
#define X(str) XStr(str).unicodeForm()
               ^
/work/thirdparty/xerces-c/tests/src/DOM/TypeInfo/TypeInfo.cpp:590:71: warning: cast from 'const char16_t *' to 'char16_t *' drops const qualifier [-Wcast-qual]
    DOMTYPEINFOTEST(testEle->getSchemaTypeInfo(), X("level1Complex"), X(""), __LINE__);
                                                                      ^
/work/thirdparty/xerces-c/tests/src/DOM/TypeInfo/TypeInfo.cpp:96:16: note: expanded from macro 'X'
#define X(str) XStr(str).unicodeForm()
               ^
/work/thirdparty/xerces-c/tests/src/DOM/TypeInfo/TypeInfo.cpp:593:51: warning: cast from 'const char16_t *' to 'char16_t *' drops const qualifier [-Wcast-qual]
    DOMTYPEINFOTEST(testEle->getSchemaTypeInfo(), X("level2Complex"), X(""), __LINE__);
                                                  ^
/work/thirdparty/xerces-c/tests/src/DOM/TypeInfo/TypeInfo.cpp:96:16: note: expanded from macro 'X'
#define X(str) XStr(str).unicodeForm()
               ^
/work/thirdparty/xerces-c/tests/src/DOM/TypeInfo/TypeInfo.cpp:593:71: warning: cast from 'const char16_t *' to 'char16_t *' drops const qualifier [-Wcast-qual]
    DOMTYPEINFOTEST(testEle->getSchemaTypeInfo(), X("level2Complex"), X(""), __LINE__);
                                                                      ^
/work/thirdparty/xerces-c/tests/src/DOM/TypeInfo/TypeInfo.cpp:96:16: note: expanded from macro 'X'
#define X(str) XStr(str).unicodeForm()
               ^
/work/thirdparty/xerces-c/tests/src/DOM/TypeInfo/TypeInfo.cpp:615:51: warning: cast from 'const char16_t *' to 'char16_t *' drops const qualifier [-Wcast-qual]
    DOMTYPEINFOTEST(testEle->getSchemaTypeInfo(), X("anyTestPartialType"), X(""), __LINE__);
                                                  ^
/work/thirdparty/xerces-c/tests/src/DOM/TypeInfo/TypeInfo.cpp:96:16: note: expanded from macro 'X'
#define X(str) XStr(str).unicodeForm()
               ^
/work/thirdparty/xerces-c/tests/src/DOM/TypeInfo/TypeInfo.cpp:615:76: warning: cast from 'const char16_t *' to 'char16_t *' drops const qualifier [-Wcast-qual]
    DOMTYPEINFOTEST(testEle->getSchemaTypeInfo(), X("anyTestPartialType"), X(""), __LINE__);
                                                                           ^
/work/thirdparty/xerces-c/tests/src/DOM/TypeInfo/TypeInfo.cpp:96:16: note: expanded from macro 'X'
#define X(str) XStr(str).unicodeForm()
               ^
/work/thirdparty/xerces-c/tests/src/DOM/TypeInfo/TypeInfo.cpp:624:51: warning: cast from 'const char16_t *' to 'char16_t *' drops const qualifier [-Wcast-qual]
    DOMTYPEINFOTEST(testEle->getSchemaTypeInfo(), SchemaSymbols::fgDT_STRING, SchemaSymbols::fgURI_SCHEMAFORSCHEMA, __LINE__);
                                                  ^
/work/thirdparty/xerces-c/tests/src/DOM/TypeInfo/TypeInfo.cpp:624:79: warning: cast from 'const char16_t *' to 'char16_t *' drops const qualifier [-Wcast-qual]
    DOMTYPEINFOTEST(testEle->getSchemaTypeInfo(), SchemaSymbols::fgDT_STRING, SchemaSymbols::fgURI_SCHEMAFORSCHEMA, __LINE__);
                                                                              ^
/work/thirdparty/xerces-c/tests/src/DOM/TypeInfo/TypeInfo.cpp:632:52: warning: cast from 'const char16_t *' to 'char16_t *' drops const qualifier [-Wcast-qual]
    DOMTYPEINFOTEST(testAttr->getSchemaTypeInfo(), SchemaSymbols::fgDT_STRING, SchemaSymbols::fgURI_SCHEMAFORSCHEMA, __LINE__);
                                                   ^
/work/thirdparty/xerces-c/tests/src/DOM/TypeInfo/TypeInfo.cpp:632:80: warning: cast from 'const char16_t *' to 'char16_t *' drops const qualifier [-Wcast-qual]
    DOMTYPEINFOTEST(testAttr->getSchemaTypeInfo(), SchemaSymbols::fgDT_STRING, SchemaSymbols::fgURI_SCHEMAFORSCHEMA, __LINE__);
                                                                               ^
/work/thirdparty/xerces-c/tests/src/DOM/TypeInfo/TypeInfo.cpp:635:52: warning: cast from 'const char16_t *' to 'char16_t *' drops const qualifier [-Wcast-qual]
    DOMTYPEINFOTEST(testAttr->getSchemaTypeInfo(), SchemaSymbols::fgDT_INTEGER, SchemaSymbols::fgURI_SCHEMAFORSCHEMA, __LINE__);
                                                   ^
/work/thirdparty/xerces-c/tests/src/DOM/TypeInfo/TypeInfo.cpp:635:81: warning: cast from 'const char16_t *' to 'char16_t *' drops const qualifier [-Wcast-qual]
    DOMTYPEINFOTEST(testAttr->getSchemaTypeInfo(), SchemaSymbols::fgDT_INTEGER, SchemaSymbols::fgURI_SCHEMAFORSCHEMA, __LINE__);
                                                                                ^
/work/thirdparty/xerces-c/tests/src/DOM/TypeInfo/TypeInfo.cpp:638:52: warning: cast from 'const char16_t *' to 'char16_t *' drops const qualifier [-Wcast-qual]
    DOMTYPEINFOTEST(testAttr->getSchemaTypeInfo(), SchemaSymbols::fgDT_STRING, SchemaSymbols::fgURI_SCHEMAFORSCHEMA, __LINE__);
                                                   ^
/work/thirdparty/xerces-c/tests/src/DOM/TypeInfo/TypeInfo.cpp:638:80: warning: cast from 'const char16_t *' to 'char16_t *' drops const qualifier [-Wcast-qual]
    DOMTYPEINFOTEST(testAttr->getSchemaTypeInfo(), SchemaSymbols::fgDT_STRING, SchemaSymbols::fgURI_SCHEMAFORSCHEMA, __LINE__);
                                                                               ^
/work/thirdparty/xerces-c/tests/src/DOM/TypeInfo/TypeInfo.cpp:641:52: warning: cast from 'const char16_t *' to 'char16_t *' drops const qualifier [-Wcast-qual]
    DOMTYPEINFOTEST(testAttr->getSchemaTypeInfo(), SchemaSymbols::fgDT_INTEGER, SchemaSymbols::fgURI_SCHEMAFORSCHEMA, __LINE__);
                                                   ^
/work/thirdparty/xerces-c/tests/src/DOM/TypeInfo/TypeInfo.cpp:641:81: warning: cast from 'const char16_t *' to 'char16_t *' drops const qualifier [-Wcast-qual]
    DOMTYPEINFOTEST(testAttr->getSchemaTypeInfo(), SchemaSymbols::fgDT_INTEGER, SchemaSymbols::fgURI_SCHEMAFORSCHEMA, __LINE__);
                                                                                ^
/work/thirdparty/xerces-c/tests/src/DOM/TypeInfo/TypeInfo.cpp:643:51: warning: cast from 'const char16_t *' to 'char16_t *' drops const qualifier [-Wcast-qual]
    DOMTYPEINFOTEST(testEle->getSchemaTypeInfo(), X("anyTestType"), X(""), __LINE__);
                                                  ^
/work/thirdparty/xerces-c/tests/src/DOM/TypeInfo/TypeInfo.cpp:96:16: note: expanded from macro 'X'
#define X(str) XStr(str).unicodeForm()
               ^
/work/thirdparty/xerces-c/tests/src/DOM/TypeInfo/TypeInfo.cpp:643:69: warning: cast from 'const char16_t *' to 'char16_t *' drops const qualifier [-Wcast-qual]
    DOMTYPEINFOTEST(testEle->getSchemaTypeInfo(), X("anyTestType"), X(""), __LINE__);
                                                                    ^
/work/thirdparty/xerces-c/tests/src/DOM/TypeInfo/TypeInfo.cpp:96:16: note: expanded from macro 'X'
#define X(str) XStr(str).unicodeForm()
               ^
/work/thirdparty/xerces-c/tests/src/DOM/TypeInfo/TypeInfo.cpp:646:51: warning: cast from 'const char16_t *' to 'char16_t *' drops const qualifier [-Wcast-qual]
    DOMTYPEINFOTEST(testEle->getSchemaTypeInfo(), SchemaSymbols::fgDT_STRING, SchemaSymbols::fgURI_SCHEMAFORSCHEMA, __LINE__);
                                                  ^
/work/thirdparty/xerces-c/tests/src/DOM/TypeInfo/TypeInfo.cpp:646:79: warning: cast from 'const char16_t *' to 'char16_t *' drops const qualifier [-Wcast-qual]
    DOMTYPEINFOTEST(testEle->getSchemaTypeInfo(), SchemaSymbols::fgDT_STRING, SchemaSymbols::fgURI_SCHEMAFORSCHEMA, __LINE__);
                                                                              ^
/work/thirdparty/xerces-c/tests/src/DOM/TypeInfo/TypeInfo.cpp:649:51: warning: cast from 'const char16_t *' to 'char16_t *' drops const qualifier [-Wcast-qual]
    DOMTYPEINFOTEST(testEle->getSchemaTypeInfo(), SchemaSymbols::fgDT_STRING, SchemaSymbols::fgURI_SCHEMAFORSCHEMA, __LINE__);
                                                  ^
/work/thirdparty/xerces-c/tests/src/DOM/TypeInfo/TypeInfo.cpp:649:79: warning: cast from 'const char16_t *' to 'char16_t *' drops const qualifier [-Wcast-qual]
    DOMTYPEINFOTEST(testEle->getSchemaTypeInfo(), SchemaSymbols::fgDT_STRING, SchemaSymbols::fgURI_SCHEMAFORSCHEMA, __LINE__);
                                                                              ^
/work/thirdparty/xerces-c/tests/src/DOM/TypeInfo/TypeInfo.cpp:671:51: warning: cast from 'const char16_t *' to 'char16_t *' drops const qualifier [-Wcast-qual]
    DOMTYPEINFOTEST(testEle->getSchemaTypeInfo(), X("anyTestType"), X(""), __LINE__);
                                                  ^
/work/thirdparty/xerces-c/tests/src/DOM/TypeInfo/TypeInfo.cpp:96:16: note: expanded from macro 'X'
#define X(str) XStr(str).unicodeForm()
               ^
/work/thirdparty/xerces-c/tests/src/DOM/TypeInfo/TypeInfo.cpp:671:69: warning: cast from 'const char16_t *' to 'char16_t *' drops const qualifier [-Wcast-qual]
    DOMTYPEINFOTEST(testEle->getSchemaTypeInfo(), X("anyTestType"), X(""), __LINE__);
                                                                    ^
/work/thirdparty/xerces-c/tests/src/DOM/TypeInfo/TypeInfo.cpp:96:16: note: expanded from macro 'X'
#define X(str) XStr(str).unicodeForm()
               ^
/work/thirdparty/xerces-c/tests/src/DOM/TypeInfo/TypeInfo.cpp:685:66: warning: cast from 'const char16_t *' to 'char16_t *' drops const qualifier [-Wcast-qual]
    DOMTYPEINFOTEST(((DOMElement *)docEle)->getSchemaTypeInfo(), X("rootType"), X(""), __LINE__);
                                                                 ^
/work/thirdparty/xerces-c/tests/src/DOM/TypeInfo/TypeInfo.cpp:96:16: note: expanded from macro 'X'
#define X(str) XStr(str).unicodeForm()
               ^
/work/thirdparty/xerces-c/tests/src/DOM/TypeInfo/TypeInfo.cpp:685:81: warning: cast from 'const char16_t *' to 'char16_t *' drops const qualifier [-Wcast-qual]
    DOMTYPEINFOTEST(((DOMElement *)docEle)->getSchemaTypeInfo(), X("rootType"), X(""), __LINE__);
                                                                                ^
/work/thirdparty/xerces-c/tests/src/DOM/TypeInfo/TypeInfo.cpp:96:16: note: expanded from macro 'X'
#define X(str) XStr(str).unicodeForm()
               ^
/work/thirdparty/xerces-c/tests/src/DOM/TypeInfo/TypeInfo.cpp:691:52: warning: cast from 'const char16_t *' to 'char16_t *' drops const qualifier [-Wcast-qual]
    DOMTYPEINFOTEST(testAttr->getSchemaTypeInfo(), X("stringDerivedType"), X(""), __LINE__);
                                                   ^
/work/thirdparty/xerces-c/tests/src/DOM/TypeInfo/TypeInfo.cpp:96:16: note: expanded from macro 'X'
#define X(str) XStr(str).unicodeForm()
               ^
/work/thirdparty/xerces-c/tests/src/DOM/TypeInfo/TypeInfo.cpp:691:76: warning: cast from 'const char16_t *' to 'char16_t *' drops const qualifier [-Wcast-qual]
    DOMTYPEINFOTEST(testAttr->getSchemaTypeInfo(), X("stringDerivedType"), X(""), __LINE__);
                                                                           ^
/work/thirdparty/xerces-c/tests/src/DOM/TypeInfo/TypeInfo.cpp:96:16: note: expanded from macro 'X'
#define X(str) XStr(str).unicodeForm()
               ^
/work/thirdparty/xerces-c/tests/src/DOM/TypeInfo/TypeInfo.cpp:697:51: warning: cast from 'const char16_t *' to 'char16_t *' drops const qualifier [-Wcast-qual]
    DOMTYPEINFOTEST(testEle->getSchemaTypeInfo(), X("stringDerivedType"), X(""), __LINE__);
                                                  ^
/work/thirdparty/xerces-c/tests/src/DOM/TypeInfo/TypeInfo.cpp:96:16: note: expanded from macro 'X'
#define X(str) XStr(str).unicodeForm()
               ^
/work/thirdparty/xerces-c/tests/src/DOM/TypeInfo/TypeInfo.cpp:697:75: warning: cast from 'const char16_t *' to 'char16_t *' drops const qualifier [-Wcast-qual]
    DOMTYPEINFOTEST(testEle->getSchemaTypeInfo(), X("stringDerivedType"), X(""), __LINE__);
                                                                          ^
/work/thirdparty/xerces-c/tests/src/DOM/TypeInfo/TypeInfo.cpp:96:16: note: expanded from macro 'X'
#define X(str) XStr(str).unicodeForm()
               ^
/work/thirdparty/xerces-c/tests/src/DOM/TypeInfo/TypeInfo.cpp:700:51: warning: cast from 'const char16_t *' to 'char16_t *' drops const qualifier [-Wcast-qual]
    DOMTYPEINFOTEST(testEle->getSchemaTypeInfo(), X("baseComplex"), X(""), __LINE__);
                                                  ^
/work/thirdparty/xerces-c/tests/src/DOM/TypeInfo/TypeInfo.cpp:96:16: note: expanded from macro 'X'
#define X(str) XStr(str).unicodeForm()
               ^
/work/thirdparty/xerces-c/tests/src/DOM/TypeInfo/TypeInfo.cpp:700:69: warning: cast from 'const char16_t *' to 'char16_t *' drops const qualifier [-Wcast-qual]
    DOMTYPEINFOTEST(testEle->getSchemaTypeInfo(), X("baseComplex"), X(""), __LINE__);
                                                                    ^
/work/thirdparty/xerces-c/tests/src/DOM/TypeInfo/TypeInfo.cpp:96:16: note: expanded from macro 'X'
#define X(str) XStr(str).unicodeForm()
               ^
/work/thirdparty/xerces-c/tests/src/DOM/TypeInfo/TypeInfo.cpp:704:51: warning: cast from 'const char16_t *' to 'char16_t *' drops const qualifier [-Wcast-qual]
    DOMTYPEINFOTEST(testEle->getSchemaTypeInfo(), X("stringDerivedType"), X(""), __LINE__);
                                                  ^
/work/thirdparty/xerces-c/tests/src/DOM/TypeInfo/TypeInfo.cpp:96:16: note: expanded from macro 'X'
#define X(str) XStr(str).unicodeForm()
               ^
/work/thirdparty/xerces-c/tests/src/DOM/TypeInfo/TypeInfo.cpp:704:75: warning: cast from 'const char16_t *' to 'char16_t *' drops const qualifier [-Wcast-qual]
    DOMTYPEINFOTEST(testEle->getSchemaTypeInfo(), X("stringDerivedType"), X(""), __LINE__);
                                                                          ^
/work/thirdparty/xerces-c/tests/src/DOM/TypeInfo/TypeInfo.cpp:96:16: note: expanded from macro 'X'
#define X(str) XStr(str).unicodeForm()
               ^
/work/thirdparty/xerces-c/tests/src/DOM/TypeInfo/TypeInfo.cpp:707:51: warning: cast from 'const char16_t *' to 'char16_t *' drops const qualifier [-Wcast-qual]
    DOMTYPEINFOTEST(testEle->getSchemaTypeInfo(), X("baseComplex"), X(""), __LINE__);
                                                  ^
/work/thirdparty/xerces-c/tests/src/DOM/TypeInfo/TypeInfo.cpp:96:16: note: expanded from macro 'X'
#define X(str) XStr(str).unicodeForm()
               ^
/work/thirdparty/xerces-c/tests/src/DOM/TypeInfo/TypeInfo.cpp:707:69: warning: cast from 'const char16_t *' to 'char16_t *' drops const qualifier [-Wcast-qual]
    DOMTYPEINFOTEST(testEle->getSchemaTypeInfo(), X("baseComplex"), X(""), __LINE__);
                                                                    ^
/work/thirdparty/xerces-c/tests/src/DOM/TypeInfo/TypeInfo.cpp:96:16: note: expanded from macro 'X'
#define X(str) XStr(str).unicodeForm()
               ^
/work/thirdparty/xerces-c/tests/src/DOM/TypeInfo/TypeInfo.cpp:710:51: warning: cast from 'const char16_t *' to 'char16_t *' drops const qualifier [-Wcast-qual]
    DOMTYPEINFOTEST(testEle->getSchemaTypeInfo(), X("uType"), X(""), __LINE__);
                                                  ^
/work/thirdparty/xerces-c/tests/src/DOM/TypeInfo/TypeInfo.cpp:96:16: note: expanded from macro 'X'
#define X(str) XStr(str).unicodeForm()
               ^
/work/thirdparty/xerces-c/tests/src/DOM/TypeInfo/TypeInfo.cpp:710:63: warning: cast from 'const char16_t *' to 'char16_t *' drops const qualifier [-Wcast-qual]
    DOMTYPEINFOTEST(testEle->getSchemaTypeInfo(), X("uType"), X(""), __LINE__);
                                                              ^
/work/thirdparty/xerces-c/tests/src/DOM/TypeInfo/TypeInfo.cpp:96:16: note: expanded from macro 'X'
#define X(str) XStr(str).unicodeForm()
               ^
/work/thirdparty/xerces-c/tests/src/DOM/TypeInfo/TypeInfo.cpp:719:51: warning: cast from 'const char16_t *' to 'char16_t *' drops const qualifier [-Wcast-qual]
    DOMTYPEINFOTEST(testEle->getSchemaTypeInfo(), X("attrOnlyType"), X(""), __LINE__);
                                                  ^
/work/thirdparty/xerces-c/tests/src/DOM/TypeInfo/TypeInfo.cpp:96:16: note: expanded from macro 'X'
#define X(str) XStr(str).unicodeForm()
               ^
/work/thirdparty/xerces-c/tests/src/DOM/TypeInfo/TypeInfo.cpp:719:70: warning: cast from 'const char16_t *' to 'char16_t *' drops const qualifier [-Wcast-qual]
    DOMTYPEINFOTEST(testEle->getSchemaTypeInfo(), X("attrOnlyType"), X(""), __LINE__);
                                                                     ^
/work/thirdparty/xerces-c/tests/src/DOM/TypeInfo/TypeInfo.cpp:96:16: note: expanded from macro 'X'
#define X(str) XStr(str).unicodeForm()
               ^
/work/thirdparty/xerces-c/tests/src/DOM/TypeInfo/TypeInfo.cpp:722:51: warning: cast from 'const char16_t *' to 'char16_t *' drops const qualifier [-Wcast-qual]
    DOMTYPEINFOTEST(testEle->getSchemaTypeInfo(), X("attrOnlyType"), X(""), __LINE__);
                                                  ^
/work/thirdparty/xerces-c/tests/src/DOM/TypeInfo/TypeInfo.cpp:96:16: note: expanded from macro 'X'
#define X(str) XStr(str).unicodeForm()
               ^
/work/thirdparty/xerces-c/tests/src/DOM/TypeInfo/TypeInfo.cpp:722:70: warning: cast from 'const char16_t *' to 'char16_t *' drops const qualifier [-Wcast-qual]
    DOMTYPEINFOTEST(testEle->getSchemaTypeInfo(), X("attrOnlyType"), X(""), __LINE__);
                                                                     ^
/work/thirdparty/xerces-c/tests/src/DOM/TypeInfo/TypeInfo.cpp:96:16: note: expanded from macro 'X'
#define X(str) XStr(str).unicodeForm()
               ^
/work/thirdparty/xerces-c/tests/src/DOM/TypeInfo/TypeInfo.cpp:725:51: warning: cast from 'const char16_t *' to 'char16_t *' drops const qualifier [-Wcast-qual]
    DOMTYPEINFOTEST(testEle->getSchemaTypeInfo(), X("prohibitedAttrType"), X(""), __LINE__);
                                                  ^
/work/thirdparty/xerces-c/tests/src/DOM/TypeInfo/TypeInfo.cpp:96:16: note: expanded from macro 'X'
#define X(str) XStr(str).unicodeForm()
               ^
/work/thirdparty/xerces-c/tests/src/DOM/TypeInfo/TypeInfo.cpp:725:76: warning: cast from 'const char16_t *' to 'char16_t *' drops const qualifier [-Wcast-qual]
    DOMTYPEINFOTEST(testEle->getSchemaTypeInfo(), X("prohibitedAttrType"), X(""), __LINE__);
                                                                           ^
/work/thirdparty/xerces-c/tests/src/DOM/TypeInfo/TypeInfo.cpp:96:16: note: expanded from macro 'X'
#define X(str) XStr(str).unicodeForm()
               ^
/work/thirdparty/xerces-c/tests/src/DOM/TypeInfo/TypeInfo.cpp:742:51: warning: cast from 'const char16_t *' to 'char16_t *' drops const qualifier [-Wcast-qual]
    DOMTYPEINFOTEST(testEle->getSchemaTypeInfo(), X(""), X(""), __LINE__);
                                                  ^
/work/thirdparty/xerces-c/tests/src/DOM/TypeInfo/TypeInfo.cpp:96:16: note: expanded from macro 'X'
#define X(str) XStr(str).unicodeForm()
               ^
/work/thirdparty/xerces-c/tests/src/DOM/TypeInfo/TypeInfo.cpp:742:58: warning: cast from 'const char16_t *' to 'char16_t *' drops const qualifier [-Wcast-qual]
    DOMTYPEINFOTEST(testEle->getSchemaTypeInfo(), X(""), X(""), __LINE__);
                                                         ^
/work/thirdparty/xerces-c/tests/src/DOM/TypeInfo/TypeInfo.cpp:96:16: note: expanded from macro 'X'
#define X(str) XStr(str).unicodeForm()
               ^
/work/thirdparty/xerces-c/tests/src/DOM/TypeInfo/TypeInfo.cpp:745:52: warning: cast from 'const char16_t *' to 'char16_t *' drops const qualifier [-Wcast-qual]
    DOMTYPEINFOTEST(testAttr->getSchemaTypeInfo(), X("CDATA"), X("http://www.w3.org/TR/REC-xml"), __LINE__);
                                                   ^
/work/thirdparty/xerces-c/tests/src/DOM/TypeInfo/TypeInfo.cpp:96:16: note: expanded from macro 'X'
#define X(str) XStr(str).unicodeForm()
               ^
/work/thirdparty/xerces-c/tests/src/DOM/TypeInfo/TypeInfo.cpp:745:64: warning: cast from 'const char16_t *' to 'char16_t *' drops const qualifier [-Wcast-qual]
    DOMTYPEINFOTEST(testAttr->getSchemaTypeInfo(), X("CDATA"), X("http://www.w3.org/TR/REC-xml"), __LINE__);
                                                               ^
/work/thirdparty/xerces-c/tests/src/DOM/TypeInfo/TypeInfo.cpp:96:16: note: expanded from macro 'X'
#define X(str) XStr(str).unicodeForm()
               ^
/work/thirdparty/xerces-c/tests/src/DOM/TypeInfo/TypeInfo.cpp:748:52: warning: cast from 'const char16_t *' to 'char16_t *' drops const qualifier [-Wcast-qual]
    DOMTYPEINFOTEST(testAttr->getSchemaTypeInfo(), X("ENUMERATION"), X("http://www.w3.org/TR/REC-xml"), __LINE__);
                                                   ^
/work/thirdparty/xerces-c/tests/src/DOM/TypeInfo/TypeInfo.cpp:96:16: note: expanded from macro 'X'
#define X(str) XStr(str).unicodeForm()
               ^
/work/thirdparty/xerces-c/tests/src/DOM/TypeInfo/TypeInfo.cpp:748:70: warning: cast from 'const char16_t *' to 'char16_t *' drops const qualifier [-Wcast-qual]
    DOMTYPEINFOTEST(testAttr->getSchemaTypeInfo(), X("ENUMERATION"), X("http://www.w3.org/TR/REC-xml"), __LINE__);
                                                                     ^
/work/thirdparty/xerces-c/tests/src/DOM/TypeInfo/TypeInfo.cpp:96:16: note: expanded from macro 'X'
#define X(str) XStr(str).unicodeForm()
               ^
/work/thirdparty/xerces-c/tests/src/DOM/TypeInfo/TypeInfo.cpp:751:52: warning: cast from 'const char16_t *' to 'char16_t *' drops const qualifier [-Wcast-qual]
    DOMTYPEINFOTEST(testAttr->getSchemaTypeInfo(), X("ID"), X("http://www.w3.org/TR/REC-xml"), __LINE__);
                                                   ^
/work/thirdparty/xerces-c/tests/src/DOM/TypeInfo/TypeInfo.cpp:96:16: note: expanded from macro 'X'
#define X(str) XStr(str).unicodeForm()
               ^
/work/thirdparty/xerces-c/tests/src/DOM/TypeInfo/TypeInfo.cpp:751:61: warning: cast from 'const char16_t *' to 'char16_t *' drops const qualifier [-Wcast-qual]
    DOMTYPEINFOTEST(testAttr->getSchemaTypeInfo(), X("ID"), X("http://www.w3.org/TR/REC-xml"), __LINE__);
                                                            ^
/work/thirdparty/xerces-c/tests/src/DOM/TypeInfo/TypeInfo.cpp:96:16: note: expanded from macro 'X'
#define X(str) XStr(str).unicodeForm()
               ^
/work/thirdparty/xerces-c/tests/src/DOM/TypeInfo/TypeInfo.cpp:754:52: warning: cast from 'const char16_t *' to 'char16_t *' drops const qualifier [-Wcast-qual]
    DOMTYPEINFOTEST(testAttr->getSchemaTypeInfo(), X("IDREF"), X("http://www.w3.org/TR/REC-xml"), __LINE__);
                                                   ^
/work/thirdparty/xerces-c/tests/src/DOM/TypeInfo/TypeInfo.cpp:96:16: note: expanded from macro 'X'
#define X(str) XStr(str).unicodeForm()
               ^
/work/thirdparty/xerces-c/tests/src/DOM/TypeInfo/TypeInfo.cpp:754:64: warning: cast from 'const char16_t *' to 'char16_t *' drops const qualifier [-Wcast-qual]
    DOMTYPEINFOTEST(testAttr->getSchemaTypeInfo(), X("IDREF"), X("http://www.w3.org/TR/REC-xml"), __LINE__);
                                                               ^
/work/thirdparty/xerces-c/tests/src/DOM/TypeInfo/TypeInfo.cpp:96:16: note: expanded from macro 'X'
#define X(str) XStr(str).unicodeForm()
               ^
/work/thirdparty/xerces-c/tests/src/DOM/TypeInfo/TypeInfo.cpp:757:52: warning: cast from 'const char16_t *' to 'char16_t *' drops const qualifier [-Wcast-qual]
    DOMTYPEINFOTEST(testAttr->getSchemaTypeInfo(), X("IDREFS"), X("http://www.w3.org/TR/REC-xml"), __LINE__);
                                                   ^
/work/thirdparty/xerces-c/tests/src/DOM/TypeInfo/TypeInfo.cpp:96:16: note: expanded from macro 'X'
#define X(str) XStr(str).unicodeForm()
               ^
/work/thirdparty/xerces-c/tests/src/DOM/TypeInfo/TypeInfo.cpp:757:65: warning: cast from 'const char16_t *' to 'char16_t *' drops const qualifier [-Wcast-qual]
    DOMTYPEINFOTEST(testAttr->getSchemaTypeInfo(), X("IDREFS"), X("http://www.w3.org/TR/REC-xml"), __LINE__);
                                                                ^
/work/thirdparty/xerces-c/tests/src/DOM/TypeInfo/TypeInfo.cpp:96:16: note: expanded from macro 'X'
#define X(str) XStr(str).unicodeForm()
               ^
/work/thirdparty/xerces-c/tests/src/DOM/TypeInfo/TypeInfo.cpp:760:52: warning: cast from 'const char16_t *' to 'char16_t *' drops const qualifier [-Wcast-qual]
    DOMTYPEINFOTEST(testAttr->getSchemaTypeInfo(), X("NMTOKEN"), X("http://www.w3.org/TR/REC-xml"), __LINE__);
                                                   ^
/work/thirdparty/xerces-c/tests/src/DOM/TypeInfo/TypeInfo.cpp:96:16: note: expanded from macro 'X'
#define X(str) XStr(str).unicodeForm()
               ^
/work/thirdparty/xerces-c/tests/src/DOM/TypeInfo/TypeInfo.cpp:760:66: warning: cast from 'const char16_t *' to 'char16_t *' drops const qualifier [-Wcast-qual]
    DOMTYPEINFOTEST(testAttr->getSchemaTypeInfo(), X("NMTOKEN"), X("http://www.w3.org/TR/REC-xml"), __LINE__);
                                                                 ^
/work/thirdparty/xerces-c/tests/src/DOM/TypeInfo/TypeInfo.cpp:96:16: note: expanded from macro 'X'
#define X(str) XStr(str).unicodeForm()
               ^
/work/thirdparty/xerces-c/tests/src/DOM/TypeInfo/TypeInfo.cpp:763:52: warning: cast from 'const char16_t *' to 'char16_t *' drops const qualifier [-Wcast-qual]
    DOMTYPEINFOTEST(testAttr->getSchemaTypeInfo(), X("NMTOKEN"), X("http://www.w3.org/TR/REC-xml"), __LINE__);
                                                   ^
/work/thirdparty/xerces-c/tests/src/DOM/TypeInfo/TypeInfo.cpp:96:16: note: expanded from macro 'X'
#define X(str) XStr(str).unicodeForm()
               ^
/work/thirdparty/xerces-c/tests/src/DOM/TypeInfo/TypeInfo.cpp:763:66: warning: cast from 'const char16_t *' to 'char16_t *' drops const qualifier [-Wcast-qual]
    DOMTYPEINFOTEST(testAttr->getSchemaTypeInfo(), X("NMTOKEN"), X("http://www.w3.org/TR/REC-xml"), __LINE__);
                                                                 ^
/work/thirdparty/xerces-c/tests/src/DOM/TypeInfo/TypeInfo.cpp:96:16: note: expanded from macro 'X'
#define X(str) XStr(str).unicodeForm()
               ^
/work/thirdparty/xerces-c/tests/src/DOM/TypeInfo/TypeInfo.cpp:766:52: warning: cast from 'const char16_t *' to 'char16_t *' drops const qualifier [-Wcast-qual]
    DOMTYPEINFOTEST(testAttr->getSchemaTypeInfo(), X("NMTOKEN"), X("http://www.w3.org/TR/REC-xml"), __LINE__);
                                                   ^
/work/thirdparty/xerces-c/tests/src/DOM/TypeInfo/TypeInfo.cpp:96:16: note: expanded from macro 'X'
#define X(str) XStr(str).unicodeForm()
               ^
/work/thirdparty/xerces-c/tests/src/DOM/TypeInfo/TypeInfo.cpp:766:66: warning: cast from 'const char16_t *' to 'char16_t *' drops const qualifier [-Wcast-qual]
    DOMTYPEINFOTEST(testAttr->getSchemaTypeInfo(), X("NMTOKEN"), X("http://www.w3.org/TR/REC-xml"), __LINE__);
                                                                 ^
/work/thirdparty/xerces-c/tests/src/DOM/TypeInfo/TypeInfo.cpp:96:16: note: expanded from macro 'X'
#define X(str) XStr(str).unicodeForm()
               ^
/work/thirdparty/xerces-c/tests/src/DOM/TypeInfo/TypeInfo.cpp:769:52: warning: cast from 'const char16_t *' to 'char16_t *' drops const qualifier [-Wcast-qual]
    DOMTYPEINFOTEST(testAttr->getSchemaTypeInfo(), X("NMTOKENS"), X("http://www.w3.org/TR/REC-xml"), __LINE__);
                                                   ^
/work/thirdparty/xerces-c/tests/src/DOM/TypeInfo/TypeInfo.cpp:96:16: note: expanded from macro 'X'
#define X(str) XStr(str).unicodeForm()
               ^
/work/thirdparty/xerces-c/tests/src/DOM/TypeInfo/TypeInfo.cpp:769:67: warning: cast from 'const char16_t *' to 'char16_t *' drops const qualifier [-Wcast-qual]
    DOMTYPEINFOTEST(testAttr->getSchemaTypeInfo(), X("NMTOKENS"), X("http://www.w3.org/TR/REC-xml"), __LINE__);
                                                                  ^
/work/thirdparty/xerces-c/tests/src/DOM/TypeInfo/TypeInfo.cpp:96:16: note: expanded from macro 'X'
#define X(str) XStr(str).unicodeForm()
               ^
/work/thirdparty/xerces-c/tests/src/DOM/TypeInfo/TypeInfo.cpp:772:52: warning: cast from 'const char16_t *' to 'char16_t *' drops const qualifier [-Wcast-qual]
    DOMTYPEINFOTEST(testAttr->getSchemaTypeInfo(), X("ENTITY"), X("http://www.w3.org/TR/REC-xml"), __LINE__);
                                                   ^
/work/thirdparty/xerces-c/tests/src/DOM/TypeInfo/TypeInfo.cpp:96:16: note: expanded from macro 'X'
#define X(str) XStr(str).unicodeForm()
               ^
/work/thirdparty/xerces-c/tests/src/DOM/TypeInfo/TypeInfo.cpp:772:65: warning: cast from 'const char16_t *' to 'char16_t *' drops const qualifier [-Wcast-qual]
    DOMTYPEINFOTEST(testAttr->getSchemaTypeInfo(), X("ENTITY"), X("http://www.w3.org/TR/REC-xml"), __LINE__);
                                                                ^
/work/thirdparty/xerces-c/tests/src/DOM/TypeInfo/TypeInfo.cpp:96:16: note: expanded from macro 'X'
#define X(str) XStr(str).unicodeForm()
               ^
/work/thirdparty/xerces-c/tests/src/DOM/TypeInfo/TypeInfo.cpp:775:52: warning: cast from 'const char16_t *' to 'char16_t *' drops const qualifier [-Wcast-qual]
    DOMTYPEINFOTEST(testAttr->getSchemaTypeInfo(), X("ENTITIES"), X("http://www.w3.org/TR/REC-xml"), __LINE__);
                                                   ^
/work/thirdparty/xerces-c/tests/src/DOM/TypeInfo/TypeInfo.cpp:96:16: note: expanded from macro 'X'
#define X(str) XStr(str).unicodeForm()
               ^
/work/thirdparty/xerces-c/tests/src/DOM/TypeInfo/TypeInfo.cpp:775:67: warning: cast from 'const char16_t *' to 'char16_t *' drops const qualifier [-Wcast-qual]
    DOMTYPEINFOTEST(testAttr->getSchemaTypeInfo(), X("ENTITIES"), X("http://www.w3.org/TR/REC-xml"), __LINE__);
                                                                  ^
/work/thirdparty/xerces-c/tests/src/DOM/TypeInfo/TypeInfo.cpp:96:16: note: expanded from macro 'X'
#define X(str) XStr(str).unicodeForm()
               ^
/work/thirdparty/xerces-c/tests/src/DOM/TypeInfo/TypeInfo.cpp:778:52: warning: cast from 'const char16_t *' to 'char16_t *' drops const qualifier [-Wcast-qual]
    DOMTYPEINFOTEST(testAttr->getSchemaTypeInfo(), X("NOTATION"), X("http://www.w3.org/TR/REC-xml"), __LINE__);
                                                   ^
/work/thirdparty/xerces-c/tests/src/DOM/TypeInfo/TypeInfo.cpp:96:16: note: expanded from macro 'X'
#define X(str) XStr(str).unicodeForm()
               ^
/work/thirdparty/xerces-c/tests/src/DOM/TypeInfo/TypeInfo.cpp:778:67: warning: cast from 'const char16_t *' to 'char16_t *' drops const qualifier [-Wcast-qual]
    DOMTYPEINFOTEST(testAttr->getSchemaTypeInfo(), X("NOTATION"), X("http://www.w3.org/TR/REC-xml"), __LINE__);
                                                                  ^
/work/thirdparty/xerces-c/tests/src/DOM/TypeInfo/TypeInfo.cpp:96:16: note: expanded from macro 'X'
#define X(str) XStr(str).unicodeForm()
               ^
/work/thirdparty/xerces-c/tests/src/DOM/TypeInfo/TypeInfo.cpp:781:52: warning: cast from 'const char16_t *' to 'char16_t *' drops const qualifier [-Wcast-qual]
    DOMTYPEINFOTEST(testAttr->getSchemaTypeInfo(), X("CDATA"), X("http://www.w3.org/TR/REC-xml"), __LINE__);
                                                   ^
/work/thirdparty/xerces-c/tests/src/DOM/TypeInfo/TypeInfo.cpp:96:16: note: expanded from macro 'X'
#define X(str) XStr(str).unicodeForm()
               ^
/work/thirdparty/xerces-c/tests/src/DOM/TypeInfo/TypeInfo.cpp:781:64: warning: cast from 'const char16_t *' to 'char16_t *' drops const qualifier [-Wcast-qual]
    DOMTYPEINFOTEST(testAttr->getSchemaTypeInfo(), X("CDATA"), X("http://www.w3.org/TR/REC-xml"), __LINE__);
                                                               ^
/work/thirdparty/xerces-c/tests/src/DOM/TypeInfo/TypeInfo.cpp:96:16: note: expanded from macro 'X'
#define X(str) XStr(str).unicodeForm()
               ^
/work/thirdparty/xerces-c/tests/src/DOM/TypeInfo/TypeInfo.cpp:784:52: warning: cast from 'const char16_t *' to 'char16_t *' drops const qualifier [-Wcast-qual]
    DOMTYPEINFOTEST(testAttr->getSchemaTypeInfo(), X("CDATA"), X("http://www.w3.org/TR/REC-xml"), __LINE__);
                                                   ^
/work/thirdparty/xerces-c/tests/src/DOM/TypeInfo/TypeInfo.cpp:96:16: note: expanded from macro 'X'
#define X(str) XStr(str).unicodeForm()
               ^
/work/thirdparty/xerces-c/tests/src/DOM/TypeInfo/TypeInfo.cpp:784:64: warning: cast from 'const char16_t *' to 'char16_t *' drops const qualifier [-Wcast-qual]
    DOMTYPEINFOTEST(testAttr->getSchemaTypeInfo(), X("CDATA"), X("http://www.w3.org/TR/REC-xml"), __LINE__);
                                                               ^
/work/thirdparty/xerces-c/tests/src/DOM/TypeInfo/TypeInfo.cpp:96:16: note: expanded from macro 'X'
#define X(str) XStr(str).unicodeForm()
               ^
/work/thirdparty/xerces-c/tests/src/DOM/TypeInfo/TypeInfo.cpp:797:51: warning: cast from 'const char16_t *' to 'char16_t *' drops const qualifier [-Wcast-qual]
    DOMTYPEINFOTEST(testEle->getSchemaTypeInfo(), X("rootType"), X(""), __LINE__);
                                                  ^
/work/thirdparty/xerces-c/tests/src/DOM/TypeInfo/TypeInfo.cpp:96:16: note: expanded from macro 'X'
#define X(str) XStr(str).unicodeForm()
               ^
/work/thirdparty/xerces-c/tests/src/DOM/TypeInfo/TypeInfo.cpp:797:66: warning: cast from 'const char16_t *' to 'char16_t *' drops const qualifier [-Wcast-qual]
    DOMTYPEINFOTEST(testEle->getSchemaTypeInfo(), X("rootType"), X(""), __LINE__);
                                                                 ^
/work/thirdparty/xerces-c/tests/src/DOM/TypeInfo/TypeInfo.cpp:96:16: note: expanded from macro 'X'
#define X(str) XStr(str).unicodeForm()
               ^
/work/thirdparty/xerces-c/tests/src/DOM/TypeInfo/TypeInfo.cpp:800:52: warning: cast from 'const char16_t *' to 'char16_t *' drops const qualifier [-Wcast-qual]
    DOMTYPEINFOTEST(testAttr->getSchemaTypeInfo(), SchemaSymbols::fgDT_STRING, SchemaSymbols::fgURI_SCHEMAFORSCHEMA, __LINE__);
                                                   ^
/work/thirdparty/xerces-c/tests/src/DOM/TypeInfo/TypeInfo.cpp:800:80: warning: cast from 'const char16_t *' to 'char16_t *' drops const qualifier [-Wcast-qual]
    DOMTYPEINFOTEST(testAttr->getSchemaTypeInfo(), SchemaSymbols::fgDT_STRING, SchemaSymbols::fgURI_SCHEMAFORSCHEMA, __LINE__);
                                                                               ^
/work/thirdparty/xerces-c/tests/src/DOM/TypeInfo/TypeInfo.cpp:803:52: warning: cast from 'const char16_t *' to 'char16_t *' drops const qualifier [-Wcast-qual]
    DOMTYPEINFOTEST(testAttr->getSchemaTypeInfo(), SchemaSymbols::fgDT_STRING, SchemaSymbols::fgURI_SCHEMAFORSCHEMA, __LINE__);
                                                   ^
/work/thirdparty/xerces-c/tests/src/DOM/TypeInfo/TypeInfo.cpp:803:80: warning: cast from 'const char16_t *' to 'char16_t *' drops const qualifier [-Wcast-qual]
    DOMTYPEINFOTEST(testAttr->getSchemaTypeInfo(), SchemaSymbols::fgDT_STRING, SchemaSymbols::fgURI_SCHEMAFORSCHEMA, __LINE__);
                                                                               ^
/work/thirdparty/xerces-c/tests/src/DOM/TypeInfo/TypeInfo.cpp:809:51: warning: cast from 'const char16_t *' to 'char16_t *' drops const qualifier [-Wcast-qual]
    DOMTYPEINFOTEST(testEle->getSchemaTypeInfo(), SchemaSymbols::fgDT_STRING, SchemaSymbols::fgURI_SCHEMAFORSCHEMA, __LINE__);
                                                  ^
/work/thirdparty/xerces-c/tests/src/DOM/TypeInfo/TypeInfo.cpp:809:79: warning: cast from 'const char16_t *' to 'char16_t *' drops const qualifier [-Wcast-qual]
    DOMTYPEINFOTEST(testEle->getSchemaTypeInfo(), SchemaSymbols::fgDT_STRING, SchemaSymbols::fgURI_SCHEMAFORSCHEMA, __LINE__);
                                                                              ^
/work/thirdparty/xerces-c/tests/src/DOM/TypeInfo/TypeInfo.cpp:848:9: warning: bool literal returned from 'main' [-Wmain]
        return false;
        ^      ~~~~~
/work/thirdparty/xerces-c/tests/src/DOM/TypeInfo/TypeInfo.cpp:882:9: warning: bool literal returned from 'main' [-Wmain]
        return false;
        ^      ~~~~~
/work/thirdparty/xerces-c/tests/src/DOM/TypeInfo/TypeInfo.cpp:914:9: warning: bool literal returned from 'main' [-Wmain]
        return false;
        ^      ~~~~~
/work/thirdparty/xerces-c/tests/src/DOM/TypeInfo/TypeInfo.cpp:939:9: warning: bool literal returned from 'main' [-Wmain]
        return false;
        ^      ~~~~~
/work/thirdparty/xerces-c/tests/src/DOM/TypeInfo/TypeInfo.cpp:963:9: warning: bool literal returned from 'main' [-Wmain]
        return false;
        ^      ~~~~~
317 warnings generated.
[ 85%] Linking CXX executable DOMTypeInfoTest
/work/thirdparty/xerces-c/tests/src/XSTSHarness/XSTSHarness.cpp:198:48: warning: cast from 'const char *' to 'unsigned char *' drops const qualifier [-Wcast-qual]
        return new MemBufInputSource((XMLByte*)xmlXsd, strlen(xmlXsd), "");
                                               ^
[ 85%] Linking CXX executable InitTermTest
2 warnings generated.
[ 85%] Building CXX object tests/CMakeFiles/XSTSHarness.dir/src/XSTSHarness/XSTSHarnessHandlers.cpp.o
In file included from /work/thirdparty/xerces-c/tests/src/XSTSHarness/XSTSHarnessHandlers.cpp:25:
In file included from /work/thirdparty/xerces-c/tests/src/XSTSHarness/XSTSHarnessHandlers.hpp:26:
In file included from /work/thirdparty/xerces-c/tests/src/XSTSHarness/XSTSHarness.hpp:40:
/work/thirdparty/xerces-c/src/xercesc/util/XMLURL.hpp:277:19: warning: cast from 'const xercesc_3_2::XMLURL *' to 'xercesc_3_2::XMLURL *' drops const qualifier [-Wcast-qual]
        ((XMLURL*)this)->buildFullText();
                  ^
1 warning generated.
[ 85%] Building CXX object tests/CMakeFiles/XSTSHarness.dir/src/XSTSHarness/XMLHarnessHandlers.cpp.o
make[2]: Leaving directory '/work/build/darwin-x64/xerces-c'
make[2]: Leaving directory '/work/build/darwin-x64/xerces-c'
make[2]: Leaving directory '/work/build/darwin-x64/xerces-c'
make[2]: Leaving directory '/work/build/darwin-x64/xerces-c'
make[2]: Leaving directory '/work/build/darwin-x64/xerces-c'
make[2]: Leaving directory '/work/build/darwin-x64/xerces-c'
make[2]: Leaving directory '/work/build/darwin-x64/xerces-c'
[ 85%] Built target DOMTraversalTest
[ 85%] Built target DOMMemTest
[ 85%] Built target Normalizer
[ 85%] Built target EncodingTest
[ 85%] Built target DOMTest
[ 85%] Built target InitTermTest
[ 85%] Built target DOMTypeInfoTest
make[2]: Entering directory '/work/build/darwin-x64/xerces-c'
make[2]: Entering directory '/work/build/darwin-x64/xerces-c'
make[2]: Entering directory '/work/build/darwin-x64/xerces-c'
make[2]: Entering directory '/work/build/darwin-x64/xerces-c'
make[2]: Entering directory '/work/build/darwin-x64/xerces-c'
make[2]: Entering directory '/work/build/darwin-x64/xerces-c'
Scanning dependencies of target XSValueTest
make[2]: Leaving directory '/work/build/darwin-x64/xerces-c'
make[2]: Entering directory '/work/build/darwin-x64/xerces-c'
Scanning dependencies of target MemHandlerTest
make[2]: Leaving directory '/work/build/darwin-x64/xerces-c'
[ 86%] Building CXX object tests/CMakeFiles/XSValueTest.dir/src/XSValueTest/XSValueTest.cpp.o
make[2]: Entering directory '/work/build/darwin-x64/xerces-c'
[ 86%] Building CXX object tests/CMakeFiles/MemHandlerTest.dir/src/MemHandlerTest/MemoryMonitor.cpp.o
In file included from /work/thirdparty/xerces-c/tests/src/XSTSHarness/XMLHarnessHandlers.cpp:25:
In file included from /work/thirdparty/xerces-c/tests/src/XSTSHarness/XMLHarnessHandlers.hpp:26:
In file included from /work/thirdparty/xerces-c/tests/src/XSTSHarness/XSTSHarness.hpp:40:
/work/thirdparty/xerces-c/src/xercesc/util/XMLURL.hpp:277:19: warning: cast from 'const xercesc_3_2::XMLURL *' to 'xercesc_3_2::XMLURL *' drops const qualifier [-Wcast-qual]
        ((XMLURL*)this)->buildFullText();
                  ^
Scanning dependencies of target NetAccessorTest
make[2]: Leaving directory '/work/build/darwin-x64/xerces-c'
Scanning dependencies of target XSerializerTest
Scanning dependencies of target RangeTest
make[2]: Leaving directory '/work/build/darwin-x64/xerces-c'
make[2]: Leaving directory '/work/build/darwin-x64/xerces-c'
1 warning generated.
[ 86%] Linking CXX executable XSTSHarness
make[2]: Entering directory '/work/build/darwin-x64/xerces-c'
make[2]: Entering directory '/work/build/darwin-x64/xerces-c'
make[2]: Entering directory '/work/build/darwin-x64/xerces-c'
make[2]: Entering directory '/work/build/darwin-x64/xerces-c'
[ 86%] Building CXX object tests/CMakeFiles/XSerializerTest.dir/src/XSerializerTest/XSerializerHandlers.cpp.o
[ 87%] Building CXX object tests/CMakeFiles/NetAccessorTest.dir/src/NetAccessorTest/NetAccessorTest.cpp.o
[ 87%] Building CXX object tests/CMakeFiles/RangeTest.dir/src/DOM/RangeTest/RangeTest.cpp.o
In file included from /work/thirdparty/xerces-c/tests/src/NetAccessorTest/NetAccessorTest.cpp:29:
/work/thirdparty/xerces-c/src/xercesc/util/XMLURL.hpp:277:19: warning: cast from 'const xercesc_3_2::XMLURL *' to 'xercesc_3_2::XMLURL *' drops const qualifier [-Wcast-qual]
        ((XMLURL*)this)->buildFullText();
                  ^
Scanning dependencies of target MemParse
make[2]: Leaving directory '/work/build/darwin-x64/xerces-c'
make[2]: Entering directory '/work/build/darwin-x64/xerces-c'
[ 87%] Building CXX object samples/CMakeFiles/MemParse.dir/src/MemParse/MemParse.cpp.o
Scanning dependencies of target Char16Test
make[2]: Leaving directory '/work/build/darwin-x64/xerces-c'
make[2]: Entering directory '/work/build/darwin-x64/xerces-c'
[ 87%] Building CXX object tests/CMakeFiles/Char16Test.dir/src/Char16Test/Char16Test.cpp.o
[ 88%] Linking CXX executable RangeTest
/work/thirdparty/xerces-c/tests/src/XSValueTest/XSValueTest.cpp:1354:83: warning: integer literal is too large to be represented in a signed integer type, interpreting as unsigned [-Wimplicitly-unsigned-literal]
    XSValue::XSValue_Data act_v_ran64_v_2; act_v_ran64_v_2.fValue.f_long = (long)-9223372036854775808;
                                                                                  ^
/work/thirdparty/xerces-c/tests/src/XSValueTest/XSValueTest.cpp:1510:85: warning: integer literal is too large to be represented in a signed integer type, interpreting as unsigned [-Wimplicitly-unsigned-literal]
    XSValue::XSValue_Data act_v_ran64_v_2;   act_v_ran64_v_2.fValue.f_long = (long)-9223372036854775808;
                                                                                    ^
/work/thirdparty/xerces-c/tests/src/XSValueTest/XSValueTest.cpp:1658:85: warning: integer literal is too large to be represented in a signed integer type, interpreting as unsigned [-Wimplicitly-unsigned-literal]
    XSValue::XSValue_Data act_v_ran64_v_2;   act_v_ran64_v_2.fValue.f_long = (long)-9223372036854775808;
                                                                                    ^
make[2]: Leaving directory '/work/build/darwin-x64/xerces-c'
/work/thirdparty/xerces-c/tests/src/XSValueTest/XSValueTest.cpp:1805:85: warning: integer literal is too large to be represented in a signed integer type, interpreting as unsigned [-Wimplicitly-unsigned-literal]
    XSValue::XSValue_Data act_v_ran64_v_2;   act_v_ran64_v_2.fValue.f_long = (long)-9223372036854775808;
                                                                                    ^
make[2]: Leaving directory '/work/build/darwin-x64/xerces-c'
/work/thirdparty/xerces-c/tests/src/XSValueTest/XSValueTest.cpp:2427:94: warning: integer literal is too large to be represented in a signed integer type, interpreting as unsigned [-Wimplicitly-unsigned-literal]
    XSValue::XSValue_Data act_v_ran64_v_2;  act_v_ran64_v_2.fValue.f_ulong = (unsigned long)+18446744073709551615;
                                                                                             ^
/work/thirdparty/xerces-c/tests/src/XSValueTest/XSValueTest.cpp:2579:94: warning: integer literal is too large to be represented in a signed integer type, interpreting as unsigned [-Wimplicitly-unsigned-literal]
    XSValue::XSValue_Data act_v_ran64_v_1;  act_v_ran64_v_1.fValue.f_ulong = (unsigned long)+18446744073709551615;
                                                                                             ^
/work/thirdparty/xerces-c/tests/src/XSValueTest/XSValueTest.cpp:3194:94: warning: integer literal is too large to be represented in a signed integer type, interpreting as unsigned [-Wimplicitly-unsigned-literal]
    XSValue::XSValue_Data act_v_ran64_v_2;  act_v_ran64_v_2.fValue.f_ulong = (unsigned long)+18446744073709551615;
                                                                                             ^
[ 88%] Built target RangeTest
1 warning generated.
[ 88%] Built target XSTSHarness
[ 88%] Building CXX object samples/CMakeFiles/MemParse.dir/src/MemParse/MemParseHandlers.cpp.o
make[2]: Entering directory '/work/build/darwin-x64/xerces-c'
[ 88%] Linking CXX executable NetAccessorTest
[ 88%] Building CXX object tests/CMakeFiles/XSerializerTest.dir/src/XSerializerTest/XSerializerTest.cpp.o
Scanning dependencies of target EnumVal
make[2]: Leaving directory '/work/build/darwin-x64/xerces-c'
make[2]: Entering directory '/work/build/darwin-x64/xerces-c'
[ 88%] Building CXX object samples/CMakeFiles/EnumVal.dir/src/EnumVal/EnumVal.cpp.o
[ 89%] Linking CXX executable MemHandlerTest
[ 89%] Linking CXX executable Char16Test
make[2]: Entering directory '/work/build/darwin-x64/xerces-c'
Scanning dependencies of target StdInParse
make[2]: Leaving directory '/work/build/darwin-x64/xerces-c'
make[2]: Entering directory '/work/build/darwin-x64/xerces-c'
[ 89%] Building CXX object samples/CMakeFiles/StdInParse.dir/src/StdInParse/StdInParse.cpp.o
make[2]: Leaving directory '/work/build/darwin-x64/xerces-c'
[ 89%] Built target NetAccessorTest
make[2]: Entering directory '/work/build/darwin-x64/xerces-c'
Scanning dependencies of target SAXCount
make[2]: Leaving directory '/work/build/darwin-x64/xerces-c'
make[2]: Entering directory '/work/build/darwin-x64/xerces-c'
[ 90%] Building CXX object samples/CMakeFiles/SAXCount.dir/src/SAXCount/SAXCount.cpp.o
make[2]: Leaving directory '/work/build/darwin-x64/xerces-c'
[ 90%] Built target Char16Test
make[2]: Leaving directory '/work/build/darwin-x64/xerces-c'
[ 90%] Built target MemHandlerTest
[ 90%] Building CXX object samples/CMakeFiles/SAXCount.dir/src/SAXCount/SAXCountHandlers.cpp.o
make[2]: Entering directory '/work/build/darwin-x64/xerces-c'
Scanning dependencies of target DOMPrint
make[2]: Leaving directory '/work/build/darwin-x64/xerces-c'
make[2]: Entering directory '/work/build/darwin-x64/xerces-c'
[ 90%] Building CXX object samples/CMakeFiles/DOMPrint.dir/src/DOMPrint/DOMPrint.cpp.o
[ 90%] Linking CXX executable MemParse
[ 91%] Linking CXX executable EnumVal
make[2]: Leaving directory '/work/build/darwin-x64/xerces-c'
[ 91%] Built target MemParse
make[2]: Leaving directory '/work/build/darwin-x64/xerces-c'
[ 91%] Built target EnumVal
[ 91%] Building CXX object samples/CMakeFiles/DOMPrint.dir/src/DOMPrint/DOMPrintErrorHandler.cpp.o
[ 92%] Building CXX object samples/CMakeFiles/StdInParse.dir/src/StdInParse/StdInParseHandlers.cpp.o
[ 93%] Linking CXX executable XSerializerTest
7 warnings generated.
[ 93%] Linking CXX executable XSValueTest
[ 93%] Building CXX object samples/CMakeFiles/DOMPrint.dir/src/DOMPrint/DOMPrintFilter.cpp.o
[ 93%] Linking CXX executable SAXCount
[ 94%] Building CXX object samples/CMakeFiles/DOMPrint.dir/src/DOMPrint/DOMTreeErrorReporter.cpp.o
make[2]: Entering directory '/work/build/darwin-x64/xerces-c'
make[2]: Leaving directory '/work/build/darwin-x64/xerces-c'
[ 94%] Built target XSerializerTest
make[2]: Entering directory '/work/build/darwin-x64/xerces-c'
Scanning dependencies of target CreateDOMDocument
make[2]: Leaving directory '/work/build/darwin-x64/xerces-c'
make[2]: Entering directory '/work/build/darwin-x64/xerces-c'
[ 94%] Building CXX object samples/CMakeFiles/CreateDOMDocument.dir/src/CreateDOMDocument/CreateDOMDocument.cpp.o
[ 94%] Linking CXX executable StdInParse
make[2]: Leaving directory '/work/build/darwin-x64/xerces-c'
make[2]: Leaving directory '/work/build/darwin-x64/xerces-c'
[ 94%] Built target XSValueTest
[ 94%] Built target SAXCount
make[2]: Entering directory '/work/build/darwin-x64/xerces-c'
make[2]: Entering directory '/work/build/darwin-x64/xerces-c'
Scanning dependencies of target Redirect
make[2]: Leaving directory '/work/build/darwin-x64/xerces-c'
make[2]: Entering directory '/work/build/darwin-x64/xerces-c'
[ 94%] Building CXX object samples/CMakeFiles/Redirect.dir/src/Redirect/Redirect.cpp.o
[ 94%] Linking CXX executable DOMPrint
Scanning dependencies of target PParse
make[2]: Leaving directory '/work/build/darwin-x64/xerces-c'
make[2]: Entering directory '/work/build/darwin-x64/xerces-c'
make[2]: Entering directory '/work/build/darwin-x64/xerces-c'
make[2]: Entering directory '/work/build/darwin-x64/xerces-c'
[ 94%] Building CXX object samples/CMakeFiles/PParse.dir/src/PParse/PParse.cpp.o
[ 95%] Linking CXX executable CreateDOMDocument
[ 95%] Building CXX object samples/CMakeFiles/Redirect.dir/src/Redirect/RedirectHandlers.cpp.o
make[2]: Leaving directory '/work/build/darwin-x64/xerces-c'
[ 95%] Built target DOMPrint
Scanning dependencies of target DOMCount
make[2]: Leaving directory '/work/build/darwin-x64/xerces-c'
make[2]: Entering directory '/work/build/darwin-x64/xerces-c'
Scanning dependencies of target SAX2Count
make[2]: Leaving directory '/work/build/darwin-x64/xerces-c'
Scanning dependencies of target PSVIWriter
make[2]: Leaving directory '/work/build/darwin-x64/xerces-c'
make[2]: Entering directory '/work/build/darwin-x64/xerces-c'
make[2]: Entering directory '/work/build/darwin-x64/xerces-c'
[ 95%] Building CXX object samples/CMakeFiles/DOMCount.dir/src/DOMCount/DOMCount.cpp.o
[ 96%] Building CXX object samples/CMakeFiles/SAX2Count.dir/src/SAX2Count/SAX2Count.cpp.o
[ 97%] Building CXX object samples/CMakeFiles/PSVIWriter.dir/src/PSVIWriter/PSVIWriter.cpp.o
make[2]: Leaving directory '/work/build/darwin-x64/xerces-c'
[ 97%] Built target StdInParse
make[2]: Entering directory '/work/build/darwin-x64/xerces-c'
make[2]: Entering directory '/work/build/darwin-x64/xerces-c'
make[2]: Leaving directory '/work/build/darwin-x64/xerces-c'
In file included from /work/thirdparty/xerces-c/samples/src/PSVIWriter/PSVIWriter.cpp:27:
In file included from /work/thirdparty/xerces-c/samples/src/PSVIWriter/PSVIWriter.hpp:26:
/work/thirdparty/xerces-c/samples/src/PSVIWriter/PSVIWriterHandlers.hpp:75:31: warning: cast from 'const char16_t *' to 'char16_t *' drops const qualifier [-Wcast-qual]
                XMLString::release((XMLCh**)&uri);
                                            ^
/work/thirdparty/xerces-c/samples/src/PSVIWriter/PSVIWriterHandlers.hpp:76:31: warning: cast from 'const char16_t *' to 'char16_t *' drops const qualifier [-Wcast-qual]
                XMLString::release((XMLCh**)&name);
                                            ^
/work/thirdparty/xerces-c/samples/src/PSVIWriter/PSVIWriterHandlers.hpp:77:31: warning: cast from 'const char16_t *' to 'char16_t *' drops const qualifier [-Wcast-qual]
                XMLString::release((XMLCh**)&type);
                                            ^
/work/thirdparty/xerces-c/samples/src/PSVIWriter/PSVIWriterHandlers.hpp:78:31: warning: cast from 'const char16_t *' to 'char16_t *' drops const qualifier [-Wcast-qual]
                XMLString::release((XMLCh**)&value);
                                            ^
[ 97%] Built target CreateDOMDocument
[ 97%] Linking CXX executable Redirect
Scanning dependencies of target SAX2Print
Scanning dependencies of target SAXPrint
make[2]: Leaving directory '/work/build/darwin-x64/xerces-c'
make[2]: Leaving directory '/work/build/darwin-x64/xerces-c'
make[2]: Entering directory '/work/build/darwin-x64/xerces-c'
[ 97%] Building CXX object samples/CMakeFiles/PParse.dir/src/PParse/PParseHandlers.cpp.o
make[2]: Entering directory '/work/build/darwin-x64/xerces-c'
[ 97%] Building CXX object samples/CMakeFiles/SAXPrint.dir/src/SAXPrint/SAXPrint.cpp.o
[ 98%] Building CXX object samples/CMakeFiles/SAX2Print.dir/src/SAX2Print/SAX2FilterHandlers.cpp.o
make[2]: Entering directory '/work/build/darwin-x64/xerces-c'
make[2]: Leaving directory '/work/build/darwin-x64/xerces-c'
[ 98%] Built target Redirect
[ 98%] Building CXX object samples/CMakeFiles/SAX2Print.dir/src/SAX2Print/SAX2Print.cpp.o
make[2]: Entering directory '/work/build/darwin-x64/xerces-c'
Scanning dependencies of target SEnumVal
make[2]: Leaving directory '/work/build/darwin-x64/xerces-c'
make[2]: Entering directory '/work/build/darwin-x64/xerces-c'
[ 99%] Building CXX object samples/CMakeFiles/SEnumVal.dir/src/SEnumVal/SEnumVal.cpp.o
/work/thirdparty/xerces-c/samples/src/PSVIWriter/PSVIWriter.cpp:252:44: warning: cast from 'const char *' to 'char *' drops const qualifier [-Wcast-qual]
                    XMLString::trim((char*)xmlFile);
                                           ^
Scanning dependencies of target SCMPrint
make[2]: Leaving directory '/work/build/darwin-x64/xerces-c'
make[2]: Entering directory '/work/build/darwin-x64/xerces-c'
[ 99%] Building CXX object samples/CMakeFiles/SCMPrint.dir/src/SCMPrint/SCMPrint.cpp.o
[ 99%] Building CXX object samples/CMakeFiles/SAX2Print.dir/src/SAX2Print/SAX2PrintHandlers.cpp.o
5 warnings generated.
[ 99%] Building CXX object samples/CMakeFiles/PSVIWriter.dir/src/PSVIWriter/PSVIWriterHandlers.cpp.o
[ 99%] Linking CXX executable PParse
[100%] Building CXX object samples/CMakeFiles/SAXPrint.dir/src/SAXPrint/SAXPrintHandlers.cpp.o
[100%] Linking CXX executable DOMCount
[100%] Building CXX object samples/CMakeFiles/SAX2Count.dir/src/SAX2Count/SAX2CountHandlers.cpp.o
/work/thirdparty/xerces-c/samples/src/SEnumVal/SEnumVal.cpp:450:56: warning: cast from 'const char16_t *' to 'char16_t *' drops const qualifier [-Wcast-qual]
                    sortedList.insertElementAt((XMLCh*)key,i);
                                                       ^
/work/thirdparty/xerces-c/samples/src/SEnumVal/SEnumVal.cpp:454:47: warning: cast from 'const char16_t *' to 'char16_t *' drops const qualifier [-Wcast-qual]
                sortedList.addElement((XMLCh*)key);
                                              ^
/work/thirdparty/xerces-c/samples/src/SEnumVal/SEnumVal.cpp:467:52: warning: cast from 'const xercesc_3_2::RefArrayVectorOf<char16_t> *' to 'xercesc_3_2::RefVectorOf<char16_t> *' drops const qualifier [-Wcast-qual]
        RefVectorOf<XMLCh>* enums = (RefVectorOf<XMLCh>*) dtValidator->getEnumString();
                                                          ^
3 warnings generated.
[100%] Linking CXX executable SEnumVal
/work/thirdparty/xerces-c/samples/src/SAX2Print/SAX2PrintHandlers.cpp:108:46: warning: cast from 'const unsigned char *' to 'char *' drops const qualifier [-Wcast-qual]
    XERCES_STD_QUALIFIER cout.write((char *) toWrite, (int) count);
                                             ^
[100%] Linking CXX executable SCMPrint
In file included from /work/thirdparty/xerces-c/samples/src/PSVIWriter/PSVIWriterHandlers.cpp:21:
/work/thirdparty/xerces-c/samples/src/PSVIWriter/PSVIWriterHandlers.hpp:75:31: warning: cast from 'const char16_t *' to 'char16_t *' drops const qualifier [-Wcast-qual]
                XMLString::release((XMLCh**)&uri);
                                            ^
/work/thirdparty/xerces-c/samples/src/PSVIWriter/PSVIWriterHandlers.hpp:76:31: warning: cast from 'const char16_t *' to 'char16_t *' drops const qualifier [-Wcast-qual]
                XMLString::release((XMLCh**)&name);
                                            ^
/work/thirdparty/xerces-c/samples/src/PSVIWriter/PSVIWriterHandlers.hpp:77:31: warning: cast from 'const char16_t *' to 'char16_t *' drops const qualifier [-Wcast-qual]
                XMLString::release((XMLCh**)&type);
                                            ^
/work/thirdparty/xerces-c/samples/src/PSVIWriter/PSVIWriterHandlers.hpp:78:31: warning: cast from 'const char16_t *' to 'char16_t *' drops const qualifier [-Wcast-qual]
                XMLString::release((XMLCh**)&value);
                                            ^
1 warning generated.
[100%] Linking CXX executable SAX2Print
/work/thirdparty/xerces-c/samples/src/PSVIWriter/PSVIWriterHandlers.cpp:206:32: warning: cast from 'const char16_t *' to 'char16_t *' drops const qualifier [-Wcast-qual]
        fAttrList->addElement((XMLCh*)gXmlnsColonXsi);
                                      ^
/work/thirdparty/xerces-c/samples/src/PSVIWriter/PSVIWriterHandlers.cpp:207:32: warning: cast from 'const char16_t *' to 'char16_t *' drops const qualifier [-Wcast-qual]
        fAttrList->addElement((XMLCh*)PSVIUni::fgNamespaceInstance);
                                      ^
/work/thirdparty/xerces-c/samples/src/PSVIWriter/PSVIWriterHandlers.cpp:208:32: warning: cast from 'const char16_t *' to 'char16_t *' drops const qualifier [-Wcast-qual]
        fAttrList->addElement((XMLCh*)gXmlnsColonPsv);
                                      ^
/work/thirdparty/xerces-c/samples/src/PSVIWriter/PSVIWriterHandlers.cpp:209:32: warning: cast from 'const char16_t *' to 'char16_t *' drops const qualifier [-Wcast-qual]
        fAttrList->addElement((XMLCh*)PSVIUni::fgNamespacePsvi);
                                      ^
/work/thirdparty/xerces-c/samples/src/PSVIWriter/PSVIWriterHandlers.cpp:210:32: warning: cast from 'const char16_t *' to 'char16_t *' drops const qualifier [-Wcast-qual]
        fAttrList->addElement((XMLCh*)XMLUni::fgXMLNSString);
                                      ^
/work/thirdparty/xerces-c/samples/src/PSVIWriter/PSVIWriterHandlers.cpp:211:32: warning: cast from 'const char16_t *' to 'char16_t *' drops const qualifier [-Wcast-qual]
        fAttrList->addElement((XMLCh*)PSVIUni::fgNamespaceInfoset);
                                      ^
/work/thirdparty/xerces-c/samples/src/PSVIWriter/PSVIWriterHandlers.cpp:260:50: warning: cast from 'const char16_t *' to 'char16_t *' drops const qualifier [-Wcast-qual]
                XMLCh* permaUri = XMLString::replicate((XMLCh*)uri);
                                                               ^
/work/thirdparty/xerces-c/samples/src/PSVIWriter/PSVIWriterHandlers.cpp:261:53: warning: cast from 'const char16_t *' to 'char16_t *' drops const qualifier [-Wcast-qual]
                XMLCh* permaPrefix = XMLString::replicate((XMLCh*)prefix);
                                                                  ^
/work/thirdparty/xerces-c/samples/src/PSVIWriter/PSVIWriterHandlers.cpp:1223:33: warning: cast from 'const char16_t *' to 'char16_t *' drops const qualifier [-Wcast-qual]
                fAttrList->addElement((XMLCh*)gRef);
                                              ^
/work/thirdparty/xerces-c/samples/src/PSVIWriter/PSVIWriterHandlers.cpp:1224:33: warning: cast from 'const char16_t *' to 'char16_t *' drops const qualifier [-Wcast-qual]
                fAttrList->addElement((XMLCh*)getIdName(obj));
                                              ^
/work/thirdparty/xerces-c/samples/src/PSVIWriter/PSVIWriterHandlers.cpp:1225:33: warning: cast from 'const char16_t *' to 'char16_t *' drops const qualifier [-Wcast-qual]
                fAttrList->addElement((XMLCh*)fgXsiNil);
                                              ^
/work/thirdparty/xerces-c/samples/src/PSVIWriter/PSVIWriterHandlers.cpp:1226:33: warning: cast from 'const char16_t *' to 'char16_t *' drops const qualifier [-Wcast-qual]
                fAttrList->addElement((XMLCh*)PSVIUni::fgTrue);
                                              ^
/work/thirdparty/xerces-c/samples/src/PSVIWriter/PSVIWriterHandlers.cpp:1233:32: warning: cast from 'const char16_t *' to 'char16_t *' drops const qualifier [-Wcast-qual]
        fAttrList->addElement((XMLCh*)fgXsiNil);
                                      ^
/work/thirdparty/xerces-c/samples/src/PSVIWriter/PSVIWriterHandlers.cpp:1234:32: warning: cast from 'const char16_t *' to 'char16_t *' drops const qualifier [-Wcast-qual]
        fAttrList->addElement((XMLCh*)PSVIUni::fgTrue);
                                      ^
/work/thirdparty/xerces-c/samples/src/PSVIWriter/PSVIWriterHandlers.cpp:1267:32: warning: cast from 'const char16_t *' to 'char16_t *' drops const qualifier [-Wcast-qual]
        fAttrList->addElement((XMLCh*)gId);
                                      ^
/work/thirdparty/xerces-c/samples/src/PSVIWriter/PSVIWriterHandlers.cpp:1268:32: warning: cast from 'const char16_t *' to 'char16_t *' drops const qualifier [-Wcast-qual]
        fAttrList->addElement((XMLCh*)getIdName(obj));
                                      ^
make[2]: Leaving directory '/work/build/darwin-x64/xerces-c'
make[2]: Leaving directory '/work/build/darwin-x64/xerces-c'
[100%] Built target PParse
[100%] Built target SEnumVal
make[2]: Leaving directory '/work/build/darwin-x64/xerces-c'
[100%] Built target DOMCount
20 warnings generated.
make[2]: Leaving directory '/work/build/darwin-x64/xerces-c'
[100%] Linking CXX executable PSVIWriter
[100%] Built target SAX2Print
make[2]: Leaving directory '/work/build/darwin-x64/xerces-c'
[100%] Built target SCMPrint
/work/thirdparty/xerces-c/samples/src/SAXPrint/SAXPrintHandlers.cpp:106:46: warning: cast from 'const unsigned char *' to 'char *' drops const qualifier [-Wcast-qual]
    XERCES_STD_QUALIFIER cout.write((char *) toWrite, (int) count);
                                             ^
1 warning generated.
[100%] Linking CXX executable SAX2Count
[100%] Linking CXX executable SAXPrint
make[2]: Leaving directory '/work/build/darwin-x64/xerces-c'
[100%] Built target PSVIWriter
make[2]: Entering directory '/work/build/darwin-x64/xerces-c'
Scanning dependencies of target XInclude
make[2]: Leaving directory '/work/build/darwin-x64/xerces-c'
make[2]: Entering directory '/work/build/darwin-x64/xerces-c'
make[2]: Leaving directory '/work/build/darwin-x64/xerces-c'
make[2]: Leaving directory '/work/build/darwin-x64/xerces-c'
[100%] Building CXX object samples/CMakeFiles/XInclude.dir/src/XInclude/XInclude.cpp.o
[100%] Built target SAX2Count
[100%] Built target SAXPrint
[100%] Linking CXX executable XInclude
make[2]: Leaving directory '/work/build/darwin-x64/xerces-c'
[100%] Built target XInclude
make[1]: Leaving directory '/work/build/darwin-x64/xerces-c'
make: Leaving directory '/work/build/darwin-x64/xerces-c'
make: Entering directory '/work/build/darwin-x64/xerces-c'
make[1]: Entering directory '/work/build/darwin-x64/xerces-c'
make[2]: Entering directory '/work/build/darwin-x64/xerces-c'
make[2]: Leaving directory '/work/build/darwin-x64/xerces-c'
[ 80%] Built target xerces-c
make[2]: Entering directory '/work/build/darwin-x64/xerces-c'
make[2]: Leaving directory '/work/build/darwin-x64/xerces-c'
[ 81%] Built target DOMTypeInfoTest
make[2]: Entering directory '/work/build/darwin-x64/xerces-c'
make[2]: Leaving directory '/work/build/darwin-x64/xerces-c'
[ 82%] Built target DOMTraversalTest
make[2]: Entering directory '/work/build/darwin-x64/xerces-c'
make[2]: Leaving directory '/work/build/darwin-x64/xerces-c'
[ 83%] Built target Normalizer
make[2]: Entering directory '/work/build/darwin-x64/xerces-c'
make[2]: Leaving directory '/work/build/darwin-x64/xerces-c'
[ 83%] Built target DOMTest
make[2]: Entering directory '/work/build/darwin-x64/xerces-c'
make[2]: Leaving directory '/work/build/darwin-x64/xerces-c'
[ 83%] Built target EncodingTest
make[2]: Entering directory '/work/build/darwin-x64/xerces-c'
make[2]: Leaving directory '/work/build/darwin-x64/xerces-c'
[ 84%] Built target DOMMemTest
make[2]: Entering directory '/work/build/darwin-x64/xerces-c'
make[2]: Leaving directory '/work/build/darwin-x64/xerces-c'
[ 85%] Built target XSTSHarness
make[2]: Entering directory '/work/build/darwin-x64/xerces-c'
make[2]: Leaving directory '/work/build/darwin-x64/xerces-c'
[ 85%] Built target InitTermTest
make[2]: Entering directory '/work/build/darwin-x64/xerces-c'
make[2]: Leaving directory '/work/build/darwin-x64/xerces-c'
[ 86%] Built target MemHandlerTest
make[2]: Entering directory '/work/build/darwin-x64/xerces-c'
make[2]: Leaving directory '/work/build/darwin-x64/xerces-c'
[ 87%] Built target NetAccessorTest
make[2]: Entering directory '/work/build/darwin-x64/xerces-c'
make[2]: Leaving directory '/work/build/darwin-x64/xerces-c'
[ 88%] Built target RangeTest
make[2]: Entering directory '/work/build/darwin-x64/xerces-c'
make[2]: Leaving directory '/work/build/darwin-x64/xerces-c'
[ 89%] Built target XSerializerTest
make[2]: Entering directory '/work/build/darwin-x64/xerces-c'
make[2]: Leaving directory '/work/build/darwin-x64/xerces-c'
[ 90%] Built target XSValueTest
make[2]: Entering directory '/work/build/darwin-x64/xerces-c'
make[2]: Leaving directory '/work/build/darwin-x64/xerces-c'
[ 90%] Built target Char16Test
make[2]: Entering directory '/work/build/darwin-x64/xerces-c'
make[2]: Leaving directory '/work/build/darwin-x64/xerces-c'
[ 90%] Built target MemParse
make[2]: Entering directory '/work/build/darwin-x64/xerces-c'
make[2]: Leaving directory '/work/build/darwin-x64/xerces-c'
[ 91%] Built target EnumVal
make[2]: Entering directory '/work/build/darwin-x64/xerces-c'
make[2]: Leaving directory '/work/build/darwin-x64/xerces-c'
[ 92%] Built target StdInParse
make[2]: Entering directory '/work/build/darwin-x64/xerces-c'
make[2]: Leaving directory '/work/build/darwin-x64/xerces-c'
[ 93%] Built target SAXCount
make[2]: Entering directory '/work/build/darwin-x64/xerces-c'
make[2]: Leaving directory '/work/build/darwin-x64/xerces-c'
[ 94%] Built target DOMPrint
make[2]: Entering directory '/work/build/darwin-x64/xerces-c'
make[2]: Leaving directory '/work/build/darwin-x64/xerces-c'
[ 95%] Built target CreateDOMDocument
make[2]: Entering directory '/work/build/darwin-x64/xerces-c'
make[2]: Leaving directory '/work/build/darwin-x64/xerces-c'
[ 95%] Built target PParse
make[2]: Entering directory '/work/build/darwin-x64/xerces-c'
make[2]: Leaving directory '/work/build/darwin-x64/xerces-c'
[ 95%] Built target DOMCount
make[2]: Entering directory '/work/build/darwin-x64/xerces-c'
make[2]: Leaving directory '/work/build/darwin-x64/xerces-c'
[ 95%] Built target Redirect
make[2]: Entering directory '/work/build/darwin-x64/xerces-c'
make[2]: Leaving directory '/work/build/darwin-x64/xerces-c'
[ 96%] Built target PSVIWriter
make[2]: Entering directory '/work/build/darwin-x64/xerces-c'
make[2]: Leaving directory '/work/build/darwin-x64/xerces-c'
[ 97%] Built target SAX2Count
make[2]: Entering directory '/work/build/darwin-x64/xerces-c'
make[2]: Leaving directory '/work/build/darwin-x64/xerces-c'
[ 98%] Built target SAX2Print
make[2]: Entering directory '/work/build/darwin-x64/xerces-c'
make[2]: Leaving directory '/work/build/darwin-x64/xerces-c'
[ 99%] Built target SAXPrint
make[2]: Entering directory '/work/build/darwin-x64/xerces-c'
make[2]: Leaving directory '/work/build/darwin-x64/xerces-c'
[100%] Built target SEnumVal
make[2]: Entering directory '/work/build/darwin-x64/xerces-c'
make[2]: Leaving directory '/work/build/darwin-x64/xerces-c'
[100%] Built target SCMPrint
make[2]: Entering directory '/work/build/darwin-x64/xerces-c'
make[2]: Leaving directory '/work/build/darwin-x64/xerces-c'
[100%] Built target XInclude
make[1]: Leaving directory '/work/build/darwin-x64/xerces-c'
Install the project...
-- Install configuration: ""
-- Installing: /work/build/external/darwin-x86_64/lib/pkgconfig/xerces-c.pc
-- Installing: /work/build/external/darwin-x86_64/share/doc/xerces-c/html
-- Installing: /work/build/external/darwin-x86_64/share/doc/xerces-c/html/ApacheDOMC++Binding.html
-- Installing: /work/build/external/darwin-x86_64/share/doc/xerces-c/html/secadv
-- Installing: /work/build/external/darwin-x86_64/share/doc/xerces-c/html/secadv/CVE-2015-0252.txt
-- Installing: /work/build/external/darwin-x86_64/share/doc/xerces-c/html/secadv/CVE-2016-4463.txt
-- Installing: /work/build/external/darwin-x86_64/share/doc/xerces-c/html/secadv/CVE-2016-0729.txt
-- Installing: /work/build/external/darwin-x86_64/share/doc/xerces-c/html/secadv/CVE-2017-12627.txt
-- Up-to-date: /work/build/external/darwin-x86_64/share/doc/xerces-c/html
-- Installing: /work/build/external/darwin-x86_64/lib/libxerces-c-3.2.a
-- Installing: /work/build/external/darwin-x86_64/lib/cmake/XercesC/XercesCConfigInternal.cmake
-- Installing: /work/build/external/darwin-x86_64/lib/cmake/XercesC/XercesCConfigInternal-noconfig.cmake
-- Installing: /work/build/external/darwin-x86_64/lib/cmake/XercesC/XercesCConfig.cmake
-- Installing: /work/build/external/darwin-x86_64/lib/cmake/XercesC/XercesCConfigVersion.cmake
-- Installing: /work/build/external/darwin-x86_64/include/xercesc/util/ArrayIndexOutOfBoundsException.hpp
-- Installing: /work/build/external/darwin-x86_64/include/xercesc/util/Base64.hpp
-- Installing: /work/build/external/darwin-x86_64/include/xercesc/util/BaseRefVectorOf.hpp
-- Installing: /work/build/external/darwin-x86_64/include/xercesc/util/BaseRefVectorOf.c
-- Installing: /work/build/external/darwin-x86_64/include/xercesc/util/BinFileInputStream.hpp
-- Installing: /work/build/external/darwin-x86_64/include/xercesc/util/BinInputStream.hpp
-- Installing: /work/build/external/darwin-x86_64/include/xercesc/util/BinMemInputStream.hpp
-- Installing: /work/build/external/darwin-x86_64/include/xercesc/util/BitOps.hpp
-- Installing: /work/build/external/darwin-x86_64/include/xercesc/util/BitSet.hpp
-- Installing: /work/build/external/darwin-x86_64/include/xercesc/util/CountedPointer.hpp
-- Installing: /work/build/external/darwin-x86_64/include/xercesc/util/CountedPointer.c
-- Installing: /work/build/external/darwin-x86_64/include/xercesc/util/DefaultPanicHandler.hpp
-- Installing: /work/build/external/darwin-x86_64/include/xercesc/util/EmptyStackException.hpp
-- Installing: /work/build/external/darwin-x86_64/include/xercesc/util/EncodingValidator.hpp
-- Installing: /work/build/external/darwin-x86_64/include/xercesc/util/FlagJanitor.hpp
-- Installing: /work/build/external/darwin-x86_64/include/xercesc/util/FlagJanitor.c
-- Installing: /work/build/external/darwin-x86_64/include/xercesc/util/Hashers.hpp
-- Installing: /work/build/external/darwin-x86_64/include/xercesc/util/Hash2KeysSetOf.hpp
-- Installing: /work/build/external/darwin-x86_64/include/xercesc/util/Hash2KeysSetOf.c
-- Installing: /work/build/external/darwin-x86_64/include/xercesc/util/HexBin.hpp
-- Installing: /work/build/external/darwin-x86_64/include/xercesc/util/IllegalArgumentException.hpp
-- Installing: /work/build/external/darwin-x86_64/include/xercesc/util/InvalidCastException.hpp
-- Installing: /work/build/external/darwin-x86_64/include/xercesc/util/IOException.hpp
-- Installing: /work/build/external/darwin-x86_64/include/xercesc/util/Janitor.hpp
-- Installing: /work/build/external/darwin-x86_64/include/xercesc/util/Janitor.c
-- Installing: /work/build/external/darwin-x86_64/include/xercesc/util/KeyRefPair.hpp
-- Installing: /work/build/external/darwin-x86_64/include/xercesc/util/KeyRefPair.c
-- Installing: /work/build/external/darwin-x86_64/include/xercesc/util/KeyValuePair.hpp
-- Installing: /work/build/external/darwin-x86_64/include/xercesc/util/KeyValuePair.c
-- Installing: /work/build/external/darwin-x86_64/include/xercesc/util/KVStringPair.hpp
-- Installing: /work/build/external/darwin-x86_64/include/xercesc/util/Mutexes.hpp
-- Installing: /work/build/external/darwin-x86_64/include/xercesc/util/LogicalPath.c
-- Installing: /work/build/external/darwin-x86_64/include/xercesc/util/NameIdPool.hpp
-- Installing: /work/build/external/darwin-x86_64/include/xercesc/util/NameIdPool.c
-- Installing: /work/build/external/darwin-x86_64/include/xercesc/util/NoSuchElementException.hpp
-- Installing: /work/build/external/darwin-x86_64/include/xercesc/util/NullPointerException.hpp
-- Installing: /work/build/external/darwin-x86_64/include/xercesc/util/NumberFormatException.hpp
-- Installing: /work/build/external/darwin-x86_64/include/xercesc/util/OutOfMemoryException.hpp
-- Installing: /work/build/external/darwin-x86_64/include/xercesc/util/PanicHandler.hpp
-- Installing: /work/build/external/darwin-x86_64/include/xercesc/util/ParseException.hpp
-- Installing: /work/build/external/darwin-x86_64/include/xercesc/util/PlatformUtils.hpp
-- Installing: /work/build/external/darwin-x86_64/include/xercesc/util/PSVIUni.hpp
-- Installing: /work/build/external/darwin-x86_64/include/xercesc/util/QName.hpp
-- Installing: /work/build/external/darwin-x86_64/include/xercesc/util/RefArrayOf.hpp
-- Installing: /work/build/external/darwin-x86_64/include/xercesc/util/RefArrayOf.c
-- Installing: /work/build/external/darwin-x86_64/include/xercesc/util/RefArrayVectorOf.hpp
-- Installing: /work/build/external/darwin-x86_64/include/xercesc/util/RefArrayVectorOf.c
-- Installing: /work/build/external/darwin-x86_64/include/xercesc/util/RefHash2KeysTableOf.hpp
-- Installing: /work/build/external/darwin-x86_64/include/xercesc/util/RefHash2KeysTableOf.c
-- Installing: /work/build/external/darwin-x86_64/include/xercesc/util/RefHash3KeysIdPool.hpp
-- Installing: /work/build/external/darwin-x86_64/include/xercesc/util/RefHash3KeysIdPool.c
-- Installing: /work/build/external/darwin-x86_64/include/xercesc/util/RefHashTableOf.hpp
-- Installing: /work/build/external/darwin-x86_64/include/xercesc/util/RefHashTableOf.c
-- Installing: /work/build/external/darwin-x86_64/include/xercesc/util/RefStackOf.hpp
-- Installing: /work/build/external/darwin-x86_64/include/xercesc/util/RefStackOf.c
-- Installing: /work/build/external/darwin-x86_64/include/xercesc/util/RefVectorOf.hpp
-- Installing: /work/build/external/darwin-x86_64/include/xercesc/util/RefVectorOf.c
-- Installing: /work/build/external/darwin-x86_64/include/xercesc/util/regx/ASCIIRangeFactory.hpp
-- Installing: /work/build/external/darwin-x86_64/include/xercesc/util/regx/BlockRangeFactory.hpp
-- Installing: /work/build/external/darwin-x86_64/include/xercesc/util/regx/BMPattern.hpp
-- Installing: /work/build/external/darwin-x86_64/include/xercesc/util/regx/CharToken.hpp
-- Installing: /work/build/external/darwin-x86_64/include/xercesc/util/regx/ClosureToken.hpp
-- Installing: /work/build/external/darwin-x86_64/include/xercesc/util/regx/ConcatToken.hpp
-- Installing: /work/build/external/darwin-x86_64/include/xercesc/util/regx/Match.hpp
-- Installing: /work/build/external/darwin-x86_64/include/xercesc/util/regx/Op.hpp
-- Installing: /work/build/external/darwin-x86_64/include/xercesc/util/regx/OpFactory.hpp
-- Installing: /work/build/external/darwin-x86_64/include/xercesc/util/regx/ParenToken.hpp
-- Installing: /work/build/external/darwin-x86_64/include/xercesc/util/regx/ParserForXMLSchema.hpp
-- Installing: /work/build/external/darwin-x86_64/include/xercesc/util/regx/RangeFactory.hpp
-- Installing: /work/build/external/darwin-x86_64/include/xercesc/util/regx/RangeToken.hpp
-- Installing: /work/build/external/darwin-x86_64/include/xercesc/util/regx/RangeTokenMap.hpp
-- Installing: /work/build/external/darwin-x86_64/include/xercesc/util/regx/RegularExpression.hpp
-- Installing: /work/build/external/darwin-x86_64/include/xercesc/util/regx/RegxDefs.hpp
-- Installing: /work/build/external/darwin-x86_64/include/xercesc/util/regx/RegxParser.hpp
-- Installing: /work/build/external/darwin-x86_64/include/xercesc/util/regx/RegxUtil.hpp
-- Installing: /work/build/external/darwin-x86_64/include/xercesc/util/regx/StringToken.hpp
-- Installing: /work/build/external/darwin-x86_64/include/xercesc/util/regx/Token.hpp
-- Installing: /work/build/external/darwin-x86_64/include/xercesc/util/regx/TokenFactory.hpp
-- Installing: /work/build/external/darwin-x86_64/include/xercesc/util/regx/TokenInc.hpp
-- Installing: /work/build/external/darwin-x86_64/include/xercesc/util/regx/UniCharTable.hpp
-- Installing: /work/build/external/darwin-x86_64/include/xercesc/util/regx/UnicodeRangeFactory.hpp
-- Installing: /work/build/external/darwin-x86_64/include/xercesc/util/regx/UnionToken.hpp
-- Installing: /work/build/external/darwin-x86_64/include/xercesc/util/regx/XMLRangeFactory.hpp
-- Installing: /work/build/external/darwin-x86_64/include/xercesc/util/regx/XMLUniCharacter.hpp
-- Installing: /work/build/external/darwin-x86_64/include/xercesc/util/RuntimeException.hpp
-- Installing: /work/build/external/darwin-x86_64/include/xercesc/util/SchemaDateTimeException.hpp
-- Installing: /work/build/external/darwin-x86_64/include/xercesc/util/SecurityManager.hpp
-- Installing: /work/build/external/darwin-x86_64/include/xercesc/util/StringPool.hpp
-- Installing: /work/build/external/darwin-x86_64/include/xercesc/util/SynchronizedStringPool.hpp
-- Installing: /work/build/external/darwin-x86_64/include/xercesc/util/TranscodingException.hpp
-- Installing: /work/build/external/darwin-x86_64/include/xercesc/util/TransENameMap.hpp
-- Installing: /work/build/external/darwin-x86_64/include/xercesc/util/TransENameMap.c
-- Installing: /work/build/external/darwin-x86_64/include/xercesc/util/TransService.hpp
-- Installing: /work/build/external/darwin-x86_64/include/xercesc/util/UnexpectedEOFException.hpp
-- Installing: /work/build/external/darwin-x86_64/include/xercesc/util/UnsupportedEncodingException.hpp
-- Installing: /work/build/external/darwin-x86_64/include/xercesc/util/UTFDataFormatException.hpp
-- Installing: /work/build/external/darwin-x86_64/include/xercesc/util/ValueArrayOf.hpp
-- Installing: /work/build/external/darwin-x86_64/include/xercesc/util/ValueArrayOf.c
-- Installing: /work/build/external/darwin-x86_64/include/xercesc/util/ValueHashTableOf.hpp
-- Installing: /work/build/external/darwin-x86_64/include/xercesc/util/ValueHashTableOf.c
-- Installing: /work/build/external/darwin-x86_64/include/xercesc/util/ValueStackOf.hpp
-- Installing: /work/build/external/darwin-x86_64/include/xercesc/util/ValueStackOf.c
-- Installing: /work/build/external/darwin-x86_64/include/xercesc/util/ValueVectorOf.hpp
-- Installing: /work/build/external/darwin-x86_64/include/xercesc/util/ValueVectorOf.c
-- Installing: /work/build/external/darwin-x86_64/include/xercesc/util/XercesDefs.hpp
-- Installing: /work/build/external/darwin-x86_64/include/xercesc/util/XMemory.hpp
-- Installing: /work/build/external/darwin-x86_64/include/xercesc/util/XML256TableTranscoder.hpp
-- Installing: /work/build/external/darwin-x86_64/include/xercesc/util/XML88591Transcoder.hpp
-- Installing: /work/build/external/darwin-x86_64/include/xercesc/util/XMLAbstractDoubleFloat.hpp
-- Installing: /work/build/external/darwin-x86_64/include/xercesc/util/XMLASCIITranscoder.hpp
-- Installing: /work/build/external/darwin-x86_64/include/xercesc/util/XMLBigDecimal.hpp
-- Installing: /work/build/external/darwin-x86_64/include/xercesc/util/XMLBigInteger.hpp
-- Installing: /work/build/external/darwin-x86_64/include/xercesc/util/XMLChar.hpp
-- Installing: /work/build/external/darwin-x86_64/include/xercesc/util/XMLChTranscoder.hpp
-- Installing: /work/build/external/darwin-x86_64/include/xercesc/util/XMLDateTime.hpp
-- Installing: /work/build/external/darwin-x86_64/include/xercesc/util/XMLDOMMsg.hpp
-- Installing: /work/build/external/darwin-x86_64/include/xercesc/util/XMLDouble.hpp
-- Installing: /work/build/external/darwin-x86_64/include/xercesc/util/XMLEBCDICTranscoder.hpp
-- Installing: /work/build/external/darwin-x86_64/include/xercesc/util/XMLEntityResolver.hpp
-- Installing: /work/build/external/darwin-x86_64/include/xercesc/util/XMLEnumerator.hpp
-- Installing: /work/build/external/darwin-x86_64/include/xercesc/util/XMLException.hpp
-- Installing: /work/build/external/darwin-x86_64/include/xercesc/util/XMLExceptMsgs.hpp
-- Installing: /work/build/external/darwin-x86_64/include/xercesc/util/XMLFileMgr.hpp
-- Installing: /work/build/external/darwin-x86_64/include/xercesc/util/XMLFloat.hpp
-- Installing: /work/build/external/darwin-x86_64/include/xercesc/util/XMLIBM1047Transcoder.hpp
-- Installing: /work/build/external/darwin-x86_64/include/xercesc/util/XMLIBM1140Transcoder.hpp
-- Installing: /work/build/external/darwin-x86_64/include/xercesc/util/XMLInitializer.hpp
-- Installing: /work/build/external/darwin-x86_64/include/xercesc/util/XMLInteger.hpp
-- Installing: /work/build/external/darwin-x86_64/include/xercesc/util/XMLMutexMgr.hpp
-- Installing: /work/build/external/darwin-x86_64/include/xercesc/util/XMLMsgLoader.hpp
-- Installing: /work/build/external/darwin-x86_64/include/xercesc/util/XMLNetAccessor.hpp
-- Installing: /work/build/external/darwin-x86_64/include/xercesc/util/XMLNumber.hpp
-- Installing: /work/build/external/darwin-x86_64/include/xercesc/util/XMLResourceIdentifier.hpp
-- Installing: /work/build/external/darwin-x86_64/include/xercesc/util/XMLString.hpp
-- Installing: /work/build/external/darwin-x86_64/include/xercesc/util/XMLStringTokenizer.hpp
-- Installing: /work/build/external/darwin-x86_64/include/xercesc/util/XMLUCS4Transcoder.hpp
-- Installing: /work/build/external/darwin-x86_64/include/xercesc/util/XMLUni.hpp
-- Installing: /work/build/external/darwin-x86_64/include/xercesc/util/XMLUniDefs.hpp
-- Installing: /work/build/external/darwin-x86_64/include/xercesc/util/XMLUri.hpp
-- Installing: /work/build/external/darwin-x86_64/include/xercesc/util/XMLURL.hpp
-- Installing: /work/build/external/darwin-x86_64/include/xercesc/util/XMLUTF16Transcoder.hpp
-- Installing: /work/build/external/darwin-x86_64/include/xercesc/util/XMLUTF8Transcoder.hpp
-- Installing: /work/build/external/darwin-x86_64/include/xercesc/util/XMLWin1252Transcoder.hpp
-- Installing: /work/build/external/darwin-x86_64/include/xercesc/dom/DOM.hpp
-- Installing: /work/build/external/darwin-x86_64/include/xercesc/dom/DOMAttr.hpp
-- Installing: /work/build/external/darwin-x86_64/include/xercesc/dom/DOMCDATASection.hpp
-- Installing: /work/build/external/darwin-x86_64/include/xercesc/dom/DOMCharacterData.hpp
-- Installing: /work/build/external/darwin-x86_64/include/xercesc/dom/DOMComment.hpp
-- Installing: /work/build/external/darwin-x86_64/include/xercesc/dom/DOMConfiguration.hpp
-- Installing: /work/build/external/darwin-x86_64/include/xercesc/dom/DOMDocument.hpp
-- Installing: /work/build/external/darwin-x86_64/include/xercesc/dom/DOMDocumentFragment.hpp
-- Installing: /work/build/external/darwin-x86_64/include/xercesc/dom/DOMDocumentRange.hpp
-- Installing: /work/build/external/darwin-x86_64/include/xercesc/dom/DOMDocumentTraversal.hpp
-- Installing: /work/build/external/darwin-x86_64/include/xercesc/dom/DOMDocumentType.hpp
-- Installing: /work/build/external/darwin-x86_64/include/xercesc/dom/DOMElement.hpp
-- Installing: /work/build/external/darwin-x86_64/include/xercesc/dom/DOMEntity.hpp
-- Installing: /work/build/external/darwin-x86_64/include/xercesc/dom/DOMEntityReference.hpp
-- Installing: /work/build/external/darwin-x86_64/include/xercesc/dom/DOMError.hpp
-- Installing: /work/build/external/darwin-x86_64/include/xercesc/dom/DOMErrorHandler.hpp
-- Installing: /work/build/external/darwin-x86_64/include/xercesc/dom/DOMException.hpp
-- Installing: /work/build/external/darwin-x86_64/include/xercesc/dom/DOMImplementation.hpp
-- Installing: /work/build/external/darwin-x86_64/include/xercesc/dom/DOMImplementationList.hpp
-- Installing: /work/build/external/darwin-x86_64/include/xercesc/dom/DOMImplementationLS.hpp
-- Installing: /work/build/external/darwin-x86_64/include/xercesc/dom/DOMImplementationRegistry.hpp
-- Installing: /work/build/external/darwin-x86_64/include/xercesc/dom/DOMImplementationSource.hpp
-- Installing: /work/build/external/darwin-x86_64/include/xercesc/dom/DOMLocator.hpp
-- Installing: /work/build/external/darwin-x86_64/include/xercesc/dom/DOMLSException.hpp
-- Installing: /work/build/external/darwin-x86_64/include/xercesc/dom/DOMLSInput.hpp
-- Installing: /work/build/external/darwin-x86_64/include/xercesc/dom/DOMLSOutput.hpp
-- Installing: /work/build/external/darwin-x86_64/include/xercesc/dom/DOMLSParser.hpp
-- Installing: /work/build/external/darwin-x86_64/include/xercesc/dom/DOMLSParserFilter.hpp
-- Installing: /work/build/external/darwin-x86_64/include/xercesc/dom/DOMLSResourceResolver.hpp
-- Installing: /work/build/external/darwin-x86_64/include/xercesc/dom/DOMLSSerializer.hpp
-- Installing: /work/build/external/darwin-x86_64/include/xercesc/dom/DOMLSSerializerFilter.hpp
-- Installing: /work/build/external/darwin-x86_64/include/xercesc/dom/DOMMemoryManager.hpp
-- Installing: /work/build/external/darwin-x86_64/include/xercesc/dom/DOMNamedNodeMap.hpp
-- Installing: /work/build/external/darwin-x86_64/include/xercesc/dom/DOMNode.hpp
-- Installing: /work/build/external/darwin-x86_64/include/xercesc/dom/DOMNodeFilter.hpp
-- Installing: /work/build/external/darwin-x86_64/include/xercesc/dom/DOMNodeIterator.hpp
-- Installing: /work/build/external/darwin-x86_64/include/xercesc/dom/DOMNodeList.hpp
-- Installing: /work/build/external/darwin-x86_64/include/xercesc/dom/DOMNotation.hpp
-- Installing: /work/build/external/darwin-x86_64/include/xercesc/dom/DOMProcessingInstruction.hpp
-- Installing: /work/build/external/darwin-x86_64/include/xercesc/dom/DOMPSVITypeInfo.hpp
-- Installing: /work/build/external/darwin-x86_64/include/xercesc/dom/DOMRange.hpp
-- Installing: /work/build/external/darwin-x86_64/include/xercesc/dom/DOMRangeException.hpp
-- Installing: /work/build/external/darwin-x86_64/include/xercesc/dom/DOMStringList.hpp
-- Installing: /work/build/external/darwin-x86_64/include/xercesc/dom/DOMText.hpp
-- Installing: /work/build/external/darwin-x86_64/include/xercesc/dom/DOMTreeWalker.hpp
-- Installing: /work/build/external/darwin-x86_64/include/xercesc/dom/DOMTypeInfo.hpp
-- Installing: /work/build/external/darwin-x86_64/include/xercesc/dom/DOMUserDataHandler.hpp
-- Installing: /work/build/external/darwin-x86_64/include/xercesc/dom/DOMXPathEvaluator.hpp
-- Installing: /work/build/external/darwin-x86_64/include/xercesc/dom/DOMXPathException.hpp
-- Installing: /work/build/external/darwin-x86_64/include/xercesc/dom/DOMXPathExpression.hpp
-- Installing: /work/build/external/darwin-x86_64/include/xercesc/dom/DOMXPathNamespace.hpp
-- Installing: /work/build/external/darwin-x86_64/include/xercesc/dom/DOMXPathNSResolver.hpp
-- Installing: /work/build/external/darwin-x86_64/include/xercesc/dom/DOMXPathResult.hpp
-- Installing: /work/build/external/darwin-x86_64/include/xercesc/dom/StDOMNode.hpp
-- Installing: /work/build/external/darwin-x86_64/include/xercesc/dom/impl/DOMAttrImpl.hpp
-- Installing: /work/build/external/darwin-x86_64/include/xercesc/dom/impl/DOMAttrMapImpl.hpp
-- Installing: /work/build/external/darwin-x86_64/include/xercesc/dom/impl/DOMAttrNSImpl.hpp
-- Installing: /work/build/external/darwin-x86_64/include/xercesc/dom/impl/DOMCasts.hpp
-- Installing: /work/build/external/darwin-x86_64/include/xercesc/dom/impl/DOMCDATASectionImpl.hpp
-- Installing: /work/build/external/darwin-x86_64/include/xercesc/dom/impl/DOMCharacterDataImpl.hpp
-- Installing: /work/build/external/darwin-x86_64/include/xercesc/dom/impl/DOMChildNode.hpp
-- Installing: /work/build/external/darwin-x86_64/include/xercesc/dom/impl/DOMCommentImpl.hpp
-- Installing: /work/build/external/darwin-x86_64/include/xercesc/dom/impl/DOMConfigurationImpl.hpp
-- Installing: /work/build/external/darwin-x86_64/include/xercesc/dom/impl/DOMDeepNodeListImpl.hpp
-- Installing: /work/build/external/darwin-x86_64/include/xercesc/dom/impl/DOMDeepNodeListPool.hpp
-- Installing: /work/build/external/darwin-x86_64/include/xercesc/dom/impl/DOMDeepNodeListPool.c
-- Installing: /work/build/external/darwin-x86_64/include/xercesc/dom/impl/DOMDocumentFragmentImpl.hpp
-- Installing: /work/build/external/darwin-x86_64/include/xercesc/dom/impl/DOMDocumentImpl.hpp
-- Installing: /work/build/external/darwin-x86_64/include/xercesc/dom/impl/DOMDocumentTypeImpl.hpp
-- Installing: /work/build/external/darwin-x86_64/include/xercesc/dom/impl/DOMElementImpl.hpp
-- Installing: /work/build/external/darwin-x86_64/include/xercesc/dom/impl/DOMElementNSImpl.hpp
-- Installing: /work/build/external/darwin-x86_64/include/xercesc/dom/impl/DOMEntityImpl.hpp
-- Installing: /work/build/external/darwin-x86_64/include/xercesc/dom/impl/DOMEntityReferenceImpl.hpp
-- Installing: /work/build/external/darwin-x86_64/include/xercesc/dom/impl/DOMErrorImpl.hpp
-- Installing: /work/build/external/darwin-x86_64/include/xercesc/dom/impl/DOMImplementationImpl.hpp
-- Installing: /work/build/external/darwin-x86_64/include/xercesc/dom/impl/DOMImplementationListImpl.hpp
-- Installing: /work/build/external/darwin-x86_64/include/xercesc/dom/impl/DOMLocatorImpl.hpp
-- Installing: /work/build/external/darwin-x86_64/include/xercesc/dom/impl/DOMNamedNodeMapImpl.hpp
-- Installing: /work/build/external/darwin-x86_64/include/xercesc/dom/impl/DOMNodeBase.hpp
-- Installing: /work/build/external/darwin-x86_64/include/xercesc/dom/impl/DOMNodeIDMap.hpp
-- Installing: /work/build/external/darwin-x86_64/include/xercesc/dom/impl/DOMNodeImpl.hpp
-- Installing: /work/build/external/darwin-x86_64/include/xercesc/dom/impl/DOMNodeIteratorImpl.hpp
-- Installing: /work/build/external/darwin-x86_64/include/xercesc/dom/impl/DOMNodeListImpl.hpp
-- Installing: /work/build/external/darwin-x86_64/include/xercesc/dom/impl/DOMNodeVector.hpp
-- Installing: /work/build/external/darwin-x86_64/include/xercesc/dom/impl/DOMNormalizer.hpp
-- Installing: /work/build/external/darwin-x86_64/include/xercesc/dom/impl/DOMNotationImpl.hpp
-- Installing: /work/build/external/darwin-x86_64/include/xercesc/dom/impl/DOMParentNode.hpp
-- Installing: /work/build/external/darwin-x86_64/include/xercesc/dom/impl/DOMProcessingInstructionImpl.hpp
-- Installing: /work/build/external/darwin-x86_64/include/xercesc/dom/impl/DOMRangeImpl.hpp
-- Installing: /work/build/external/darwin-x86_64/include/xercesc/dom/impl/DOMStringListImpl.hpp
-- Installing: /work/build/external/darwin-x86_64/include/xercesc/dom/impl/DOMStringPool.hpp
-- Installing: /work/build/external/darwin-x86_64/include/xercesc/dom/impl/DOMTextImpl.hpp
-- Installing: /work/build/external/darwin-x86_64/include/xercesc/dom/impl/DOMTreeWalkerImpl.hpp
-- Installing: /work/build/external/darwin-x86_64/include/xercesc/dom/impl/DOMTypeInfoImpl.hpp
-- Installing: /work/build/external/darwin-x86_64/include/xercesc/dom/impl/DOMLSSerializerImpl.hpp
-- Installing: /work/build/external/darwin-x86_64/include/xercesc/dom/impl/DOMLSInputImpl.hpp
-- Installing: /work/build/external/darwin-x86_64/include/xercesc/dom/impl/DOMLSOutputImpl.hpp
-- Installing: /work/build/external/darwin-x86_64/include/xercesc/dom/impl/DOMXPathExpressionImpl.hpp
-- Installing: /work/build/external/darwin-x86_64/include/xercesc/dom/impl/DOMXPathNSResolverImpl.hpp
-- Installing: /work/build/external/darwin-x86_64/include/xercesc/dom/impl/DOMXPathResultImpl.hpp
-- Installing: /work/build/external/darwin-x86_64/include/xercesc/dom/impl/XSDElementNSImpl.hpp
-- Installing: /work/build/external/darwin-x86_64/include/xercesc/framework/BinOutputStream.hpp
-- Installing: /work/build/external/darwin-x86_64/include/xercesc/framework/LocalFileFormatTarget.hpp
-- Installing: /work/build/external/darwin-x86_64/include/xercesc/framework/LocalFileInputSource.hpp
-- Installing: /work/build/external/darwin-x86_64/include/xercesc/framework/MemBufFormatTarget.hpp
-- Installing: /work/build/external/darwin-x86_64/include/xercesc/framework/MemBufInputSource.hpp
-- Installing: /work/build/external/darwin-x86_64/include/xercesc/framework/MemoryManager.hpp
-- Installing: /work/build/external/darwin-x86_64/include/xercesc/framework/psvi/PSVIAttribute.hpp
-- Installing: /work/build/external/darwin-x86_64/include/xercesc/framework/psvi/PSVIAttributeList.hpp
-- Installing: /work/build/external/darwin-x86_64/include/xercesc/framework/psvi/PSVIElement.hpp
-- Installing: /work/build/external/darwin-x86_64/include/xercesc/framework/psvi/PSVIHandler.hpp
-- Installing: /work/build/external/darwin-x86_64/include/xercesc/framework/psvi/PSVIItem.hpp
-- Installing: /work/build/external/darwin-x86_64/include/xercesc/framework/psvi/XSAnnotation.hpp
-- Installing: /work/build/external/darwin-x86_64/include/xercesc/framework/psvi/XSAttributeDeclaration.hpp
-- Installing: /work/build/external/darwin-x86_64/include/xercesc/framework/psvi/XSAttributeGroupDefinition.hpp
-- Installing: /work/build/external/darwin-x86_64/include/xercesc/framework/psvi/XSAttributeUse.hpp
-- Installing: /work/build/external/darwin-x86_64/include/xercesc/framework/psvi/XSComplexTypeDefinition.hpp
-- Installing: /work/build/external/darwin-x86_64/include/xercesc/framework/psvi/XSConstants.hpp
-- Installing: /work/build/external/darwin-x86_64/include/xercesc/framework/psvi/XSElementDeclaration.hpp
-- Installing: /work/build/external/darwin-x86_64/include/xercesc/framework/psvi/XSFacet.hpp
-- Installing: /work/build/external/darwin-x86_64/include/xercesc/framework/psvi/XSIDCDefinition.hpp
-- Installing: /work/build/external/darwin-x86_64/include/xercesc/framework/psvi/XSModel.hpp
-- Installing: /work/build/external/darwin-x86_64/include/xercesc/framework/psvi/XSModelGroup.hpp
-- Installing: /work/build/external/darwin-x86_64/include/xercesc/framework/psvi/XSModelGroupDefinition.hpp
-- Installing: /work/build/external/darwin-x86_64/include/xercesc/framework/psvi/XSMultiValueFacet.hpp
-- Installing: /work/build/external/darwin-x86_64/include/xercesc/framework/psvi/XSNamedMap.hpp
-- Installing: /work/build/external/darwin-x86_64/include/xercesc/framework/psvi/XSNamedMap.c
-- Installing: /work/build/external/darwin-x86_64/include/xercesc/framework/psvi/XSNamespaceItem.hpp
-- Installing: /work/build/external/darwin-x86_64/include/xercesc/framework/psvi/XSNotationDeclaration.hpp
-- Installing: /work/build/external/darwin-x86_64/include/xercesc/framework/psvi/XSObject.hpp
-- Installing: /work/build/external/darwin-x86_64/include/xercesc/framework/psvi/XSParticle.hpp
-- Installing: /work/build/external/darwin-x86_64/include/xercesc/framework/psvi/XSSimpleTypeDefinition.hpp
-- Installing: /work/build/external/darwin-x86_64/include/xercesc/framework/psvi/XSTypeDefinition.hpp
-- Installing: /work/build/external/darwin-x86_64/include/xercesc/framework/psvi/XSValue.hpp
-- Installing: /work/build/external/darwin-x86_64/include/xercesc/framework/psvi/XSWildcard.hpp
-- Installing: /work/build/external/darwin-x86_64/include/xercesc/framework/StdInInputSource.hpp
-- Installing: /work/build/external/darwin-x86_64/include/xercesc/framework/StdOutFormatTarget.hpp
-- Installing: /work/build/external/darwin-x86_64/include/xercesc/framework/URLInputSource.hpp
-- Installing: /work/build/external/darwin-x86_64/include/xercesc/framework/ValidationContext.hpp
-- Installing: /work/build/external/darwin-x86_64/include/xercesc/framework/Wrapper4DOMLSInput.hpp
-- Installing: /work/build/external/darwin-x86_64/include/xercesc/framework/Wrapper4InputSource.hpp
-- Installing: /work/build/external/darwin-x86_64/include/xercesc/framework/XMLAttDef.hpp
-- Installing: /work/build/external/darwin-x86_64/include/xercesc/framework/XMLAttDefList.hpp
-- Installing: /work/build/external/darwin-x86_64/include/xercesc/framework/XMLAttr.hpp
-- Installing: /work/build/external/darwin-x86_64/include/xercesc/framework/XMLBuffer.hpp
-- Installing: /work/build/external/darwin-x86_64/include/xercesc/framework/XMLBufferMgr.hpp
-- Installing: /work/build/external/darwin-x86_64/include/xercesc/framework/XMLContentModel.hpp
-- Installing: /work/build/external/darwin-x86_64/include/xercesc/framework/XMLDocumentHandler.hpp
-- Installing: /work/build/external/darwin-x86_64/include/xercesc/framework/XMLDTDDescription.hpp
-- Installing: /work/build/external/darwin-x86_64/include/xercesc/framework/XMLElementDecl.hpp
-- Installing: /work/build/external/darwin-x86_64/include/xercesc/framework/XMLEntityDecl.hpp
-- Installing: /work/build/external/darwin-x86_64/include/xercesc/framework/XMLEntityHandler.hpp
-- Installing: /work/build/external/darwin-x86_64/include/xercesc/framework/XMLErrorCodes.hpp
-- Installing: /work/build/external/darwin-x86_64/include/xercesc/framework/XMLErrorReporter.hpp
-- Installing: /work/build/external/darwin-x86_64/include/xercesc/framework/XMLFormatter.hpp
-- Installing: /work/build/external/darwin-x86_64/include/xercesc/framework/XMLGrammarDescription.hpp
-- Installing: /work/build/external/darwin-x86_64/include/xercesc/framework/XMLGrammarPool.hpp
-- Installing: /work/build/external/darwin-x86_64/include/xercesc/framework/XMLGrammarPoolImpl.hpp
-- Installing: /work/build/external/darwin-x86_64/include/xercesc/framework/XMLNotationDecl.hpp
-- Installing: /work/build/external/darwin-x86_64/include/xercesc/framework/XMLPScanToken.hpp
-- Installing: /work/build/external/darwin-x86_64/include/xercesc/framework/XMLRecognizer.hpp
-- Installing: /work/build/external/darwin-x86_64/include/xercesc/framework/XMLRefInfo.hpp
-- Installing: /work/build/external/darwin-x86_64/include/xercesc/framework/XMLSchemaDescription.hpp
-- Installing: /work/build/external/darwin-x86_64/include/xercesc/framework/XMLValidator.hpp
-- Installing: /work/build/external/darwin-x86_64/include/xercesc/framework/XMLValidityCodes.hpp
-- Installing: /work/build/external/darwin-x86_64/include/xercesc/internal/BinFileOutputStream.hpp
-- Installing: /work/build/external/darwin-x86_64/include/xercesc/internal/BinMemOutputStream.hpp
-- Installing: /work/build/external/darwin-x86_64/include/xercesc/internal/CharTypeTables.hpp
-- Installing: /work/build/external/darwin-x86_64/include/xercesc/internal/DGXMLScanner.hpp
-- Installing: /work/build/external/darwin-x86_64/include/xercesc/internal/ElemStack.hpp
-- Installing: /work/build/external/darwin-x86_64/include/xercesc/internal/EndOfEntityException.hpp
-- Installing: /work/build/external/darwin-x86_64/include/xercesc/internal/IANAEncodings.hpp
-- Installing: /work/build/external/darwin-x86_64/include/xercesc/internal/IGXMLScanner.hpp
-- Installing: /work/build/external/darwin-x86_64/include/xercesc/internal/MemoryManagerImpl.hpp
-- Installing: /work/build/external/darwin-x86_64/include/xercesc/internal/ReaderMgr.hpp
-- Installing: /work/build/external/darwin-x86_64/include/xercesc/internal/SGXMLScanner.hpp
-- Installing: /work/build/external/darwin-x86_64/include/xercesc/internal/ValidationContextImpl.hpp
-- Installing: /work/build/external/darwin-x86_64/include/xercesc/internal/VecAttributesImpl.hpp
-- Installing: /work/build/external/darwin-x86_64/include/xercesc/internal/VecAttrListImpl.hpp
-- Installing: /work/build/external/darwin-x86_64/include/xercesc/internal/WFXMLScanner.hpp
-- Installing: /work/build/external/darwin-x86_64/include/xercesc/internal/XMLInternalErrorHandler.hpp
-- Installing: /work/build/external/darwin-x86_64/include/xercesc/internal/XMLReader.hpp
-- Installing: /work/build/external/darwin-x86_64/include/xercesc/internal/XMLScanner.hpp
-- Installing: /work/build/external/darwin-x86_64/include/xercesc/internal/XMLScannerResolver.hpp
-- Installing: /work/build/external/darwin-x86_64/include/xercesc/internal/XProtoType.hpp
-- Installing: /work/build/external/darwin-x86_64/include/xercesc/internal/XSAXMLScanner.hpp
-- Installing: /work/build/external/darwin-x86_64/include/xercesc/internal/XSerializable.hpp
-- Installing: /work/build/external/darwin-x86_64/include/xercesc/internal/XSerializationException.hpp
-- Installing: /work/build/external/darwin-x86_64/include/xercesc/internal/XSerializeEngine.hpp
-- Installing: /work/build/external/darwin-x86_64/include/xercesc/internal/XSObjectFactory.hpp
-- Installing: /work/build/external/darwin-x86_64/include/xercesc/internal/XTemplateSerializer.hpp
-- Installing: /work/build/external/darwin-x86_64/include/xercesc/parsers/AbstractDOMParser.hpp
-- Installing: /work/build/external/darwin-x86_64/include/xercesc/parsers/DOMLSParserImpl.hpp
-- Installing: /work/build/external/darwin-x86_64/include/xercesc/parsers/SAX2XMLFilterImpl.hpp
-- Installing: /work/build/external/darwin-x86_64/include/xercesc/parsers/SAX2XMLReaderImpl.hpp
-- Installing: /work/build/external/darwin-x86_64/include/xercesc/parsers/SAXParser.hpp
-- Installing: /work/build/external/darwin-x86_64/include/xercesc/parsers/XercesDOMParser.hpp
-- Installing: /work/build/external/darwin-x86_64/include/xercesc/sax/AttributeList.hpp
-- Installing: /work/build/external/darwin-x86_64/include/xercesc/sax/DocumentHandler.hpp
-- Installing: /work/build/external/darwin-x86_64/include/xercesc/sax/DTDHandler.hpp
-- Installing: /work/build/external/darwin-x86_64/include/xercesc/sax/EntityResolver.hpp
-- Installing: /work/build/external/darwin-x86_64/include/xercesc/sax/ErrorHandler.hpp
-- Installing: /work/build/external/darwin-x86_64/include/xercesc/sax/HandlerBase.hpp
-- Installing: /work/build/external/darwin-x86_64/include/xercesc/sax/InputSource.hpp
-- Installing: /work/build/external/darwin-x86_64/include/xercesc/sax/Locator.hpp
-- Installing: /work/build/external/darwin-x86_64/include/xercesc/sax/Parser.hpp
-- Installing: /work/build/external/darwin-x86_64/include/xercesc/sax/SAXException.hpp
-- Installing: /work/build/external/darwin-x86_64/include/xercesc/sax/SAXParseException.hpp
-- Installing: /work/build/external/darwin-x86_64/include/xercesc/sax2/Attributes.hpp
-- Installing: /work/build/external/darwin-x86_64/include/xercesc/sax2/ContentHandler.hpp
-- Installing: /work/build/external/darwin-x86_64/include/xercesc/sax2/DeclHandler.hpp
-- Installing: /work/build/external/darwin-x86_64/include/xercesc/sax2/DefaultHandler.hpp
-- Installing: /work/build/external/darwin-x86_64/include/xercesc/sax2/LexicalHandler.hpp
-- Installing: /work/build/external/darwin-x86_64/include/xercesc/sax2/SAX2XMLFilter.hpp
-- Installing: /work/build/external/darwin-x86_64/include/xercesc/sax2/SAX2XMLReader.hpp
-- Installing: /work/build/external/darwin-x86_64/include/xercesc/sax2/XMLReaderFactory.hpp
-- Installing: /work/build/external/darwin-x86_64/include/xercesc/validators/common/AllContentModel.hpp
-- Installing: /work/build/external/darwin-x86_64/include/xercesc/validators/common/CMAny.hpp
-- Installing: /work/build/external/darwin-x86_64/include/xercesc/validators/common/CMBinaryOp.hpp
-- Installing: /work/build/external/darwin-x86_64/include/xercesc/validators/common/CMLeaf.hpp
-- Installing: /work/build/external/darwin-x86_64/include/xercesc/validators/common/CMRepeatingLeaf.hpp
-- Installing: /work/build/external/darwin-x86_64/include/xercesc/validators/common/CMNode.hpp
-- Installing: /work/build/external/darwin-x86_64/include/xercesc/validators/common/CMStateSet.hpp
-- Installing: /work/build/external/darwin-x86_64/include/xercesc/validators/common/CMUnaryOp.hpp
-- Installing: /work/build/external/darwin-x86_64/include/xercesc/validators/common/ContentLeafNameTypeVector.hpp
-- Installing: /work/build/external/darwin-x86_64/include/xercesc/validators/common/ContentSpecNode.hpp
-- Installing: /work/build/external/darwin-x86_64/include/xercesc/validators/common/DFAContentModel.hpp
-- Installing: /work/build/external/darwin-x86_64/include/xercesc/validators/common/Grammar.hpp
-- Installing: /work/build/external/darwin-x86_64/include/xercesc/validators/common/GrammarResolver.hpp
-- Installing: /work/build/external/darwin-x86_64/include/xercesc/validators/common/MixedContentModel.hpp
-- Installing: /work/build/external/darwin-x86_64/include/xercesc/validators/common/SimpleContentModel.hpp
-- Installing: /work/build/external/darwin-x86_64/include/xercesc/validators/datatype/AbstractNumericFacetValidator.hpp
-- Installing: /work/build/external/darwin-x86_64/include/xercesc/validators/datatype/AbstractNumericValidator.hpp
-- Installing: /work/build/external/darwin-x86_64/include/xercesc/validators/datatype/AbstractStringValidator.hpp
-- Installing: /work/build/external/darwin-x86_64/include/xercesc/validators/datatype/AnySimpleTypeDatatypeValidator.hpp
-- Installing: /work/build/external/darwin-x86_64/include/xercesc/validators/datatype/AnyURIDatatypeValidator.hpp
-- Installing: /work/build/external/darwin-x86_64/include/xercesc/validators/datatype/Base64BinaryDatatypeValidator.hpp
-- Installing: /work/build/external/darwin-x86_64/include/xercesc/validators/datatype/BooleanDatatypeValidator.hpp
-- Installing: /work/build/external/darwin-x86_64/include/xercesc/validators/datatype/DatatypeValidator.hpp
-- Installing: /work/build/external/darwin-x86_64/include/xercesc/validators/datatype/DatatypeValidatorFactory.hpp
-- Installing: /work/build/external/darwin-x86_64/include/xercesc/validators/datatype/DateDatatypeValidator.hpp
-- Installing: /work/build/external/darwin-x86_64/include/xercesc/validators/datatype/DateTimeDatatypeValidator.hpp
-- Installing: /work/build/external/darwin-x86_64/include/xercesc/validators/datatype/DateTimeValidator.hpp
-- Installing: /work/build/external/darwin-x86_64/include/xercesc/validators/datatype/DayDatatypeValidator.hpp
-- Installing: /work/build/external/darwin-x86_64/include/xercesc/validators/datatype/DecimalDatatypeValidator.hpp
-- Installing: /work/build/external/darwin-x86_64/include/xercesc/validators/datatype/DoubleDatatypeValidator.hpp
-- Installing: /work/build/external/darwin-x86_64/include/xercesc/validators/datatype/DurationDatatypeValidator.hpp
-- Installing: /work/build/external/darwin-x86_64/include/xercesc/validators/datatype/ENTITYDatatypeValidator.hpp
-- Installing: /work/build/external/darwin-x86_64/include/xercesc/validators/datatype/FloatDatatypeValidator.hpp
-- Installing: /work/build/external/darwin-x86_64/include/xercesc/validators/datatype/HexBinaryDatatypeValidator.hpp
-- Installing: /work/build/external/darwin-x86_64/include/xercesc/validators/datatype/IDDatatypeValidator.hpp
-- Installing: /work/build/external/darwin-x86_64/include/xercesc/validators/datatype/IDREFDatatypeValidator.hpp
-- Installing: /work/build/external/darwin-x86_64/include/xercesc/validators/datatype/InvalidDatatypeFacetException.hpp
-- Installing: /work/build/external/darwin-x86_64/include/xercesc/validators/datatype/InvalidDatatypeValueException.hpp
-- Installing: /work/build/external/darwin-x86_64/include/xercesc/validators/datatype/ListDatatypeValidator.hpp
-- Installing: /work/build/external/darwin-x86_64/include/xercesc/validators/datatype/MonthDatatypeValidator.hpp
-- Installing: /work/build/external/darwin-x86_64/include/xercesc/validators/datatype/MonthDayDatatypeValidator.hpp
-- Installing: /work/build/external/darwin-x86_64/include/xercesc/validators/datatype/NameDatatypeValidator.hpp
-- Installing: /work/build/external/darwin-x86_64/include/xercesc/validators/datatype/NCNameDatatypeValidator.hpp
-- Installing: /work/build/external/darwin-x86_64/include/xercesc/validators/datatype/NOTATIONDatatypeValidator.hpp
-- Installing: /work/build/external/darwin-x86_64/include/xercesc/validators/datatype/QNameDatatypeValidator.hpp
-- Installing: /work/build/external/darwin-x86_64/include/xercesc/validators/datatype/StringDatatypeValidator.hpp
-- Installing: /work/build/external/darwin-x86_64/include/xercesc/validators/datatype/TimeDatatypeValidator.hpp
-- Installing: /work/build/external/darwin-x86_64/include/xercesc/validators/datatype/UnionDatatypeValidator.hpp
-- Installing: /work/build/external/darwin-x86_64/include/xercesc/validators/datatype/XMLCanRepGroup.hpp
-- Installing: /work/build/external/darwin-x86_64/include/xercesc/validators/datatype/YearDatatypeValidator.hpp
-- Installing: /work/build/external/darwin-x86_64/include/xercesc/validators/datatype/YearMonthDatatypeValidator.hpp
-- Installing: /work/build/external/darwin-x86_64/include/xercesc/validators/DTD/DocTypeHandler.hpp
-- Installing: /work/build/external/darwin-x86_64/include/xercesc/validators/DTD/DTDAttDef.hpp
-- Installing: /work/build/external/darwin-x86_64/include/xercesc/validators/DTD/DTDAttDefList.hpp
-- Installing: /work/build/external/darwin-x86_64/include/xercesc/validators/DTD/DTDElementDecl.hpp
-- Installing: /work/build/external/darwin-x86_64/include/xercesc/validators/DTD/DTDEntityDecl.hpp
-- Installing: /work/build/external/darwin-x86_64/include/xercesc/validators/DTD/DTDGrammar.hpp
-- Installing: /work/build/external/darwin-x86_64/include/xercesc/validators/DTD/DTDScanner.hpp
-- Installing: /work/build/external/darwin-x86_64/include/xercesc/validators/DTD/DTDValidator.hpp
-- Installing: /work/build/external/darwin-x86_64/include/xercesc/validators/DTD/XMLDTDDescriptionImpl.hpp
-- Installing: /work/build/external/darwin-x86_64/include/xercesc/validators/schema/ComplexTypeInfo.hpp
-- Installing: /work/build/external/darwin-x86_64/include/xercesc/validators/schema/GeneralAttributeCheck.hpp
-- Installing: /work/build/external/darwin-x86_64/include/xercesc/validators/schema/identity/FieldActivator.hpp
-- Installing: /work/build/external/darwin-x86_64/include/xercesc/validators/schema/identity/FieldValueMap.hpp
-- Installing: /work/build/external/darwin-x86_64/include/xercesc/validators/schema/identity/IC_Field.hpp
-- Installing: /work/build/external/darwin-x86_64/include/xercesc/validators/schema/identity/IC_Key.hpp
-- Installing: /work/build/external/darwin-x86_64/include/xercesc/validators/schema/identity/IC_KeyRef.hpp
-- Installing: /work/build/external/darwin-x86_64/include/xercesc/validators/schema/identity/IC_Selector.hpp
-- Installing: /work/build/external/darwin-x86_64/include/xercesc/validators/schema/identity/IC_Unique.hpp
-- Installing: /work/build/external/darwin-x86_64/include/xercesc/validators/schema/identity/IdentityConstraint.hpp
-- Installing: /work/build/external/darwin-x86_64/include/xercesc/validators/schema/identity/IdentityConstraintHandler.hpp
-- Installing: /work/build/external/darwin-x86_64/include/xercesc/validators/schema/identity/ValueStore.hpp
-- Installing: /work/build/external/darwin-x86_64/include/xercesc/validators/schema/identity/ValueStoreCache.hpp
-- Installing: /work/build/external/darwin-x86_64/include/xercesc/validators/schema/identity/XercesXPath.hpp
-- Installing: /work/build/external/darwin-x86_64/include/xercesc/validators/schema/identity/XPathException.hpp
-- Installing: /work/build/external/darwin-x86_64/include/xercesc/validators/schema/identity/XPathMatcher.hpp
-- Installing: /work/build/external/darwin-x86_64/include/xercesc/validators/schema/identity/XPathMatcherStack.hpp
-- Installing: /work/build/external/darwin-x86_64/include/xercesc/validators/schema/identity/XPathSymbols.hpp
-- Installing: /work/build/external/darwin-x86_64/include/xercesc/validators/schema/NamespaceScope.hpp
-- Installing: /work/build/external/darwin-x86_64/include/xercesc/validators/schema/PSVIDefs.hpp
-- Installing: /work/build/external/darwin-x86_64/include/xercesc/validators/schema/SchemaAttDef.hpp
-- Installing: /work/build/external/darwin-x86_64/include/xercesc/validators/schema/SchemaAttDefList.hpp
-- Installing: /work/build/external/darwin-x86_64/include/xercesc/validators/schema/SchemaElementDecl.hpp
-- Installing: /work/build/external/darwin-x86_64/include/xercesc/validators/schema/SchemaGrammar.hpp
-- Installing: /work/build/external/darwin-x86_64/include/xercesc/validators/schema/SchemaInfo.hpp
-- Installing: /work/build/external/darwin-x86_64/include/xercesc/validators/schema/SchemaSymbols.hpp
-- Installing: /work/build/external/darwin-x86_64/include/xercesc/validators/schema/SchemaValidator.hpp
-- Installing: /work/build/external/darwin-x86_64/include/xercesc/validators/schema/SubstitutionGroupComparator.hpp
-- Installing: /work/build/external/darwin-x86_64/include/xercesc/validators/schema/TraverseSchema.hpp
-- Installing: /work/build/external/darwin-x86_64/include/xercesc/validators/schema/XercesAttGroupInfo.hpp
-- Installing: /work/build/external/darwin-x86_64/include/xercesc/validators/schema/XercesElementWildcard.hpp
-- Installing: /work/build/external/darwin-x86_64/include/xercesc/validators/schema/XercesGroupInfo.hpp
-- Installing: /work/build/external/darwin-x86_64/include/xercesc/validators/schema/XMLSchemaDescriptionImpl.hpp
-- Installing: /work/build/external/darwin-x86_64/include/xercesc/validators/schema/XSDDOMParser.hpp
-- Installing: /work/build/external/darwin-x86_64/include/xercesc/validators/schema/XSDErrorReporter.hpp
-- Installing: /work/build/external/darwin-x86_64/include/xercesc/validators/schema/XSDLocator.hpp
-- Installing: /work/build/external/darwin-x86_64/include/xercesc/validators/schema/XUtil.hpp
-- Installing: /work/build/external/darwin-x86_64/include/xercesc/xinclude/XIncludeDOMDocumentProcessor.hpp
-- Installing: /work/build/external/darwin-x86_64/include/xercesc/xinclude/XIncludeLocation.hpp
-- Installing: /work/build/external/darwin-x86_64/include/xercesc/xinclude/XIncludeUtils.hpp
-- Installing: /work/build/external/darwin-x86_64/include/xercesc/util/Transcoders/Iconv/IconvTransService.hpp
-- Installing: /work/build/external/darwin-x86_64/include/xercesc/util/MsgLoaders/InMemory/InMemMsgLoader.hpp
-- Installing: /work/build/external/darwin-x86_64/include/xercesc/util/MsgLoaders/InMemory/XercesMessages_en_US.hpp
-- Installing: /work/build/external/darwin-x86_64/include/xercesc/util/MutexManagers/NoThreadMutexMgr.hpp
-- Installing: /work/build/external/darwin-x86_64/include/xercesc/util/FileManagers/PosixFileMgr.hpp
-- Installing: /work/build/external/darwin-x86_64/include/xercesc/util/Xerces_autoconf_config.hpp
-- Installing: /work/build/external/darwin-x86_64/include/xercesc/util/XercesVersion.hpp
-- Installing: /work/build/external/darwin-x86_64/bin/CreateDOMDocument
-- Installing: /work/build/external/darwin-x86_64/bin/DOMCount
-- Installing: /work/build/external/darwin-x86_64/bin/DOMPrint
-- Installing: /work/build/external/darwin-x86_64/bin/EnumVal
-- Installing: /work/build/external/darwin-x86_64/bin/MemParse
-- Installing: /work/build/external/darwin-x86_64/bin/PParse
-- Installing: /work/build/external/darwin-x86_64/bin/PSVIWriter
-- Installing: /work/build/external/darwin-x86_64/bin/Redirect
-- Installing: /work/build/external/darwin-x86_64/bin/SAX2Count
-- Installing: /work/build/external/darwin-x86_64/bin/SAX2Print
-- Installing: /work/build/external/darwin-x86_64/bin/SAXCount
-- Installing: /work/build/external/darwin-x86_64/bin/SAXPrint
-- Installing: /work/build/external/darwin-x86_64/bin/SCMPrint
-- Installing: /work/build/external/darwin-x86_64/bin/SEnumVal
-- Installing: /work/build/external/darwin-x86_64/bin/StdInParse
-- Installing: /work/build/external/darwin-x86_64/bin/XInclude
make: Leaving directory '/work/build/darwin-x64/xerces-c'
Running CMake
-- cross root is: /opt/osxcross/target/bin
-- OSX target dir is /opt/osxcross/target
-- Compiler..
-- OSX SDK path /opt/osxcross/target/SDK/MacOSX10.15.sdk
-- cross root is: /opt/osxcross/target/bin
-- OSX target dir is /opt/osxcross/target
-- Compiler..
-- OSX SDK path /opt/osxcross/target/SDK/MacOSX10.15.sdk
-- The C compiler identification is Clang 9.0.0
-- The CXX compiler identification is Clang 9.0.0
-- Check for working C compiler: /opt/osxcross/target/bin/o64-clang
-- Check for working C compiler: /opt/osxcross/target/bin/o64-clang -- works
-- Detecting C compiler ABI info
-- Detecting C compiler ABI info - done
-- Detecting C compile features
-- Detecting C compile features - done
-- Check for working CXX compiler: /opt/osxcross/target/bin/o64-clang++
-- Check for working CXX compiler: /opt/osxcross/target/bin/o64-clang++ -- works
-- Detecting CXX compiler ABI info
-- Detecting CXX compiler ABI info - done
-- Detecting CXX compile features
-- Detecting CXX compile features - done
FMU will be installed to: /work/build/install
x86_64
Third parties libraries will use search path: /work/build/external/darwin-x86_64
-- Could NOT find Doxygen (missing: DOXYGEN_EXECUTABLE) 
-- No Doxygen found. Documentation won't be built
-- Could NOT find GTestSrc (missing: GTEST_SOURCE_DIR GTEST_INCLUDE_DIR) 
-- Could NOT find PythonInterp (missing: PYTHON_EXECUTABLE) 
-- Looking for pthread.h
-- Looking for pthread.h - found
-- Looking for pthread_create
-- Looking for pthread_create - found
-- Found Threads: TRUE  
-- Found C inline keyword: inline
-- Looking for getaddrinfo
-- Looking for getaddrinfo - found
-- Looking for socket
-- Looking for socket - found
-- Looking for poll
-- Looking for poll - found
-- Looking for clock_gettime in rt
-- Looking for clock_gettime in rt - not found
-- Looking for posix_spawnp in rt
-- Looking for posix_spawnp in rt - not found
-- Performing Test HAVE_GNU90
-- Performing Test HAVE_GNU90 - Success
-- Could NOT find POPT (missing: POPT_INCLUDE_DIR POPT_LIBRARY) (found version "")
-- Could NOT find XMLTO (missing: XMLTO_EXECUTABLE) 
-- Could NOT find Doxygen (missing: DOXYGEN_EXECUTABLE) 
-- Building rabbitmq as a shared library - no
-- Building rabbitmq as a static library - yes
# date: USE_SYSTEM_TZ_DB ON
# date: USE_TZ_DB_IN_DOT OFF
# date: BUILD_TZ_STATIC ON
-- Performing Test COMPILER_SUPPORTS_CXX17
-- Performing Test COMPILER_SUPPORTS_CXX17 - Success
-- Package Xerces-C++ found: 
Compiler is clang not adding -static-libgcc
x86_64
-- Configuring done
-- Generating done
-- Build files have been written to: /work/build/darwin-x64
Compiling
make: Entering directory '/work/build/darwin-x64'
/usr/bin/cmake -H/work -B/work/build/darwin-x64 --check-build-system CMakeFiles/Makefile.cmake 0
/usr/bin/cmake -E cmake_progress_start /work/build/darwin-x64/CMakeFiles /work/build/darwin-x64/CMakeFiles/progress.marks
make -f CMakeFiles/Makefile2 all
make[1]: Entering directory '/work/build/darwin-x64'
make -f thirdparty/googletest/googletest/CMakeFiles/gtest.dir/build.make thirdparty/googletest/googletest/CMakeFiles/gtest.dir/depend
make -f thirdparty/rabbitmq-c/rabbitmq-c/librabbitmq/CMakeFiles/rabbitmq-static.dir/build.make thirdparty/rabbitmq-c/rabbitmq-c/librabbitmq/CMakeFiles/rabbitmq-static.dir/depend
make -f thirdparty/date/date/CMakeFiles/tz.dir/build.make thirdparty/date/date/CMakeFiles/tz.dir/depend
make[2]: Entering directory '/work/build/darwin-x64'
cd /work/build/darwin-x64 && /usr/bin/cmake -E cmake_depends "Unix Makefiles" /work /work/thirdparty/googletest/googletest /work/build/darwin-x64 /work/build/darwin-x64/thirdparty/googletest/googletest /work/build/darwin-x64/thirdparty/googletest/googletest/CMakeFiles/gtest.dir/DependInfo.cmake --color=
make[2]: Entering directory '/work/build/darwin-x64'
cd /work/build/darwin-x64 && /usr/bin/cmake -E cmake_depends "Unix Makefiles" /work /work/thirdparty/rabbitmq-c/rabbitmq-c/librabbitmq /work/build/darwin-x64 /work/build/darwin-x64/thirdparty/rabbitmq-c/rabbitmq-c/librabbitmq /work/build/darwin-x64/thirdparty/rabbitmq-c/rabbitmq-c/librabbitmq/CMakeFiles/rabbitmq-static.dir/DependInfo.cmake --color=
make[2]: Entering directory '/work/build/darwin-x64'
cd /work/build/darwin-x64 && /usr/bin/cmake -E cmake_depends "Unix Makefiles" /work /work/thirdparty/date/date /work/build/darwin-x64 /work/build/darwin-x64/thirdparty/date/date /work/build/darwin-x64/thirdparty/date/date/CMakeFiles/tz.dir/DependInfo.cmake --color=
Scanning dependencies of target rabbitmq-static
make[2]: Leaving directory '/work/build/darwin-x64'
make -f thirdparty/rabbitmq-c/rabbitmq-c/librabbitmq/CMakeFiles/rabbitmq-static.dir/build.make thirdparty/rabbitmq-c/rabbitmq-c/librabbitmq/CMakeFiles/rabbitmq-static.dir/build
make[2]: Entering directory '/work/build/darwin-x64'
Scanning dependencies of target tz
Scanning dependencies of target gtest
make[2]: Leaving directory '/work/build/darwin-x64'
make -f thirdparty/date/date/CMakeFiles/tz.dir/build.make thirdparty/date/date/CMakeFiles/tz.dir/build
make[2]: Leaving directory '/work/build/darwin-x64'
make -f thirdparty/googletest/googletest/CMakeFiles/gtest.dir/build.make thirdparty/googletest/googletest/CMakeFiles/gtest.dir/build
make[2]: Entering directory '/work/build/darwin-x64'
[  0%] Building C object thirdparty/rabbitmq-c/rabbitmq-c/librabbitmq/CMakeFiles/rabbitmq-static.dir/amqp_table.c.o
[  3%] Building C object thirdparty/rabbitmq-c/rabbitmq-c/librabbitmq/CMakeFiles/rabbitmq-static.dir/amqp_framing.c.o
cd /work/build/darwin-x64/thirdparty/rabbitmq-c/rabbitmq-c/librabbitmq && /opt/osxcross/target/bin/o64-clang -DAMQP_BUILD -DAMQP_STATIC -DHAVE_CONFIG_H -I/work/build/darwin-x64/thirdparty/rabbitmq-c/rabbitmq-c/librabbitmq -I/work/thirdparty/rabbitmq-c/rabbitmq-c/librabbitmq -I/work/thirdparty/rabbitmq-c/rabbitmq-c/librabbitmq/unix  -Wall -Wextra -Wstrict-prototypes -Wno-unused-function -fno-common -fvisibility=hidden  -std=gnu90 -O2 -g -DNDEBUG -isysroot /opt/osxcross/target/SDK/MacOSX10.15.sdk -fPIC   -o CMakeFiles/rabbitmq-static.dir/amqp_framing.c.o   -c /work/thirdparty/rabbitmq-c/rabbitmq-c/librabbitmq/amqp_framing.c
cd /work/build/darwin-x64/thirdparty/rabbitmq-c/rabbitmq-c/librabbitmq && /opt/osxcross/target/bin/o64-clang -DAMQP_BUILD -DAMQP_STATIC -DHAVE_CONFIG_H -I/work/build/darwin-x64/thirdparty/rabbitmq-c/rabbitmq-c/librabbitmq -I/work/thirdparty/rabbitmq-c/rabbitmq-c/librabbitmq -I/work/thirdparty/rabbitmq-c/rabbitmq-c/librabbitmq/unix  -Wall -Wextra -Wstrict-prototypes -Wno-unused-function -fno-common -fvisibility=hidden  -std=gnu90 -O2 -g -DNDEBUG -isysroot /opt/osxcross/target/SDK/MacOSX10.15.sdk -fPIC   -o CMakeFiles/rabbitmq-static.dir/amqp_table.c.o   -c /work/thirdparty/rabbitmq-c/rabbitmq-c/librabbitmq/amqp_table.c
[  6%] Building C object thirdparty/rabbitmq-c/rabbitmq-c/librabbitmq/CMakeFiles/rabbitmq-static.dir/amqp_socket.c.o
cd /work/build/darwin-x64/thirdparty/rabbitmq-c/rabbitmq-c/librabbitmq && /opt/osxcross/target/bin/o64-clang -DAMQP_BUILD -DAMQP_STATIC -DHAVE_CONFIG_H -I/work/build/darwin-x64/thirdparty/rabbitmq-c/rabbitmq-c/librabbitmq -I/work/thirdparty/rabbitmq-c/rabbitmq-c/librabbitmq -I/work/thirdparty/rabbitmq-c/rabbitmq-c/librabbitmq/unix  -Wall -Wextra -Wstrict-prototypes -Wno-unused-function -fno-common -fvisibility=hidden  -std=gnu90 -O2 -g -DNDEBUG -isysroot /opt/osxcross/target/SDK/MacOSX10.15.sdk -fPIC   -o CMakeFiles/rabbitmq-static.dir/amqp_socket.c.o   -c /work/thirdparty/rabbitmq-c/rabbitmq-c/librabbitmq/amqp_socket.c
make[2]: Entering directory '/work/build/darwin-x64'
[  6%] Building C object thirdparty/rabbitmq-c/rabbitmq-c/librabbitmq/CMakeFiles/rabbitmq-static.dir/amqp_api.c.o
[  9%] Building C object thirdparty/rabbitmq-c/rabbitmq-c/librabbitmq/CMakeFiles/rabbitmq-static.dir/amqp_connection.c.o
cd /work/build/darwin-x64/thirdparty/rabbitmq-c/rabbitmq-c/librabbitmq && /opt/osxcross/target/bin/o64-clang -DAMQP_BUILD -DAMQP_STATIC -DHAVE_CONFIG_H -I/work/build/darwin-x64/thirdparty/rabbitmq-c/rabbitmq-c/librabbitmq -I/work/thirdparty/rabbitmq-c/rabbitmq-c/librabbitmq -I/work/thirdparty/rabbitmq-c/rabbitmq-c/librabbitmq/unix  -Wall -Wextra -Wstrict-prototypes -Wno-unused-function -fno-common -fvisibility=hidden  -std=gnu90 -O2 -g -DNDEBUG -isysroot /opt/osxcross/target/SDK/MacOSX10.15.sdk -fPIC   -o CMakeFiles/rabbitmq-static.dir/amqp_connection.c.o   -c /work/thirdparty/rabbitmq-c/rabbitmq-c/librabbitmq/amqp_connection.c
cd /work/build/darwin-x64/thirdparty/rabbitmq-c/rabbitmq-c/librabbitmq && /opt/osxcross/target/bin/o64-clang -DAMQP_BUILD -DAMQP_STATIC -DHAVE_CONFIG_H -I/work/build/darwin-x64/thirdparty/rabbitmq-c/rabbitmq-c/librabbitmq -I/work/thirdparty/rabbitmq-c/rabbitmq-c/librabbitmq -I/work/thirdparty/rabbitmq-c/rabbitmq-c/librabbitmq/unix  -Wall -Wextra -Wstrict-prototypes -Wno-unused-function -fno-common -fvisibility=hidden  -std=gnu90 -O2 -g -DNDEBUG -isysroot /opt/osxcross/target/SDK/MacOSX10.15.sdk -fPIC   -o CMakeFiles/rabbitmq-static.dir/amqp_api.c.o   -c /work/thirdparty/rabbitmq-c/rabbitmq-c/librabbitmq/amqp_api.c
[  9%] Building CXX object thirdparty/date/date/CMakeFiles/tz.dir/src/tz.cpp.o
cd /work/build/darwin-x64/thirdparty/date/date && /opt/osxcross/target/bin/o64-clang++  -DHAS_REMOTE_API=0 -DUSE_AUTOLOAD=0 -DUSE_OS_TZDB=1 -I/work/thirdparty/date/date -I/work/thirdparty/date/date/include -I/work/thirdparty/date/date/include/date  -O2 -g -DNDEBUG -isysroot /opt/osxcross/target/SDK/MacOSX10.15.sdk   -std=gnu++1z -o CMakeFiles/tz.dir/src/tz.cpp.o -c /work/thirdparty/date/date/src/tz.cpp
[  9%] Building C object thirdparty/rabbitmq-c/rabbitmq-c/librabbitmq/CMakeFiles/rabbitmq-static.dir/amqp_mem.c.o
cd /work/build/darwin-x64/thirdparty/rabbitmq-c/rabbitmq-c/librabbitmq && /opt/osxcross/target/bin/o64-clang -DAMQP_BUILD -DAMQP_STATIC -DHAVE_CONFIG_H -I/work/build/darwin-x64/thirdparty/rabbitmq-c/rabbitmq-c/librabbitmq -I/work/thirdparty/rabbitmq-c/rabbitmq-c/librabbitmq -I/work/thirdparty/rabbitmq-c/rabbitmq-c/librabbitmq/unix  -Wall -Wextra -Wstrict-prototypes -Wno-unused-function -fno-common -fvisibility=hidden  -std=gnu90 -O2 -g -DNDEBUG -isysroot /opt/osxcross/target/SDK/MacOSX10.15.sdk -fPIC   -o CMakeFiles/rabbitmq-static.dir/amqp_mem.c.o   -c /work/thirdparty/rabbitmq-c/rabbitmq-c/librabbitmq/amqp_mem.c
[  9%] Building CXX object thirdparty/googletest/googletest/CMakeFiles/gtest.dir/src/gtest-all.cc.o
cd /work/build/darwin-x64/thirdparty/googletest/googletest && /opt/osxcross/target/bin/o64-clang++   -I/work/thirdparty/googletest/googletest/include -I/work/thirdparty/googletest/googletest  -O2 -g -DNDEBUG -isysroot /opt/osxcross/target/SDK/MacOSX10.15.sdk   -Wall -Wshadow -Werror -Wconversion -DGTEST_HAS_PTHREAD=1 -fexceptions -W -Wpointer-arith -Wreturn-type -Wcast-qual -Wwrite-strings -Wswitch -Wunused-parameter -Wcast-align -Wchar-subscripts -Winline -Wredundant-decls -std=c++11 -o CMakeFiles/gtest.dir/src/gtest-all.cc.o -c /work/thirdparty/googletest/googletest/src/gtest-all.cc
[  9%] Building C object thirdparty/rabbitmq-c/rabbitmq-c/librabbitmq/CMakeFiles/rabbitmq-static.dir/amqp_url.c.o
cd /work/build/darwin-x64/thirdparty/rabbitmq-c/rabbitmq-c/librabbitmq && /opt/osxcross/target/bin/o64-clang -DAMQP_BUILD -DAMQP_STATIC -DHAVE_CONFIG_H -I/work/build/darwin-x64/thirdparty/rabbitmq-c/rabbitmq-c/librabbitmq -I/work/thirdparty/rabbitmq-c/rabbitmq-c/librabbitmq -I/work/thirdparty/rabbitmq-c/rabbitmq-c/librabbitmq/unix  -Wall -Wextra -Wstrict-prototypes -Wno-unused-function -fno-common -fvisibility=hidden  -std=gnu90 -O2 -g -DNDEBUG -isysroot /opt/osxcross/target/SDK/MacOSX10.15.sdk -fPIC   -o CMakeFiles/rabbitmq-static.dir/amqp_url.c.o   -c /work/thirdparty/rabbitmq-c/rabbitmq-c/librabbitmq/amqp_url.c
[ 12%] Building C object thirdparty/rabbitmq-c/rabbitmq-c/librabbitmq/CMakeFiles/rabbitmq-static.dir/amqp_tcp_socket.c.o
cd /work/build/darwin-x64/thirdparty/rabbitmq-c/rabbitmq-c/librabbitmq && /opt/osxcross/target/bin/o64-clang -DAMQP_BUILD -DAMQP_STATIC -DHAVE_CONFIG_H -I/work/build/darwin-x64/thirdparty/rabbitmq-c/rabbitmq-c/librabbitmq -I/work/thirdparty/rabbitmq-c/rabbitmq-c/librabbitmq -I/work/thirdparty/rabbitmq-c/rabbitmq-c/librabbitmq/unix  -Wall -Wextra -Wstrict-prototypes -Wno-unused-function -fno-common -fvisibility=hidden  -std=gnu90 -O2 -g -DNDEBUG -isysroot /opt/osxcross/target/SDK/MacOSX10.15.sdk -fPIC   -o CMakeFiles/rabbitmq-static.dir/amqp_tcp_socket.c.o   -c /work/thirdparty/rabbitmq-c/rabbitmq-c/librabbitmq/amqp_tcp_socket.c
[ 12%] Building C object thirdparty/rabbitmq-c/rabbitmq-c/librabbitmq/CMakeFiles/rabbitmq-static.dir/amqp_time.c.o
cd /work/build/darwin-x64/thirdparty/rabbitmq-c/rabbitmq-c/librabbitmq && /opt/osxcross/target/bin/o64-clang -DAMQP_BUILD -DAMQP_STATIC -DHAVE_CONFIG_H -I/work/build/darwin-x64/thirdparty/rabbitmq-c/rabbitmq-c/librabbitmq -I/work/thirdparty/rabbitmq-c/rabbitmq-c/librabbitmq -I/work/thirdparty/rabbitmq-c/rabbitmq-c/librabbitmq/unix  -Wall -Wextra -Wstrict-prototypes -Wno-unused-function -fno-common -fvisibility=hidden  -std=gnu90 -O2 -g -DNDEBUG -isysroot /opt/osxcross/target/SDK/MacOSX10.15.sdk -fPIC   -o CMakeFiles/rabbitmq-static.dir/amqp_time.c.o   -c /work/thirdparty/rabbitmq-c/rabbitmq-c/librabbitmq/amqp_time.c
[ 15%] Building C object thirdparty/rabbitmq-c/rabbitmq-c/librabbitmq/CMakeFiles/rabbitmq-static.dir/amqp_consumer.c.o
cd /work/build/darwin-x64/thirdparty/rabbitmq-c/rabbitmq-c/librabbitmq && /opt/osxcross/target/bin/o64-clang -DAMQP_BUILD -DAMQP_STATIC -DHAVE_CONFIG_H -I/work/build/darwin-x64/thirdparty/rabbitmq-c/rabbitmq-c/librabbitmq -I/work/thirdparty/rabbitmq-c/rabbitmq-c/librabbitmq -I/work/thirdparty/rabbitmq-c/rabbitmq-c/librabbitmq/unix  -Wall -Wextra -Wstrict-prototypes -Wno-unused-function -fno-common -fvisibility=hidden  -std=gnu90 -O2 -g -DNDEBUG -isysroot /opt/osxcross/target/SDK/MacOSX10.15.sdk -fPIC   -o CMakeFiles/rabbitmq-static.dir/amqp_consumer.c.o   -c /work/thirdparty/rabbitmq-c/rabbitmq-c/librabbitmq/amqp_consumer.c
[ 15%] Linking C static library librabbitmq.a
cd /work/build/darwin-x64/thirdparty/rabbitmq-c/rabbitmq-c/librabbitmq && /usr/bin/cmake -P CMakeFiles/rabbitmq-static.dir/cmake_clean_target.cmake
cd /work/build/darwin-x64/thirdparty/rabbitmq-c/rabbitmq-c/librabbitmq && /usr/bin/cmake -E cmake_link_script CMakeFiles/rabbitmq-static.dir/link.txt --verbose=1
/opt/osxcross/target/bin/x86_64-apple-darwin19-ar qc librabbitmq.a  CMakeFiles/rabbitmq-static.dir/amqp_framing.c.o CMakeFiles/rabbitmq-static.dir/amqp_api.c.o CMakeFiles/rabbitmq-static.dir/amqp_connection.c.o CMakeFiles/rabbitmq-static.dir/amqp_mem.c.o CMakeFiles/rabbitmq-static.dir/amqp_socket.c.o CMakeFiles/rabbitmq-static.dir/amqp_table.c.o CMakeFiles/rabbitmq-static.dir/amqp_url.c.o CMakeFiles/rabbitmq-static.dir/amqp_tcp_socket.c.o CMakeFiles/rabbitmq-static.dir/amqp_time.c.o CMakeFiles/rabbitmq-static.dir/amqp_consumer.c.o
/opt/osxcross/target/bin/x86_64-apple-darwin19-ranlib librabbitmq.a
make[2]: Leaving directory '/work/build/darwin-x64'
[ 15%] Built target rabbitmq-static
[ 18%] Linking CXX static library libtz.a
cd /work/build/darwin-x64/thirdparty/date/date && /usr/bin/cmake -P CMakeFiles/tz.dir/cmake_clean_target.cmake
cd /work/build/darwin-x64/thirdparty/date/date && /usr/bin/cmake -E cmake_link_script CMakeFiles/tz.dir/link.txt --verbose=1
/opt/osxcross/target/bin/x86_64-apple-darwin19-ar qc libtz.a  CMakeFiles/tz.dir/src/tz.cpp.o
/opt/osxcross/target/bin/x86_64-apple-darwin19-ranlib libtz.a
make[2]: Leaving directory '/work/build/darwin-x64'
[ 18%] Built target tz
make -f rabbitmq-core/CMakeFiles/rabbitmq-core.dir/build.make rabbitmq-core/CMakeFiles/rabbitmq-core.dir/depend
make[2]: Entering directory '/work/build/darwin-x64'
cd /work/build/darwin-x64 && /usr/bin/cmake -E cmake_depends "Unix Makefiles" /work /work/rabbitmq-core /work/build/darwin-x64 /work/build/darwin-x64/rabbitmq-core /work/build/darwin-x64/rabbitmq-core/CMakeFiles/rabbitmq-core.dir/DependInfo.cmake --color=
Scanning dependencies of target rabbitmq-core
make[2]: Leaving directory '/work/build/darwin-x64'
make -f rabbitmq-core/CMakeFiles/rabbitmq-core.dir/build.make rabbitmq-core/CMakeFiles/rabbitmq-core.dir/build
make[2]: Entering directory '/work/build/darwin-x64'
[ 21%] Building CXX object rabbitmq-core/CMakeFiles/rabbitmq-core.dir/src/FmuContainerCore.cpp.o
cd /work/build/darwin-x64/rabbitmq-core && /opt/osxcross/target/bin/o64-clang++   -I/work/thirdparty/googletest/googletest/include -I/work/rabbitmq-core/src -I/work/thirdparty/date/date -I/work/thirdparty/date/date/include  -O2 -g -DNDEBUG -isysroot /opt/osxcross/target/SDK/MacOSX10.15.sdk -fPIC   -std=gnu++1z -o CMakeFiles/rabbitmq-core.dir/src/FmuContainerCore.cpp.o -c /work/rabbitmq-core/src/FmuContainerCore.cpp
In file included from /work/rabbitmq-core/src/FmuContainerCore.cpp:5:
In file included from /work/rabbitmq-core/src/FmuContainerCore.h:9:
In file included from /opt/osxcross/target/bin/../SDK/MacOSX10.15.sdk/usr/include/c++/v1/list:183:
In file included from /opt/osxcross/target/bin/../SDK/MacOSX10.15.sdk/usr/include/c++/v1/memory:663:
/opt/osxcross/target/bin/../SDK/MacOSX10.15.sdk/usr/include/c++/v1/tuple:1343:7: error: no matching constructor for initialization of 'std::__1::pair<std::__1::chrono::time_point<std::__1::chrono::system_clock, std::__1::chrono::duration<long long, std::__1::ratio<1, 1000> > >, ScalarVariableBaseValue>'
      second(_VSTD::forward<_Args2>(_VSTD::get<_I2>(__second_args))...)
      ^
/opt/osxcross/target/bin/../SDK/MacOSX10.15.sdk/usr/include/c++/v1/utility:511:11: note: in instantiation of function template specialization 'std::__1::pair<const unsigned int, std::__1::pair<std::__1::chrono::time_point<std::__1::chrono::system_clock, std::__1::chrono::duration<long long, std::__1::ratio<1, 1000> > >, ScalarVariableBaseValue> >::pair<const unsigned int &, 0>' requested here
        : pair(__pc, __first_args, __second_args,
          ^
/opt/osxcross/target/bin/../SDK/MacOSX10.15.sdk/usr/include/c++/v1/memory:1826:31: note: in instantiation of function template specialization 'std::__1::pair<const unsigned int, std::__1::pair<std::__1::chrono::time_point<std::__1::chrono::system_clock, std::__1::chrono::duration<long long, std::__1::ratio<1, 1000> > >, ScalarVariableBaseValue> >::pair<const unsigned int &>' requested here
            ::new((void*)__p) _Up(_VSTD::forward<_Args>(__args)...);
                              ^
/opt/osxcross/target/bin/../SDK/MacOSX10.15.sdk/usr/include/c++/v1/memory:1718:18: note: in instantiation of function template specialization 'std::__1::allocator<std::__1::__tree_node<std::__1::__value_type<unsigned int, std::__1::pair<std::__1::chrono::time_point<std::__1::chrono::system_clock, std::__1::chrono::duration<long long, std::__1::ratio<1, 1000> > >, ScalarVariableBaseValue> >, void *> >::construct<std::__1::pair<const unsigned int, std::__1::pair<std::__1::chrono::time_point<std::__1::chrono::system_clock, std::__1::chrono::duration<long long, std::__1::ratio<1, 1000> > >, ScalarVariableBaseValue> >, const std::__1::piecewise_construct_t &, std::__1::tuple<const unsigned int &>, std::__1::tuple<> >' requested here
            {__a.construct(__p, _VSTD::forward<_Args>(__args)...);}
                 ^
/opt/osxcross/target/bin/../SDK/MacOSX10.15.sdk/usr/include/c++/v1/memory:1561:14: note: in instantiation of function template specialization 'std::__1::allocator_traits<std::__1::allocator<std::__1::__tree_node<std::__1::__value_type<unsigned int, std::__1::pair<std::__1::chrono::time_point<std::__1::chrono::system_clock, std::__1::chrono::duration<long long, std::__1::ratio<1, 1000> > >, ScalarVariableBaseValue> >, void *> > >::__construct<std::__1::pair<const unsigned int, std::__1::pair<std::__1::chrono::time_point<std::__1::chrono::system_clock, std::__1::chrono::duration<long long, std::__1::ratio<1, 1000> > >, ScalarVariableBaseValue> >, const std::__1::piecewise_construct_t &, std::__1::tuple<const unsigned int &>, std::__1::tuple<> >' requested here
            {__construct(__has_construct<allocator_type, _Tp*, _Args...>(),
             ^
/opt/osxcross/target/bin/../SDK/MacOSX10.15.sdk/usr/include/c++/v1/__tree:2212:20: note: in instantiation of function template specialization 'std::__1::allocator_traits<std::__1::allocator<std::__1::__tree_node<std::__1::__value_type<unsigned int, std::__1::pair<std::__1::chrono::time_point<std::__1::chrono::system_clock, std::__1::chrono::duration<long long, std::__1::ratio<1, 1000> > >, ScalarVariableBaseValue> >, void *> > >::construct<std::__1::pair<const unsigned int, std::__1::pair<std::__1::chrono::time_point<std::__1::chrono::system_clock, std::__1::chrono::duration<long long, std::__1::ratio<1, 1000> > >, ScalarVariableBaseValue> >, const std::__1::piecewise_construct_t &, std::__1::tuple<const unsigned int &>, std::__1::tuple<> >' requested here
    __node_traits::construct(__na, _NodeTypes::__get_ptr(__h->__value_), _VSTD::forward<_Args>(__args)...);
                   ^
/opt/osxcross/target/bin/../SDK/MacOSX10.15.sdk/usr/include/c++/v1/__tree:2157:29: note: in instantiation of function template specialization 'std::__1::__tree<std::__1::__value_type<unsigned int, std::__1::pair<std::__1::chrono::time_point<std::__1::chrono::system_clock, std::__1::chrono::duration<long long, std::__1::ratio<1, 1000> > >, ScalarVariableBaseValue> >, std::__1::__map_value_compare<unsigned int, std::__1::__value_type<unsigned int, std::__1::pair<std::__1::chrono::time_point<std::__1::chrono::system_clock, std::__1::chrono::duration<long long, std::__1::ratio<1, 1000> > >, ScalarVariableBaseValue> >, std::__1::less<unsigned int>, true>, std::__1::allocator<std::__1::__value_type<unsigned int, std::__1::pair<std::__1::chrono::time_point<std::__1::chrono::system_clock, std::__1::chrono::duration<long long, std::__1::ratio<1, 1000> > >, ScalarVariableBaseValue> > > >::__construct_node<const std::__1::piecewise_construct_t &, std::__1::tuple<const unsigned int &>, std::__1::tuple<> >' requested here
        __node_holder __h = __construct_node(_VSTD::forward<_Args>(__args)...);
                            ^
/opt/osxcross/target/bin/../SDK/MacOSX10.15.sdk/usr/include/c++/v1/map:1484:20: note: in instantiation of function template specialization 'std::__1::__tree<std::__1::__value_type<unsigned int, std::__1::pair<std::__1::chrono::time_point<std::__1::chrono::system_clock, std::__1::chrono::duration<long long, std::__1::ratio<1, 1000> > >, ScalarVariableBaseValue> >, std::__1::__map_value_compare<unsigned int, std::__1::__value_type<unsigned int, std::__1::pair<std::__1::chrono::time_point<std::__1::chrono::system_clock, std::__1::chrono::duration<long long, std::__1::ratio<1, 1000> > >, ScalarVariableBaseValue> >, std::__1::less<unsigned int>, true>, std::__1::allocator<std::__1::__value_type<unsigned int, std::__1::pair<std::__1::chrono::time_point<std::__1::chrono::system_clock, std::__1::chrono::duration<long long, std::__1::ratio<1, 1000> > >, ScalarVariableBaseValue> > > >::__emplace_unique_key_args<unsigned int, const std::__1::piecewise_construct_t &, std::__1::tuple<const unsigned int &>, std::__1::tuple<> >' requested here
    return __tree_.__emplace_unique_key_args(__k,
                   ^
/work/rabbitmq-core/src/FmuContainerCore.cpp:159:38: note: in instantiation of member function 'std::__1::map<unsigned int, std::__1::pair<std::__1::chrono::time_point<std::__1::chrono::system_clock, std::__1::chrono::duration<long long, std::__1::ratio<1, 1000> > >, ScalarVariableBaseValue>, std::__1::less<unsigned int>, std::__1::allocator<std::__1::pair<const unsigned int, std::__1::pair<std::__1::chrono::time_point<std::__1::chrono::system_clock, std::__1::chrono::duration<long long, std::__1::ratio<1, 1000> > >, ScalarVariableBaseValue> > > >::operator[]' requested here
                    this->currentData[id].first < timeValue->first) {
                                     ^
/work/rabbitmq-core/src/FmuContainerCore.cpp:220:5: note: in instantiation of function template specialization 'FmuContainerCore::processLookahead<(lambda at /work/rabbitmq-core/src/FmuContainerCore.cpp:212:22)>' requested here
    processLookahead(predicate);
    ^
/opt/osxcross/target/bin/../SDK/MacOSX10.15.sdk/usr/include/c++/v1/utility:353:41: note: candidate template ignored: disabled by 'enable_if' [with _Dummy = true]
    using _EnableB = typename enable_if<_Val, bool>::type;
                                        ^
/opt/osxcross/target/bin/../SDK/MacOSX10.15.sdk/usr/include/c++/v1/utility:421:14: note: candidate constructor template not viable: requires 2 arguments, but 0 were provided
    explicit pair(_T1 const& __t1, _T2 const& __t2)
             ^
/opt/osxcross/target/bin/../SDK/MacOSX10.15.sdk/usr/include/c++/v1/utility:430:5: note: candidate constructor template not viable: requires 2 arguments, but 0 were provided
    pair(_T1 const& __t1, _T2 const& __t2)
    ^
/opt/osxcross/target/bin/../SDK/MacOSX10.15.sdk/usr/include/c++/v1/utility:439:14: note: candidate constructor template not viable: requires 2 arguments, but 0 were provided
    explicit pair(_U1&& __u1, _U2&& __u2)
             ^
/opt/osxcross/target/bin/../SDK/MacOSX10.15.sdk/usr/include/c++/v1/utility:448:5: note: candidate constructor template not viable: requires 2 arguments, but 0 were provided
    pair(_U1&& __u1, _U2&& __u2)
    ^
/opt/osxcross/target/bin/../SDK/MacOSX10.15.sdk/usr/include/c++/v1/utility:457:14: note: candidate constructor template not viable: requires single argument '__p', but no arguments were provided
    explicit pair(pair<_U1, _U2> const& __p)
             ^
/opt/osxcross/target/bin/../SDK/MacOSX10.15.sdk/usr/include/c++/v1/utility:466:5: note: candidate constructor template not viable: requires single argument '__p', but no arguments were provided
    pair(pair<_U1, _U2> const& __p)
    ^
/opt/osxcross/target/bin/../SDK/MacOSX10.15.sdk/usr/include/c++/v1/utility:475:14: note: candidate constructor template not viable: requires single argument '__p', but no arguments were provided
    explicit pair(pair<_U1, _U2>&&__p)
             ^
/opt/osxcross/target/bin/../SDK/MacOSX10.15.sdk/usr/include/c++/v1/utility:484:5: note: candidate constructor template not viable: requires single argument '__p', but no arguments were provided
    pair(pair<_U1, _U2>&& __p)
    ^
/opt/osxcross/target/bin/../SDK/MacOSX10.15.sdk/usr/include/c++/v1/utility:493:14: note: candidate constructor template not viable: requires single argument '__p', but no arguments were provided
    explicit pair(_Tuple&& __p)
             ^
/opt/osxcross/target/bin/../SDK/MacOSX10.15.sdk/usr/include/c++/v1/utility:501:5: note: candidate constructor template not viable: requires single argument '__p', but no arguments were provided
    pair(_Tuple&& __p)
    ^
/opt/osxcross/target/bin/../SDK/MacOSX10.15.sdk/usr/include/c++/v1/utility:507:5: note: candidate constructor template not viable: requires 3 arguments, but 0 were provided
    pair(piecewise_construct_t __pc,
    ^
/opt/osxcross/target/bin/../SDK/MacOSX10.15.sdk/usr/include/c++/v1/utility:566:9: note: candidate constructor template not viable: requires 5 arguments, but 0 were provided
        pair(piecewise_construct_t,
        ^
/opt/osxcross/target/bin/../SDK/MacOSX10.15.sdk/usr/include/c++/v1/utility:328:5: note: candidate constructor not viable: requires 1 argument, but 0 were provided
    pair(pair const&) = default;
    ^
/opt/osxcross/target/bin/../SDK/MacOSX10.15.sdk/usr/include/c++/v1/utility:329:5: note: candidate constructor not viable: requires 1 argument, but 0 were provided
    pair(pair&&) = default;
    ^
1 error generated.
rabbitmq-core/CMakeFiles/rabbitmq-core.dir/build.make:65: recipe for target 'rabbitmq-core/CMakeFiles/rabbitmq-core.dir/src/FmuContainerCore.cpp.o' failed
make[2]: Leaving directory '/work/build/darwin-x64'
make[2]: *** [rabbitmq-core/CMakeFiles/rabbitmq-core.dir/src/FmuContainerCore.cpp.o] Error 1
CMakeFiles/Makefile2:4951: recipe for target 'rabbitmq-core/CMakeFiles/rabbitmq-core.dir/all' failed
make[1]: *** [rabbitmq-core/CMakeFiles/rabbitmq-core.dir/all] Error 2
make[1]: *** Waiting for unfinished jobs....
[ 24%] Linking CXX static library ../../../lib/libgtest.a
cd /work/build/darwin-x64/thirdparty/googletest/googletest && /usr/bin/cmake -P CMakeFiles/gtest.dir/cmake_clean_target.cmake
cd /work/build/darwin-x64/thirdparty/googletest/googletest && /usr/bin/cmake -E cmake_link_script CMakeFiles/gtest.dir/link.txt --verbose=1
/opt/osxcross/target/bin/x86_64-apple-darwin19-ar qc ../../../lib/libgtest.a  CMakeFiles/gtest.dir/src/gtest-all.cc.o
/opt/osxcross/target/bin/x86_64-apple-darwin19-ranlib ../../../lib/libgtest.a
make[2]: Leaving directory '/work/build/darwin-x64'
[ 24%] Built target gtest
make[1]: Leaving directory '/work/build/darwin-x64'
Makefile:131: recipe for target 'all' failed
make: *** [all] Error 2
make: Leaving directory '/work/build/darwin-x64'