FailedConsole Output

Skipping 986 KB.. Full Log
stants.hpp:56:24: warning: 'class xercesc_3_2::XSConstants' only defines private constructors and has no friends [-Wctor-dtor-privacy]
 class XMLPARSER_EXPORT XSConstants
                        ^~~~~~~~~~~
make[2]: Leaving directory '/work/build/linux-x64/xerces-c'
[ 92%] Built target MemHandlerTest
/work/thirdparty/xerces-c/samples/src/PSVIWriter/PSVIWriter.cpp: In function 'void usage()':
/work/thirdparty/xerces-c/samples/src/PSVIWriter/PSVIWriter.cpp:45:6: warning: no previous declaration for 'void usage()' [-Wmissing-declarations]
 void usage()
      ^~~~~
/work/thirdparty/xerces-c/samples/src/PSVIWriter/PSVIWriter.cpp: In function 'int main(int, char**)':
/work/thirdparty/xerces-c/samples/src/PSVIWriter/PSVIWriter.cpp:252:44: warning: cast from type 'const char*' to type 'char*' casts away qualifiers [-Wcast-qual]
                     XMLString::trim((char*)xmlFile);
                                            ^~~~~~~
/work/thirdparty/xerces-c/samples/src/PSVIWriter/PSVIWriter.cpp:272:18: warning: this 'if' clause does not guard... [-Wmisleading-indentation]
                  if (psviTarget)
                  ^~
/work/thirdparty/xerces-c/samples/src/PSVIWriter/PSVIWriter.cpp:274:9: note: ...this statement, but the latter is misleadingly indented as if it is guarded by the 'if'
         psviTarget = new LocalFileFormatTarget(fileName);
         ^~~~~~~~~~
make[2]: Entering directory '/work/build/linux-x64/xerces-c'
Scanning dependencies of target SAX2Count
make[2]: Leaving directory '/work/build/linux-x64/xerces-c'
make[2]: Entering directory '/work/build/linux-x64/xerces-c'
[ 93%] Building CXX object samples/CMakeFiles/SAX2Count.dir/src/SAX2Count/SAX2Count.cpp.o
[ 93%] Linking CXX executable SAXCount
make[2]: Leaving directory '/work/build/linux-x64/xerces-c'
[ 93%] Built target NetAccessorTest
[ 93%] Building CXX object samples/CMakeFiles/SAX2Count.dir/src/SAX2Count/SAX2CountHandlers.cpp.o
[ 93%] Building CXX object samples/CMakeFiles/PSVIWriter.dir/src/PSVIWriter/PSVIWriterHandlers.cpp.o
In file included from /work/thirdparty/xerces-c/samples/src/PSVIWriter/PSVIWriterHandlers.hpp:26:0,
                 from /work/thirdparty/xerces-c/samples/src/PSVIWriter/PSVIWriterHandlers.cpp:21:
/work/thirdparty/xerces-c/src/xercesc/framework/psvi/XSConstants.hpp:56:24: warning: 'class xercesc_3_2::XSConstants' only defines private constructors and has no friends [-Wctor-dtor-privacy]
 class XMLPARSER_EXPORT XSConstants
                        ^~~~~~~~~~~
make[2]: Leaving directory '/work/build/linux-x64/xerces-c'
[ 93%] Built target XSTSHarness
make[2]: Entering directory '/work/build/linux-x64/xerces-c'
In file included from /work/thirdparty/xerces-c/src/xercesc/validators/datatype/DatatypeValidator.hpp:30:0,
                 from /work/thirdparty/xerces-c/src/xercesc/framework/psvi/PSVIAttribute.hpp:27,
                 from /work/thirdparty/xerces-c/samples/src/PSVIWriter/PSVIWriterHandlers.hpp:28,
                 from /work/thirdparty/xerces-c/samples/src/PSVIWriter/PSVIWriterHandlers.cpp:21:
/work/thirdparty/xerces-c/src/xercesc/validators/schema/SchemaSymbols.hpp:33:25: warning: 'class xercesc_3_2::SchemaSymbols' only defines private constructors and has no friends [-Wctor-dtor-privacy]
 class VALIDATORS_EXPORT SchemaSymbols
                         ^~~~~~~~~~~~~
Scanning dependencies of target EnumVal
make[2]: Leaving directory '/work/build/linux-x64/xerces-c'
make[2]: Entering directory '/work/build/linux-x64/xerces-c'
[ 93%] Building CXX object samples/CMakeFiles/EnumVal.dir/src/EnumVal/EnumVal.cpp.o
In file included from /work/thirdparty/xerces-c/samples/src/PSVIWriter/PSVIWriterHandlers.cpp:21:0:
/work/thirdparty/xerces-c/samples/src/PSVIWriter/PSVIWriterHandlers.hpp: In destructor 'AttrInfo::~AttrInfo()':
/work/thirdparty/xerces-c/samples/src/PSVIWriter/PSVIWriterHandlers.hpp:75:32: warning: cast from type 'const XMLCh** {aka const char16_t**}' to type 'XMLCh** {aka char16_t**}' casts away qualifiers [-Wcast-qual]
   XMLString::release((XMLCh**)&uri);
                                ^~~
/work/thirdparty/xerces-c/samples/src/PSVIWriter/PSVIWriterHandlers.hpp:76:32: warning: cast from type 'const XMLCh** {aka const char16_t**}' to type 'XMLCh** {aka char16_t**}' casts away qualifiers [-Wcast-qual]
   XMLString::release((XMLCh**)&name);
                                ^~~~
/work/thirdparty/xerces-c/samples/src/PSVIWriter/PSVIWriterHandlers.hpp:77:32: warning: cast from type 'const XMLCh** {aka const char16_t**}' to type 'XMLCh** {aka char16_t**}' casts away qualifiers [-Wcast-qual]
   XMLString::release((XMLCh**)&type);
                                ^~~~
/work/thirdparty/xerces-c/samples/src/PSVIWriter/PSVIWriterHandlers.hpp:78:32: warning: cast from type 'const XMLCh** {aka const char16_t**}' to type 'XMLCh** {aka char16_t**}' casts away qualifiers [-Wcast-qual]
   XMLString::release((XMLCh**)&value);
                                ^~~~~
/work/thirdparty/xerces-c/samples/src/PSVIWriter/PSVIWriterHandlers.cpp: In member function 'virtual void PSVIWriterHandlers::startDocument()':
/work/thirdparty/xerces-c/samples/src/PSVIWriter/PSVIWriterHandlers.cpp:206:32: warning: cast from type 'const XMLCh* {aka const char16_t*}' to type 'XMLCh* {aka char16_t*}' casts away qualifiers [-Wcast-qual]
  fAttrList->addElement((XMLCh*)gXmlnsColonXsi);
                                ^~~~~~~~~~~~~~
/work/thirdparty/xerces-c/samples/src/PSVIWriter/PSVIWriterHandlers.cpp:207:41: warning: cast from type 'const XMLCh* {aka const char16_t*}' to type 'XMLCh* {aka char16_t*}' casts away qualifiers [-Wcast-qual]
  fAttrList->addElement((XMLCh*)PSVIUni::fgNamespaceInstance);
                                         ^~~~~~~~~~~~~~~~~~~
/work/thirdparty/xerces-c/samples/src/PSVIWriter/PSVIWriterHandlers.cpp:208:32: warning: cast from type 'const XMLCh* {aka const char16_t*}' to type 'XMLCh* {aka char16_t*}' casts away qualifiers [-Wcast-qual]
  fAttrList->addElement((XMLCh*)gXmlnsColonPsv);
                                ^~~~~~~~~~~~~~
/work/thirdparty/xerces-c/samples/src/PSVIWriter/PSVIWriterHandlers.cpp:209:41: warning: cast from type 'const XMLCh* {aka const char16_t*}' to type 'XMLCh* {aka char16_t*}' casts away qualifiers [-Wcast-qual]
  fAttrList->addElement((XMLCh*)PSVIUni::fgNamespacePsvi);
                                         ^~~~~~~~~~~~~~~
/work/thirdparty/xerces-c/samples/src/PSVIWriter/PSVIWriterHandlers.cpp:210:40: warning: cast from type 'const XMLCh* {aka const char16_t*}' to type 'XMLCh* {aka char16_t*}' casts away qualifiers [-Wcast-qual]
  fAttrList->addElement((XMLCh*)XMLUni::fgXMLNSString);
                                        ^~~~~~~~~~~~~
/work/thirdparty/xerces-c/samples/src/PSVIWriter/PSVIWriterHandlers.cpp:211:41: warning: cast from type 'const XMLCh* {aka const char16_t*}' to type 'XMLCh* {aka char16_t*}' casts away qualifiers [-Wcast-qual]
  fAttrList->addElement((XMLCh*)PSVIUni::fgNamespaceInfoset);
                                         ^~~~~~~~~~~~~~~~~~
/work/thirdparty/xerces-c/samples/src/PSVIWriter/PSVIWriterHandlers.cpp: In member function 'virtual void PSVIWriterHandlers::startPrefixMapping(const XMLCh*, const XMLCh*)':
/work/thirdparty/xerces-c/samples/src/PSVIWriter/PSVIWriterHandlers.cpp:260:50: warning: cast from type 'const XMLCh* const {aka const char16_t* const}' to type 'XMLCh* {aka char16_t*}' casts away qualifiers [-Wcast-qual]
   XMLCh* permaUri = XMLString::replicate((XMLCh*)uri);
                                                  ^~~
/work/thirdparty/xerces-c/samples/src/PSVIWriter/PSVIWriterHandlers.cpp:261:53: warning: cast from type 'const XMLCh* const {aka const char16_t* const}' to type 'XMLCh* {aka char16_t*}' casts away qualifiers [-Wcast-qual]
   XMLCh* permaPrefix = XMLString::replicate((XMLCh*)prefix);
                                                     ^~~~~~
/work/thirdparty/xerces-c/samples/src/PSVIWriter/PSVIWriterHandlers.cpp: In member function 'void PSVIWriterHandlers::processScope(xercesc_3_2::XSComplexTypeDefinition*, short int)':
/work/thirdparty/xerces-c/samples/src/PSVIWriter/PSVIWriterHandlers.cpp:1050:9: warning: switch missing default case [-Wswitch-default]
  switch (scope) {
         ^
/work/thirdparty/xerces-c/samples/src/PSVIWriter/PSVIWriterHandlers.cpp: In member function 'void PSVIWriterHandlers::sendReference(const XMLCh*, xercesc_3_2::XSObject*)':
/work/thirdparty/xerces-c/samples/src/PSVIWriter/PSVIWriterHandlers.cpp:1223:33: warning: cast from type 'const XMLCh* {aka const char16_t*}' to type 'XMLCh* {aka char16_t*}' casts away qualifiers [-Wcast-qual]
   fAttrList->addElement((XMLCh*)gRef);
                                 ^~~~
/work/thirdparty/xerces-c/samples/src/PSVIWriter/PSVIWriterHandlers.cpp:1224:46: warning: cast from type 'const XMLCh* {aka const char16_t*}' to type 'XMLCh* {aka char16_t*}' casts away qualifiers [-Wcast-qual]
   fAttrList->addElement((XMLCh*)getIdName(obj));
                                              ^
/work/thirdparty/xerces-c/samples/src/PSVIWriter/PSVIWriterHandlers.cpp:1225:33: warning: cast from type 'const XMLCh* {aka const char16_t*}' to type 'XMLCh* {aka char16_t*}' casts away qualifiers [-Wcast-qual]
   fAttrList->addElement((XMLCh*)fgXsiNil);
                                 ^~~~~~~~
/work/thirdparty/xerces-c/samples/src/PSVIWriter/PSVIWriterHandlers.cpp:1226:42: warning: cast from type 'const XMLCh* {aka const char16_t*}' to type 'XMLCh* {aka char16_t*}' casts away qualifiers [-Wcast-qual]
   fAttrList->addElement((XMLCh*)PSVIUni::fgTrue);
                                          ^~~~~~
/work/thirdparty/xerces-c/samples/src/PSVIWriter/PSVIWriterHandlers.cpp: In member function 'void PSVIWriterHandlers::sendElementEmpty(const XMLCh*)':
/work/thirdparty/xerces-c/samples/src/PSVIWriter/PSVIWriterHandlers.cpp:1233:32: warning: cast from type 'const XMLCh* {aka const char16_t*}' to type 'XMLCh* {aka char16_t*}' casts away qualifiers [-Wcast-qual]
  fAttrList->addElement((XMLCh*)fgXsiNil);
                                ^~~~~~~~
/work/thirdparty/xerces-c/samples/src/PSVIWriter/PSVIWriterHandlers.cpp:1234:41: warning: cast from type 'const XMLCh* {aka const char16_t*}' to type 'XMLCh* {aka char16_t*}' casts away qualifiers [-Wcast-qual]
  fAttrList->addElement((XMLCh*)PSVIUni::fgTrue);
                                         ^~~~~~
/work/thirdparty/xerces-c/samples/src/PSVIWriter/PSVIWriterHandlers.cpp: In member function 'void PSVIWriterHandlers::sendIndentedElementWithID(const XMLCh*, xercesc_3_2::XSObject*)':
/work/thirdparty/xerces-c/samples/src/PSVIWriter/PSVIWriterHandlers.cpp:1267:32: warning: cast from type 'const XMLCh* {aka const char16_t*}' to type 'XMLCh* {aka char16_t*}' casts away qualifiers [-Wcast-qual]
  fAttrList->addElement((XMLCh*)gId);
                                ^~~
/work/thirdparty/xerces-c/samples/src/PSVIWriter/PSVIWriterHandlers.cpp:1268:45: warning: cast from type 'const XMLCh* {aka const char16_t*}' to type 'XMLCh* {aka char16_t*}' casts away qualifiers [-Wcast-qual]
  fAttrList->addElement((XMLCh*)getIdName(obj));
                                             ^
In file included from /work/thirdparty/xerces-c/src/xercesc/validators/datatype/DatatypeValidator.hpp:30:0,
                 from /work/thirdparty/xerces-c/src/xercesc/framework/XMLAttr.hpp:28,
                 from /work/thirdparty/xerces-c/src/xercesc/framework/XMLValidator.hpp:25,
                 from /work/thirdparty/xerces-c/src/xercesc/sax2/SAX2XMLReader.hpp:27,
                 from /work/thirdparty/xerces-c/src/xercesc/sax2/XMLReaderFactory.hpp:25,
                 from /work/thirdparty/xerces-c/samples/src/SAX2Count/SAX2Count.hpp:36,
                 from /work/thirdparty/xerces-c/samples/src/SAX2Count/SAX2Count.cpp:26:
/work/thirdparty/xerces-c/src/xercesc/validators/schema/SchemaSymbols.hpp:33:25: warning: 'class xercesc_3_2::SchemaSymbols' only defines private constructors and has no friends [-Wctor-dtor-privacy]
 class VALIDATORS_EXPORT SchemaSymbols
                         ^~~~~~~~~~~~~
In file included from /work/thirdparty/xerces-c/src/xercesc/framework/psvi/XSObject.hpp:26:0,
                 from /work/thirdparty/xerces-c/src/xercesc/framework/psvi/XSTypeDefinition.hpp:25,
                 from /work/thirdparty/xerces-c/src/xercesc/framework/psvi/XSSimpleTypeDefinition.hpp:25,
                 from /work/thirdparty/xerces-c/src/xercesc/validators/datatype/DatatypeValidator.hpp:32,
                 from /work/thirdparty/xerces-c/src/xercesc/framework/XMLAttr.hpp:28,
                 from /work/thirdparty/xerces-c/src/xercesc/framework/XMLValidator.hpp:25,
                 from /work/thirdparty/xerces-c/src/xercesc/sax2/SAX2XMLReader.hpp:27,
                 from /work/thirdparty/xerces-c/src/xercesc/sax2/XMLReaderFactory.hpp:25,
                 from /work/thirdparty/xerces-c/samples/src/SAX2Count/SAX2Count.hpp:36,
                 from /work/thirdparty/xerces-c/samples/src/SAX2Count/SAX2Count.cpp:26:
/work/thirdparty/xerces-c/src/xercesc/framework/psvi/XSConstants.hpp:56:24: warning: 'class xercesc_3_2::XSConstants' only defines private constructors and has no friends [-Wctor-dtor-privacy]
 class XMLPARSER_EXPORT XSConstants
                        ^~~~~~~~~~~
In file included from /work/thirdparty/xerces-c/src/xercesc/validators/datatype/DatatypeValidator.hpp:30:0,
                 from /work/thirdparty/xerces-c/src/xercesc/framework/XMLAttr.hpp:28,
                 from /work/thirdparty/xerces-c/src/xercesc/framework/XMLValidator.hpp:25,
                 from /work/thirdparty/xerces-c/samples/src/EnumVal/EnumVal.cpp:27:
/work/thirdparty/xerces-c/src/xercesc/validators/schema/SchemaSymbols.hpp:33:25: warning: 'class xercesc_3_2::SchemaSymbols' only defines private constructors and has no friends [-Wctor-dtor-privacy]
 class VALIDATORS_EXPORT SchemaSymbols
                         ^~~~~~~~~~~~~
In file included from /work/thirdparty/xerces-c/src/xercesc/framework/psvi/XSObject.hpp:26:0,
                 from /work/thirdparty/xerces-c/src/xercesc/framework/psvi/XSTypeDefinition.hpp:25,
                 from /work/thirdparty/xerces-c/src/xercesc/framework/psvi/XSSimpleTypeDefinition.hpp:25,
                 from /work/thirdparty/xerces-c/src/xercesc/validators/datatype/DatatypeValidator.hpp:32,
                 from /work/thirdparty/xerces-c/src/xercesc/framework/XMLAttr.hpp:28,
                 from /work/thirdparty/xerces-c/src/xercesc/framework/XMLValidator.hpp:25,
                 from /work/thirdparty/xerces-c/samples/src/EnumVal/EnumVal.cpp:27:
/work/thirdparty/xerces-c/src/xercesc/framework/psvi/XSConstants.hpp:56:24: warning: 'class xercesc_3_2::XSConstants' only defines private constructors and has no friends [-Wctor-dtor-privacy]
 class XMLPARSER_EXPORT XSConstants
                        ^~~~~~~~~~~
/work/thirdparty/xerces-c/samples/src/SAX2Count/SAX2Count.cpp: In function 'void usage()':
/work/thirdparty/xerces-c/samples/src/SAX2Count/SAX2Count.cpp:40:6: warning: no previous declaration for 'void usage()' [-Wmissing-declarations]
 void usage()
      ^~~~~
In file included from /work/thirdparty/xerces-c/src/xercesc/validators/datatype/DatatypeValidator.hpp:30:0,
                 from /work/thirdparty/xerces-c/src/xercesc/framework/XMLAttr.hpp:28,
                 from /work/thirdparty/xerces-c/src/xercesc/framework/XMLValidator.hpp:25,
                 from /work/thirdparty/xerces-c/src/xercesc/sax2/SAX2XMLReader.hpp:27,
                 from /work/thirdparty/xerces-c/src/xercesc/sax2/XMLReaderFactory.hpp:25,
                 from /work/thirdparty/xerces-c/samples/src/SAX2Count/SAX2Count.hpp:36,
                 from /work/thirdparty/xerces-c/samples/src/SAX2Count/SAX2CountHandlers.cpp:25:
/work/thirdparty/xerces-c/src/xercesc/validators/schema/SchemaSymbols.hpp:33:25: warning: 'class xercesc_3_2::SchemaSymbols' only defines private constructors and has no friends [-Wctor-dtor-privacy]
 class VALIDATORS_EXPORT SchemaSymbols
                         ^~~~~~~~~~~~~
In file included from /work/thirdparty/xerces-c/src/xercesc/framework/psvi/XSObject.hpp:26:0,
                 from /work/thirdparty/xerces-c/src/xercesc/framework/psvi/XSTypeDefinition.hpp:25,
                 from /work/thirdparty/xerces-c/src/xercesc/framework/psvi/XSSimpleTypeDefinition.hpp:25,
                 from /work/thirdparty/xerces-c/src/xercesc/validators/datatype/DatatypeValidator.hpp:32,
                 from /work/thirdparty/xerces-c/src/xercesc/framework/XMLAttr.hpp:28,
                 from /work/thirdparty/xerces-c/src/xercesc/framework/XMLValidator.hpp:25,
                 from /work/thirdparty/xerces-c/src/xercesc/sax2/SAX2XMLReader.hpp:27,
                 from /work/thirdparty/xerces-c/src/xercesc/sax2/XMLReaderFactory.hpp:25,
                 from /work/thirdparty/xerces-c/samples/src/SAX2Count/SAX2Count.hpp:36,
                 from /work/thirdparty/xerces-c/samples/src/SAX2Count/SAX2CountHandlers.cpp:25:
/work/thirdparty/xerces-c/src/xercesc/framework/psvi/XSConstants.hpp:56:24: warning: 'class xercesc_3_2::XSConstants' only defines private constructors and has no friends [-Wctor-dtor-privacy]
 class XMLPARSER_EXPORT XSConstants
                        ^~~~~~~~~~~
make[2]: Entering directory '/work/build/linux-x64/xerces-c'
make[2]: Leaving directory '/work/build/linux-x64/xerces-c'
[ 93%] Built target XSValueTest
[ 93%] Linking CXX executable SAX2Count
make[2]: Entering directory '/work/build/linux-x64/xerces-c'
make[2]: Leaving directory '/work/build/linux-x64/xerces-c'
[ 93%] Built target DOMTest
Scanning dependencies of target DOMPrint
In file included from /work/thirdparty/xerces-c/src/xercesc/util/NameIdPool.hpp:204:0,
                 from /work/thirdparty/xerces-c/samples/src/EnumVal/EnumVal.cpp:25:
/work/thirdparty/xerces-c/src/xercesc/util/NameIdPool.c: In instantiation of 'XMLSize_t xercesc_3_2::NameIdPool<TElem>::put(TElem*) [with TElem = xercesc_3_2::DTDEntityDecl; XMLSize_t = long unsigned int]':
/work/thirdparty/xerces-c/src/xercesc/validators/DTD/DTDGrammar.hpp:280:43:   required from here
/work/thirdparty/xerces-c/src/xercesc/util/NameIdPool.c:166:21: warning: cast from type 'const XMLCh* {aka const char16_t*}' to type 'void*' casts away qualifiers [-Wcast-qual]
     fBucketList.put((void*)elemToAdopt->getKey(), elemToAdopt);
                      
make[2]: Leaving directory '/work/build/linux-x64/xerces-c'
/work/thirdparty/xerces-c/src/xercesc/util/NameIdPool.c: In instantiation of 'XMLSize_t xercesc_3_2::NameIdPool<TElem>::put(TElem*) [with TElem = xercesc_3_2::DTDElementDecl; XMLSize_t = long unsigned int]':
/work/thirdparty/xerces-c/src/xercesc/validators/DTD/DTDGrammar.hpp:357:64:   required from here
/work/thirdparty/xerces-c/src/xercesc/util/NameIdPool.c:166:21: warning: cast from type 'const XMLCh* {aka const char16_t*}' to type 'void*' casts away qualifiers [-Wcast-qual]
/work/thirdparty/xerces-c/src/xercesc/util/NameIdPool.c: In instantiation of 'XMLSize_t xercesc_3_2::NameIdPool<TElem>::put(TElem*) [with TElem = xercesc_3_2::XMLNotationDecl; XMLSize_t = long unsigned int]':
/work/thirdparty/xerces-c/src/xercesc/validators/DTD/DTDGrammar.hpp:376:47:   required from here
/work/thirdparty/xerces-c/src/xercesc/util/NameIdPool.c:166:21: warning: cast from type 'const XMLCh* {aka const char16_t*}' to type 'void*' casts away qualifiers [-Wcast-qual]
make[2]: Entering directory '/work/build/linux-x64/xerces-c'
[ 93%] Building CXX object samples/CMakeFiles/DOMPrint.dir/src/DOMPrint/DOMPrint.cpp.o
make[2]: Entering directory '/work/build/linux-x64/xerces-c'
Scanning dependencies of target PParse
make[2]: Leaving directory '/work/build/linux-x64/xerces-c'
make[2]: Entering directory '/work/build/linux-x64/xerces-c'
[ 93%] Building CXX object samples/CMakeFiles/PParse.dir/src/PParse/PParse.cpp.o
Scanning dependencies of target SAXPrint
make[2]: Leaving directory '/work/build/linux-x64/xerces-c'
make[2]: Entering directory '/work/build/linux-x64/xerces-c'
[ 93%] Building CXX object samples/CMakeFiles/SAXPrint.dir/src/SAXPrint/SAXPrint.cpp.o
[ 94%] Linking CXX executable EnumVal
[ 94%] Linking CXX executable PSVIWriter
make[2]: Leaving directory '/work/build/linux-x64/xerces-c'
[ 94%] Built target Redirect
make[2]: Entering directory '/work/build/linux-x64/xerces-c'
Scanning dependencies of target SEnumVal
make[2]: Leaving directory '/work/build/linux-x64/xerces-c'
make[2]: Entering directory '/work/build/linux-x64/xerces-c'
[ 95%] Building CXX object samples/CMakeFiles/SEnumVal.dir/src/SEnumVal/SEnumVal.cpp.o
In file included from /work/thirdparty/xerces-c/src/xercesc/validators/datatype/DatatypeValidator.hpp:30:0,
                 from /work/thirdparty/xerces-c/src/xercesc/framework/XMLAttr.hpp:28,
                 from /work/thirdparty/xerces-c/src/xercesc/framework/XMLElementDecl.hpp:25,
                 from /work/thirdparty/xerces-c/src/xercesc/validators/common/Grammar.hpp:27,
                 from /work/thirdparty/xerces-c/src/xercesc/dom/DOMLSParser.hpp:29,
                 from /work/thirdparty/xerces-c/src/xercesc/dom/DOM.hpp:59,
                 from /work/thirdparty/xerces-c/samples/src/DOMPrint/DOMPrint.cpp:71:
/work/thirdparty/xerces-c/src/xercesc/validators/schema/SchemaSymbols.hpp:33:25: warning: 'class xercesc_3_2::SchemaSymbols' only defines private constructors and has no friends [-Wctor-dtor-privacy]
 class VALIDATORS_EXPORT SchemaSymbols
                         ^~~~~~~~~~~~~
make[2]: Leaving directory '/work/build/linux-x64/xerces-c'
In file included from /work/thirdparty/xerces-c/src/xercesc/framework/psvi/XSObject.hpp:26:0,
                 from /work/thirdparty/xerces-c/src/xercesc/framework/psvi/XSTypeDefinition.hpp:25,
                 from /work/thirdparty/xerces-c/src/xercesc/framework/psvi/XSSimpleTypeDefinition.hpp:25,
                 from /work/thirdparty/xerces-c/src/xercesc/validators/datatype/DatatypeValidator.hpp:32,
                 from /work/thirdparty/xerces-c/src/xercesc/framework/XMLAttr.hpp:28,
                 from /work/thirdparty/xerces-c/src/xercesc/framework/XMLElementDecl.hpp:25,
                 from /work/thirdparty/xerces-c/src/xercesc/validators/common/Grammar.hpp:27,
                 from /work/thirdparty/xerces-c/src/xercesc/dom/DOMLSParser.hpp:29,
                 from /work/thirdparty/xerces-c/src/xercesc/dom/DOM.hpp:59,
                 from /work/thirdparty/xerces-c/samples/src/DOMPrint/DOMPrint.cpp:71:
/work/thirdparty/xerces-c/src/xercesc/framework/psvi/XSConstants.hpp:56:24: warning: 'class xercesc_3_2::XSConstants' only defines private constructors and has no friends [-Wctor-dtor-privacy]
 class XMLPARSER_EXPORT XSConstants
                        ^~~~~~~~~~~
[ 95%] Built target SAXCount
[ 95%] Building CXX object samples/CMakeFiles/PParse.dir/src/PParse/PParseHandlers.cpp.o
In file included from /work/thirdparty/xerces-c/src/xercesc/validators/datatype/DatatypeValidator.hpp:30:0,
                 from /work/thirdparty/xerces-c/src/xercesc/framework/XMLAttr.hpp:28,
                 from /work/thirdparty/xerces-c/src/xercesc/internal/VecAttrListImpl.hpp:26,
                 from /work/thirdparty/xerces-c/src/xercesc/parsers/SAXParser.hpp:26,
                 from /work/thirdparty/xerces-c/samples/src/PParse/PParse.cpp:50:
/work/thirdparty/xerces-c/src/xercesc/validators/schema/SchemaSymbols.hpp:33:25: warning: 'class xercesc_3_2::SchemaSymbols' only defines private constructors and has no friends [-Wctor-dtor-privacy]
 class VALIDATORS_EXPORT SchemaSymbols
                         ^~~~~~~~~~~~~
In file included from /work/thirdparty/xerces-c/src/xercesc/framework/psvi/XSObject.hpp:26:0,
                 from /work/thirdparty/xerces-c/src/xercesc/framework/psvi/XSTypeDefinition.hpp:25,
                 from /work/thirdparty/xerces-c/src/xercesc/framework/psvi/XSSimpleTypeDefinition.hpp:25,
                 from /work/thirdparty/xerces-c/src/xercesc/validators/datatype/DatatypeValidator.hpp:32,
                 from /work/thirdparty/xerces-c/src/xercesc/framework/XMLAttr.hpp:28,
                 from /work/thirdparty/xerces-c/src/xercesc/internal/VecAttrListImpl.hpp:26,
                 from /work/thirdparty/xerces-c/src/xercesc/parsers/SAXParser.hpp:26,
                 from /work/thirdparty/xerces-c/samples/src/PParse/PParse.cpp:50:
/work/thirdparty/xerces-c/src/xercesc/framework/psvi/XSConstants.hpp:56:24: warning: 'class xercesc_3_2::XSConstants' only defines private constructors and has no friends [-Wctor-dtor-privacy]
 class XMLPARSER_EXPORT XSConstants
                        ^~~~~~~~~~~
In file included from /work/thirdparty/xerces-c/src/xercesc/validators/datatype/DatatypeValidator.hpp:30:0,
                 from /work/thirdparty/xerces-c/src/xercesc/framework/XMLAttr.hpp:28,
                 from /work/thirdparty/xerces-c/src/xercesc/internal/VecAttrListImpl.hpp:26,
                 from /work/thirdparty/xerces-c/src/xercesc/parsers/SAXParser.hpp:26,
                 from /work/thirdparty/xerces-c/samples/src/SAXPrint/SAXPrint.cpp:28:
/work/thirdparty/xerces-c/src/xercesc/validators/schema/SchemaSymbols.hpp:33:25: warning: 'class xercesc_3_2::SchemaSymbols' only defines private constructors and has no friends [-Wctor-dtor-privacy]
 class VALIDATORS_EXPORT SchemaSymbols
                         ^~~~~~~~~~~~~
In file included from /work/thirdparty/xerces-c/src/xercesc/framework/psvi/XSObject.hpp:26:0,
                 from /work/thirdparty/xerces-c/src/xercesc/framework/psvi/XSTypeDefinition.hpp:25,
                 from /work/thirdparty/xerces-c/src/xercesc/framework/psvi/XSSimpleTypeDefinition.hpp:25,
                 from /work/thirdparty/xerces-c/src/xercesc/validators/datatype/DatatypeValidator.hpp:32,
                 from /work/thirdparty/xerces-c/src/xercesc/framework/XMLAttr.hpp:28,
                 from /work/thirdparty/xerces-c/src/xercesc/internal/VecAttrListImpl.hpp:26,
                 from /work/thirdparty/xerces-c/src/xercesc/parsers/SAXParser.hpp:26,
                 from /work/thirdparty/xerces-c/samples/src/SAXPrint/SAXPrint.cpp:28:
/work/thirdparty/xerces-c/src/xercesc/framework/psvi/XSConstants.hpp:56:24: warning: 'class xercesc_3_2::XSConstants' only defines private constructors and has no friends [-Wctor-dtor-privacy]
 class XMLPARSER_EXPORT XSConstants
                        ^~~~~~~~~~~
In file included from /work/thirdparty/xerces-c/src/xercesc/validators/datatype/DatatypeValidator.hpp:30:0,
                 from /work/thirdparty/xerces-c/src/xercesc/framework/XMLAttr.hpp:28,
                 from /work/thirdparty/xerces-c/src/xercesc/framework/XMLValidator.hpp:25,
                 from /work/thirdparty/xerces-c/samples/src/SEnumVal/SEnumVal.cpp:26:
/work/thirdparty/xerces-c/src/xercesc/validators/schema/SchemaSymbols.hpp:33:25: warning: 'class xercesc_3_2::SchemaSymbols' only defines private constructors and has no friends [-Wctor-dtor-privacy]
 class VALIDATORS_EXPORT SchemaSymbols
                         ^~~~~~~~~~~~~
In file included from /work/thirdparty/xerces-c/src/xercesc/framework/psvi/XSObject.hpp:26:0,
                 from /work/thirdparty/xerces-c/src/xercesc/framework/psvi/XSTypeDefinition.hpp:25,
                 from /work/thirdparty/xerces-c/src/xercesc/framework/psvi/XSSimpleTypeDefinition.hpp:25,
                 from /work/thirdparty/xerces-c/src/xercesc/validators/datatype/DatatypeValidator.hpp:32,
                 from /work/thirdparty/xerces-c/src/xercesc/framework/XMLAttr.hpp:28,
                 from /work/thirdparty/xerces-c/src/xercesc/framework/XMLValidator.hpp:25,
                 from /work/thirdparty/xerces-c/samples/src/SEnumVal/SEnumVal.cpp:26:
/work/thirdparty/xerces-c/src/xercesc/framework/psvi/XSConstants.hpp:56:24: warning: 'class xercesc_3_2::XSConstants' only defines private constructors and has no friends [-Wctor-dtor-privacy]
 class XMLPARSER_EXPORT XSConstants
                        ^~~~~~~~~~~
[ 95%] Building CXX object samples/CMakeFiles/DOMPrint.dir/src/DOMPrint/DOMPrintErrorHandler.cpp.o
[ 95%] Building CXX object samples/CMakeFiles/DOMPrint.dir/src/DOMPrint/DOMPrintFilter.cpp.o
[ 95%] Linking CXX executable PParse
[ 96%] Building CXX object samples/CMakeFiles/SAXPrint.dir/src/SAXPrint/SAXPrintHandlers.cpp.o
/work/thirdparty/xerces-c/samples/src/SEnumVal/SEnumVal.cpp: In function 'void processDatatypeValidator(const xercesc_3_2::DatatypeValidator*, bool)':
/work/thirdparty/xerces-c/samples/src/SEnumVal/SEnumVal.cpp:398:11: warning: switch missing default case [-Wswitch-default]
     switch( dtValidator->getType() )
           ^
/work/thirdparty/xerces-c/samples/src/SEnumVal/SEnumVal.cpp:450:56: warning: cast from type 'const XMLCh* {aka const char16_t*}' to type 'XMLCh* {aka char16_t*}' casts away qualifiers [-Wcast-qual]
                     sortedList.insertElementAt((XMLCh*)key,i);
                                                        ^~~
/work/thirdparty/xerces-c/samples/src/SEnumVal/SEnumVal.cpp:454:47: warning: cast from type 'const XMLCh* {aka const char16_t*}' to type 'XMLCh* {aka char16_t*}' casts away qualifiers [-Wcast-qual]
                 sortedList.addElement((XMLCh*)key);
                                               ^~~
/work/thirdparty/xerces-c/samples/src/SEnumVal/SEnumVal.cpp:467:79: warning: cast from type 'const xercesc_3_2::RefArrayVectorOf<char16_t>*' to type 'xercesc_3_2::RefVectorOf<char16_t>*' casts away qualifiers [-Wcast-qual]
  RefVectorOf<XMLCh>* enums = (RefVectorOf<XMLCh>*) dtValidator->getEnumString();
                                                                               ^
/work/thirdparty/xerces-c/samples/src/SEnumVal/SEnumVal.cpp: In function 'void processContentSpecNode(const xercesc_3_2::ContentSpecNode*, bool)':
/work/thirdparty/xerces-c/samples/src/SEnumVal/SEnumVal.cpp:494:11: warning: switch missing default case [-Wswitch-default]
     switch( cSpecNode->getType() )
           ^
In file included from /work/thirdparty/xerces-c/src/xercesc/util/NameIdPool.hpp:204:0,
                 from /work/thirdparty/xerces-c/samples/src/SEnumVal/SEnumVal.cpp:24:
/work/thirdparty/xerces-c/src/xercesc/util/NameIdPool.c: In instantiation of 'XMLSize_t xercesc_3_2::NameIdPool<TElem>::put(TElem*) [with TElem = xercesc_3_2::XMLNotationDecl; XMLSize_t = long unsigned int]':
/work/thirdparty/xerces-c/src/xercesc/validators/schema/SchemaGrammar.hpp:587:47:   required from here
/work/thirdparty/xerces-c/src/xercesc/util/NameIdPool.c:166:21: warning: cast from type 'const XMLCh* {aka const char16_t*}' to type 'void*' casts away qualifiers [-Wcast-qual]
     fBucketList.put((void*)elemToAdopt->getKey(), elemToAdopt);
                      
[ 97%] Building CXX object samples/CMakeFiles/DOMPrint.dir/src/DOMPrint/DOMTreeErrorReporter.cpp.o
[ 97%] Linking CXX executable SEnumVal
/work/thirdparty/xerces-c/samples/src/SAXPrint/SAXPrintHandlers.cpp: In member function 'virtual void SAXPrintHandlers::writeChars(const XMLByte*, XMLSize_t, xercesc_3_2::XMLFormatter*)':
/work/thirdparty/xerces-c/samples/src/SAXPrint/SAXPrintHandlers.cpp:106:46: warning: cast from type 'const XMLByte* const {aka const unsigned char* const}' to type 'char*' casts away qualifiers [-Wcast-qual]
     XERCES_STD_QUALIFIER cout.write((char *) toWrite, (int) count);
                                              ^~~~~~~
make[2]: Leaving directory '/work/build/linux-x64/xerces-c'
[ 97%] Built target SAX2Count
make[2]: Leaving directory '/work/build/linux-x64/xerces-c'
[ 97%] Built target PSVIWriter
make[2]: Leaving directory '/work/build/linux-x64/xerces-c'
[ 97%] Built target EnumVal
make[2]: Leaving directory '/work/build/linux-x64/xerces-c'
[ 97%] Built target PParse
make[2]: Entering directory '/work/build/linux-x64/xerces-c'
make[2]: Entering directory '/work/build/linux-x64/xerces-c'
Scanning dependencies of target StdInParse
make[2]: Leaving directory '/work/build/linux-x64/xerces-c'
make[2]: Entering directory '/work/build/linux-x64/xerces-c'
[ 97%] Building CXX object samples/CMakeFiles/StdInParse.dir/src/StdInParse/StdInParse.cpp.o
make[2]: Entering directory '/work/build/linux-x64/xerces-c'
make[2]: Entering directory '/work/build/linux-x64/xerces-c'
Scanning dependencies of target SAX2Print
make[2]: Leaving directory '/work/build/linux-x64/xerces-c'
make[2]: Entering directory '/work/build/linux-x64/xerces-c'
[ 97%] Linking CXX executable DOMPrint
make[2]: Entering directory '/work/build/linux-x64/xerces-c'
[ 98%] Building CXX object samples/CMakeFiles/SAX2Print.dir/src/SAX2Print/SAX2FilterHandlers.cpp.o
Scanning dependencies of target DOMCount
Scanning dependencies of target MemParse
make[2]: Leaving directory '/work/build/linux-x64/xerces-c'
make[2]: Leaving directory '/work/build/linux-x64/xerces-c'
[ 98%] Linking CXX executable SAXPrint
make[2]: Entering directory '/work/build/linux-x64/xerces-c'
make[2]: Entering directory '/work/build/linux-x64/xerces-c'
[ 98%] Building CXX object samples/CMakeFiles/MemParse.dir/src/MemParse/MemParse.cpp.o
[ 98%] Building CXX object samples/CMakeFiles/DOMCount.dir/src/DOMCount/DOMCount.cpp.o
Scanning dependencies of target XInclude
make[2]: Leaving directory '/work/build/linux-x64/xerces-c'
make[2]: Entering directory '/work/build/linux-x64/xerces-c'
[ 98%] Building CXX object samples/CMakeFiles/XInclude.dir/src/XInclude/XInclude.cpp.o
In file included from /work/thirdparty/xerces-c/src/xercesc/validators/datatype/DatatypeValidator.hpp:30:0,
                 from /work/thirdparty/xerces-c/src/xercesc/framework/XMLAttr.hpp:28,
                 from /work/thirdparty/xerces-c/src/xercesc/framework/XMLValidator.hpp:25,
                 from /work/thirdparty/xerces-c/src/xercesc/sax2/SAX2XMLReader.hpp:27,
                 from /work/thirdparty/xerces-c/src/xercesc/sax2/SAX2XMLFilter.hpp:25,
                 from /work/thirdparty/xerces-c/src/xercesc/parsers/SAX2XMLFilterImpl.hpp:25,
                 from /work/thirdparty/xerces-c/samples/src/SAX2Print/SAX2FilterHandlers.hpp:22,
                 from /work/thirdparty/xerces-c/samples/src/SAX2Print/SAX2FilterHandlers.cpp:26:
/work/thirdparty/xerces-c/src/xercesc/validators/schema/SchemaSymbols.hpp:33:25: warning: 'class xercesc_3_2::SchemaSymbols' only defines private constructors and has no friends [-Wctor-dtor-privacy]
 class VALIDATORS_EXPORT SchemaSymbols
                         ^~~~~~~~~~~~~
In file included from /work/thirdparty/xerces-c/src/xercesc/framework/psvi/XSObject.hpp:26:0,
                 from /work/thirdparty/xerces-c/src/xercesc/framework/psvi/XSTypeDefinition.hpp:25,
                 from /work/thirdparty/xerces-c/src/xercesc/framework/psvi/XSSimpleTypeDefinition.hpp:25,
                 from /work/thirdparty/xerces-c/src/xercesc/validators/datatype/DatatypeValidator.hpp:32,
                 from /work/thirdparty/xerces-c/src/xercesc/framework/XMLAttr.hpp:28,
                 from /work/thirdparty/xerces-c/src/xercesc/framework/XMLValidator.hpp:25,
                 from /work/thirdparty/xerces-c/src/xercesc/sax2/SAX2XMLReader.hpp:27,
                 from /work/thirdparty/xerces-c/src/xercesc/sax2/SAX2XMLFilter.hpp:25,
                 from /work/thirdparty/xerces-c/src/xercesc/parsers/SAX2XMLFilterImpl.hpp:25,
                 from /work/thirdparty/xerces-c/samples/src/SAX2Print/SAX2FilterHandlers.hpp:22,
                 from /work/thirdparty/xerces-c/samples/src/SAX2Print/SAX2FilterHandlers.cpp:26:
/work/thirdparty/xerces-c/src/xercesc/framework/psvi/XSConstants.hpp:56:24: warning: 'class xercesc_3_2::XSConstants' only defines private constructors and has no friends [-Wctor-dtor-privacy]
 class XMLPARSER_EXPORT XSConstants
                        ^~~~~~~~~~~
In file included from /work/thirdparty/xerces-c/src/xercesc/validators/datatype/DatatypeValidator.hpp:30:0,
                 from /work/thirdparty/xerces-c/src/xercesc/framework/XMLAttr.hpp:28,
                 from /work/thirdparty/xerces-c/src/xercesc/internal/VecAttrListImpl.hpp:26,
                 from /work/thirdparty/xerces-c/src/xercesc/parsers/SAXParser.hpp:26,
                 from /work/thirdparty/xerces-c/samples/src/StdInParse/StdInParse.cpp:27:
/work/thirdparty/xerces-c/src/xercesc/validators/schema/SchemaSymbols.hpp:33:25: warning: 'class xercesc_3_2::SchemaSymbols' only defines private constructors and has no friends [-Wctor-dtor-privacy]
 class VALIDATORS_EXPORT SchemaSymbols
                         ^~~~~~~~~~~~~
In file included from /work/thirdparty/xerces-c/src/xercesc/framework/psvi/XSObject.hpp:26:0,
                 from /work/thirdparty/xerces-c/src/xercesc/framework/psvi/XSTypeDefinition.hpp:25,
                 from /work/thirdparty/xerces-c/src/xercesc/framework/psvi/XSSimpleTypeDefinition.hpp:25,
                 from /work/thirdparty/xerces-c/src/xercesc/validators/datatype/DatatypeValidator.hpp:32,
                 from /work/thirdparty/xerces-c/src/xercesc/framework/XMLAttr.hpp:28,
                 from /work/thirdparty/xerces-c/src/xercesc/internal/VecAttrListImpl.hpp:26,
                 from /work/thirdparty/xerces-c/src/xercesc/parsers/SAXParser.hpp:26,
                 from /work/thirdparty/xerces-c/samples/src/StdInParse/StdInParse.cpp:27:
/work/thirdparty/xerces-c/src/xercesc/framework/psvi/XSConstants.hpp:56:24: warning: 'class xercesc_3_2::XSConstants' only defines private constructors and has no friends [-Wctor-dtor-privacy]
 class XMLPARSER_EXPORT XSConstants
                        ^~~~~~~~~~~
[ 98%] Building CXX object samples/CMakeFiles/SAX2Print.dir/src/SAX2Print/SAX2Print.cpp.o
/work/thirdparty/xerces-c/samples/src/StdInParse/StdInParse.cpp: In function 'void usage()':
/work/thirdparty/xerces-c/samples/src/StdInParse/StdInParse.cpp:60:6: warning: no previous declaration for 'void usage()' [-Wmissing-declarations]
 void usage()
      ^~~~~
[ 99%] Building CXX object samples/CMakeFiles/StdInParse.dir/src/StdInParse/StdInParseHandlers.cpp.o
make[2]: Leaving directory '/work/build/linux-x64/xerces-c'
[ 99%] Built target SEnumVal
[ 99%] Building CXX object samples/CMakeFiles/SAX2Print.dir/src/SAX2Print/SAX2PrintHandlers.cpp.o
make[2]: Leaving directory '/work/build/linux-x64/xerces-c'
[ 99%] Built target DOMPrint
make[2]: Entering directory '/work/build/linux-x64/xerces-c'
make[2]: Leaving directory '/work/build/linux-x64/xerces-c'
[ 99%] Built target SAXPrint
[ 99%] Building CXX object samples/CMakeFiles/MemParse.dir/src/MemParse/MemParseHandlers.cpp.o
In file included from /work/thirdparty/xerces-c/src/xercesc/validators/datatype/DatatypeValidator.hpp:30:0,
                 from /work/thirdparty/xerces-c/src/xercesc/framework/XMLAttr.hpp:28,
                 from /work/thirdparty/xerces-c/src/xercesc/internal/VecAttrListImpl.hpp:26,
                 from /work/thirdparty/xerces-c/src/xercesc/parsers/SAXParser.hpp:26,
                 from /work/thirdparty/xerces-c/samples/src/MemParse/MemParse.cpp:38:
/work/thirdparty/xerces-c/src/xercesc/validators/schema/SchemaSymbols.hpp:33:25: warning: 'class xercesc_3_2::SchemaSymbols' only defines private constructors and has no friends [-Wctor-dtor-privacy]
 class VALIDATORS_EXPORT SchemaSymbols
                         ^~~~~~~~~~~~~
In file included from /work/thirdparty/xerces-c/src/xercesc/framework/psvi/XSObject.hpp:26:0,
                 from /work/thirdparty/xerces-c/src/xercesc/framework/psvi/XSTypeDefinition.hpp:25,
                 from /work/thirdparty/xerces-c/src/xercesc/framework/psvi/XSSimpleTypeDefinition.hpp:25,
                 from /work/thirdparty/xerces-c/src/xercesc/validators/datatype/DatatypeValidator.hpp:32,
                 from /work/thirdparty/xerces-c/src/xercesc/framework/XMLAttr.hpp:28,
                 from /work/thirdparty/xerces-c/src/xercesc/internal/VecAttrListImpl.hpp:26,
                 from /work/thirdparty/xerces-c/src/xercesc/parsers/SAXParser.hpp:26,
                 from /work/thirdparty/xerces-c/samples/src/MemParse/MemParse.cpp:38:
/work/thirdparty/xerces-c/src/xercesc/framework/psvi/XSConstants.hpp:56:24: warning: 'class xercesc_3_2::XSConstants' only defines private constructors and has no friends [-Wctor-dtor-privacy]
 class XMLPARSER_EXPORT XSConstants
                        ^~~~~~~~~~~
/work/thirdparty/xerces-c/samples/src/MemParse/MemParse.cpp: In function 'void usage()':
/work/thirdparty/xerces-c/samples/src/MemParse/MemParse.cpp:96:6: warning: no previous declaration for 'void usage()' [-Wmissing-declarations]
 void usage()
      ^~~~~
In file included from /work/thirdparty/xerces-c/src/xercesc/validators/datatype/DatatypeValidator.hpp:30:0,
                 from /work/thirdparty/xerces-c/src/xercesc/framework/XMLAttr.hpp:28,
                 from /work/thirdparty/xerces-c/src/xercesc/framework/XMLDocumentHandler.hpp:27,
                 from /work/thirdparty/xerces-c/src/xercesc/parsers/AbstractDOMParser.hpp:26,
                 from /work/thirdparty/xerces-c/samples/src/DOMCount/DOMCount.cpp:26:
/work/thirdparty/xerces-c/src/xercesc/validators/schema/SchemaSymbols.hpp:33:25: warning: 'class xercesc_3_2::SchemaSymbols' only defines private constructors and has no friends [-Wctor-dtor-privacy]
 class VALIDATORS_EXPORT SchemaSymbols
                         ^~~~~~~~~~~~~
In file included from /work/thirdparty/xerces-c/src/xercesc/framework/psvi/XSObject.hpp:26:0,
                 from /work/thirdparty/xerces-c/src/xercesc/framework/psvi/XSTypeDefinition.hpp:25,
                 from /work/thirdparty/xerces-c/src/xercesc/framework/psvi/XSSimpleTypeDefinition.hpp:25,
                 from /work/thirdparty/xerces-c/src/xercesc/validators/datatype/DatatypeValidator.hpp:32,
                 from /work/thirdparty/xerces-c/src/xercesc/framework/XMLAttr.hpp:28,
                 from /work/thirdparty/xerces-c/src/xercesc/framework/XMLDocumentHandler.hpp:27,
                 from /work/thirdparty/xerces-c/src/xercesc/parsers/AbstractDOMParser.hpp:26,
                 from /work/thirdparty/xerces-c/samples/src/DOMCount/DOMCount.cpp:26:
/work/thirdparty/xerces-c/src/xercesc/framework/psvi/XSConstants.hpp:56:24: warning: 'class xercesc_3_2::XSConstants' only defines private constructors and has no friends [-Wctor-dtor-privacy]
 class XMLPARSER_EXPORT XSConstants
                        ^~~~~~~~~~~
In file included from /work/thirdparty/xerces-c/src/xercesc/validators/datatype/DatatypeValidator.hpp:30:0,
                 from /work/thirdparty/xerces-c/src/xercesc/framework/XMLAttr.hpp:28,
                 from /work/thirdparty/xerces-c/src/xercesc/framework/XMLDocumentHandler.hpp:27,
                 from /work/thirdparty/xerces-c/src/xercesc/parsers/AbstractDOMParser.hpp:26,
                 from /work/thirdparty/xerces-c/samples/src/XInclude/XInclude.cpp:26:
/work/thirdparty/xerces-c/src/xercesc/validators/schema/SchemaSymbols.hpp:33:25: warning: 'class xercesc_3_2::SchemaSymbols' only defines private constructors and has no friends [-Wctor-dtor-privacy]
 class VALIDATORS_EXPORT SchemaSymbols
                         ^~~~~~~~~~~~~
In file included from /work/thirdparty/xerces-c/src/xercesc/framework/psvi/XSObject.hpp:26:0,
                 from /work/thirdparty/xerces-c/src/xercesc/framework/psvi/XSTypeDefinition.hpp:25,
                 from /work/thirdparty/xerces-c/src/xercesc/framework/psvi/XSSimpleTypeDefinition.hpp:25,
                 from /work/thirdparty/xerces-c/src/xercesc/validators/datatype/DatatypeValidator.hpp:32,
                 from /work/thirdparty/xerces-c/src/xercesc/framework/XMLAttr.hpp:28,
                 from /work/thirdparty/xerces-c/src/xercesc/framework/XMLDocumentHandler.hpp:27,
                 from /work/thirdparty/xerces-c/src/xercesc/parsers/AbstractDOMParser.hpp:26,
                 from /work/thirdparty/xerces-c/samples/src/XInclude/XInclude.cpp:26:
/work/thirdparty/xerces-c/src/xercesc/framework/psvi/XSConstants.hpp:56:24: warning: 'class xercesc_3_2::XSConstants' only defines private constructors and has no friends [-Wctor-dtor-privacy]
 class XMLPARSER_EXPORT XSConstants
                        ^~~~~~~~~~~
Scanning dependencies of target CreateDOMDocument
make[2]: Leaving directory '/work/build/linux-x64/xerces-c'
make[2]: Entering directory '/work/build/linux-x64/xerces-c'
[ 99%] Building CXX object samples/CMakeFiles/CreateDOMDocument.dir/src/CreateDOMDocument/CreateDOMDocument.cpp.o
[ 99%] Linking CXX executable XInclude
[ 99%] Linking CXX executable DOMCount
make[2]: Entering directory '/work/build/linux-x64/xerces-c'
Scanning dependencies of target SCMPrint
make[2]: Leaving directory '/work/build/linux-x64/xerces-c'
make[2]: Entering directory '/work/build/linux-x64/xerces-c'
[ 99%] Building CXX object samples/CMakeFiles/SCMPrint.dir/src/SCMPrint/SCMPrint.cpp.o
In file included from /work/thirdparty/xerces-c/src/xercesc/validators/datatype/DatatypeValidator.hpp:30:0,
                 from /work/thirdparty/xerces-c/src/xercesc/framework/XMLAttr.hpp:28,
                 from /work/thirdparty/xerces-c/src/xercesc/framework/XMLValidator.hpp:25,
                 from /work/thirdparty/xerces-c/src/xercesc/sax2/SAX2XMLReader.hpp:27,
                 from /work/thirdparty/xerces-c/samples/src/SAX2Print/SAX2Print.cpp:28:
/work/thirdparty/xerces-c/src/xercesc/validators/schema/SchemaSymbols.hpp:33:25: warning: 'class xercesc_3_2::SchemaSymbols' only defines private constructors and has no friends [-Wctor-dtor-privacy]
 class VALIDATORS_EXPORT SchemaSymbols
                         ^~~~~~~~~~~~~
In file included from /work/thirdparty/xerces-c/src/xercesc/framework/psvi/XSObject.hpp:26:0,
                 from /work/thirdparty/xerces-c/src/xercesc/framework/psvi/XSTypeDefinition.hpp:25,
                 from /work/thirdparty/xerces-c/src/xercesc/framework/psvi/XSSimpleTypeDefinition.hpp:25,
                 from /work/thirdparty/xerces-c/src/xercesc/validators/datatype/DatatypeValidator.hpp:32,
                 from /work/thirdparty/xerces-c/src/xercesc/framework/XMLAttr.hpp:28,
                 from /work/thirdparty/xerces-c/src/xercesc/framework/XMLValidator.hpp:25,
                 from /work/thirdparty/xerces-c/src/xercesc/sax2/SAX2XMLReader.hpp:27,
                 from /work/thirdparty/xerces-c/samples/src/SAX2Print/SAX2Print.cpp:28:
/work/thirdparty/xerces-c/src/xercesc/framework/psvi/XSConstants.hpp:56:24: warning: 'class xercesc_3_2::XSConstants' only defines private constructors and has no friends [-Wctor-dtor-privacy]
 class XMLPARSER_EXPORT XSConstants
                        ^~~~~~~~~~~
In file included from /work/thirdparty/xerces-c/src/xercesc/validators/datatype/DatatypeValidator.hpp:30:0,
                 from /work/thirdparty/xerces-c/src/xercesc/framework/XMLAttr.hpp:28,
                 from /work/thirdparty/xerces-c/src/xercesc/framework/XMLValidator.hpp:25,
                 from /work/thirdparty/xerces-c/src/xercesc/sax2/SAX2XMLReader.hpp:27,
                 from /work/thirdparty/xerces-c/samples/src/SCMPrint/SCMPrint.cpp:26:
/work/thirdparty/xerces-c/src/xercesc/validators/schema/SchemaSymbols.hpp:33:25: warning: 'class xercesc_3_2::SchemaSymbols' only defines private constructors and has no friends [-Wctor-dtor-privacy]
 class VALIDATORS_EXPORT SchemaSymbols
                         ^~~~~~~~~~~~~
In file included from /work/thirdparty/xerces-c/src/xercesc/framework/psvi/XSObject.hpp:26:0,
                 from /work/thirdparty/xerces-c/src/xercesc/framework/psvi/XSTypeDefinition.hpp:25,
                 from /work/thirdparty/xerces-c/src/xercesc/framework/psvi/XSSimpleTypeDefinition.hpp:25,
                 from /work/thirdparty/xerces-c/src/xercesc/validators/datatype/DatatypeValidator.hpp:32,
                 from /work/thirdparty/xerces-c/src/xercesc/framework/XMLAttr.hpp:28,
                 from /work/thirdparty/xerces-c/src/xercesc/framework/XMLValidator.hpp:25,
                 from /work/thirdparty/xerces-c/src/xercesc/sax2/SAX2XMLReader.hpp:27,
                 from /work/thirdparty/xerces-c/samples/src/SCMPrint/SCMPrint.cpp:26:
/work/thirdparty/xerces-c/src/xercesc/framework/psvi/XSConstants.hpp:56:24: warning: 'class xercesc_3_2::XSConstants' only defines private constructors and has no friends [-Wctor-dtor-privacy]
 class XMLPARSER_EXPORT XSConstants
                        ^~~~~~~~~~~
In file included from /work/thirdparty/xerces-c/src/xercesc/validators/datatype/DatatypeValidator.hpp:30:0,
                 from /work/thirdparty/xerces-c/src/xercesc/framework/XMLAttr.hpp:28,
                 from /work/thirdparty/xerces-c/src/xercesc/framework/XMLElementDecl.hpp:25,
                 from /work/thirdparty/xerces-c/src/xercesc/validators/common/Grammar.hpp:27,
                 from /work/thirdparty/xerces-c/src/xercesc/dom/DOMLSParser.hpp:29,
                 from /work/thirdparty/xerces-c/src/xercesc/dom/DOM.hpp:59,
                 from /work/thirdparty/xerces-c/samples/src/CreateDOMDocument/CreateDOMDocument.cpp:33:
/work/thirdparty/xerces-c/src/xercesc/validators/schema/SchemaSymbols.hpp:33:25: warning: 'class xercesc_3_2::SchemaSymbols' only defines private constructors and has no friends [-Wctor-dtor-privacy]
 class VALIDATORS_EXPORT SchemaSymbols
                         ^~~~~~~~~~~~~
In file included from /work/thirdparty/xerces-c/src/xercesc/framework/psvi/XSObject.hpp:26:0,
                 from /work/thirdparty/xerces-c/src/xercesc/framework/psvi/XSTypeDefinition.hpp:25,
                 from /work/thirdparty/xerces-c/src/xercesc/framework/psvi/XSSimpleTypeDefinition.hpp:25,
                 from /work/thirdparty/xerces-c/src/xercesc/validators/datatype/DatatypeValidator.hpp:32,
                 from /work/thirdparty/xerces-c/src/xercesc/framework/XMLAttr.hpp:28,
                 from /work/thirdparty/xerces-c/src/xercesc/framework/XMLElementDecl.hpp:25,
                 from /work/thirdparty/xerces-c/src/xercesc/validators/common/Grammar.hpp:27,
                 from /work/thirdparty/xerces-c/src/xercesc/dom/DOMLSParser.hpp:29,
                 from /work/thirdparty/xerces-c/src/xercesc/dom/DOM.hpp:59,
                 from /work/thirdparty/xerces-c/samples/src/CreateDOMDocument/CreateDOMDocument.cpp:33:
/work/thirdparty/xerces-c/src/xercesc/framework/psvi/XSConstants.hpp:56:24: warning: 'class xercesc_3_2::XSConstants' only defines private constructors and has no friends [-Wctor-dtor-privacy]
 class XMLPARSER_EXPORT XSConstants
                        ^~~~~~~~~~~
/work/thirdparty/xerces-c/samples/src/SAX2Print/SAX2PrintHandlers.cpp: In member function 'virtual void SAX2PrintHandlers::writeChars(const XMLByte*, XMLSize_t, xercesc_3_2::XMLFormatter*)':
/work/thirdparty/xerces-c/samples/src/SAX2Print/SAX2PrintHandlers.cpp:108:46: warning: cast from type 'const XMLByte* const {aka const unsigned char* const}' to type 'char*' casts away qualifiers [-Wcast-qual]
     XERCES_STD_QUALIFIER cout.write((char *) toWrite, (int) count);
                                              ^~~~~~~
[ 99%] Linking CXX executable StdInParse
[ 99%] Linking CXX executable MemParse
/work/thirdparty/xerces-c/samples/src/SCMPrint/SCMPrint.cpp: In function 'int main(int, char**)':
/work/thirdparty/xerces-c/samples/src/SCMPrint/SCMPrint.cpp:282:74: warning: cast from type 'const XMLCh* {aka const char16_t*}' to type 'void*' casts away qualifiers [-Wcast-qual]
         parser->setProperty(XMLUni::fgXercesScannerName, (void *)XMLUni::fgSGXMLScanner);
                                                                          ^~~~~~~~~~~~~~
[ 99%] Linking CXX executable SAX2Print
/work/thirdparty/xerces-c/samples/src/SCMPrint/SCMPrint.cpp: In function 'void printCompositorTypeConnector(xercesc_3_2::XSModelGroup::COMPOSITOR_TYPE)':
/work/thirdparty/xerces-c/samples/src/SCMPrint/SCMPrint.cpp:486:12: warning: switch missing default case [-Wswitch-default]
     switch (type) {
            ^
[100%] Linking CXX executable CreateDOMDocument
[100%] Linking CXX executable SCMPrint
make[2]: Leaving directory '/work/build/linux-x64/xerces-c'
[100%] Built target XInclude
make[2]: Leaving directory '/work/build/linux-x64/xerces-c'
[100%] Built target DOMCount
make[2]: Leaving directory '/work/build/linux-x64/xerces-c'
make[2]: Leaving directory '/work/build/linux-x64/xerces-c'
[100%] Built target MemParse
[100%] Built target CreateDOMDocument
make[2]: Leaving directory '/work/build/linux-x64/xerces-c'
[100%] Built target StdInParse
make[2]: Leaving directory '/work/build/linux-x64/xerces-c'
[100%] Built target SAX2Print
make[2]: Leaving directory '/work/build/linux-x64/xerces-c'
[100%] Built target SCMPrint
make[1]: Leaving directory '/work/build/linux-x64/xerces-c'
make: Leaving directory '/work/build/linux-x64/xerces-c'
make: Entering directory '/work/build/linux-x64/xerces-c'
make[1]: Entering directory '/work/build/linux-x64/xerces-c'
make[2]: Entering directory '/work/build/linux-x64/xerces-c'
make[2]: Leaving directory '/work/build/linux-x64/xerces-c'
[ 80%] Built target xerces-c
make[2]: Entering directory '/work/build/linux-x64/xerces-c'
make[2]: Leaving directory '/work/build/linux-x64/xerces-c'
[ 80%] Built target Char16Test
make[2]: Entering directory '/work/build/linux-x64/xerces-c'
make[2]: Leaving directory '/work/build/linux-x64/xerces-c'
[ 81%] Built target XSTSHarness
make[2]: Entering directory '/work/build/linux-x64/xerces-c'
make[2]: Leaving directory '/work/build/linux-x64/xerces-c'
[ 82%] Built target XSerializerTest
make[2]: Entering directory '/work/build/linux-x64/xerces-c'
make[2]: Leaving directory '/work/build/linux-x64/xerces-c'
[ 83%] Built target Normalizer
make[2]: Entering directory '/work/build/linux-x64/xerces-c'
make[2]: Leaving directory '/work/build/linux-x64/xerces-c'
[ 84%] Built target DOMMemTest
make[2]: Entering directory '/work/build/linux-x64/xerces-c'
make[2]: Leaving directory '/work/build/linux-x64/xerces-c'
[ 85%] Built target DOMTypeInfoTest
make[2]: Entering directory '/work/build/linux-x64/xerces-c'
make[2]: Leaving directory '/work/build/linux-x64/xerces-c'
[ 85%] Built target EncodingTest
make[2]: Entering directory '/work/build/linux-x64/xerces-c'
make[2]: Leaving directory '/work/build/linux-x64/xerces-c'
[ 86%] Built target DOMTraversalTest
make[2]: Entering directory '/work/build/linux-x64/xerces-c'
make[2]: Leaving directory '/work/build/linux-x64/xerces-c'
[ 87%] Built target RangeTest
make[2]: Entering directory '/work/build/linux-x64/xerces-c'
make[2]: Leaving directory '/work/build/linux-x64/xerces-c'
[ 87%] Built target InitTermTest
make[2]: Entering directory '/work/build/linux-x64/xerces-c'
make[2]: Leaving directory '/work/build/linux-x64/xerces-c'
[ 88%] Built target XSValueTest
make[2]: Entering directory '/work/build/linux-x64/xerces-c'
make[2]: Leaving directory '/work/build/linux-x64/xerces-c'
[ 89%] Built target MemHandlerTest
make[2]: Entering directory '/work/build/linux-x64/xerces-c'
make[2]: Leaving directory '/work/build/linux-x64/xerces-c'
[ 89%] Built target DOMTest
make[2]: Entering directory '/work/build/linux-x64/xerces-c'
make[2]: Leaving directory '/work/build/linux-x64/xerces-c'
[ 90%] Built target NetAccessorTest
make[2]: Entering directory '/work/build/linux-x64/xerces-c'
make[2]: Leaving directory '/work/build/linux-x64/xerces-c'
[ 91%] Built target SAXCount
make[2]: Entering directory '/work/build/linux-x64/xerces-c'
make[2]: Leaving directory '/work/build/linux-x64/xerces-c'
[ 91%] Built target Redirect
make[2]: Entering directory '/work/build/linux-x64/xerces-c'
make[2]: Leaving directory '/work/build/linux-x64/xerces-c'
[ 92%] Built target PSVIWriter
make[2]: Entering directory '/work/build/linux-x64/xerces-c'
make[2]: Leaving directory '/work/build/linux-x64/xerces-c'
[ 93%] Built target SAX2Count
make[2]: Entering directory '/work/build/linux-x64/xerces-c'
make[2]: Leaving directory '/work/build/linux-x64/xerces-c'
[ 94%] Built target EnumVal
make[2]: Entering directory '/work/build/linux-x64/xerces-c'
make[2]: Leaving directory '/work/build/linux-x64/xerces-c'
[ 95%] Built target DOMPrint
make[2]: Entering directory '/work/build/linux-x64/xerces-c'
make[2]: Leaving directory '/work/build/linux-x64/xerces-c'
[ 95%] Built target PParse
make[2]: Entering directory '/work/build/linux-x64/xerces-c'
make[2]: Leaving directory '/work/build/linux-x64/xerces-c'
[ 96%] Built target SAXPrint
make[2]: Entering directory '/work/build/linux-x64/xerces-c'
make[2]: Leaving directory '/work/build/linux-x64/xerces-c'
[ 97%] Built target SEnumVal
make[2]: Entering directory '/work/build/linux-x64/xerces-c'
make[2]: Leaving directory '/work/build/linux-x64/xerces-c'
[ 97%] Built target MemParse
make[2]: Entering directory '/work/build/linux-x64/xerces-c'
make[2]: Leaving directory '/work/build/linux-x64/xerces-c'
[ 98%] Built target SAX2Print
make[2]: Entering directory '/work/build/linux-x64/xerces-c'
make[2]: Leaving directory '/work/build/linux-x64/xerces-c'
[ 98%] Built target DOMCount
make[2]: Entering directory '/work/build/linux-x64/xerces-c'
make[2]: Leaving directory '/work/build/linux-x64/xerces-c'
[ 99%] Built target StdInParse
make[2]: Entering directory '/work/build/linux-x64/xerces-c'
make[2]: Leaving directory '/work/build/linux-x64/xerces-c'
[ 99%] Built target XInclude
make[2]: Entering directory '/work/build/linux-x64/xerces-c'
make[2]: Leaving directory '/work/build/linux-x64/xerces-c'
[100%] Built target CreateDOMDocument
make[2]: Entering directory '/work/build/linux-x64/xerces-c'
make[2]: Leaving directory '/work/build/linux-x64/xerces-c'
[100%] Built target SCMPrint
make[1]: Leaving directory '/work/build/linux-x64/xerces-c'
Install the project...
-- Install configuration: ""
-- Installing: /work/build/external/linux-x86_64/lib/pkgconfig/xerces-c.pc
-- Installing: /work/build/external/linux-x86_64/share/doc/xerces-c/html
-- Installing: /work/build/external/linux-x86_64/share/doc/xerces-c/html/ApacheDOMC++Binding.html
-- Installing: /work/build/external/linux-x86_64/share/doc/xerces-c/html/secadv
-- Installing: /work/build/external/linux-x86_64/share/doc/xerces-c/html/secadv/CVE-2015-0252.txt
-- Installing: /work/build/external/linux-x86_64/share/doc/xerces-c/html/secadv/CVE-2016-4463.txt
-- Installing: /work/build/external/linux-x86_64/share/doc/xerces-c/html/secadv/CVE-2016-0729.txt
-- Installing: /work/build/external/linux-x86_64/share/doc/xerces-c/html/secadv/CVE-2017-12627.txt
-- Up-to-date: /work/build/external/linux-x86_64/share/doc/xerces-c/html
-- Installing: /work/build/external/linux-x86_64/lib/libxerces-c-3.2.a
-- Installing: /work/build/external/linux-x86_64/lib/cmake/XercesC/XercesCConfigInternal.cmake
-- Installing: /work/build/external/linux-x86_64/lib/cmake/XercesC/XercesCConfigInternal-noconfig.cmake
-- Installing: /work/build/external/linux-x86_64/lib/cmake/XercesC/XercesCConfig.cmake
-- Installing: /work/build/external/linux-x86_64/lib/cmake/XercesC/XercesCConfigVersion.cmake
-- Installing: /work/build/external/linux-x86_64/include/xercesc/util/ArrayIndexOutOfBoundsException.hpp
-- Installing: /work/build/external/linux-x86_64/include/xercesc/util/Base64.hpp
-- Installing: /work/build/external/linux-x86_64/include/xercesc/util/BaseRefVectorOf.hpp
-- Installing: /work/build/external/linux-x86_64/include/xercesc/util/BaseRefVectorOf.c
-- Installing: /work/build/external/linux-x86_64/include/xercesc/util/BinFileInputStream.hpp
-- Installing: /work/build/external/linux-x86_64/include/xercesc/util/BinInputStream.hpp
-- Installing: /work/build/external/linux-x86_64/include/xercesc/util/BinMemInputStream.hpp
-- Installing: /work/build/external/linux-x86_64/include/xercesc/util/BitOps.hpp
-- Installing: /work/build/external/linux-x86_64/include/xercesc/util/BitSet.hpp
-- Installing: /work/build/external/linux-x86_64/include/xercesc/util/CountedPointer.hpp
-- Installing: /work/build/external/linux-x86_64/include/xercesc/util/CountedPointer.c
-- Installing: /work/build/external/linux-x86_64/include/xercesc/util/DefaultPanicHandler.hpp
-- Installing: /work/build/external/linux-x86_64/include/xercesc/util/EmptyStackException.hpp
-- Installing: /work/build/external/linux-x86_64/include/xercesc/util/EncodingValidator.hpp
-- Installing: /work/build/external/linux-x86_64/include/xercesc/util/FlagJanitor.hpp
-- Installing: /work/build/external/linux-x86_64/include/xercesc/util/FlagJanitor.c
-- Installing: /work/build/external/linux-x86_64/include/xercesc/util/Hashers.hpp
-- Installing: /work/build/external/linux-x86_64/include/xercesc/util/Hash2KeysSetOf.hpp
-- Installing: /work/build/external/linux-x86_64/include/xercesc/util/Hash2KeysSetOf.c
-- Installing: /work/build/external/linux-x86_64/include/xercesc/util/HexBin.hpp
-- Installing: /work/build/external/linux-x86_64/include/xercesc/util/IllegalArgumentException.hpp
-- Installing: /work/build/external/linux-x86_64/include/xercesc/util/InvalidCastException.hpp
-- Installing: /work/build/external/linux-x86_64/include/xercesc/util/IOException.hpp
-- Installing: /work/build/external/linux-x86_64/include/xercesc/util/Janitor.hpp
-- Installing: /work/build/external/linux-x86_64/include/xercesc/util/Janitor.c
-- Installing: /work/build/external/linux-x86_64/include/xercesc/util/KeyRefPair.hpp
-- Installing: /work/build/external/linux-x86_64/include/xercesc/util/KeyRefPair.c
-- Installing: /work/build/external/linux-x86_64/include/xercesc/util/KeyValuePair.hpp
-- Installing: /work/build/external/linux-x86_64/include/xercesc/util/KeyValuePair.c
-- Installing: /work/build/external/linux-x86_64/include/xercesc/util/KVStringPair.hpp
-- Installing: /work/build/external/linux-x86_64/include/xercesc/util/Mutexes.hpp
-- Installing: /work/build/external/linux-x86_64/include/xercesc/util/LogicalPath.c
-- Installing: /work/build/external/linux-x86_64/include/xercesc/util/NameIdPool.hpp
-- Installing: /work/build/external/linux-x86_64/include/xercesc/util/NameIdPool.c
-- Installing: /work/build/external/linux-x86_64/include/xercesc/util/NoSuchElementException.hpp
-- Installing: /work/build/external/linux-x86_64/include/xercesc/util/NullPointerException.hpp
-- Installing: /work/build/external/linux-x86_64/include/xercesc/util/NumberFormatException.hpp
-- Installing: /work/build/external/linux-x86_64/include/xercesc/util/OutOfMemoryException.hpp
-- Installing: /work/build/external/linux-x86_64/include/xercesc/util/PanicHandler.hpp
-- Installing: /work/build/external/linux-x86_64/include/xercesc/util/ParseException.hpp
-- Installing: /work/build/external/linux-x86_64/include/xercesc/util/PlatformUtils.hpp
-- Installing: /work/build/external/linux-x86_64/include/xercesc/util/PSVIUni.hpp
-- Installing: /work/build/external/linux-x86_64/include/xercesc/util/QName.hpp
-- Installing: /work/build/external/linux-x86_64/include/xercesc/util/RefArrayOf.hpp
-- Installing: /work/build/external/linux-x86_64/include/xercesc/util/RefArrayOf.c
-- Installing: /work/build/external/linux-x86_64/include/xercesc/util/RefArrayVectorOf.hpp
-- Installing: /work/build/external/linux-x86_64/include/xercesc/util/RefArrayVectorOf.c
-- Installing: /work/build/external/linux-x86_64/include/xercesc/util/RefHash2KeysTableOf.hpp
-- Installing: /work/build/external/linux-x86_64/include/xercesc/util/RefHash2KeysTableOf.c
-- Installing: /work/build/external/linux-x86_64/include/xercesc/util/RefHash3KeysIdPool.hpp
-- Installing: /work/build/external/linux-x86_64/include/xercesc/util/RefHash3KeysIdPool.c
-- Installing: /work/build/external/linux-x86_64/include/xercesc/util/RefHashTableOf.hpp
-- Installing: /work/build/external/linux-x86_64/include/xercesc/util/RefHashTableOf.c
-- Installing: /work/build/external/linux-x86_64/include/xercesc/util/RefStackOf.hpp
-- Installing: /work/build/external/linux-x86_64/include/xercesc/util/RefStackOf.c
-- Installing: /work/build/external/linux-x86_64/include/xercesc/util/RefVectorOf.hpp
-- Installing: /work/build/external/linux-x86_64/include/xercesc/util/RefVectorOf.c
-- Installing: /work/build/external/linux-x86_64/include/xercesc/util/regx/ASCIIRangeFactory.hpp
-- Installing: /work/build/external/linux-x86_64/include/xercesc/util/regx/BlockRangeFactory.hpp
-- Installing: /work/build/external/linux-x86_64/include/xercesc/util/regx/BMPattern.hpp
-- Installing: /work/build/external/linux-x86_64/include/xercesc/util/regx/CharToken.hpp
-- Installing: /work/build/external/linux-x86_64/include/xercesc/util/regx/ClosureToken.hpp
-- Installing: /work/build/external/linux-x86_64/include/xercesc/util/regx/ConcatToken.hpp
-- Installing: /work/build/external/linux-x86_64/include/xercesc/util/regx/Match.hpp
-- Installing: /work/build/external/linux-x86_64/include/xercesc/util/regx/Op.hpp
-- Installing: /work/build/external/linux-x86_64/include/xercesc/util/regx/OpFactory.hpp
-- Installing: /work/build/external/linux-x86_64/include/xercesc/util/regx/ParenToken.hpp
-- Installing: /work/build/external/linux-x86_64/include/xercesc/util/regx/ParserForXMLSchema.hpp
-- Installing: /work/build/external/linux-x86_64/include/xercesc/util/regx/RangeFactory.hpp
-- Installing: /work/build/external/linux-x86_64/include/xercesc/util/regx/RangeToken.hpp
-- Installing: /work/build/external/linux-x86_64/include/xercesc/util/regx/RangeTokenMap.hpp
-- Installing: /work/build/external/linux-x86_64/include/xercesc/util/regx/RegularExpression.hpp
-- Installing: /work/build/external/linux-x86_64/include/xercesc/util/regx/RegxDefs.hpp
-- Installing: /work/build/external/linux-x86_64/include/xercesc/util/regx/RegxParser.hpp
-- Installing: /work/build/external/linux-x86_64/include/xercesc/util/regx/RegxUtil.hpp
-- Installing: /work/build/external/linux-x86_64/include/xercesc/util/regx/StringToken.hpp
-- Installing: /work/build/external/linux-x86_64/include/xercesc/util/regx/Token.hpp
-- Installing: /work/build/external/linux-x86_64/include/xercesc/util/regx/TokenFactory.hpp
-- Installing: /work/build/external/linux-x86_64/include/xercesc/util/regx/TokenInc.hpp
-- Installing: /work/build/external/linux-x86_64/include/xercesc/util/regx/UniCharTable.hpp
-- Installing: /work/build/external/linux-x86_64/include/xercesc/util/regx/UnicodeRangeFactory.hpp
-- Installing: /work/build/external/linux-x86_64/include/xercesc/util/regx/UnionToken.hpp
-- Installing: /work/build/external/linux-x86_64/include/xercesc/util/regx/XMLRangeFactory.hpp
-- Installing: /work/build/external/linux-x86_64/include/xercesc/util/regx/XMLUniCharacter.hpp
-- Installing: /work/build/external/linux-x86_64/include/xercesc/util/RuntimeException.hpp
-- Installing: /work/build/external/linux-x86_64/include/xercesc/util/SchemaDateTimeException.hpp
-- Installing: /work/build/external/linux-x86_64/include/xercesc/util/SecurityManager.hpp
-- Installing: /work/build/external/linux-x86_64/include/xercesc/util/StringPool.hpp
-- Installing: /work/build/external/linux-x86_64/include/xercesc/util/SynchronizedStringPool.hpp
-- Installing: /work/build/external/linux-x86_64/include/xercesc/util/TranscodingException.hpp
-- Installing: /work/build/external/linux-x86_64/include/xercesc/util/TransENameMap.hpp
-- Installing: /work/build/external/linux-x86_64/include/xercesc/util/TransENameMap.c
-- Installing: /work/build/external/linux-x86_64/include/xercesc/util/TransService.hpp
-- Installing: /work/build/external/linux-x86_64/include/xercesc/util/UnexpectedEOFException.hpp
-- Installing: /work/build/external/linux-x86_64/include/xercesc/util/UnsupportedEncodingException.hpp
-- Installing: /work/build/external/linux-x86_64/include/xercesc/util/UTFDataFormatException.hpp
-- Installing: /work/build/external/linux-x86_64/include/xercesc/util/ValueArrayOf.hpp
-- Installing: /work/build/external/linux-x86_64/include/xercesc/util/ValueArrayOf.c
-- Installing: /work/build/external/linux-x86_64/include/xercesc/util/ValueHashTableOf.hpp
-- Installing: /work/build/external/linux-x86_64/include/xercesc/util/ValueHashTableOf.c
-- Installing: /work/build/external/linux-x86_64/include/xercesc/util/ValueStackOf.hpp
-- Installing: /work/build/external/linux-x86_64/include/xercesc/util/ValueStackOf.c
-- Installing: /work/build/external/linux-x86_64/include/xercesc/util/ValueVectorOf.hpp
-- Installing: /work/build/external/linux-x86_64/include/xercesc/util/ValueVectorOf.c
-- Installing: /work/build/external/linux-x86_64/include/xercesc/util/XercesDefs.hpp
-- Installing: /work/build/external/linux-x86_64/include/xercesc/util/XMemory.hpp
-- Installing: /work/build/external/linux-x86_64/include/xercesc/util/XML256TableTranscoder.hpp
-- Installing: /work/build/external/linux-x86_64/include/xercesc/util/XML88591Transcoder.hpp
-- Installing: /work/build/external/linux-x86_64/include/xercesc/util/XMLAbstractDoubleFloat.hpp
-- Installing: /work/build/external/linux-x86_64/include/xercesc/util/XMLASCIITranscoder.hpp
-- Installing: /work/build/external/linux-x86_64/include/xercesc/util/XMLBigDecimal.hpp
-- Installing: /work/build/external/linux-x86_64/include/xercesc/util/XMLBigInteger.hpp
-- Installing: /work/build/external/linux-x86_64/include/xercesc/util/XMLChar.hpp
-- Installing: /work/build/external/linux-x86_64/include/xercesc/util/XMLChTranscoder.hpp
-- Installing: /work/build/external/linux-x86_64/include/xercesc/util/XMLDateTime.hpp
-- Installing: /work/build/external/linux-x86_64/include/xercesc/util/XMLDOMMsg.hpp
-- Installing: /work/build/external/linux-x86_64/include/xercesc/util/XMLDouble.hpp
-- Installing: /work/build/external/linux-x86_64/include/xercesc/util/XMLEBCDICTranscoder.hpp
-- Installing: /work/build/external/linux-x86_64/include/xercesc/util/XMLEntityResolver.hpp
-- Installing: /work/build/external/linux-x86_64/include/xercesc/util/XMLEnumerator.hpp
-- Installing: /work/build/external/linux-x86_64/include/xercesc/util/XMLException.hpp
-- Installing: /work/build/external/linux-x86_64/include/xercesc/util/XMLExceptMsgs.hpp
-- Installing: /work/build/external/linux-x86_64/include/xercesc/util/XMLFileMgr.hpp
-- Installing: /work/build/external/linux-x86_64/include/xercesc/util/XMLFloat.hpp
-- Installing: /work/build/external/linux-x86_64/include/xercesc/util/XMLIBM1047Transcoder.hpp
-- Installing: /work/build/external/linux-x86_64/include/xercesc/util/XMLIBM1140Transcoder.hpp
-- Installing: /work/build/external/linux-x86_64/include/xercesc/util/XMLInitializer.hpp
-- Installing: /work/build/external/linux-x86_64/include/xercesc/util/XMLInteger.hpp
-- Installing: /work/build/external/linux-x86_64/include/xercesc/util/XMLMutexMgr.hpp
-- Installing: /work/build/external/linux-x86_64/include/xercesc/util/XMLMsgLoader.hpp
-- Installing: /work/build/external/linux-x86_64/include/xercesc/util/XMLNetAccessor.hpp
-- Installing: /work/build/external/linux-x86_64/include/xercesc/util/XMLNumber.hpp
-- Installing: /work/build/external/linux-x86_64/include/xercesc/util/XMLResourceIdentifier.hpp
-- Installing: /work/build/external/linux-x86_64/include/xercesc/util/XMLString.hpp
-- Installing: /work/build/external/linux-x86_64/include/xercesc/util/XMLStringTokenizer.hpp
-- Installing: /work/build/external/linux-x86_64/include/xercesc/util/XMLUCS4Transcoder.hpp
-- Installing: /work/build/external/linux-x86_64/include/xercesc/util/XMLUni.hpp
-- Installing: /work/build/external/linux-x86_64/include/xercesc/util/XMLUniDefs.hpp
-- Installing: /work/build/external/linux-x86_64/include/xercesc/util/XMLUri.hpp
-- Installing: /work/build/external/linux-x86_64/include/xercesc/util/XMLURL.hpp
-- Installing: /work/build/external/linux-x86_64/include/xercesc/util/XMLUTF16Transcoder.hpp
-- Installing: /work/build/external/linux-x86_64/include/xercesc/util/XMLUTF8Transcoder.hpp
-- Installing: /work/build/external/linux-x86_64/include/xercesc/util/XMLWin1252Transcoder.hpp
-- Installing: /work/build/external/linux-x86_64/include/xercesc/dom/DOM.hpp
-- Installing: /work/build/external/linux-x86_64/include/xercesc/dom/DOMAttr.hpp
-- Installing: /work/build/external/linux-x86_64/include/xercesc/dom/DOMCDATASection.hpp
-- Installing: /work/build/external/linux-x86_64/include/xercesc/dom/DOMCharacterData.hpp
-- Installing: /work/build/external/linux-x86_64/include/xercesc/dom/DOMComment.hpp
-- Installing: /work/build/external/linux-x86_64/include/xercesc/dom/DOMConfiguration.hpp
-- Installing: /work/build/external/linux-x86_64/include/xercesc/dom/DOMDocument.hpp
-- Installing: /work/build/external/linux-x86_64/include/xercesc/dom/DOMDocumentFragment.hpp
-- Installing: /work/build/external/linux-x86_64/include/xercesc/dom/DOMDocumentRange.hpp
-- Installing: /work/build/external/linux-x86_64/include/xercesc/dom/DOMDocumentTraversal.hpp
-- Installing: /work/build/external/linux-x86_64/include/xercesc/dom/DOMDocumentType.hpp
-- Installing: /work/build/external/linux-x86_64/include/xercesc/dom/DOMElement.hpp
-- Installing: /work/build/external/linux-x86_64/include/xercesc/dom/DOMEntity.hpp
-- Installing: /work/build/external/linux-x86_64/include/xercesc/dom/DOMEntityReference.hpp
-- Installing: /work/build/external/linux-x86_64/include/xercesc/dom/DOMError.hpp
-- Installing: /work/build/external/linux-x86_64/include/xercesc/dom/DOMErrorHandler.hpp
-- Installing: /work/build/external/linux-x86_64/include/xercesc/dom/DOMException.hpp
-- Installing: /work/build/external/linux-x86_64/include/xercesc/dom/DOMImplementation.hpp
-- Installing: /work/build/external/linux-x86_64/include/xercesc/dom/DOMImplementationList.hpp
-- Installing: /work/build/external/linux-x86_64/include/xercesc/dom/DOMImplementationLS.hpp
-- Installing: /work/build/external/linux-x86_64/include/xercesc/dom/DOMImplementationRegistry.hpp
-- Installing: /work/build/external/linux-x86_64/include/xercesc/dom/DOMImplementationSource.hpp
-- Installing: /work/build/external/linux-x86_64/include/xercesc/dom/DOMLocator.hpp
-- Installing: /work/build/external/linux-x86_64/include/xercesc/dom/DOMLSException.hpp
-- Installing: /work/build/external/linux-x86_64/include/xercesc/dom/DOMLSInput.hpp
-- Installing: /work/build/external/linux-x86_64/include/xercesc/dom/DOMLSOutput.hpp
-- Installing: /work/build/external/linux-x86_64/include/xercesc/dom/DOMLSParser.hpp
-- Installing: /work/build/external/linux-x86_64/include/xercesc/dom/DOMLSParserFilter.hpp
-- Installing: /work/build/external/linux-x86_64/include/xercesc/dom/DOMLSResourceResolver.hpp
-- Installing: /work/build/external/linux-x86_64/include/xercesc/dom/DOMLSSerializer.hpp
-- Installing: /work/build/external/linux-x86_64/include/xercesc/dom/DOMLSSerializerFilter.hpp
-- Installing: /work/build/external/linux-x86_64/include/xercesc/dom/DOMMemoryManager.hpp
-- Installing: /work/build/external/linux-x86_64/include/xercesc/dom/DOMNamedNodeMap.hpp
-- Installing: /work/build/external/linux-x86_64/include/xercesc/dom/DOMNode.hpp
-- Installing: /work/build/external/linux-x86_64/include/xercesc/dom/DOMNodeFilter.hpp
-- Installing: /work/build/external/linux-x86_64/include/xercesc/dom/DOMNodeIterator.hpp
-- Installing: /work/build/external/linux-x86_64/include/xercesc/dom/DOMNodeList.hpp
-- Installing: /work/build/external/linux-x86_64/include/xercesc/dom/DOMNotation.hpp
-- Installing: /work/build/external/linux-x86_64/include/xercesc/dom/DOMProcessingInstruction.hpp
-- Installing: /work/build/external/linux-x86_64/include/xercesc/dom/DOMPSVITypeInfo.hpp
-- Installing: /work/build/external/linux-x86_64/include/xercesc/dom/DOMRange.hpp
-- Installing: /work/build/external/linux-x86_64/include/xercesc/dom/DOMRangeException.hpp
-- Installing: /work/build/external/linux-x86_64/include/xercesc/dom/DOMStringList.hpp
-- Installing: /work/build/external/linux-x86_64/include/xercesc/dom/DOMText.hpp
-- Installing: /work/build/external/linux-x86_64/include/xercesc/dom/DOMTreeWalker.hpp
-- Installing: /work/build/external/linux-x86_64/include/xercesc/dom/DOMTypeInfo.hpp
-- Installing: /work/build/external/linux-x86_64/include/xercesc/dom/DOMUserDataHandler.hpp
-- Installing: /work/build/external/linux-x86_64/include/xercesc/dom/DOMXPathEvaluator.hpp
-- Installing: /work/build/external/linux-x86_64/include/xercesc/dom/DOMXPathException.hpp
-- Installing: /work/build/external/linux-x86_64/include/xercesc/dom/DOMXPathExpression.hpp
-- Installing: /work/build/external/linux-x86_64/include/xercesc/dom/DOMXPathNamespace.hpp
-- Installing: /work/build/external/linux-x86_64/include/xercesc/dom/DOMXPathNSResolver.hpp
-- Installing: /work/build/external/linux-x86_64/include/xercesc/dom/DOMXPathResult.hpp
-- Installing: /work/build/external/linux-x86_64/include/xercesc/dom/StDOMNode.hpp
-- Installing: /work/build/external/linux-x86_64/include/xercesc/dom/impl/DOMAttrImpl.hpp
-- Installing: /work/build/external/linux-x86_64/include/xercesc/dom/impl/DOMAttrMapImpl.hpp
-- Installing: /work/build/external/linux-x86_64/include/xercesc/dom/impl/DOMAttrNSImpl.hpp
-- Installing: /work/build/external/linux-x86_64/include/xercesc/dom/impl/DOMCasts.hpp
-- Installing: /work/build/external/linux-x86_64/include/xercesc/dom/impl/DOMCDATASectionImpl.hpp
-- Installing: /work/build/external/linux-x86_64/include/xercesc/dom/impl/DOMCharacterDataImpl.hpp
-- Installing: /work/build/external/linux-x86_64/include/xercesc/dom/impl/DOMChildNode.hpp
-- Installing: /work/build/external/linux-x86_64/include/xercesc/dom/impl/DOMCommentImpl.hpp
-- Installing: /work/build/external/linux-x86_64/include/xercesc/dom/impl/DOMConfigurationImpl.hpp
-- Installing: /work/build/external/linux-x86_64/include/xercesc/dom/impl/DOMDeepNodeListImpl.hpp
-- Installing: /work/build/external/linux-x86_64/include/xercesc/dom/impl/DOMDeepNodeListPool.hpp
-- Installing: /work/build/external/linux-x86_64/include/xercesc/dom/impl/DOMDeepNodeListPool.c
-- Installing: /work/build/external/linux-x86_64/include/xercesc/dom/impl/DOMDocumentFragmentImpl.hpp
-- Installing: /work/build/external/linux-x86_64/include/xercesc/dom/impl/DOMDocumentImpl.hpp
-- Installing: /work/build/external/linux-x86_64/include/xercesc/dom/impl/DOMDocumentTypeImpl.hpp
-- Installing: /work/build/external/linux-x86_64/include/xercesc/dom/impl/DOMElementImpl.hpp
-- Installing: /work/build/external/linux-x86_64/include/xercesc/dom/impl/DOMElementNSImpl.hpp
-- Installing: /work/build/external/linux-x86_64/include/xercesc/dom/impl/DOMEntityImpl.hpp
-- Installing: /work/build/external/linux-x86_64/include/xercesc/dom/impl/DOMEntityReferenceImpl.hpp
-- Installing: /work/build/external/linux-x86_64/include/xercesc/dom/impl/DOMErrorImpl.hpp
-- Installing: /work/build/external/linux-x86_64/include/xercesc/dom/impl/DOMImplementationImpl.hpp
-- Installing: /work/build/external/linux-x86_64/include/xercesc/dom/impl/DOMImplementationListImpl.hpp
-- Installing: /work/build/external/linux-x86_64/include/xercesc/dom/impl/DOMLocatorImpl.hpp
-- Installing: /work/build/external/linux-x86_64/include/xercesc/dom/impl/DOMNamedNodeMapImpl.hpp
-- Installing: /work/build/external/linux-x86_64/include/xercesc/dom/impl/DOMNodeBase.hpp
-- Installing: /work/build/external/linux-x86_64/include/xercesc/dom/impl/DOMNodeIDMap.hpp
-- Installing: /work/build/external/linux-x86_64/include/xercesc/dom/impl/DOMNodeImpl.hpp
-- Installing: /work/build/external/linux-x86_64/include/xercesc/dom/impl/DOMNodeIteratorImpl.hpp
-- Installing: /work/build/external/linux-x86_64/include/xercesc/dom/impl/DOMNodeListImpl.hpp
-- Installing: /work/build/external/linux-x86_64/include/xercesc/dom/impl/DOMNodeVector.hpp
-- Installing: /work/build/external/linux-x86_64/include/xercesc/dom/impl/DOMNormalizer.hpp
-- Installing: /work/build/external/linux-x86_64/include/xercesc/dom/impl/DOMNotationImpl.hpp
-- Installing: /work/build/external/linux-x86_64/include/xercesc/dom/impl/DOMParentNode.hpp
-- Installing: /work/build/external/linux-x86_64/include/xercesc/dom/impl/DOMProcessingInstructionImpl.hpp
-- Installing: /work/build/external/linux-x86_64/include/xercesc/dom/impl/DOMRangeImpl.hpp
-- Installing: /work/build/external/linux-x86_64/include/xercesc/dom/impl/DOMStringListImpl.hpp
-- Installing: /work/build/external/linux-x86_64/include/xercesc/dom/impl/DOMStringPool.hpp
-- Installing: /work/build/external/linux-x86_64/include/xercesc/dom/impl/DOMTextImpl.hpp
-- Installing: /work/build/external/linux-x86_64/include/xercesc/dom/impl/DOMTreeWalkerImpl.hpp
-- Installing: /work/build/external/linux-x86_64/include/xercesc/dom/impl/DOMTypeInfoImpl.hpp
-- Installing: /work/build/external/linux-x86_64/include/xercesc/dom/impl/DOMLSSerializerImpl.hpp
-- Installing: /work/build/external/linux-x86_64/include/xercesc/dom/impl/DOMLSInputImpl.hpp
-- Installing: /work/build/external/linux-x86_64/include/xercesc/dom/impl/DOMLSOutputImpl.hpp
-- Installing: /work/build/external/linux-x86_64/include/xercesc/dom/impl/DOMXPathExpressionImpl.hpp
-- Installing: /work/build/external/linux-x86_64/include/xercesc/dom/impl/DOMXPathNSResolverImpl.hpp
-- Installing: /work/build/external/linux-x86_64/include/xercesc/dom/impl/DOMXPathResultImpl.hpp
-- Installing: /work/build/external/linux-x86_64/include/xercesc/dom/impl/XSDElementNSImpl.hpp
-- Installing: /work/build/external/linux-x86_64/include/xercesc/framework/BinOutputStream.hpp
-- Installing: /work/build/external/linux-x86_64/include/xercesc/framework/LocalFileFormatTarget.hpp
-- Installing: /work/build/external/linux-x86_64/include/xercesc/framework/LocalFileInputSource.hpp
-- Installing: /work/build/external/linux-x86_64/include/xercesc/framework/MemBufFormatTarget.hpp
-- Installing: /work/build/external/linux-x86_64/include/xercesc/framework/MemBufInputSource.hpp
-- Installing: /work/build/external/linux-x86_64/include/xercesc/framework/MemoryManager.hpp
-- Installing: /work/build/external/linux-x86_64/include/xercesc/framework/psvi/PSVIAttribute.hpp
-- Installing: /work/build/external/linux-x86_64/include/xercesc/framework/psvi/PSVIAttributeList.hpp
-- Installing: /work/build/external/linux-x86_64/include/xercesc/framework/psvi/PSVIElement.hpp
-- Installing: /work/build/external/linux-x86_64/include/xercesc/framework/psvi/PSVIHandler.hpp
-- Installing: /work/build/external/linux-x86_64/include/xercesc/framework/psvi/PSVIItem.hpp
-- Installing: /work/build/external/linux-x86_64/include/xercesc/framework/psvi/XSAnnotation.hpp
-- Installing: /work/build/external/linux-x86_64/include/xercesc/framework/psvi/XSAttributeDeclaration.hpp
-- Installing: /work/build/external/linux-x86_64/include/xercesc/framework/psvi/XSAttributeGroupDefinition.hpp
-- Installing: /work/build/external/linux-x86_64/include/xercesc/framework/psvi/XSAttributeUse.hpp
-- Installing: /work/build/external/linux-x86_64/include/xercesc/framework/psvi/XSComplexTypeDefinition.hpp
-- Installing: /work/build/external/linux-x86_64/include/xercesc/framework/psvi/XSConstants.hpp
-- Installing: /work/build/external/linux-x86_64/include/xercesc/framework/psvi/XSElementDeclaration.hpp
-- Installing: /work/build/external/linux-x86_64/include/xercesc/framework/psvi/XSFacet.hpp
-- Installing: /work/build/external/linux-x86_64/include/xercesc/framework/psvi/XSIDCDefinition.hpp
-- Installing: /work/build/external/linux-x86_64/include/xercesc/framework/psvi/XSModel.hpp
-- Installing: /work/build/external/linux-x86_64/include/xercesc/framework/psvi/XSModelGroup.hpp
-- Installing: /work/build/external/linux-x86_64/include/xercesc/framework/psvi/XSModelGroupDefinition.hpp
-- Installing: /work/build/external/linux-x86_64/include/xercesc/framework/psvi/XSMultiValueFacet.hpp
-- Installing: /work/build/external/linux-x86_64/include/xercesc/framework/psvi/XSNamedMap.hpp
-- Installing: /work/build/external/linux-x86_64/include/xercesc/framework/psvi/XSNamedMap.c
-- Installing: /work/build/external/linux-x86_64/include/xercesc/framework/psvi/XSNamespaceItem.hpp
-- Installing: /work/build/external/linux-x86_64/include/xercesc/framework/psvi/XSNotationDeclaration.hpp
-- Installing: /work/build/external/linux-x86_64/include/xercesc/framework/psvi/XSObject.hpp
-- Installing: /work/build/external/linux-x86_64/include/xercesc/framework/psvi/XSParticle.hpp
-- Installing: /work/build/external/linux-x86_64/include/xercesc/framework/psvi/XSSimpleTypeDefinition.hpp
-- Installing: /work/build/external/linux-x86_64/include/xercesc/framework/psvi/XSTypeDefinition.hpp
-- Installing: /work/build/external/linux-x86_64/include/xercesc/framework/psvi/XSValue.hpp
-- Installing: /work/build/external/linux-x86_64/include/xercesc/framework/psvi/XSWildcard.hpp
-- Installing: /work/build/external/linux-x86_64/include/xercesc/framework/StdInInputSource.hpp
-- Installing: /work/build/external/linux-x86_64/include/xercesc/framework/StdOutFormatTarget.hpp
-- Installing: /work/build/external/linux-x86_64/include/xercesc/framework/URLInputSource.hpp
-- Installing: /work/build/external/linux-x86_64/include/xercesc/framework/ValidationContext.hpp
-- Installing: /work/build/external/linux-x86_64/include/xercesc/framework/Wrapper4DOMLSInput.hpp
-- Installing: /work/build/external/linux-x86_64/include/xercesc/framework/Wrapper4InputSource.hpp
-- Installing: /work/build/external/linux-x86_64/include/xercesc/framework/XMLAttDef.hpp
-- Installing: /work/build/external/linux-x86_64/include/xercesc/framework/XMLAttDefList.hpp
-- Installing: /work/build/external/linux-x86_64/include/xercesc/framework/XMLAttr.hpp
-- Installing: /work/build/external/linux-x86_64/include/xercesc/framework/XMLBuffer.hpp
-- Installing: /work/build/external/linux-x86_64/include/xercesc/framework/XMLBufferMgr.hpp
-- Installing: /work/build/external/linux-x86_64/include/xercesc/framework/XMLContentModel.hpp
-- Installing: /work/build/external/linux-x86_64/include/xercesc/framework/XMLDocumentHandler.hpp
-- Installing: /work/build/external/linux-x86_64/include/xercesc/framework/XMLDTDDescription.hpp
-- Installing: /work/build/external/linux-x86_64/include/xercesc/framework/XMLElementDecl.hpp
-- Installing: /work/build/external/linux-x86_64/include/xercesc/framework/XMLEntityDecl.hpp
-- Installing: /work/build/external/linux-x86_64/include/xercesc/framework/XMLEntityHandler.hpp
-- Installing: /work/build/external/linux-x86_64/include/xercesc/framework/XMLErrorCodes.hpp
-- Installing: /work/build/external/linux-x86_64/include/xercesc/framework/XMLErrorReporter.hpp
-- Installing: /work/build/external/linux-x86_64/include/xercesc/framework/XMLFormatter.hpp
-- Installing: /work/build/external/linux-x86_64/include/xercesc/framework/XMLGrammarDescription.hpp
-- Installing: /work/build/external/linux-x86_64/include/xercesc/framework/XMLGrammarPool.hpp
-- Installing: /work/build/external/linux-x86_64/include/xercesc/framework/XMLGrammarPoolImpl.hpp
-- Installing: /work/build/external/linux-x86_64/include/xercesc/framework/XMLNotationDecl.hpp
-- Installing: /work/build/external/linux-x86_64/include/xercesc/framework/XMLPScanToken.hpp
-- Installing: /work/build/external/linux-x86_64/include/xercesc/framework/XMLRecognizer.hpp
-- Installing: /work/build/external/linux-x86_64/include/xercesc/framework/XMLRefInfo.hpp
-- Installing: /work/build/external/linux-x86_64/include/xercesc/framework/XMLSchemaDescription.hpp
-- Installing: /work/build/external/linux-x86_64/include/xercesc/framework/XMLValidator.hpp
-- Installing: /work/build/external/linux-x86_64/include/xercesc/framework/XMLValidityCodes.hpp
-- Installing: /work/build/external/linux-x86_64/include/xercesc/internal/BinFileOutputStream.hpp
-- Installing: /work/build/external/linux-x86_64/include/xercesc/internal/BinMemOutputStream.hpp
-- Installing: /work/build/external/linux-x86_64/include/xercesc/internal/CharTypeTables.hpp
-- Installing: /work/build/external/linux-x86_64/include/xercesc/internal/DGXMLScanner.hpp
-- Installing: /work/build/external/linux-x86_64/include/xercesc/internal/ElemStack.hpp
-- Installing: /work/build/external/linux-x86_64/include/xercesc/internal/EndOfEntityException.hpp
-- Installing: /work/build/external/linux-x86_64/include/xercesc/internal/IANAEncodings.hpp
-- Installing: /work/build/external/linux-x86_64/include/xercesc/internal/IGXMLScanner.hpp
-- Installing: /work/build/external/linux-x86_64/include/xercesc/internal/MemoryManagerImpl.hpp
-- Installing: /work/build/external/linux-x86_64/include/xercesc/internal/ReaderMgr.hpp
-- Installing: /work/build/external/linux-x86_64/include/xercesc/internal/SGXMLScanner.hpp
-- Installing: /work/build/external/linux-x86_64/include/xercesc/internal/ValidationContextImpl.hpp
-- Installing: /work/build/external/linux-x86_64/include/xercesc/internal/VecAttributesImpl.hpp
-- Installing: /work/build/external/linux-x86_64/include/xercesc/internal/VecAttrListImpl.hpp
-- Installing: /work/build/external/linux-x86_64/include/xercesc/internal/WFXMLScanner.hpp
-- Installing: /work/build/external/linux-x86_64/include/xercesc/internal/XMLInternalErrorHandler.hpp
-- Installing: /work/build/external/linux-x86_64/include/xercesc/internal/XMLReader.hpp
-- Installing: /work/build/external/linux-x86_64/include/xercesc/internal/XMLScanner.hpp
-- Installing: /work/build/external/linux-x86_64/include/xercesc/internal/XMLScannerResolver.hpp
-- Installing: /work/build/external/linux-x86_64/include/xercesc/internal/XProtoType.hpp
-- Installing: /work/build/external/linux-x86_64/include/xercesc/internal/XSAXMLScanner.hpp
-- Installing: /work/build/external/linux-x86_64/include/xercesc/internal/XSerializable.hpp
-- Installing: /work/build/external/linux-x86_64/include/xercesc/internal/XSerializationException.hpp
-- Installing: /work/build/external/linux-x86_64/include/xercesc/internal/XSerializeEngine.hpp
-- Installing: /work/build/external/linux-x86_64/include/xercesc/internal/XSObjectFactory.hpp
-- Installing: /work/build/external/linux-x86_64/include/xercesc/internal/XTemplateSerializer.hpp
-- Installing: /work/build/external/linux-x86_64/include/xercesc/parsers/AbstractDOMParser.hpp
-- Installing: /work/build/external/linux-x86_64/include/xercesc/parsers/DOMLSParserImpl.hpp
-- Installing: /work/build/external/linux-x86_64/include/xercesc/parsers/SAX2XMLFilterImpl.hpp
-- Installing: /work/build/external/linux-x86_64/include/xercesc/parsers/SAX2XMLReaderImpl.hpp
-- Installing: /work/build/external/linux-x86_64/include/xercesc/parsers/SAXParser.hpp
-- Installing: /work/build/external/linux-x86_64/include/xercesc/parsers/XercesDOMParser.hpp
-- Installing: /work/build/external/linux-x86_64/include/xercesc/sax/AttributeList.hpp
-- Installing: /work/build/external/linux-x86_64/include/xercesc/sax/DocumentHandler.hpp
-- Installing: /work/build/external/linux-x86_64/include/xercesc/sax/DTDHandler.hpp
-- Installing: /work/build/external/linux-x86_64/include/xercesc/sax/EntityResolver.hpp
-- Installing: /work/build/external/linux-x86_64/include/xercesc/sax/ErrorHandler.hpp
-- Installing: /work/build/external/linux-x86_64/include/xercesc/sax/HandlerBase.hpp
-- Installing: /work/build/external/linux-x86_64/include/xercesc/sax/InputSource.hpp
-- Installing: /work/build/external/linux-x86_64/include/xercesc/sax/Locator.hpp
-- Installing: /work/build/external/linux-x86_64/include/xercesc/sax/Parser.hpp
-- Installing: /work/build/external/linux-x86_64/include/xercesc/sax/SAXException.hpp
-- Installing: /work/build/external/linux-x86_64/include/xercesc/sax/SAXParseException.hpp
-- Installing: /work/build/external/linux-x86_64/include/xercesc/sax2/Attributes.hpp
-- Installing: /work/build/external/linux-x86_64/include/xercesc/sax2/ContentHandler.hpp
-- Installing: /work/build/external/linux-x86_64/include/xercesc/sax2/DeclHandler.hpp
-- Installing: /work/build/external/linux-x86_64/include/xercesc/sax2/DefaultHandler.hpp
-- Installing: /work/build/external/linux-x86_64/include/xercesc/sax2/LexicalHandler.hpp
-- Installing: /work/build/external/linux-x86_64/include/xercesc/sax2/SAX2XMLFilter.hpp
-- Installing: /work/build/external/linux-x86_64/include/xercesc/sax2/SAX2XMLReader.hpp
-- Installing: /work/build/external/linux-x86_64/include/xercesc/sax2/XMLReaderFactory.hpp
-- Installing: /work/build/external/linux-x86_64/include/xercesc/validators/common/AllContentModel.hpp
-- Installing: /work/build/external/linux-x86_64/include/xercesc/validators/common/CMAny.hpp
-- Installing: /work/build/external/linux-x86_64/include/xercesc/validators/common/CMBinaryOp.hpp
-- Installing: /work/build/external/linux-x86_64/include/xercesc/validators/common/CMLeaf.hpp
-- Installing: /work/build/external/linux-x86_64/include/xercesc/validators/common/CMRepeatingLeaf.hpp
-- Installing: /work/build/external/linux-x86_64/include/xercesc/validators/common/CMNode.hpp
-- Installing: /work/build/external/linux-x86_64/include/xercesc/validators/common/CMStateSet.hpp
-- Installing: /work/build/external/linux-x86_64/include/xercesc/validators/common/CMUnaryOp.hpp
-- Installing: /work/build/external/linux-x86_64/include/xercesc/validators/common/ContentLeafNameTypeVector.hpp
-- Installing: /work/build/external/linux-x86_64/include/xercesc/validators/common/ContentSpecNode.hpp
-- Installing: /work/build/external/linux-x86_64/include/xercesc/validators/common/DFAContentModel.hpp
-- Installing: /work/build/external/linux-x86_64/include/xercesc/validators/common/Grammar.hpp
-- Installing: /work/build/external/linux-x86_64/include/xercesc/validators/common/GrammarResolver.hpp
-- Installing: /work/build/external/linux-x86_64/include/xercesc/validators/common/MixedContentModel.hpp
-- Installing: /work/build/external/linux-x86_64/include/xercesc/validators/common/SimpleContentModel.hpp
-- Installing: /work/build/external/linux-x86_64/include/xercesc/validators/datatype/AbstractNumericFacetValidator.hpp
-- Installing: /work/build/external/linux-x86_64/include/xercesc/validators/datatype/AbstractNumericValidator.hpp
-- Installing: /work/build/external/linux-x86_64/include/xercesc/validators/datatype/AbstractStringValidator.hpp
-- Installing: /work/build/external/linux-x86_64/include/xercesc/validators/datatype/AnySimpleTypeDatatypeValidator.hpp
-- Installing: /work/build/external/linux-x86_64/include/xercesc/validators/datatype/AnyURIDatatypeValidator.hpp
-- Installing: /work/build/external/linux-x86_64/include/xercesc/validators/datatype/Base64BinaryDatatypeValidator.hpp
-- Installing: /work/build/external/linux-x86_64/include/xercesc/validators/datatype/BooleanDatatypeValidator.hpp
-- Installing: /work/build/external/linux-x86_64/include/xercesc/validators/datatype/DatatypeValidator.hpp
-- Installing: /work/build/external/linux-x86_64/include/xercesc/validators/datatype/DatatypeValidatorFactory.hpp
-- Installing: /work/build/external/linux-x86_64/include/xercesc/validators/datatype/DateDatatypeValidator.hpp
-- Installing: /work/build/external/linux-x86_64/include/xercesc/validators/datatype/DateTimeDatatypeValidator.hpp
-- Installing: /work/build/external/linux-x86_64/include/xercesc/validators/datatype/DateTimeValidator.hpp
-- Installing: /work/build/external/linux-x86_64/include/xercesc/validators/datatype/DayDatatypeValidator.hpp
-- Installing: /work/build/external/linux-x86_64/include/xercesc/validators/datatype/DecimalDatatypeValidator.hpp
-- Installing: /work/build/external/linux-x86_64/include/xercesc/validators/datatype/DoubleDatatypeValidator.hpp
-- Installing: /work/build/external/linux-x86_64/include/xercesc/validators/datatype/DurationDatatypeValidator.hpp
-- Installing: /work/build/external/linux-x86_64/include/xercesc/validators/datatype/ENTITYDatatypeValidator.hpp
-- Installing: /work/build/external/linux-x86_64/include/xercesc/validators/datatype/FloatDatatypeValidator.hpp
-- Installing: /work/build/external/linux-x86_64/include/xercesc/validators/datatype/HexBinaryDatatypeValidator.hpp
-- Installing: /work/build/external/linux-x86_64/include/xercesc/validators/datatype/IDDatatypeValidator.hpp
-- Installing: /work/build/external/linux-x86_64/include/xercesc/validators/datatype/IDREFDatatypeValidator.hpp
-- Installing: /work/build/external/linux-x86_64/include/xercesc/validators/datatype/InvalidDatatypeFacetException.hpp
-- Installing: /work/build/external/linux-x86_64/include/xercesc/validators/datatype/InvalidDatatypeValueException.hpp
-- Installing: /work/build/external/linux-x86_64/include/xercesc/validators/datatype/ListDatatypeValidator.hpp
-- Installing: /work/build/external/linux-x86_64/include/xercesc/validators/datatype/MonthDatatypeValidator.hpp
-- Installing: /work/build/external/linux-x86_64/include/xercesc/validators/datatype/MonthDayDatatypeValidator.hpp
-- Installing: /work/build/external/linux-x86_64/include/xercesc/validators/datatype/NameDatatypeValidator.hpp
-- Installing: /work/build/external/linux-x86_64/include/xercesc/validators/datatype/NCNameDatatypeValidator.hpp
-- Installing: /work/build/external/linux-x86_64/include/xercesc/validators/datatype/NOTATIONDatatypeValidator.hpp
-- Installing: /work/build/external/linux-x86_64/include/xercesc/validators/datatype/QNameDatatypeValidator.hpp
-- Installing: /work/build/external/linux-x86_64/include/xercesc/validators/datatype/StringDatatypeValidator.hpp
-- Installing: /work/build/external/linux-x86_64/include/xercesc/validators/datatype/TimeDatatypeValidator.hpp
-- Installing: /work/build/external/linux-x86_64/include/xercesc/validators/datatype/UnionDatatypeValidator.hpp
-- Installing: /work/build/external/linux-x86_64/include/xercesc/validators/datatype/XMLCanRepGroup.hpp
-- Installing: /work/build/external/linux-x86_64/include/xercesc/validators/datatype/YearDatatypeValidator.hpp
-- Installing: /work/build/external/linux-x86_64/include/xercesc/validators/datatype/YearMonthDatatypeValidator.hpp
-- Installing: /work/build/external/linux-x86_64/include/xercesc/validators/DTD/DocTypeHandler.hpp
-- Installing: /work/build/external/linux-x86_64/include/xercesc/validators/DTD/DTDAttDef.hpp
-- Installing: /work/build/external/linux-x86_64/include/xercesc/validators/DTD/DTDAttDefList.hpp
-- Installing: /work/build/external/linux-x86_64/include/xercesc/validators/DTD/DTDElementDecl.hpp
-- Installing: /work/build/external/linux-x86_64/include/xercesc/validators/DTD/DTDEntityDecl.hpp
-- Installing: /work/build/external/linux-x86_64/include/xercesc/validators/DTD/DTDGrammar.hpp
-- Installing: /work/build/external/linux-x86_64/include/xercesc/validators/DTD/DTDScanner.hpp
-- Installing: /work/build/external/linux-x86_64/include/xercesc/validators/DTD/DTDValidator.hpp
-- Installing: /work/build/external/linux-x86_64/include/xercesc/validators/DTD/XMLDTDDescriptionImpl.hpp
-- Installing: /work/build/external/linux-x86_64/include/xercesc/validators/schema/ComplexTypeInfo.hpp
-- Installing: /work/build/external/linux-x86_64/include/xercesc/validators/schema/GeneralAttributeCheck.hpp
-- Installing: /work/build/external/linux-x86_64/include/xercesc/validators/schema/identity/FieldActivator.hpp
-- Installing: /work/build/external/linux-x86_64/include/xercesc/validators/schema/identity/FieldValueMap.hpp
-- Installing: /work/build/external/linux-x86_64/include/xercesc/validators/schema/identity/IC_Field.hpp
-- Installing: /work/build/external/linux-x86_64/include/xercesc/validators/schema/identity/IC_Key.hpp
-- Installing: /work/build/external/linux-x86_64/include/xercesc/validators/schema/identity/IC_KeyRef.hpp
-- Installing: /work/build/external/linux-x86_64/include/xercesc/validators/schema/identity/IC_Selector.hpp
-- Installing: /work/build/external/linux-x86_64/include/xercesc/validators/schema/identity/IC_Unique.hpp
-- Installing: /work/build/external/linux-x86_64/include/xercesc/validators/schema/identity/IdentityConstraint.hpp
-- Installing: /work/build/external/linux-x86_64/include/xercesc/validators/schema/identity/IdentityConstraintHandler.hpp
-- Installing: /work/build/external/linux-x86_64/include/xercesc/validators/schema/identity/ValueStore.hpp
-- Installing: /work/build/external/linux-x86_64/include/xercesc/validators/schema/identity/ValueStoreCache.hpp
-- Installing: /work/build/external/linux-x86_64/include/xercesc/validators/schema/identity/XercesXPath.hpp
-- Installing: /work/build/external/linux-x86_64/include/xercesc/validators/schema/identity/XPathException.hpp
-- Installing: /work/build/external/linux-x86_64/include/xercesc/validators/schema/identity/XPathMatcher.hpp
-- Installing: /work/build/external/linux-x86_64/include/xercesc/validators/schema/identity/XPathMatcherStack.hpp
-- Installing: /work/build/external/linux-x86_64/include/xercesc/validators/schema/identity/XPathSymbols.hpp
-- Installing: /work/build/external/linux-x86_64/include/xercesc/validators/schema/NamespaceScope.hpp
-- Installing: /work/build/external/linux-x86_64/include/xercesc/validators/schema/PSVIDefs.hpp
-- Installing: /work/build/external/linux-x86_64/include/xercesc/validators/schema/SchemaAttDef.hpp
-- Installing: /work/build/external/linux-x86_64/include/xercesc/validators/schema/SchemaAttDefList.hpp
-- Installing: /work/build/external/linux-x86_64/include/xercesc/validators/schema/SchemaElementDecl.hpp
-- Installing: /work/build/external/linux-x86_64/include/xercesc/validators/schema/SchemaGrammar.hpp
-- Installing: /work/build/external/linux-x86_64/include/xercesc/validators/schema/SchemaInfo.hpp
-- Installing: /work/build/external/linux-x86_64/include/xercesc/validators/schema/SchemaSymbols.hpp
-- Installing: /work/build/external/linux-x86_64/include/xercesc/validators/schema/SchemaValidator.hpp
-- Installing: /work/build/external/linux-x86_64/include/xercesc/validators/schema/SubstitutionGroupComparator.hpp
-- Installing: /work/build/external/linux-x86_64/include/xercesc/validators/schema/TraverseSchema.hpp
-- Installing: /work/build/external/linux-x86_64/include/xercesc/validators/schema/XercesAttGroupInfo.hpp
-- Installing: /work/build/external/linux-x86_64/include/xercesc/validators/schema/XercesElementWildcard.hpp
-- Installing: /work/build/external/linux-x86_64/include/xercesc/validators/schema/XercesGroupInfo.hpp
-- Installing: /work/build/external/linux-x86_64/include/xercesc/validators/schema/XMLSchemaDescriptionImpl.hpp
-- Installing: /work/build/external/linux-x86_64/include/xercesc/validators/schema/XSDDOMParser.hpp
-- Installing: /work/build/external/linux-x86_64/include/xercesc/validators/schema/XSDErrorReporter.hpp
-- Installing: /work/build/external/linux-x86_64/include/xercesc/validators/schema/XSDLocator.hpp
-- Installing: /work/build/external/linux-x86_64/include/xercesc/validators/schema/XUtil.hpp
-- Installing: /work/build/external/linux-x86_64/include/xercesc/xinclude/XIncludeDOMDocumentProcessor.hpp
-- Installing: /work/build/external/linux-x86_64/include/xercesc/xinclude/XIncludeLocation.hpp
-- Installing: /work/build/external/linux-x86_64/include/xercesc/xinclude/XIncludeUtils.hpp
-- Installing: /work/build/external/linux-x86_64/include/xercesc/util/Transcoders/IconvGNU/IconvGNUTransService.hpp
-- Installing: /work/build/external/linux-x86_64/include/xercesc/util/MsgLoaders/InMemory/InMemMsgLoader.hpp
-- Installing: /work/build/external/linux-x86_64/include/xercesc/util/MsgLoaders/InMemory/XercesMessages_en_US.hpp
-- Installing: /work/build/external/linux-x86_64/include/xercesc/util/MutexManagers/NoThreadMutexMgr.hpp
-- Installing: /work/build/external/linux-x86_64/include/xercesc/util/FileManagers/PosixFileMgr.hpp
-- Installing: /work/build/external/linux-x86_64/include/xercesc/util/Xerces_autoconf_config.hpp
-- Installing: /work/build/external/linux-x86_64/include/xercesc/util/XercesVersion.hpp
-- Installing: /work/build/external/linux-x86_64/bin/CreateDOMDocument
-- Installing: /work/build/external/linux-x86_64/bin/DOMCount
-- Installing: /work/build/external/linux-x86_64/bin/DOMPrint
-- Installing: /work/build/external/linux-x86_64/bin/EnumVal
-- Installing: /work/build/external/linux-x86_64/bin/MemParse
-- Installing: /work/build/external/linux-x86_64/bin/PParse
-- Installing: /work/build/external/linux-x86_64/bin/PSVIWriter
-- Installing: /work/build/external/linux-x86_64/bin/Redirect
-- Installing: /work/build/external/linux-x86_64/bin/SAX2Count
-- Installing: /work/build/external/linux-x86_64/bin/SAX2Print
-- Installing: /work/build/external/linux-x86_64/bin/SAXCount
-- Installing: /work/build/external/linux-x86_64/bin/SAXPrint
-- Installing: /work/build/external/linux-x86_64/bin/SCMPrint
-- Installing: /work/build/external/linux-x86_64/bin/SEnumVal
-- Installing: /work/build/external/linux-x86_64/bin/StdInParse
-- Installing: /work/build/external/linux-x86_64/bin/XInclude
make: Leaving directory '/work/build/linux-x64/xerces-c'
Running CMake
-- The C compiler identification is GNU 6.3.0
-- The CXX compiler identification is GNU 6.3.0
-- Check for working C compiler: /usr/bin/x86_64-linux-gnu-gcc
-- Check for working C compiler: /usr/bin/x86_64-linux-gnu-gcc -- works
-- Detecting C compiler ABI info
-- Detecting C compiler ABI info - done
-- Detecting C compile features
-- Detecting C compile features - done
-- Check for working CXX compiler: /usr/bin/x86_64-linux-gnu-g++
-- Check for working CXX compiler: /usr/bin/x86_64-linux-gnu-g++ -- works
-- Detecting CXX compiler ABI info
-- Detecting CXX compiler ABI info - done
-- Detecting CXX compile features
-- Detecting CXX compile features - done
FMU will be installed to: /work/build/install
x86_64
Third parties libraries will use search path: /work/build/external/linux-x86_64
-- Could NOT find Doxygen (missing: DOXYGEN_EXECUTABLE) 
-- No Doxygen found. Documentation won't be built
-- Could NOT find GTestSrc (missing: GTEST_SOURCE_DIR GTEST_INCLUDE_DIR) 
-- Found PythonInterp: /usr/bin/python (found version "2.7.13") 
-- Looking for pthread.h
-- Looking for pthread.h - found
-- Looking for pthread_create
-- Looking for pthread_create - not found
-- Looking for pthread_create in pthreads
-- Looking for pthread_create in pthreads - not found
-- Looking for pthread_create in pthread
-- Looking for pthread_create in pthread - found
-- Found Threads: TRUE  
-- Found C inline keyword: inline
-- Looking for getaddrinfo
-- Looking for getaddrinfo - found
-- Looking for socket
-- Looking for socket - found
-- Looking for poll
-- Looking for poll - found
-- Looking for clock_gettime in rt
-- Looking for clock_gettime in rt - found
-- Looking for posix_spawnp in rt
-- Looking for posix_spawnp in rt - found
-- Performing Test HAVE_GNU90
-- Performing Test HAVE_GNU90 - Success
-- Could NOT find POPT (missing: POPT_INCLUDE_DIR POPT_LIBRARY) (found version "")
-- Could NOT find XMLTO (missing: XMLTO_EXECUTABLE) 
-- Could NOT find Doxygen (missing: DOXYGEN_EXECUTABLE) 
-- Building rabbitmq as a shared library - no
-- Building rabbitmq as a static library - yes
# date: USE_SYSTEM_TZ_DB ON
# date: USE_TZ_DB_IN_DOT OFF
# date: BUILD_TZ_STATIC ON
-- Performing Test COMPILER_SUPPORTS_CXX17
-- Performing Test COMPILER_SUPPORTS_CXX17 - Success
-- Package Xerces-C++ found: 
x86_64
-- Configuring done
-- Generating done
-- Build files have been written to: /work/build/linux-x64
Compiling
make: Entering directory '/work/build/linux-x64'
/usr/bin/cmake -S/work -B/work/build/linux-x64 --check-build-system CMakeFiles/Makefile.cmake 0
/usr/bin/cmake -E cmake_progress_start /work/build/linux-x64/CMakeFiles /work/build/linux-x64/CMakeFiles/progress.marks
make -f CMakeFiles/Makefile2 all
make[1]: Entering directory '/work/build/linux-x64'
make -f thirdparty/googletest/googletest/CMakeFiles/gtest.dir/build.make thirdparty/googletest/googletest/CMakeFiles/gtest.dir/depend
make -f thirdparty/rabbitmq-c/rabbitmq-c/librabbitmq/CMakeFiles/rabbitmq-static.dir/build.make thirdparty/rabbitmq-c/rabbitmq-c/librabbitmq/CMakeFiles/rabbitmq-static.dir/depend
make -f thirdparty/date/date/CMakeFiles/tz.dir/build.make thirdparty/date/date/CMakeFiles/tz.dir/depend
make[2]: Entering directory '/work/build/linux-x64'
cd /work/build/linux-x64 && /usr/bin/cmake -E cmake_depends "Unix Makefiles" /work /work/thirdparty/rabbitmq-c/rabbitmq-c/librabbitmq /work/build/linux-x64 /work/build/linux-x64/thirdparty/rabbitmq-c/rabbitmq-c/librabbitmq /work/build/linux-x64/thirdparty/rabbitmq-c/rabbitmq-c/librabbitmq/CMakeFiles/rabbitmq-static.dir/DependInfo.cmake --color=
make[2]: Entering directory '/work/build/linux-x64'
cd /work/build/linux-x64 && /usr/bin/cmake -E cmake_depends "Unix Makefiles" /work /work/thirdparty/googletest/googletest /work/build/linux-x64 /work/build/linux-x64/thirdparty/googletest/googletest /work/build/linux-x64/thirdparty/googletest/googletest/CMakeFiles/gtest.dir/DependInfo.cmake --color=
make[2]: Entering directory '/work/build/linux-x64'
cd /work/build/linux-x64 && /usr/bin/cmake -E cmake_depends "Unix Makefiles" /work /work/thirdparty/date/date /work/build/linux-x64 /work/build/linux-x64/thirdparty/date/date /work/build/linux-x64/thirdparty/date/date/CMakeFiles/tz.dir/DependInfo.cmake --color=
Scanning dependencies of target gtest
Scanning dependencies of target tz
make[2]: Leaving directory '/work/build/linux-x64'
make -f thirdparty/googletest/googletest/CMakeFiles/gtest.dir/build.make thirdparty/googletest/googletest/CMakeFiles/gtest.dir/build
make[2]: Entering directory '/work/build/linux-x64'
[  0%] Building CXX object thirdparty/googletest/googletest/CMakeFiles/gtest.dir/src/gtest-all.cc.o
cd /work/build/linux-x64/thirdparty/googletest/googletest && /usr/bin/x86_64-linux-gnu-g++   -I/work/thirdparty/googletest/googletest/include -I/work/thirdparty/googletest/googletest  -O2 -g -DNDEBUG   -Wall -Wshadow -Werror -DGTEST_HAS_PTHREAD=1 -fexceptions -Wextra -Wno-unused-parameter -Wno-missing-field-initializers -std=c++11 -o CMakeFiles/gtest.dir/src/gtest-all.cc.o -c /work/thirdparty/googletest/googletest/src/gtest-all.cc
make[2]: Leaving directory '/work/build/linux-x64'
make -f thirdparty/date/date/CMakeFiles/tz.dir/build.make thirdparty/date/date/CMakeFiles/tz.dir/build
make[2]: Entering directory '/work/build/linux-x64'
[  0%] Building CXX object thirdparty/date/date/CMakeFiles/tz.dir/src/tz.cpp.o
cd /work/build/linux-x64/thirdparty/date/date && /usr/bin/x86_64-linux-gnu-g++  -DHAS_REMOTE_API=0 -DUSE_AUTOLOAD=0 -DUSE_OS_TZDB=1 -I/work/thirdparty/date/date -I/work/thirdparty/date/date/include -I/work/thirdparty/date/date/include/date  -O2 -g -DNDEBUG   -std=gnu++1z -o CMakeFiles/tz.dir/src/tz.cpp.o -c /work/thirdparty/date/date/src/tz.cpp
Scanning dependencies of target rabbitmq-static
make[2]: Leaving directory '/work/build/linux-x64'
make -f thirdparty/rabbitmq-c/rabbitmq-c/librabbitmq/CMakeFiles/rabbitmq-static.dir/build.make thirdparty/rabbitmq-c/rabbitmq-c/librabbitmq/CMakeFiles/rabbitmq-static.dir/build
make[2]: Entering directory '/work/build/linux-x64'
[  0%] Building C object thirdparty/rabbitmq-c/rabbitmq-c/librabbitmq/CMakeFiles/rabbitmq-static.dir/amqp_api.c.o
[  0%] Building C object thirdparty/rabbitmq-c/rabbitmq-c/librabbitmq/CMakeFiles/rabbitmq-static.dir/amqp_mem.c.o
cd /work/build/linux-x64/thirdparty/rabbitmq-c/rabbitmq-c/librabbitmq && /usr/bin/x86_64-linux-gnu-gcc -DAMQP_BUILD -DAMQP_STATIC -DHAVE_CONFIG_H -I/work/build/linux-x64/thirdparty/rabbitmq-c/rabbitmq-c/librabbitmq -I/work/thirdparty/rabbitmq-c/rabbitmq-c/librabbitmq -I/work/thirdparty/rabbitmq-c/rabbitmq-c/librabbitmq/unix  -Wall -Wextra -Wstrict-prototypes -Wno-unused-function -fno-common -fvisibility=hidden  -std=gnu90 -O2 -g -DNDEBUG -fPIC   -o CMakeFiles/rabbitmq-static.dir/amqp_api.c.o   -c /work/thirdparty/rabbitmq-c/rabbitmq-c/librabbitmq/amqp_api.c
[  3%] Building C object thirdparty/rabbitmq-c/rabbitmq-c/librabbitmq/CMakeFiles/rabbitmq-static.dir/amqp_socket.c.o
cd /work/build/linux-x64/thirdparty/rabbitmq-c/rabbitmq-c/librabbitmq && /usr/bin/x86_64-linux-gnu-gcc -DAMQP_BUILD -DAMQP_STATIC -DHAVE_CONFIG_H -I/work/build/linux-x64/thirdparty/rabbitmq-c/rabbitmq-c/librabbitmq -I/work/thirdparty/rabbitmq-c/rabbitmq-c/librabbitmq -I/work/thirdparty/rabbitmq-c/rabbitmq-c/librabbitmq/unix  -Wall -Wextra -Wstrict-prototypes -Wno-unused-function -fno-common -fvisibility=hidden  -std=gnu90 -O2 -g -DNDEBUG -fPIC   -o CMakeFiles/rabbitmq-static.dir/amqp_mem.c.o   -c /work/thirdparty/rabbitmq-c/rabbitmq-c/librabbitmq/amqp_mem.c
cd /work/build/linux-x64/thirdparty/rabbitmq-c/rabbitmq-c/librabbitmq && /usr/bin/x86_64-linux-gnu-gcc -DAMQP_BUILD -DAMQP_STATIC -DHAVE_CONFIG_H -I/work/build/linux-x64/thirdparty/rabbitmq-c/rabbitmq-c/librabbitmq -I/work/thirdparty/rabbitmq-c/rabbitmq-c/librabbitmq -I/work/thirdparty/rabbitmq-c/rabbitmq-c/librabbitmq/unix  -Wall -Wextra -Wstrict-prototypes -Wno-unused-function -fno-common -fvisibility=hidden  -std=gnu90 -O2 -g -DNDEBUG -fPIC   -o CMakeFiles/rabbitmq-static.dir/amqp_socket.c.o   -c /work/thirdparty/rabbitmq-c/rabbitmq-c/librabbitmq/amqp_socket.c
[  3%] Building C object thirdparty/rabbitmq-c/rabbitmq-c/librabbitmq/CMakeFiles/rabbitmq-static.dir/amqp_table.c.o
cd /work/build/linux-x64/thirdparty/rabbitmq-c/rabbitmq-c/librabbitmq && /usr/bin/x86_64-linux-gnu-gcc -DAMQP_BUILD -DAMQP_STATIC -DHAVE_CONFIG_H -I/work/build/linux-x64/thirdparty/rabbitmq-c/rabbitmq-c/librabbitmq -I/work/thirdparty/rabbitmq-c/rabbitmq-c/librabbitmq -I/work/thirdparty/rabbitmq-c/rabbitmq-c/librabbitmq/unix  -Wall -Wextra -Wstrict-prototypes -Wno-unused-function -fno-common -fvisibility=hidden  -std=gnu90 -O2 -g -DNDEBUG -fPIC   -o CMakeFiles/rabbitmq-static.dir/amqp_table.c.o   -c /work/thirdparty/rabbitmq-c/rabbitmq-c/librabbitmq/amqp_table.c
[  6%] Building C object thirdparty/rabbitmq-c/rabbitmq-c/librabbitmq/CMakeFiles/rabbitmq-static.dir/amqp_framing.c.o
cd /work/build/linux-x64/thirdparty/rabbitmq-c/rabbitmq-c/librabbitmq && /usr/bin/x86_64-linux-gnu-gcc -DAMQP_BUILD -DAMQP_STATIC -DHAVE_CONFIG_H -I/work/build/linux-x64/thirdparty/rabbitmq-c/rabbitmq-c/librabbitmq -I/work/thirdparty/rabbitmq-c/rabbitmq-c/librabbitmq -I/work/thirdparty/rabbitmq-c/rabbitmq-c/librabbitmq/unix  -Wall -Wextra -Wstrict-prototypes -Wno-unused-function -fno-common -fvisibility=hidden  -std=gnu90 -O2 -g -DNDEBUG -fPIC   -o CMakeFiles/rabbitmq-static.dir/amqp_framing.c.o   -c /work/thirdparty/rabbitmq-c/rabbitmq-c/librabbitmq/amqp_framing.c
[  9%] Building C object thirdparty/rabbitmq-c/rabbitmq-c/librabbitmq/CMakeFiles/rabbitmq-static.dir/amqp_connection.c.o
cd /work/build/linux-x64/thirdparty/rabbitmq-c/rabbitmq-c/librabbitmq && /usr/bin/x86_64-linux-gnu-gcc -DAMQP_BUILD -DAMQP_STATIC -DHAVE_CONFIG_H -I/work/build/linux-x64/thirdparty/rabbitmq-c/rabbitmq-c/librabbitmq -I/work/thirdparty/rabbitmq-c/rabbitmq-c/librabbitmq -I/work/thirdparty/rabbitmq-c/rabbitmq-c/librabbitmq/unix  -Wall -Wextra -Wstrict-prototypes -Wno-unused-function -fno-common -fvisibility=hidden  -std=gnu90 -O2 -g -DNDEBUG -fPIC   -o CMakeFiles/rabbitmq-static.dir/amqp_connection.c.o   -c /work/thirdparty/rabbitmq-c/rabbitmq-c/librabbitmq/amqp_connection.c
[  9%] Building C object thirdparty/rabbitmq-c/rabbitmq-c/librabbitmq/CMakeFiles/rabbitmq-static.dir/amqp_url.c.o
cd /work/build/linux-x64/thirdparty/rabbitmq-c/rabbitmq-c/librabbitmq && /usr/bin/x86_64-linux-gnu-gcc -DAMQP_BUILD -DAMQP_STATIC -DHAVE_CONFIG_H -I/work/build/linux-x64/thirdparty/rabbitmq-c/rabbitmq-c/librabbitmq -I/work/thirdparty/rabbitmq-c/rabbitmq-c/librabbitmq -I/work/thirdparty/rabbitmq-c/rabbitmq-c/librabbitmq/unix  -Wall -Wextra -Wstrict-prototypes -Wno-unused-function -fno-common -fvisibility=hidden  -std=gnu90 -O2 -g -DNDEBUG -fPIC   -o CMakeFiles/rabbitmq-static.dir/amqp_url.c.o   -c /work/thirdparty/rabbitmq-c/rabbitmq-c/librabbitmq/amqp_url.c
[ 12%] Building C object thirdparty/rabbitmq-c/rabbitmq-c/librabbitmq/CMakeFiles/rabbitmq-static.dir/amqp_tcp_socket.c.o
cd /work/build/linux-x64/thirdparty/rabbitmq-c/rabbitmq-c/librabbitmq && /usr/bin/x86_64-linux-gnu-gcc -DAMQP_BUILD -DAMQP_STATIC -DHAVE_CONFIG_H -I/work/build/linux-x64/thirdparty/rabbitmq-c/rabbitmq-c/librabbitmq -I/work/thirdparty/rabbitmq-c/rabbitmq-c/librabbitmq -I/work/thirdparty/rabbitmq-c/rabbitmq-c/librabbitmq/unix  -Wall -Wextra -Wstrict-prototypes -Wno-unused-function -fno-common -fvisibility=hidden  -std=gnu90 -O2 -g -DNDEBUG -fPIC   -o CMakeFiles/rabbitmq-static.dir/amqp_tcp_socket.c.o   -c /work/thirdparty/rabbitmq-c/rabbitmq-c/librabbitmq/amqp_tcp_socket.c
[ 12%] Building C object thirdparty/rabbitmq-c/rabbitmq-c/librabbitmq/CMakeFiles/rabbitmq-static.dir/amqp_time.c.o
cd /work/build/linux-x64/thirdparty/rabbitmq-c/rabbitmq-c/librabbitmq && /usr/bin/x86_64-linux-gnu-gcc -DAMQP_BUILD -DAMQP_STATIC -DHAVE_CONFIG_H -I/work/build/linux-x64/thirdparty/rabbitmq-c/rabbitmq-c/librabbitmq -I/work/thirdparty/rabbitmq-c/rabbitmq-c/librabbitmq -I/work/thirdparty/rabbitmq-c/rabbitmq-c/librabbitmq/unix  -Wall -Wextra -Wstrict-prototypes -Wno-unused-function -fno-common -fvisibility=hidden  -std=gnu90 -O2 -g -DNDEBUG -fPIC   -o CMakeFiles/rabbitmq-static.dir/amqp_time.c.o   -c /work/thirdparty/rabbitmq-c/rabbitmq-c/librabbitmq/amqp_time.c
[ 15%] Building C object thirdparty/rabbitmq-c/rabbitmq-c/librabbitmq/CMakeFiles/rabbitmq-static.dir/amqp_consumer.c.o
cd /work/build/linux-x64/thirdparty/rabbitmq-c/rabbitmq-c/librabbitmq && /usr/bin/x86_64-linux-gnu-gcc -DAMQP_BUILD -DAMQP_STATIC -DHAVE_CONFIG_H -I/work/build/linux-x64/thirdparty/rabbitmq-c/rabbitmq-c/librabbitmq -I/work/thirdparty/rabbitmq-c/rabbitmq-c/librabbitmq -I/work/thirdparty/rabbitmq-c/rabbitmq-c/librabbitmq/unix  -Wall -Wextra -Wstrict-prototypes -Wno-unused-function -fno-common -fvisibility=hidden  -std=gnu90 -O2 -g -DNDEBUG -fPIC   -o CMakeFiles/rabbitmq-static.dir/amqp_consumer.c.o   -c /work/thirdparty/rabbitmq-c/rabbitmq-c/librabbitmq/amqp_consumer.c
[ 15%] Linking C static library librabbitmq.a
cd /work/build/linux-x64/thirdparty/rabbitmq-c/rabbitmq-c/librabbitmq && /usr/bin/cmake -P CMakeFiles/rabbitmq-static.dir/cmake_clean_target.cmake
cd /work/build/linux-x64/thirdparty/rabbitmq-c/rabbitmq-c/librabbitmq && /usr/bin/cmake -E cmake_link_script CMakeFiles/rabbitmq-static.dir/link.txt --verbose=1
/usr/bin/x86_64-linux-gnu-ar qc librabbitmq.a  CMakeFiles/rabbitmq-static.dir/amqp_framing.c.o CMakeFiles/rabbitmq-static.dir/amqp_api.c.o CMakeFiles/rabbitmq-static.dir/amqp_connection.c.o CMakeFiles/rabbitmq-static.dir/amqp_mem.c.o CMakeFiles/rabbitmq-static.dir/amqp_socket.c.o CMakeFiles/rabbitmq-static.dir/amqp_table.c.o CMakeFiles/rabbitmq-static.dir/amqp_url.c.o CMakeFiles/rabbitmq-static.dir/amqp_tcp_socket.c.o CMakeFiles/rabbitmq-static.dir/amqp_time.c.o CMakeFiles/rabbitmq-static.dir/amqp_consumer.c.o
/usr/bin/x86_64-linux-gnu-ranlib librabbitmq.a
make[2]: Leaving directory '/work/build/linux-x64'
[ 15%] Built target rabbitmq-static
[ 18%] Linking CXX static library libtz.a
cd /work/build/linux-x64/thirdparty/date/date && /usr/bin/cmake -P CMakeFiles/tz.dir/cmake_clean_target.cmake
cd /work/build/linux-x64/thirdparty/date/date && /usr/bin/cmake -E cmake_link_script CMakeFiles/tz.dir/link.txt --verbose=1
/usr/bin/x86_64-linux-gnu-ar qc libtz.a  CMakeFiles/tz.dir/src/tz.cpp.o
/usr/bin/x86_64-linux-gnu-ranlib libtz.a
make[2]: Leaving directory '/work/build/linux-x64'
[ 18%] Built target tz
make -f rabbitmq-core/CMakeFiles/rabbitmq-core.dir/build.make rabbitmq-core/CMakeFiles/rabbitmq-core.dir/depend
make[2]: Entering directory '/work/build/linux-x64'
cd /work/build/linux-x64 && /usr/bin/cmake -E cmake_depends "Unix Makefiles" /work /work/rabbitmq-core /work/build/linux-x64 /work/build/linux-x64/rabbitmq-core /work/build/linux-x64/rabbitmq-core/CMakeFiles/rabbitmq-core.dir/DependInfo.cmake --color=
Scanning dependencies of target rabbitmq-core
make[2]: Leaving directory '/work/build/linux-x64'
make -f rabbitmq-core/CMakeFiles/rabbitmq-core.dir/build.make rabbitmq-core/CMakeFiles/rabbitmq-core.dir/build
make[2]: Entering directory '/work/build/linux-x64'
[ 21%] Building CXX object rabbitmq-core/CMakeFiles/rabbitmq-core.dir/src/FmuContainerCore.cpp.o
cd /work/build/linux-x64/rabbitmq-core && /usr/bin/x86_64-linux-gnu-g++   -I/work/thirdparty/googletest/googletest/include -I/work/rabbitmq-core/src -I/work/thirdparty/date/date -I/work/thirdparty/date/date/include  -O2 -g -DNDEBUG -fPIC   -std=gnu++1z -o CMakeFiles/rabbitmq-core.dir/src/FmuContainerCore.cpp.o -c /work/rabbitmq-core/src/FmuContainerCore.cpp
In file included from /usr/include/c++/6/bits/unique_ptr.h:37:0,
                 from /usr/include/c++/6/bits/locale_conv.h:41,
                 from /usr/include/c++/6/locale:43,
                 from /work/thirdparty/date/date/include/date/date.h:57,
                 from /work/rabbitmq-core/src/FmuContainerCore.h:11,
                 from /work/rabbitmq-core/src/FmuContainerCore.cpp:5:
/usr/include/c++/6/tuple: In instantiation of 'std::pair<_T1, _T2>::pair(std::tuple<_Args1 ...>&, std::tuple<_Args2 ...>&, std::_Index_tuple<_Indexes1 ...>, std::_Index_tuple<_Indexes2 ...>) [with _Args1 = {const unsigned int&}; long unsigned int ..._Indexes1 = {0ul}; _Args2 = {}; long unsigned int ..._Indexes2 = {}; _T1 = const unsigned int; _T2 = std::pair<std::chrono::time_point<std::chrono::_V2::system_clock, std::chrono::duration<long int, std::ratio<1l, 1000l> > >, ScalarVariableBaseValue>]':
/usr/include/c++/6/tuple:1579:63:   required from 'std::pair<_T1, _T2>::pair(std::piecewise_construct_t, std::tuple<_Args1 ...>, std::tuple<_Args2 ...>) [with _Args1 = {const unsigned int&}; _Args2 = {}; _T1 = const unsigned int; _T2 = std::pair<std::chrono::time_point<std::chrono::_V2::system_clock, std::chrono::duration<long int, std::ratio<1l, 1000l> > >, ScalarVariableBaseValue>]'
/usr/include/c++/6/ext/new_allocator.h:120:4:   required from 'void __gnu_cxx::new_allocator<_Tp>::construct(_Up*, _Args&& ...) [with _Up = std::pair<const unsigned int, std::pair<std::chrono::time_point<std::chrono::_V2::system_clock, std::chrono::duration<long int, std::ratio<1l, 1000l> > >, ScalarVariableBaseValue> >; _Args = {const std::piecewise_construct_t&, std::tuple<const unsigned int&>, std::tuple<>}; _Tp = std::_Rb_tree_node<std::pair<const unsigned int, std::pair<std::chrono::time_point<std::chrono::_V2::system_clock, std::chrono::duration<long int, std::ratio<1l, 1000l> > >, ScalarVariableBaseValue> > >]'
/usr/include/c++/6/bits/alloc_traits.h:475:4:   required from 'static void std::allocator_traits<std::allocator<_Tp1> >::construct(std::allocator_traits<std::allocator<_Tp1> >::allocator_type&, _Up*, _Args&& ...) [with _Up = std::pair<const unsigned int, std::pair<std::chrono::time_point<std::chrono::_V2::system_clock, std::chrono::duration<long int, std::ratio<1l, 1000l> > >, ScalarVariableBaseValue> >; _Args = {const std::piecewise_construct_t&, std::tuple<const unsigned int&>, std::tuple<>}; _Tp = std::_Rb_tree_node<std::pair<const unsigned int, std::pair<std::chrono::time_point<std::chrono::_V2::system_clock, std::chrono::duration<long int, std::ratio<1l, 1000l> > >, ScalarVariableBaseValue> > >; std::allocator_traits<std::allocator<_Tp1> >::allocator_type = std::allocator<std::_Rb_tree_node<std::pair<const unsigned int, std::pair<std::chrono::time_point<std::chrono::_V2::system_clock, std::chrono::duration<long int, std::ratio<1l, 1000l> > >, ScalarVariableBaseValue> > > >]'
/usr/include/c++/6/bits/stl_tree.h:543:32:   required from 'void std::_Rb_tree<_Key, _Val, _KeyOfValue, _Compare, _Alloc>::_M_construct_node(std::_Rb_tree<_Key, _Val, _KeyOfValue, _Compare, _Alloc>::_Link_type, _Args&& ...) [with _Args = {const std::piecewise_construct_t&, std::tuple<const unsigned int&>, std::tuple<>}; _Key = unsigned int; _Val = std::pair<const unsigned int, std::pair<std::chrono::time_point<std::chrono::_V2::system_clock, std::chrono::duration<long int, std::ratio<1l, 1000l> > >, ScalarVariableBaseValue> >; _KeyOfValue = std::_Select1st<std::pair<const unsigned int, std::pair<std::chrono::time_point<std::chrono::_V2::system_clock, std::chrono::duration<long int, std::ratio<1l, 1000l> > >, ScalarVariableBaseValue> > >; _Compare = std::less<unsigned int>; _Alloc = std::allocator<std::pair<const unsigned int, std::pair<std::chrono::time_point<std::chrono::_V2::system_clock, std::chrono::duration<long int, std::ratio<1l, 1000l> > >, ScalarVariableBaseValue> > >; std::_Rb_tree<_Key, _Val, _KeyOfValue, _Compare, _Alloc>::_Link_type = std::_Rb_tree_node<std::pair<const unsigned int, std::pair<std::chrono::time_point<std::chrono::_V2::system_clock, std::chrono::duration<long int, std::ratio<1l, 1000l> > >, ScalarVariableBaseValue> > >*]'
/usr/include/c++/6/bits/stl_tree.h:560:4:   required from 'std::_Rb_tree_node<_Val>* std::_Rb_tree<_Key, _Val, _KeyOfValue, _Compare, _Alloc>::_M_create_node(_Args&& ...) [with _Args = {const std::piecewise_construct_t&, std::tuple<const unsigned int&>, std::tuple<>}; _Key = unsigned int; _Val = std::pair<const unsigned int, std::pair<std::chrono::time_point<std::chrono::_V2::system_clock, std::chrono::duration<long int, std::ratio<1l, 1000l> > >, ScalarVariableBaseValue> >; _KeyOfValue = std::_Select1st<std::pair<const unsigned int, std::pair<std::chrono::time_point<std::chrono::_V2::system_clock, std::chrono::duration<long int, std::ratio<1l, 1000l> > >, ScalarVariableBaseValue> > >; _Compare = std::less<unsigned int>; _Alloc = std::allocator<std::pair<const unsigned int, std::pair<std::chrono::time_point<std::chrono::_V2::system_clock, std::chrono::duration<long int, std::ratio<1l, 1000l> > >, ScalarVariableBaseValue> > >; std::_Rb_tree<_Key, _Val, _KeyOfValue, _Compare, _Alloc>::_Link_type = std::_Rb_tree_node<std::pair<const unsigned int, std::pair<std::chrono::time_point<std::chrono::_V2::system_clock, std::chrono::duration<long int, std::ratio<1l, 1000l> > >, ScalarVariableBaseValue> > >*]'
/usr/include/c++/6/bits/stl_tree.h:2196:64:   required from 'std::_Rb_tree<_Key, _Val, _KeyOfValue, _Compare, _Alloc>::iterator std::_Rb_tree<_Key, _Val, _KeyOfValue, _Compare, _Alloc>::_M_emplace_hint_unique(std::_Rb_tree<_Key, _Val, _KeyOfValue, _Compare, _Alloc>::const_iterator, _Args&& ...) [with _Args = {const std::piecewise_construct_t&, std::tuple<const unsigned int&>, std::tuple<>}; _Key = unsigned int; _Val = std::pair<const unsigned int, std::pair<std::chrono::time_point<std::chrono::_V2::system_clock, std::chrono::duration<long int, std::ratio<1l, 1000l> > >, ScalarVariableBaseValue> >; _KeyOfValue = std::_Select1st<std::pair<const unsigned int, std::pair<std::chrono::time_point<std::chrono::_V2::system_clock, std::chrono::duration<long int, std::ratio<1l, 1000l> > >, ScalarVariableBaseValue> > >; _Compare = std::less<unsigned int>; _Alloc = std::allocator<std::pair<const unsigned int, std::pair<std::chrono::time_point<std::chrono::_V2::system_clock, std::chrono::duration<long int, std::ratio<1l, 1000l> > >, ScalarVariableBaseValue> > >; std::_Rb_tree<_Key, _Val, _KeyOfValue, _Compare, _Alloc>::iterator = std::_Rb_tree_iterator<std::pair<const unsigned int, std::pair<std::chrono::time_point<std::chrono::_V2::system_clock, std::chrono::duration<long int, std::ratio<1l, 1000l> > >, ScalarVariableBaseValue> > >; std::_Rb_tree<_Key, _Val, _KeyOfValue, _Compare, _Alloc>::const_iterator = std::_Rb_tree_const_iterator<std::pair<const unsigned int, std::pair<std::chrono::time_point<std::chrono::_V2::system_clock, std::chrono::duration<long int, std::ratio<1l, 1000l> > >, ScalarVariableBaseValue> > >]'
/usr/include/c++/6/bits/stl_map.h:483:8:   required from 'std::map<_Key, _Tp, _Compare, _Alloc>::mapped_type& std::map<_Key, _Tp, _Compare, _Alloc>::operator[](const key_type&) [with _Key = unsigned int; _Tp = std::pair<std::chrono::time_point<std::chrono::_V2::system_clock, std::chrono::duration<long int, std::ratio<1l, 1000l> > >, ScalarVariableBaseValue>; _Compare = std::less<unsigned int>; _Alloc = std::allocator<std::pair<const unsigned int, std::pair<std::chrono::time_point<std::chrono::_V2::system_clock, std::chrono::duration<long int, std::ratio<1l, 1000l> > >, ScalarVariableBaseValue> > >; std::map<_Key, _Tp, _Compare, _Alloc>::mapped_type = std::pair<std::chrono::time_point<std::chrono::_V2::system_clock, std::chrono::duration<long int, std::ratio<1l, 1000l> > >, ScalarVariableBaseValue>; std::map<_Key, _Tp, _Compare, _Alloc>::key_type = unsigned int]'
/work/rabbitmq-core/src/FmuContainerCore.cpp:159:43:   required from 'void FmuContainerCore::processLookahead(Predicate) [with Predicate = FmuContainerCore::initialize()::<lambda(FmuContainerCore::TimedScalarBasicValue&)>]'
/work/rabbitmq-core/src/FmuContainerCore.cpp:220:31:   required from here
/usr/include/c++/6/tuple:1590:70: error: no matching function for call to 'std::pair<std::chrono::time_point<std::chrono::_V2::system_clock, std::chrono::duration<long int, std::ratio<1l, 1000l> > >, ScalarVariableBaseValue>::pair()'
         second(std::forward<_Args2>(std::get<_Indexes2>(__tuple2))...)
                                                                      ^
In file included from /usr/include/c++/6/bits/stl_algobase.h:64:0,
                 from /usr/include/c++/6/list:60,
                 from /work/rabbitmq-core/src/FmuContainerCore.h:9,
                 from /work/rabbitmq-core/src/FmuContainerCore.cpp:5:
/usr/include/c++/6/bits/stl_pair.h:427:9: note: candidate: template<class ... _Args1, long unsigned int ..._Indexes1, class ... _Args2, long unsigned int ..._Indexes2> std::pair<_T1, _T2>::pair(std::tuple<_Args1 ...>&, std::tuple<_Args2 ...>&, std::_Index_tuple<_Indexes1 ...>, std::_Index_tuple<_Indexes2 ...>)
         pair(tuple<_Args1...>&, tuple<_Args2...>&,
         ^~~~
/usr/include/c++/6/bits/stl_pair.h:427:9: note:   template argument deduction/substitution failed:
In file included from /usr/include/c++/6/bits/unique_ptr.h:37:0,
                 from /usr/include/c++/6/bits/locale_conv.h:41,
                 from /usr/include/c++/6/locale:43,
                 from /work/thirdparty/date/date/include/date/date.h:57,
                 from /work/rabbitmq-core/src/FmuContainerCore.h:11,
                 from /work/rabbitmq-core/src/FmuContainerCore.cpp:5:
/usr/include/c++/6/tuple:1590:70: note:   candidate expects 4 arguments, 0 provided
         second(std::forward<_Args2>(std::get<_Indexes2>(__tuple2))...)
                                                                      ^
In file included from /usr/include/c++/6/bits/stl_algobase.h:64:0,
                 from /usr/include/c++/6/list:60,
                 from /work/rabbitmq-core/src/FmuContainerCore.h:9,
                 from /work/rabbitmq-core/src/FmuContainerCore.cpp:5:
/usr/include/c++/6/bits/stl_pair.h:360:9: note: candidate: template<class ... _Args1, class ... _Args2> std::pair<_T1, _T2>::pair(std::piecewise_construct_t, std::tuple<_Args1 ...>, std::tuple<_Args2 ...>)
         pair(piecewise_construct_t, tuple<_Args1...>, tuple<_Args2...>);
         ^~~~
/usr/include/c++/6/bits/stl_pair.h:360:9: note:   template argument deduction/substitution failed:
In file included from /usr/include/c++/6/bits/unique_ptr.h:37:0,
                 from /usr/include/c++/6/bits/locale_conv.h:41,
                 from /usr/include/c++/6/locale:43,
                 from /work/thirdparty/date/date/include/date/date.h:57,
                 from /work/rabbitmq-core/src/FmuContainerCore.h:11,
                 from /work/rabbitmq-core/src/FmuContainerCore.cpp:5:
/usr/include/c++/6/tuple:1590:70: note:   candidate expects 3 arguments, 0 provided
         second(std::forward<_Args2>(std::get<_Indexes2>(__tuple2))...)
                                                                      ^
In file included from /usr/include/c++/6/bits/stl_algobase.h:64:0,
                 from /usr/include/c++/6/list:60,
                 from /work/rabbitmq-core/src/FmuContainerCore.h:9,
                 from /work/rabbitmq-core/src/FmuContainerCore.cpp:5:
/usr/include/c++/6/bits/stl_pair.h:355:21: note: candidate: template<class _U1, class _U2, typename std::enable_if<(std::_PCC<((! std::is_same<std::chrono::time_point<std::chrono::_V2::system_clock, std::chrono::duration<long int, std::ratio<1l, 1000l> > >, _U1>::value) || (! std::is_same<ScalarVariableBaseValue, _U2>::value)), std::chrono::time_point<std::chrono::_V2::system_clock, std::chrono::duration<long int, std::ratio<1l, 1000l> > >, ScalarVariableBaseValue>::_MoveConstructiblePair<_U1, _U2>() && (! std::_PCC<((! std::is_same<std::chrono::time_point<std::chrono::_V2::system_clock, std::chrono::duration<long int, std::ratio<1l, 1000l> > >, _U1>::value) || (! std::is_same<ScalarVariableBaseValue, _U2>::value)), std::chrono::time_point<std::chrono::_V2::system_clock, std::chrono::duration<long int, std::ratio<1l, 1000l> > >, ScalarVariableBaseValue>::_ImplicitlyMoveConvertiblePair<_U1, _U2>())), bool>::type <anonymous> > constexpr std::pair<_T1, _T2>::pair(std::pair<_U1, _U2>&&)
  explicit constexpr pair(pair<_U1, _U2>&& __p)
                     ^~~~
/usr/include/c++/6/bits/stl_pair.h:355:21: note:   template argument deduction/substitution failed:
In file included from /usr/include/c++/6/bits/unique_ptr.h:37:0,
                 from /usr/include/c++/6/bits/locale_conv.h:41,
                 from /usr/include/c++/6/locale:43,
                 from /work/thirdparty/date/date/include/date/date.h:57,
                 from /work/rabbitmq-core/src/FmuContainerCore.h:11,
                 from /work/rabbitmq-core/src/FmuContainerCore.cpp:5:
/usr/include/c++/6/tuple:1590:70: note:   candidate expects 1 argument, 0 provided
         second(std::forward<_Args2>(std::get<_Indexes2>(__tuple2))...)
                                                                      ^
In file included from /usr/include/c++/6/bits/stl_algobase.h:64:0,
                 from /usr/include/c++/6/list:60,
                 from /work/rabbitmq-core/src/FmuContainerCore.h:9,
                 from /work/rabbitmq-core/src/FmuContainerCore.cpp:5:
/usr/include/c++/6/bits/stl_pair.h:345:12: note: candidate: template<class _U1, class _U2, typename std::enable_if<(std::_PCC<((! std::is_same<std::chrono::time_point<std::chrono::_V2::system_clock, std::chrono::duration<long int, std::ratio<1l, 1000l> > >, _U1>::value) || (! std::is_same<ScalarVariableBaseValue, _U2>::value)), std::chrono::time_point<std::chrono::_V2::system_clock, std::chrono::duration<long int, std::ratio<1l, 1000l> > >, ScalarVariableBaseValue>::_MoveConstructiblePair<_U1, _U2>() && std::_PCC<((! std::is_same<std::chrono::time_point<std::chrono::_V2::system_clock, std::chrono::duration<long int, std::ratio<1l, 1000l> > >, _U1>::value) || (! std::is_same<ScalarVariableBaseValue, _U2>::value)), std::chrono::time_point<std::chrono::_V2::system_clock, std::chrono::duration<long int, std::ratio<1l, 1000l> > >, ScalarVariableBaseValue>::_ImplicitlyMoveConvertiblePair<_U1, _U2>()), bool>::type <anonymous> > constexpr std::pair<_T1, _T2>::pair(std::pair<_U1, _U2>&&)
  constexpr pair(pair<_U1, _U2>&& __p)
            ^~~~
/usr/include/c++/6/bits/stl_pair.h:345:12: note:   template argument deduction/substitution failed:
In file included from /usr/include/c++/6/bits/unique_ptr.h:37:0,
                 from /usr/include/c++/6/bits/locale_conv.h:41,
                 from /usr/include/c++/6/locale:43,
                 from /work/thirdparty/date/date/include/date/date.h:57,
                 from /work/rabbitmq-core/src/FmuContainerCore.h:11,
                 from /work/rabbitmq-core/src/FmuContainerCore.cpp:5:
/usr/include/c++/6/tuple:1590:70: note:   candidate expects 1 argument, 0 provided
         second(std::forward<_Args2>(std::get<_Indexes2>(__tuple2))...)
                                                                      ^
In file included from /usr/include/c++/6/bits/stl_algobase.h:64:0,
                 from /usr/include/c++/6/list:60,
                 from /work/rabbitmq-core/src/FmuContainerCore.h:9,
                 from /work/rabbitmq-core/src/FmuContainerCore.cpp:5:
/usr/include/c++/6/bits/stl_pair.h:335:21: note: candidate: template<class _U1, class _U2, typename std::enable_if<(_MoveConstructiblePair<_U1, _U2>() && (! _ImplicitlyMoveConvertiblePair<_U1, _U2>())), bool>::type <anonymous> > constexpr std::pair<_T1, _T2>::pair(_U1&&, _U2&&)
  explicit constexpr pair(_U1&& __x, _U2&& __y)
                     ^~~~
/usr/include/c++/6/bits/stl_pair.h:335:21: note:   template argument deduction/substitution failed:
In file included from /usr/include/c++/6/bits/unique_ptr.h:37:0,
                 from /usr/include/c++/6/bits/locale_conv.h:41,
                 from /usr/include/c++/6/locale:43,
                 from /work/thirdparty/date/date/include/date/date.h:57,
                 from /work/rabbitmq-core/src/FmuContainerCore.h:11,
                 from /work/rabbitmq-core/src/FmuContainerCore.cpp:5:
/usr/include/c++/6/tuple:1590:70: note:   candidate expects 2 arguments, 0 provided
         second(std::forward<_Args2>(std::get<_Indexes2>(__tuple2))...)
                                                                      ^
In file included from /usr/include/c++/6/bits/stl_algobase.h:64:0,
                 from /usr/include/c++/6/list:60,
                 from /work/rabbitmq-core/src/FmuContainerCore.h:9,
                 from /work/rabbitmq-core/src/FmuContainerCore.cpp:5:
/usr/include/c++/6/bits/stl_pair.h:326:12: note: candidate: template<class _U1, class _U2, typename std::enable_if<(_MoveConstructiblePair<_U1, _U2>() && _ImplicitlyMoveConvertiblePair<_U1, _U2>()), bool>::type <anonymous> > constexpr std::pair<_T1, _T2>::pair(_U1&&, _U2&&)
  constexpr pair(_U1&& __x, _U2&& __y)
            ^~~~
/usr/include/c++/6/bits/stl_pair.h:326:12: note:   template argument deduction/substitution failed:
In file included from /usr/include/c++/6/bits/unique_ptr.h:37:0,
                 from /usr/include/c++/6/bits/locale_conv.h:41,
                 from /usr/include/c++/6/locale:43,
                 from /work/thirdparty/date/date/include/date/date.h:57,
                 from /work/rabbitmq-core/src/FmuContainerCore.h:11,
                 from /work/rabbitmq-core/src/FmuContainerCore.cpp:5:
/usr/include/c++/6/tuple:1590:70: note:   candidate expects 2 arguments, 0 provided
         second(std::forward<_Args2>(std::get<_Indexes2>(__tuple2))...)
                                                                      ^
In file included from /usr/include/c++/6/bits/stl_algobase.h:64:0,
                 from /usr/include/c++/6/list:60,
                 from /work/rabbitmq-core/src/FmuContainerCore.h:9,
                 from /work/rabbitmq-core/src/FmuContainerCore.cpp:5:
/usr/include/c++/6/bits/stl_pair.h:317:17: note: candidate: template<class _U2, typename std::enable_if<_CopyMovePair<false, std::chrono::time_point<std::chrono::_V2::system_clock, std::chrono::duration<long int, std::ratio<1l, 1000l> > >, _U2>(), bool>::type <anonymous> > std::pair<_T1, _T2>::pair(const _T1&, _U2&&)
        explicit pair(const _T1& __x, _U2&& __y)
                 ^~~~
/usr/include/c++/6/bits/stl_pair.h:317:17: note:   template argument deduction/substitution failed:
In file included from /usr/include/c++/6/bits/unique_ptr.h:37:0,
                 from /usr/include/c++/6/bits/locale_conv.h:41,
                 from /usr/include/c++/6/locale:43,
                 from /work/thirdparty/date/date/include/date/date.h:57,
                 from /work/rabbitmq-core/src/FmuContainerCore.h:11,
                 from /work/rabbitmq-core/src/FmuContainerCore.cpp:5:
/usr/include/c++/6/tuple:1590:70: note:   candidate expects 2 arguments, 0 provided
         second(std::forward<_Args2>(std::get<_Indexes2>(__tuple2))...)
                                                                      ^
In file included from /usr/include/c++/6/bits/stl_algobase.h:64:0,
                 from /usr/include/c++/6/list:60,
                 from /work/rabbitmq-core/src/FmuContainerCore.h:9,
                 from /work/rabbitmq-core/src/FmuContainerCore.cpp:5:
/usr/include/c++/6/bits/stl_pair.h:310:18: note: candidate: template<class _U2, typename std::enable_if<_CopyMovePair<true, std::chrono::time_point<std::chrono::_V2::system_clock, std::chrono::duration<long int, std::ratio<1l, 1000l> > >, _U2>(), bool>::type <anonymous> > constexpr std::pair<_T1, _T2>::pair(const _T1&, _U2&&)
        constexpr pair(const _T1& __x, _U2&& __y)
                  ^~~~
/usr/include/c++/6/bits/stl_pair.h:310:18: note:   template argument deduction/substitution failed:
In file included from /usr/include/c++/6/bits/unique_ptr.h:37:0,
                 from /usr/include/c++/6/bits/locale_conv.h:41,
                 from /usr/include/c++/6/locale:43,
                 from /work/thirdparty/date/date/include/date/date.h:57,
                 from /work/rabbitmq-core/src/FmuContainerCore.h:11,
                 from /work/rabbitmq-core/src/FmuContainerCore.cpp:5:
/usr/include/c++/6/tuple:1590:70: note:   candidate expects 2 arguments, 0 provided
         second(std::forward<_Args2>(std::get<_Indexes2>(__tuple2))...)
                                                                      ^
In file included from /usr/include/c++/6/bits/stl_algobase.h:64:0,
                 from /usr/include/c++/6/list:60,
                 from /work/rabbitmq-core/src/FmuContainerCore.h:9,
                 from /work/rabbitmq-core/src/FmuContainerCore.cpp:5:
/usr/include/c++/6/bits/stl_pair.h:303:27: note: candidate: template<class _U1, typename std::enable_if<_MoveCopyPair<false, _U1, ScalarVariableBaseValue>(), bool>::type <anonymous> > constexpr std::pair<_T1, _T2>::pair(_U1&&, const _T2&)
        explicit constexpr pair(_U1&& __x, const _T2& __y)
                           ^~~~
/usr/include/c++/6/bits/stl_pair.h:303:27: note:   template argument deduction/substitution failed:
In file included from /usr/include/c++/6/bits/unique_ptr.h:37:0,
                 from /usr/include/c++/6/bits/locale_conv.h:41,
                 from /usr/include/c++/6/locale:43,
                 from /work/thirdparty/date/date/include/date/date.h:57,
                 from /work/rabbitmq-core/src/FmuContainerCore.h:11,
                 from /work/rabbitmq-core/src/FmuContainerCore.cpp:5:
/usr/include/c++/6/tuple:1590:70: note:   candidate expects 2 arguments, 0 provided
         second(std::forward<_Args2>(std::get<_Indexes2>(__tuple2))...)
                                                                      ^
In file included from /usr/include/c++/6/bits/stl_algobase.h:64:0,
                 from /usr/include/c++/6/list:60,
                 from /work/rabbitmq-core/src/FmuContainerCore.h:9,
                 from /work/rabbitmq-core/src/FmuContainerCore.cpp:5:
/usr/include/c++/6/bits/stl_pair.h:296:18: note: candidate: template<class _U1, typename std::enable_if<_MoveCopyPair<true, _U1, ScalarVariableBaseValue>(), bool>::type <anonymous> > constexpr std::pair<_T1, _T2>::pair(_U1&&, const _T2&)
        constexpr pair(_U1&& __x, const _T2& __y)
                  ^~~~
/usr/include/c++/6/bits/stl_pair.h:296:18: note:   template argument deduction/substitution failed:
In file included from /usr/include/c++/6/bits/unique_ptr.h:37:0,
                 from /usr/include/c++/6/bits/locale_conv.h:41,
                 from /usr/include/c++/6/locale:43,
                 from /work/thirdparty/date/date/include/date/date.h:57,
                 from /work/rabbitmq-core/src/FmuContainerCore.h:11,
                 from /work/rabbitmq-core/src/FmuContainerCore.cpp:5:
/usr/include/c++/6/tuple:1590:70: note:   candidate expects 2 arguments, 0 provided
         second(std::forward<_Args2>(std::get<_Indexes2>(__tuple2))...)
                                                                      ^
In file included from /usr/include/c++/6/bits/stl_algobase.h:64:0,
                 from /usr/include/c++/6/list:60,
                 from /work/rabbitmq-core/src/FmuContainerCore.h:9,
                 from /work/rabbitmq-core/src/FmuContainerCore.cpp:5:
/usr/include/c++/6/bits/stl_pair.h:289:17: note: candidate: constexpr std::pair<_T1, _T2>::pair(std::pair<_T1, _T2>&&) [with _T1 = std::chrono::time_point<std::chrono::_V2::system_clock, std::chrono::duration<long int, std::ratio<1l, 1000l> > >; _T2 = ScalarVariableBaseValue]
       constexpr pair(pair&&) = default;
                 ^~~~
/usr/include/c++/6/bits/stl_pair.h:289:17: note:   candidate expects 1 argument, 0 provided
/usr/include/c++/6/bits/stl_pair.h:288:17: note: candidate: constexpr std::pair<_T1, _T2>::pair(const std::pair<_T1, _T2>&) [with _T1 = std::chrono::time_point<std::chrono::_V2::system_clock, std::chrono::duration<long int, std::ratio<1l, 1000l> > >; _T2 = ScalarVariableBaseValue]
       constexpr pair(const pair&) = default;
                 ^~~~
/usr/include/c++/6/bits/stl_pair.h:288:17: note:   candidate expects 1 argument, 0 provided
/usr/include/c++/6/bits/stl_pair.h:285:21: note: candidate: template<class _U1, class _U2, typename std::enable_if<(std::_PCC<((! std::is_same<std::chrono::time_point<std::chrono::_V2::system_clock, std::chrono::duration<long int, std::ratio<1l, 1000l> > >, _U1>::value) || (! std::is_same<ScalarVariableBaseValue, _U2>::value)), std::chrono::time_point<std::chrono::_V2::system_clock, std::chrono::duration<long int, std::ratio<1l, 1000l> > >, ScalarVariableBaseValue>::_ConstructiblePair<_U1, _U2>() && (! std::_PCC<((! std::is_same<std::chrono::time_point<std::chrono::_V2::system_clock, std::chrono::duration<long int, std::ratio<1l, 1000l> > >, _U1>::value) || (! std::is_same<ScalarVariableBaseValue, _U2>::value)), std::chrono::time_point<std::chrono::_V2::system_clock, std::chrono::duration<long int, std::ratio<1l, 1000l> > >, ScalarVariableBaseValue>::_ImplicitlyConvertiblePair<_U1, _U2>())), bool>::type <anonymous> > constexpr std::pair<_T1, _T2>::pair(const std::pair<_U1, _U2>&)
  explicit constexpr pair(const pair<_U1, _U2>& __p)
                     ^~~~
/usr/include/c++/6/bits/stl_pair.h:285:21: note:   template argument deduction/substitution failed:
In file included from /usr/include/c++/6/bits/unique_ptr.h:37:0,
                 from /usr/include/c++/6/bits/locale_conv.h:41,
                 from /usr/include/c++/6/locale:43,
                 from /work/thirdparty/date/date/include/date/date.h:57,
                 from /work/rabbitmq-core/src/FmuContainerCore.h:11,
                 from /work/rabbitmq-core/src/FmuContainerCore.cpp:5:
/usr/include/c++/6/tuple:1590:70: note:   candidate expects 1 argument, 0 provided
         second(std::forward<_Args2>(std::get<_Indexes2>(__tuple2))...)
                                                                      ^
In file included from /usr/include/c++/6/bits/stl_algobase.h:64:0,
                 from /usr/include/c++/6/list:60,
                 from /work/rabbitmq-core/src/FmuContainerCore.h:9,
                 from /work/rabbitmq-core/src/FmuContainerCore.cpp:5:
/usr/include/c++/6/bits/stl_pair.h:276:19: note: candidate: template<class _U1, class _U2, typename std::enable_if<(std::_PCC<((! std::is_same<std::chrono::time_point<std::chrono::_V2::system_clock, std::chrono::duration<long int, std::ratio<1l, 1000l> > >, _U1>::value) || (! std::is_same<ScalarVariableBaseValue, _U2>::value)), std::chrono::time_point<std::chrono::_V2::system_clock, std::chrono::duration<long int, std::ratio<1l, 1000l> > >, ScalarVariableBaseValue>::_ConstructiblePair<_U1, _U2>() && std::_PCC<((! std::is_same<std::chrono::time_point<std::chrono::_V2::system_clock, std::chrono::duration<long int, std::ratio<1l, 1000l> > >, _U1>::value) || (! std::is_same<ScalarVariableBaseValue, _U2>::value)), std::chrono::time_point<std::chrono::_V2::system_clock, std::chrono::duration<long int, std::ratio<1l, 1000l> > >, ScalarVariableBaseValue>::_ImplicitlyConvertiblePair<_U1, _U2>()), bool>::type <anonymous> > constexpr std::pair<_T1, _T2>::pair(const std::pair<_U1, _U2>&)
         constexpr pair(const pair<_U1, _U2>& __p)
                   ^~~~
/usr/include/c++/6/bits/stl_pair.h:276:19: note:   template argument deduction/substitution failed:
In file included from /usr/include/c++/6/bits/unique_ptr.h:37:0,
                 from /usr/include/c++/6/bits/locale_conv.h:41,
                 from /usr/include/c++/6/locale:43,
                 from /work/thirdparty/date/date/include/date/date.h:57,
                 from /work/rabbitmq-core/src/FmuContainerCore.h:11,
                 from /work/rabbitmq-core/src/FmuContainerCore.cpp:5:
/usr/include/c++/6/tuple:1590:70: note:   candidate expects 1 argument, 0 provided
         second(std::forward<_Args2>(std::get<_Indexes2>(__tuple2))...)
                                                                      ^
In file included from /usr/include/c++/6/bits/stl_algobase.h:64:0,
                 from /usr/include/c++/6/list:60,
                 from /work/rabbitmq-core/src/FmuContainerCore.h:9,
                 from /work/rabbitmq-core/src/FmuContainerCore.cpp:5:
/usr/include/c++/6/bits/stl_pair.h:254:26: note: candidate: template<class _U1, class _U2, typename std::enable_if<(_ConstructiblePair<_U1, _U2>() && (! _ImplicitlyConvertiblePair<_U1, _U2>())), bool>::type <anonymous> > constexpr std::pair<_T1, _T2>::pair(const _T1&, const _T2&)
       explicit constexpr pair(const _T1& __a, const _T2& __b)
                          ^~~~
/usr/include/c++/6/bits/stl_pair.h:254:26: note:   template argument deduction/substitution failed:
In file included from /usr/include/c++/6/bits/unique_ptr.h:37:0,
                 from /usr/include/c++/6/bits/locale_conv.h:41,
                 from /usr/include/c++/6/locale:43,
                 from /work/thirdparty/date/date/include/date/date.h:57,
                 from /work/rabbitmq-core/src/FmuContainerCore.h:11,
                 from /work/rabbitmq-core/src/FmuContainerCore.cpp:5:
/usr/include/c++/6/tuple:1590:70: note:   candidate expects 2 arguments, 0 provided
         second(std::forward<_Args2>(std::get<_Indexes2>(__tuple2))...)
                                                                      ^
In file included from /usr/include/c++/6/bits/stl_algobase.h:64:0,
                 from /usr/include/c++/6/list:60,
                 from /work/rabbitmq-core/src/FmuContainerCore.h:9,
                 from /work/rabbitmq-core/src/FmuContainerCore.cpp:5:
/usr/include/c++/6/bits/stl_pair.h:245:17: note: candidate: template<class _U1, class _U2, typename std::enable_if<(_ConstructiblePair<_U1, _U2>() && _ImplicitlyConvertiblePair<_U1, _U2>()), bool>::type <anonymous> > constexpr std::pair<_T1, _T2>::pair(const _T1&, const _T2&)
       constexpr pair(const _T1& __a, const _T2& __b)
                 ^~~~
/usr/include/c++/6/bits/stl_pair.h:245:17: note:   template argument deduction/substitution failed:
In file included from /usr/include/c++/6/bits/unique_ptr.h:37:0,
                 from /usr/include/c++/6/bits/locale_conv.h:41,
                 from /usr/include/c++/6/locale:43,
                 from /work/thirdparty/date/date/include/date/date.h:57,
                 from /work/rabbitmq-core/src/FmuContainerCore.h:11,
                 from /work/rabbitmq-core/src/FmuContainerCore.cpp:5:
/usr/include/c++/6/tuple:1590:70: note:   candidate expects 2 arguments, 0 provided
         second(std::forward<_Args2>(std::get<_Indexes2>(__tuple2))...)
                                                                      ^
In file included from /usr/include/c++/6/bits/stl_algobase.h:64:0,
                 from /usr/include/c++/6/list:60,
                 from /work/rabbitmq-core/src/FmuContainerCore.h:9,
                 from /work/rabbitmq-core/src/FmuContainerCore.cpp:5:
/usr/include/c++/6/bits/stl_pair.h:227:26: note: candidate: template<class _U1, class _U2, typename std::enable_if<std::__and_<std::is_default_constructible<_Tp>, std::is_default_constructible<_U2>, std::__not_<std::__and_<std::__is_implicitly_default_constructible<_U1>, std::__is_implicitly_default_constructible<_U2> > > >::value, bool>::type <anonymous> > constexpr std::pair<_T1, _T2>::pair()
       explicit constexpr pair()
                          ^~~~
/usr/include/c++/6/bits/stl_pair.h:227:26: note:   template argument deduction/substitution failed:
/usr/include/c++/6/bits/stl_pair.h:226:59: error: no type named 'type' in 'struct std::enable_if<false, bool>'
                                    ::value, bool>::type = false>
                                                           ^~~~~
/usr/include/c++/6/bits/stl_pair.h:226:59: note: invalid template non-type parameter
/usr/include/c++/6/bits/stl_pair.h:214:26: note: candidate: template<class _U1, class _U2, typename std::enable_if<std::__and_<std::__is_implicitly_default_constructible<_U1>, std::__is_implicitly_default_constructible<_U2> >::value, bool>::type <anonymous> > constexpr std::pair<_T1, _T2>::pair()
       _GLIBCXX_CONSTEXPR pair()
                          ^~~~
/usr/include/c++/6/bits/stl_pair.h:214:26: note:   template argument deduction/substitution failed:
/usr/include/c++/6/bits/stl_pair.h:212:59: error: no type named 'type' in 'struct std::enable_if<false, bool>'
                                    ::value, bool>::type = true>
                                                           ^~~~
/usr/include/c++/6/bits/stl_pair.h:212:59: note: invalid template non-type parameter
make[2]: *** [rabbitmq-core/CMakeFiles/rabbitmq-core.dir/src/FmuContainerCore.cpp.o] Error 1
rabbitmq-core/CMakeFiles/rabbitmq-core.dir/build.make:65: recipe for target 'rabbitmq-core/CMakeFiles/rabbitmq-core.dir/src/FmuContainerCore.cpp.o' failed
make[2]: Leaving directory '/work/build/linux-x64'
make[1]: *** [rabbitmq-core/CMakeFiles/rabbitmq-core.dir/all] Error 2
make[1]: *** Waiting for unfinished jobs....
CMakeFiles/Makefile2:4995: recipe for target 'rabbitmq-core/CMakeFiles/rabbitmq-core.dir/all' failed
[ 24%] Linking CXX static library ../../../lib/libgtest.a
cd /work/build/linux-x64/thirdparty/googletest/googletest && /usr/bin/cmake -P CMakeFiles/gtest.dir/cmake_clean_target.cmake
cd /work/build/linux-x64/thirdparty/googletest/googletest && /usr/bin/cmake -E cmake_link_script CMakeFiles/gtest.dir/link.txt --verbose=1
/usr/bin/x86_64-linux-gnu-ar qc ../../../lib/libgtest.a  CMakeFiles/gtest.dir/src/gtest-all.cc.o
/usr/bin/x86_64-linux-gnu-ranlib ../../../lib/libgtest.a
make[2]: Leaving directory '/work/build/linux-x64'
[ 24%] Built target gtest
make[1]: Leaving directory '/work/build/linux-x64'
make: *** [all] Error 2
Makefile:143: recipe for target 'all' failed
make: Leaving directory '/work/build/linux-x64'