FailedConsole Output

Skipping 1,090 KB.. Full Log
              ^~~~~~~~~~~
In file included from /work/thirdparty/xerces-c/src/xercesc/validators/datatype/DatatypeValidator.hpp:30,
                 from /work/thirdparty/xerces-c/src/xercesc/framework/XMLAttr.hpp:28,
                 from /work/thirdparty/xerces-c/src/xercesc/framework/XMLValidator.hpp:25,
                 from /work/thirdparty/xerces-c/src/xercesc/sax2/SAX2XMLReader.hpp:27,
                 from /work/thirdparty/xerces-c/src/xercesc/sax2/XMLReaderFactory.hpp:25,
                 from /work/thirdparty/xerces-c/samples/src/SAX2Count/SAX2Count.hpp:36,
                 from /work/thirdparty/xerces-c/samples/src/SAX2Count/SAX2Count.cpp:26:
/work/thirdparty/xerces-c/src/xercesc/validators/schema/SchemaSymbols.hpp:33:25: warning: 'class xercesc_3_2::SchemaSymbols' only defines private constructors and has no friends [-Wctor-dtor-privacy]
   33 | class VALIDATORS_EXPORT SchemaSymbols
      |                         ^~~~~~~~~~~~~
In file included from /work/thirdparty/xerces-c/src/xercesc/framework/psvi/XSObject.hpp:26,
                 from /work/thirdparty/xerces-c/src/xercesc/framework/psvi/XSTypeDefinition.hpp:25,
                 from /work/thirdparty/xerces-c/src/xercesc/framework/psvi/XSSimpleTypeDefinition.hpp:25,
                 from /work/thirdparty/xerces-c/src/xercesc/validators/datatype/DatatypeValidator.hpp:32,
                 from /work/thirdparty/xerces-c/src/xercesc/framework/XMLAttr.hpp:28,
                 from /work/thirdparty/xerces-c/src/xercesc/framework/XMLValidator.hpp:25,
                 from /work/thirdparty/xerces-c/src/xercesc/sax2/SAX2XMLReader.hpp:27,
                 from /work/thirdparty/xerces-c/src/xercesc/sax2/XMLReaderFactory.hpp:25,
                 from /work/thirdparty/xerces-c/samples/src/SAX2Count/SAX2Count.hpp:36,
                 from /work/thirdparty/xerces-c/samples/src/SAX2Count/SAX2Count.cpp:26:
/work/thirdparty/xerces-c/src/xercesc/framework/psvi/XSConstants.hpp:56:24: warning: 'class xercesc_3_2::XSConstants' only defines private constructors and has no friends [-Wctor-dtor-privacy]
   56 | class XMLPARSER_EXPORT XSConstants
      |                        ^~~~~~~~~~~
make[2]: Leaving directory '/work/build/win-x64/xerces-c'
/work/thirdparty/xerces-c/samples/src/SAX2Count/SAX2Count.cpp:40:6: warning: no previous declaration for 'void usage()' [-Wmissing-declarations]
   40 | void usage()
      |      ^~~~~
[ 93%] Built target SAXCount
[ 93%] Building CXX object samples/CMakeFiles/SAX2Count.dir/src/SAX2Count/SAX2CountHandlers.cpp.obj
/work/thirdparty/xerces-c/samples/src/SAX2Count/SAX2Count.cpp: In function 'int main(int, char**)':
/work/thirdparty/xerces-c/samples/src/SAX2Count/SAX2Count.cpp:163:21: warning: 'char* strncpy(char*, const char*, size_t)' specified bound 64 equals destination size [-Wstringop-truncation]
  163 |              strncpy(localeStr, &(argV[argInd][8]), sizeof localeStr);
      |              ~~~~~~~^~~~~~~~~~~~~~~~~~~~~~~~~~~~~~~~~~~~~~~~~~~~~~~~~
make[2]: Leaving directory '/work/build/win-x64/xerces-c'
[ 93%] Building CXX object samples/CMakeFiles/PParse.dir/src/PParse/PParseHandlers.cpp.obj
In file included from /work/thirdparty/xerces-c/src/xercesc/validators/datatype/DatatypeValidator.hpp:30,
                 from /work/thirdparty/xerces-c/src/xercesc/framework/XMLAttr.hpp:28,
                 from /work/thirdparty/xerces-c/src/xercesc/framework/XMLValidator.hpp:25,
                 from /work/thirdparty/xerces-c/src/xercesc/sax2/SAX2XMLReader.hpp:27,
                 from /work/thirdparty/xerces-c/src/xercesc/sax2/XMLReaderFactory.hpp:25,
                 from /work/thirdparty/xerces-c/samples/src/SAX2Count/SAX2Count.hpp:36,
                 from /work/thirdparty/xerces-c/samples/src/SAX2Count/SAX2CountHandlers.cpp:25:
/work/thirdparty/xerces-c/src/xercesc/validators/schema/SchemaSymbols.hpp:33:25: warning: 'class xercesc_3_2::SchemaSymbols' only defines private constructors and has no friends [-Wctor-dtor-privacy]
   33 | class VALIDATORS_EXPORT SchemaSymbols
      |                         ^~~~~~~~~~~~~
In file included from /work/thirdparty/xerces-c/src/xercesc/framework/psvi/XSObject.hpp:26,
                 from /work/thirdparty/xerces-c/src/xercesc/framework/psvi/XSTypeDefinition.hpp:25,
                 from /work/thirdparty/xerces-c/src/xercesc/framework/psvi/XSSimpleTypeDefinition.hpp:25,
                 from /work/thirdparty/xerces-c/src/xercesc/validators/datatype/DatatypeValidator.hpp:32,
                 from /work/thirdparty/xerces-c/src/xercesc/framework/XMLAttr.hpp:28,
                 from /work/thirdparty/xerces-c/src/xercesc/framework/XMLValidator.hpp:25,
                 from /work/thirdparty/xerces-c/src/xercesc/sax2/SAX2XMLReader.hpp:27,
                 from /work/thirdparty/xerces-c/src/xercesc/sax2/XMLReaderFactory.hpp:25,
                 from /work/thirdparty/xerces-c/samples/src/SAX2Count/SAX2Count.hpp:36,
                 from /work/thirdparty/xerces-c/samples/src/SAX2Count/SAX2CountHandlers.cpp:25:
/work/thirdparty/xerces-c/src/xercesc/framework/psvi/XSConstants.hpp:56:24: warning: 'class xercesc_3_2::XSConstants' only defines private constructors and has no friends [-Wctor-dtor-privacy]
   56 | class XMLPARSER_EXPORT XSConstants
      |                        ^~~~~~~~~~~
[ 93%] Building CXX object samples/CMakeFiles/DOMPrint.dir/src/DOMPrint/DOMPrintErrorHandler.cpp.obj
make[2]: Entering directory '/work/build/win-x64/xerces-c'
[ 93%] Built target DOMTest
make[2]: Entering directory '/work/build/win-x64/xerces-c'
[ 93%] Linking CXX executable SAX2Count.exe
Scanning dependencies of target EnumVal
make[2]: Leaving directory '/work/build/win-x64/xerces-c'
make[2]: Entering directory '/work/build/win-x64/xerces-c'
[ 93%] Building CXX object samples/CMakeFiles/EnumVal.dir/src/EnumVal/EnumVal.cpp.obj
make[2]: Leaving directory '/work/build/win-x64/xerces-c'
[ 93%] Built target MemParse
make[2]: Entering directory '/work/build/win-x64/xerces-c'
[ 93%] Building CXX object samples/CMakeFiles/PSVIWriter.dir/src/PSVIWriter/PSVIWriterHandlers.cpp.obj
Scanning dependencies of target SAXPrint
make[2]: Leaving directory '/work/build/win-x64/xerces-c'
make[2]: Entering directory '/work/build/win-x64/xerces-c'
In file included from /work/thirdparty/xerces-c/src/xercesc/validators/datatype/DatatypeValidator.hpp:30,
                 from /work/thirdparty/xerces-c/src/xercesc/framework/XMLAttr.hpp:28,
                 from /work/thirdparty/xerces-c/src/xercesc/framework/XMLValidator.hpp:25,
                 from /work/thirdparty/xerces-c/samples/src/EnumVal/EnumVal.cpp:27:
/work/thirdparty/xerces-c/src/xercesc/validators/schema/SchemaSymbols.hpp:33:25: warning: 'class xercesc_3_2::SchemaSymbols' only defines private constructors and has no friends [-Wctor-dtor-privacy]
   33 | class VALIDATORS_EXPORT SchemaSymbols
      |                         ^~~~~~~~~~~~~
In file included from /work/thirdparty/xerces-c/src/xercesc/framework/psvi/XSObject.hpp:26,
                 from /work/thirdparty/xerces-c/src/xercesc/framework/psvi/XSTypeDefinition.hpp:25,
                 from /work/thirdparty/xerces-c/src/xercesc/framework/psvi/XSSimpleTypeDefinition.hpp:25,
                 from /work/thirdparty/xerces-c/src/xercesc/validators/datatype/DatatypeValidator.hpp:32,
                 from /work/thirdparty/xerces-c/src/xercesc/framework/XMLAttr.hpp:28,
                 from /work/thirdparty/xerces-c/src/xercesc/framework/XMLValidator.hpp:25,
                 from /work/thirdparty/xerces-c/samples/src/EnumVal/EnumVal.cpp:27:
/work/thirdparty/xerces-c/src/xercesc/framework/psvi/XSConstants.hpp:56:24: warning: 'class xercesc_3_2::XSConstants' only defines private constructors and has no friends [-Wctor-dtor-privacy]
   56 | class XMLPARSER_EXPORT XSConstants
      |                        ^~~~~~~~~~~
[ 93%] Building CXX object samples/CMakeFiles/SAXPrint.dir/src/SAXPrint/SAXPrint.cpp.obj
In file included from /work/thirdparty/xerces-c/samples/src/PSVIWriter/PSVIWriterHandlers.hpp:26,
                 from /work/thirdparty/xerces-c/samples/src/PSVIWriter/PSVIWriterHandlers.cpp:21:
/work/thirdparty/xerces-c/src/xercesc/framework/psvi/XSConstants.hpp:56:24: warning: 'class xercesc_3_2::XSConstants' only defines private constructors and has no friends [-Wctor-dtor-privacy]
   56 | class XMLPARSER_EXPORT XSConstants
      |                        ^~~~~~~~~~~
In file included from /work/thirdparty/xerces-c/src/xercesc/validators/datatype/DatatypeValidator.hpp:30,
                 from /work/thirdparty/xerces-c/src/xercesc/framework/psvi/PSVIAttribute.hpp:27,
                 from /work/thirdparty/xerces-c/samples/src/PSVIWriter/PSVIWriterHandlers.hpp:28,
                 from /work/thirdparty/xerces-c/samples/src/PSVIWriter/PSVIWriterHandlers.cpp:21:
/work/thirdparty/xerces-c/src/xercesc/validators/schema/SchemaSymbols.hpp:33:25: warning: 'class xercesc_3_2::SchemaSymbols' only defines private constructors and has no friends [-Wctor-dtor-privacy]
   33 | class VALIDATORS_EXPORT SchemaSymbols
      |                         ^~~~~~~~~~~~~
Scanning dependencies of target SEnumVal
make[2]: Leaving directory '/work/build/win-x64/xerces-c'
make[2]: Entering directory '/work/build/win-x64/xerces-c'
[ 93%] Building CXX object samples/CMakeFiles/SEnumVal.dir/src/SEnumVal/SEnumVal.cpp.obj
In file included from /work/thirdparty/xerces-c/samples/src/PSVIWriter/PSVIWriterHandlers.cpp:21:
/work/thirdparty/xerces-c/samples/src/PSVIWriter/PSVIWriterHandlers.hpp: In destructor 'AttrInfo::~AttrInfo()':
/work/thirdparty/xerces-c/samples/src/PSVIWriter/PSVIWriterHandlers.hpp:75:32: warning: cast from type 'const XMLCh**' {aka 'const char16_t**'} to type 'XMLCh**' {aka 'char16_t**'} casts away qualifiers [-Wcast-qual]
   75 |   XMLString::release((XMLCh**)&uri);
      |                                ^~~
/work/thirdparty/xerces-c/samples/src/PSVIWriter/PSVIWriterHandlers.hpp:76:32: warning: cast from type 'const XMLCh**' {aka 'const char16_t**'} to type 'XMLCh**' {aka 'char16_t**'} casts away qualifiers [-Wcast-qual]
   76 |   XMLString::release((XMLCh**)&name);
      |                                ^~~~
/work/thirdparty/xerces-c/samples/src/PSVIWriter/PSVIWriterHandlers.hpp:77:32: warning: cast from type 'const XMLCh**' {aka 'const char16_t**'} to type 'XMLCh**' {aka 'char16_t**'} casts away qualifiers [-Wcast-qual]
   77 |   XMLString::release((XMLCh**)&type);
      |                                ^~~~
/work/thirdparty/xerces-c/samples/src/PSVIWriter/PSVIWriterHandlers.hpp:78:32: warning: cast from type 'const XMLCh**' {aka 'const char16_t**'} to type 'XMLCh**' {aka 'char16_t**'} casts away qualifiers [-Wcast-qual]
   78 |   XMLString::release((XMLCh**)&value);
      |                                ^~~~~
[ 93%] Building CXX object samples/CMakeFiles/DOMPrint.dir/src/DOMPrint/DOMPrintFilter.cpp.obj
[ 93%] Linking CXX executable XSValueTest.exe
/work/thirdparty/xerces-c/samples/src/PSVIWriter/PSVIWriterHandlers.cpp: In member function 'virtual void PSVIWriterHandlers::startDocument()':
/work/thirdparty/xerces-c/samples/src/PSVIWriter/PSVIWriterHandlers.cpp:206:32: warning: cast from type 'const XMLCh*' {aka 'const char16_t*'} to type 'XMLCh*' {aka 'char16_t*'} casts away qualifiers [-Wcast-qual]
  206 |  fAttrList->addElement((XMLCh*)gXmlnsColonXsi);
      |                                ^~~~~~~~~~~~~~
/work/thirdparty/xerces-c/samples/src/PSVIWriter/PSVIWriterHandlers.cpp:207:41: warning: cast from type 'const XMLCh*' {aka 'const char16_t*'} to type 'XMLCh*' {aka 'char16_t*'} casts away qualifiers [-Wcast-qual]
  207 |  fAttrList->addElement((XMLCh*)PSVIUni::fgNamespaceInstance);
      |                                         ^~~~~~~~~~~~~~~~~~~
/work/thirdparty/xerces-c/samples/src/PSVIWriter/PSVIWriterHandlers.cpp:208:32: warning: cast from type 'const XMLCh*' {aka 'const char16_t*'} to type 'XMLCh*' {aka 'char16_t*'} casts away qualifiers [-Wcast-qual]
  208 |  fAttrList->addElement((XMLCh*)gXmlnsColonPsv);
      |                                ^~~~~~~~~~~~~~
/work/thirdparty/xerces-c/samples/src/PSVIWriter/PSVIWriterHandlers.cpp:209:41: warning: cast from type 'const XMLCh*' {aka 'const char16_t*'} to type 'XMLCh*' {aka 'char16_t*'} casts away qualifiers [-Wcast-qual]
  209 |  fAttrList->addElement((XMLCh*)PSVIUni::fgNamespacePsvi);
      |                                         ^~~~~~~~~~~~~~~
/work/thirdparty/xerces-c/samples/src/PSVIWriter/PSVIWriterHandlers.cpp:210:40: warning: cast from type 'const XMLCh*' {aka 'const char16_t*'} to type 'XMLCh*' {aka 'char16_t*'} casts away qualifiers [-Wcast-qual]
  210 |  fAttrList->addElement((XMLCh*)XMLUni::fgXMLNSString);
      |                                        ^~~~~~~~~~~~~
/work/thirdparty/xerces-c/samples/src/PSVIWriter/PSVIWriterHandlers.cpp:211:41: warning: cast from type 'const XMLCh*' {aka 'const char16_t*'} to type 'XMLCh*' {aka 'char16_t*'} casts away qualifiers [-Wcast-qual]
  211 |  fAttrList->addElement((XMLCh*)PSVIUni::fgNamespaceInfoset);
      |                                         ^~~~~~~~~~~~~~~~~~
/work/thirdparty/xerces-c/samples/src/PSVIWriter/PSVIWriterHandlers.cpp: In member function 'virtual void PSVIWriterHandlers::startPrefixMapping(const XMLCh*, const XMLCh*)':
/work/thirdparty/xerces-c/samples/src/PSVIWriter/PSVIWriterHandlers.cpp:260:50: warning: cast from type 'const XMLCh* const' {aka 'const char16_t* const'} to type 'XMLCh*' {aka 'char16_t*'} casts away qualifiers [-Wcast-qual]
  260 |   XMLCh* permaUri = XMLString::replicate((XMLCh*)uri);
      |                                                  ^~~
/work/thirdparty/xerces-c/samples/src/PSVIWriter/PSVIWriterHandlers.cpp:261:53: warning: cast from type 'const XMLCh* const' {aka 'const char16_t* const'} to type 'XMLCh*' {aka 'char16_t*'} casts away qualifiers [-Wcast-qual]
  261 |   XMLCh* permaPrefix = XMLString::replicate((XMLCh*)prefix);
      |                                                     ^~~~~~
In file included from /work/thirdparty/xerces-c/src/xercesc/util/NameIdPool.hpp:204,
                 from /work/thirdparty/xerces-c/samples/src/EnumVal/EnumVal.cpp:25:
/work/thirdparty/xerces-c/src/xercesc/util/NameIdPool.c: In instantiation of 'XMLSize_t xercesc_3_2::NameIdPool<TElem>::put(TElem*) [with TElem = xercesc_3_2::DTDEntityDecl; XMLSize_t = long long unsigned int]':
/work/thirdparty/xerces-c/src/xercesc/validators/DTD/DTDGrammar.hpp:280:43:   required from here
/work/thirdparty/xerces-c/src/xercesc/util/NameIdPool.c:166:21: warning: cast from type 'const XMLCh*' {aka 'const char16_t*'} to type 'void*' casts away qualifiers [-Wcast-qual]
  166 |     fBucketList.put((void*)elemToAdopt->getKey(), elemToAdopt);
/work/thirdparty/xerces-c/src/xercesc/util/NameIdPool.c: In instantiation of 'XMLSize_t xercesc_3_2::NameIdPool<TElem>::put(TElem*) [with TElem = xercesc_3_2::DTDElementDecl; XMLSize_t = long long unsigned int]':
/work/thirdparty/xerces-c/src/xercesc/validators/DTD/DTDGrammar.hpp:357:64:   required from here
/work/thirdparty/xerces-c/src/xercesc/util/NameIdPool.c:166:21: warning: cast from type 'const XMLCh*' {aka 'const char16_t*'} to type 'void*' casts away qualifiers [-Wcast-qual]
/work/thirdparty/xerces-c/src/xercesc/util/NameIdPool.c: In instantiation of 'XMLSize_t xercesc_3_2::NameIdPool<TElem>::put(TElem*) [with TElem = xercesc_3_2::XMLNotationDecl; XMLSize_t = long long unsigned int]':
/work/thirdparty/xerces-c/src/xercesc/validators/DTD/DTDGrammar.hpp:376:47:   required from here
/work/thirdparty/xerces-c/src/xercesc/util/NameIdPool.c:166:21: warning: cast from type 'const XMLCh*' {aka 'const char16_t*'} to type 'void*' casts away qualifiers [-Wcast-qual]
/work/thirdparty/xerces-c/samples/src/PSVIWriter/PSVIWriterHandlers.cpp: In member function 'void PSVIWriterHandlers::processScope(xercesc_3_2::XSComplexTypeDefinition*, short int)':
/work/thirdparty/xerces-c/samples/src/PSVIWriter/PSVIWriterHandlers.cpp:1050:9: warning: switch missing default case [-Wswitch-default]
 1050 |  switch (scope) {
      |         ^
/work/thirdparty/xerces-c/samples/src/PSVIWriter/PSVIWriterHandlers.cpp: In member function 'void PSVIWriterHandlers::sendReference(const XMLCh*, xercesc_3_2::XSObject*)':
/work/thirdparty/xerces-c/samples/src/PSVIWriter/PSVIWriterHandlers.cpp:1223:33: warning: cast from type 'const XMLCh*' {aka 'const char16_t*'} to type 'XMLCh*' {aka 'char16_t*'} casts away qualifiers [-Wcast-qual]
 1223 |   fAttrList->addElement((XMLCh*)gRef);
      |                                 ^~~~
/work/thirdparty/xerces-c/samples/src/PSVIWriter/PSVIWriterHandlers.cpp:1224:46: warning: cast from type 'const XMLCh*' {aka 'const char16_t*'} to type 'XMLCh*' {aka 'char16_t*'} casts away qualifiers [-Wcast-qual]
 1224 |   fAttrList->addElement((XMLCh*)getIdName(obj));
      |                                              ^
/work/thirdparty/xerces-c/samples/src/PSVIWriter/PSVIWriterHandlers.cpp:1225:33: warning: cast from type 'const XMLCh*' {aka 'const char16_t*'} to type 'XMLCh*' {aka 'char16_t*'} casts away qualifiers [-Wcast-qual]
 1225 |   fAttrList->addElement((XMLCh*)fgXsiNil);
      |                                 ^~~~~~~~
/work/thirdparty/xerces-c/samples/src/PSVIWriter/PSVIWriterHandlers.cpp:1226:42: warning: cast from type 'const XMLCh*' {aka 'const char16_t*'} to type 'XMLCh*' {aka 'char16_t*'} casts away qualifiers [-Wcast-qual]
 1226 |   fAttrList->addElement((XMLCh*)PSVIUni::fgTrue);
      |                                          ^~~~~~
/work/thirdparty/xerces-c/samples/src/PSVIWriter/PSVIWriterHandlers.cpp: In member function 'void PSVIWriterHandlers::sendElementEmpty(const XMLCh*)':
/work/thirdparty/xerces-c/samples/src/PSVIWriter/PSVIWriterHandlers.cpp:1233:32: warning: cast from type 'const XMLCh*' {aka 'const char16_t*'} to type 'XMLCh*' {aka 'char16_t*'} casts away qualifiers [-Wcast-qual]
 1233 |  fAttrList->addElement((XMLCh*)fgXsiNil);
      |                                ^~~~~~~~
/work/thirdparty/xerces-c/samples/src/PSVIWriter/PSVIWriterHandlers.cpp:1234:41: warning: cast from type 'const XMLCh*' {aka 'const char16_t*'} to type 'XMLCh*' {aka 'char16_t*'} casts away qualifiers [-Wcast-qual]
 1234 |  fAttrList->addElement((XMLCh*)PSVIUni::fgTrue);
      |                                         ^~~~~~
/work/thirdparty/xerces-c/samples/src/PSVIWriter/PSVIWriterHandlers.cpp: In member function 'void PSVIWriterHandlers::sendIndentedElementWithID(const XMLCh*, xercesc_3_2::XSObject*)':
/work/thirdparty/xerces-c/samples/src/PSVIWriter/PSVIWriterHandlers.cpp:1267:32: warning: cast from type 'const XMLCh*' {aka 'const char16_t*'} to type 'XMLCh*' {aka 'char16_t*'} casts away qualifiers [-Wcast-qual]
 1267 |  fAttrList->addElement((XMLCh*)gId);
      |                                ^~~
/work/thirdparty/xerces-c/samples/src/PSVIWriter/PSVIWriterHandlers.cpp:1268:45: warning: cast from type 'const XMLCh*' {aka 'const char16_t*'} to type 'XMLCh*' {aka 'char16_t*'} casts away qualifiers [-Wcast-qual]
 1268 |  fAttrList->addElement((XMLCh*)getIdName(obj));
      |                                             ^
[ 93%] Linking CXX executable PParse.exe
In file included from /work/thirdparty/xerces-c/src/xercesc/validators/datatype/DatatypeValidator.hpp:30,
                 from /work/thirdparty/xerces-c/src/xercesc/framework/XMLAttr.hpp:28,
                 from /work/thirdparty/xerces-c/src/xercesc/internal/VecAttrListImpl.hpp:26,
                 from /work/thirdparty/xerces-c/src/xercesc/parsers/SAXParser.hpp:26,
                 from /work/thirdparty/xerces-c/samples/src/SAXPrint/SAXPrint.cpp:28:
/work/thirdparty/xerces-c/src/xercesc/validators/schema/SchemaSymbols.hpp:33:25: warning: 'class xercesc_3_2::SchemaSymbols' only defines private constructors and has no friends [-Wctor-dtor-privacy]
   33 | class VALIDATORS_EXPORT SchemaSymbols
      |                         ^~~~~~~~~~~~~
In file included from /work/thirdparty/xerces-c/src/xercesc/framework/psvi/XSObject.hpp:26,
                 from /work/thirdparty/xerces-c/src/xercesc/framework/psvi/XSTypeDefinition.hpp:25,
                 from /work/thirdparty/xerces-c/src/xercesc/framework/psvi/XSSimpleTypeDefinition.hpp:25,
                 from /work/thirdparty/xerces-c/src/xercesc/validators/datatype/DatatypeValidator.hpp:32,
                 from /work/thirdparty/xerces-c/src/xercesc/framework/XMLAttr.hpp:28,
                 from /work/thirdparty/xerces-c/src/xercesc/internal/VecAttrListImpl.hpp:26,
                 from /work/thirdparty/xerces-c/src/xercesc/parsers/SAXParser.hpp:26,
                 from /work/thirdparty/xerces-c/samples/src/SAXPrint/SAXPrint.cpp:28:
/work/thirdparty/xerces-c/src/xercesc/framework/psvi/XSConstants.hpp:56:24: warning: 'class xercesc_3_2::XSConstants' only defines private constructors and has no friends [-Wctor-dtor-privacy]
   56 | class XMLPARSER_EXPORT XSConstants
      |                        ^~~~~~~~~~~
In file included from /work/thirdparty/xerces-c/src/xercesc/validators/datatype/DatatypeValidator.hpp:30,
                 from /work/thirdparty/xerces-c/src/xercesc/framework/XMLAttr.hpp:28,
                 from /work/thirdparty/xerces-c/src/xercesc/framework/XMLValidator.hpp:25,
                 from /work/thirdparty/xerces-c/samples/src/SEnumVal/SEnumVal.cpp:26:
/work/thirdparty/xerces-c/src/xercesc/validators/schema/SchemaSymbols.hpp:33:25: warning: 'class xercesc_3_2::SchemaSymbols' only defines private constructors and has no friends [-Wctor-dtor-privacy]
   33 | class VALIDATORS_EXPORT SchemaSymbols
      |                         ^~~~~~~~~~~~~
In file included from /work/thirdparty/xerces-c/src/xercesc/framework/psvi/XSObject.hpp:26,
                 from /work/thirdparty/xerces-c/src/xercesc/framework/psvi/XSTypeDefinition.hpp:25,
                 from /work/thirdparty/xerces-c/src/xercesc/framework/psvi/XSSimpleTypeDefinition.hpp:25,
                 from /work/thirdparty/xerces-c/src/xercesc/validators/datatype/DatatypeValidator.hpp:32,
                 from /work/thirdparty/xerces-c/src/xercesc/framework/XMLAttr.hpp:28,
                 from /work/thirdparty/xerces-c/src/xercesc/framework/XMLValidator.hpp:25,
                 from /work/thirdparty/xerces-c/samples/src/SEnumVal/SEnumVal.cpp:26:
/work/thirdparty/xerces-c/src/xercesc/framework/psvi/XSConstants.hpp:56:24: warning: 'class xercesc_3_2::XSConstants' only defines private constructors and has no friends [-Wctor-dtor-privacy]
   56 | class XMLPARSER_EXPORT XSConstants
      |                        ^~~~~~~~~~~
/work/thirdparty/xerces-c/samples/src/SEnumVal/SEnumVal.cpp: In function 'void processDatatypeValidator(const xercesc_3_2::DatatypeValidator*, bool)':
/work/thirdparty/xerces-c/samples/src/SEnumVal/SEnumVal.cpp:398:11: warning: switch missing default case [-Wswitch-default]
  398 |     switch( dtValidator->getType() )
      |           ^
/work/thirdparty/xerces-c/samples/src/SEnumVal/SEnumVal.cpp:450:56: warning: cast from type 'const XMLCh*' {aka 'const char16_t*'} to type 'XMLCh*' {aka 'char16_t*'} casts away qualifiers [-Wcast-qual]
  450 |                     sortedList.insertElementAt((XMLCh*)key,i);
      |                                                        ^~~
/work/thirdparty/xerces-c/samples/src/SEnumVal/SEnumVal.cpp:454:47: warning: cast from type 'const XMLCh*' {aka 'const char16_t*'} to type 'XMLCh*' {aka 'char16_t*'} casts away qualifiers [-Wcast-qual]
  454 |                 sortedList.addElement((XMLCh*)key);
      |                                               ^~~
/work/thirdparty/xerces-c/samples/src/SEnumVal/SEnumVal.cpp:467:79: warning: cast from type 'const xercesc_3_2::RefArrayVectorOf<char16_t>*' to type 'xercesc_3_2::RefVectorOf<char16_t>*' casts away qualifiers [-Wcast-qual]
  467 |  RefVectorOf<XMLCh>* enums = (RefVectorOf<XMLCh>*) dtValidator->getEnumString();
      |                                                                               ^
/work/thirdparty/xerces-c/samples/src/SEnumVal/SEnumVal.cpp: In function 'void processContentSpecNode(const xercesc_3_2::ContentSpecNode*, bool)':
/work/thirdparty/xerces-c/samples/src/SEnumVal/SEnumVal.cpp:494:11: warning: switch missing default case [-Wswitch-default]
  494 |     switch( cSpecNode->getType() )
      |           ^
In file included from /work/thirdparty/xerces-c/src/xercesc/util/NameIdPool.hpp:204,
                 from /work/thirdparty/xerces-c/samples/src/SEnumVal/SEnumVal.cpp:24:
/work/thirdparty/xerces-c/src/xercesc/util/NameIdPool.c: In instantiation of 'XMLSize_t xercesc_3_2::NameIdPool<TElem>::put(TElem*) [with TElem = xercesc_3_2::XMLNotationDecl; XMLSize_t = long long unsigned int]':
/work/thirdparty/xerces-c/src/xercesc/validators/schema/SchemaGrammar.hpp:587:47:   required from here
/work/thirdparty/xerces-c/src/xercesc/util/NameIdPool.c:166:21: warning: cast from type 'const XMLCh*' {aka 'const char16_t*'} to type 'void*' casts away qualifiers [-Wcast-qual]
  166 |     fBucketList.put((void*)elemToAdopt->getKey(), elemToAdopt);
make[2]: Leaving directory '/work/build/win-x64/xerces-c'
[ 93%] Built target SAX2Count
[ 94%] Building CXX object samples/CMakeFiles/DOMPrint.dir/src/DOMPrint/DOMTreeErrorReporter.cpp.obj
[ 95%] Linking CXX executable EnumVal.exe
[ 96%] Building CXX object samples/CMakeFiles/SAXPrint.dir/src/SAXPrint/SAXPrintHandlers.cpp.obj
[ 96%] Linking CXX executable SEnumVal.exe
make[2]: Entering directory '/work/build/win-x64/xerces-c'
[ 96%] Linking CXX executable DOMPrint.exe
Scanning dependencies of target SAX2Print
make[2]: Leaving directory '/work/build/win-x64/xerces-c'
make[2]: Entering directory '/work/build/win-x64/xerces-c'
[ 97%] Building CXX object samples/CMakeFiles/SAX2Print.dir/src/SAX2Print/SAX2FilterHandlers.cpp.obj
/work/thirdparty/xerces-c/samples/src/SAXPrint/SAXPrintHandlers.cpp: In member function 'virtual void SAXPrintHandlers::writeChars(const XMLByte*, XMLSize_t, xercesc_3_2::XMLFormatter*)':
/work/thirdparty/xerces-c/samples/src/SAXPrint/SAXPrintHandlers.cpp:106:46: warning: cast from type 'const XMLByte* const' {aka 'const unsigned char* const'} to type 'char*' casts away qualifiers [-Wcast-qual]
  106 |     XERCES_STD_QUALIFIER cout.write((char *) toWrite, (int) count);
      |                                              ^~~~~~~
[ 97%] Linking CXX executable SAXPrint.exe
In file included from /work/thirdparty/xerces-c/src/xercesc/validators/datatype/DatatypeValidator.hpp:30,
                 from /work/thirdparty/xerces-c/src/xercesc/framework/XMLAttr.hpp:28,
                 from /work/thirdparty/xerces-c/src/xercesc/framework/XMLValidator.hpp:25,
                 from /work/thirdparty/xerces-c/src/xercesc/sax2/SAX2XMLReader.hpp:27,
                 from /work/thirdparty/xerces-c/src/xercesc/sax2/SAX2XMLFilter.hpp:25,
                 from /work/thirdparty/xerces-c/src/xercesc/parsers/SAX2XMLFilterImpl.hpp:25,
                 from /work/thirdparty/xerces-c/samples/src/SAX2Print/SAX2FilterHandlers.hpp:22,
                 from /work/thirdparty/xerces-c/samples/src/SAX2Print/SAX2FilterHandlers.cpp:26:
/work/thirdparty/xerces-c/src/xercesc/validators/schema/SchemaSymbols.hpp:33:25: warning: 'class xercesc_3_2::SchemaSymbols' only defines private constructors and has no friends [-Wctor-dtor-privacy]
   33 | class VALIDATORS_EXPORT SchemaSymbols
      |                         ^~~~~~~~~~~~~
In file included from /work/thirdparty/xerces-c/src/xercesc/framework/psvi/XSObject.hpp:26,
                 from /work/thirdparty/xerces-c/src/xercesc/framework/psvi/XSTypeDefinition.hpp:25,
                 from /work/thirdparty/xerces-c/src/xercesc/framework/psvi/XSSimpleTypeDefinition.hpp:25,
                 from /work/thirdparty/xerces-c/src/xercesc/validators/datatype/DatatypeValidator.hpp:32,
                 from /work/thirdparty/xerces-c/src/xercesc/framework/XMLAttr.hpp:28,
                 from /work/thirdparty/xerces-c/src/xercesc/framework/XMLValidator.hpp:25,
                 from /work/thirdparty/xerces-c/src/xercesc/sax2/SAX2XMLReader.hpp:27,
                 from /work/thirdparty/xerces-c/src/xercesc/sax2/SAX2XMLFilter.hpp:25,
                 from /work/thirdparty/xerces-c/src/xercesc/parsers/SAX2XMLFilterImpl.hpp:25,
                 from /work/thirdparty/xerces-c/samples/src/SAX2Print/SAX2FilterHandlers.hpp:22,
                 from /work/thirdparty/xerces-c/samples/src/SAX2Print/SAX2FilterHandlers.cpp:26:
/work/thirdparty/xerces-c/src/xercesc/framework/psvi/XSConstants.hpp:56:24: warning: 'class xercesc_3_2::XSConstants' only defines private constructors and has no friends [-Wctor-dtor-privacy]
   56 | class XMLPARSER_EXPORT XSConstants
      |                        ^~~~~~~~~~~
[ 97%] Linking CXX executable PSVIWriter.exe
make[2]: Leaving directory '/work/build/win-x64/xerces-c'
make[2]: Leaving directory '/work/build/win-x64/xerces-c'
make[2]: Leaving directory '/work/build/win-x64/xerces-c'
[ 97%] Built target EnumVal
[ 97%] Built target XSValueTest
[ 97%] Built target PParse
make[2]: Entering directory '/work/build/win-x64/xerces-c'
make[2]: Entering directory '/work/build/win-x64/xerces-c'
make[2]: Entering directory '/work/build/win-x64/xerces-c'
Scanning dependencies of target StdInParse
make[2]: Leaving directory '/work/build/win-x64/xerces-c'
make[2]: Leaving directory '/work/build/win-x64/xerces-c'
make[2]: Leaving directory '/work/build/win-x64/xerces-c'
[ 97%] Built target SEnumVal
[ 97%] Building CXX object samples/CMakeFiles/SAX2Print.dir/src/SAX2Print/SAX2Print.cpp.obj
Scanning dependencies of target XInclude
make[2]: Leaving directory '/work/build/win-x64/xerces-c'
[ 97%] Built target DOMPrint
make[2]: Entering directory '/work/build/win-x64/xerces-c'
make[2]: Entering directory '/work/build/win-x64/xerces-c'
[ 97%] Building CXX object samples/CMakeFiles/XInclude.dir/src/XInclude/XInclude.cpp.obj
[ 97%] Building CXX object samples/CMakeFiles/StdInParse.dir/src/StdInParse/StdInParse.cpp.obj
make[2]: Entering directory '/work/build/win-x64/xerces-c'
make[2]: Entering directory '/work/build/win-x64/xerces-c'
Scanning dependencies of target DOMCount
make[2]: Leaving directory '/work/build/win-x64/xerces-c'
make[2]: Entering directory '/work/build/win-x64/xerces-c'
Scanning dependencies of target SCMPrint
make[2]: Leaving directory '/work/build/win-x64/xerces-c'
[ 97%] Building CXX object samples/CMakeFiles/DOMCount.dir/src/DOMCount/DOMCount.cpp.obj
make[2]: Entering directory '/work/build/win-x64/xerces-c'
Scanning dependencies of target CreateDOMDocument
make[2]: Leaving directory '/work/build/win-x64/xerces-c'
[ 97%] Building CXX object samples/CMakeFiles/SCMPrint.dir/src/SCMPrint/SCMPrint.cpp.obj
make[2]: Entering directory '/work/build/win-x64/xerces-c'
[ 97%] Building CXX object samples/CMakeFiles/CreateDOMDocument.dir/src/CreateDOMDocument/CreateDOMDocument.cpp.obj
In file included from /work/thirdparty/xerces-c/src/xercesc/validators/datatype/DatatypeValidator.hpp:30,
                 from /work/thirdparty/xerces-c/src/xercesc/framework/XMLAttr.hpp:28,
                 from /work/thirdparty/xerces-c/src/xercesc/framework/XMLValidator.hpp:25,
                 from /work/thirdparty/xerces-c/src/xercesc/sax2/SAX2XMLReader.hpp:27,
                 from /work/thirdparty/xerces-c/samples/src/SAX2Print/SAX2Print.cpp:28:
/work/thirdparty/xerces-c/src/xercesc/validators/schema/SchemaSymbols.hpp:33:25: warning: 'class xercesc_3_2::SchemaSymbols' only defines private constructors and has no friends [-Wctor-dtor-privacy]
   33 | class VALIDATORS_EXPORT SchemaSymbols
      |                         ^~~~~~~~~~~~~
In file included from /work/thirdparty/xerces-c/src/xercesc/framework/psvi/XSObject.hpp:26,
                 from /work/thirdparty/xerces-c/src/xercesc/framework/psvi/XSTypeDefinition.hpp:25,
                 from /work/thirdparty/xerces-c/src/xercesc/framework/psvi/XSSimpleTypeDefinition.hpp:25,
                 from /work/thirdparty/xerces-c/src/xercesc/validators/datatype/DatatypeValidator.hpp:32,
                 from /work/thirdparty/xerces-c/src/xercesc/framework/XMLAttr.hpp:28,
                 from /work/thirdparty/xerces-c/src/xercesc/framework/XMLValidator.hpp:25,
                 from /work/thirdparty/xerces-c/src/xercesc/sax2/SAX2XMLReader.hpp:27,
                 from /work/thirdparty/xerces-c/samples/src/SAX2Print/SAX2Print.cpp:28:
/work/thirdparty/xerces-c/src/xercesc/framework/psvi/XSConstants.hpp:56:24: warning: 'class xercesc_3_2::XSConstants' only defines private constructors and has no friends [-Wctor-dtor-privacy]
   56 | class XMLPARSER_EXPORT XSConstants
      |                        ^~~~~~~~~~~
In file included from /work/thirdparty/xerces-c/src/xercesc/validators/datatype/DatatypeValidator.hpp:30,
                 from /work/thirdparty/xerces-c/src/xercesc/framework/XMLAttr.hpp:28,
                 from /work/thirdparty/xerces-c/src/xercesc/framework/XMLDocumentHandler.hpp:27,
                 from /work/thirdparty/xerces-c/src/xercesc/parsers/AbstractDOMParser.hpp:26,
                 from /work/thirdparty/xerces-c/samples/src/XInclude/XInclude.cpp:26:
/work/thirdparty/xerces-c/src/xercesc/validators/schema/SchemaSymbols.hpp:33:25: warning: 'class xercesc_3_2::SchemaSymbols' only defines private constructors and has no friends [-Wctor-dtor-privacy]
   33 | class VALIDATORS_EXPORT SchemaSymbols
      |                         ^~~~~~~~~~~~~
In file included from /work/thirdparty/xerces-c/src/xercesc/framework/psvi/XSObject.hpp:26,
                 from /work/thirdparty/xerces-c/src/xercesc/framework/psvi/XSTypeDefinition.hpp:25,
                 from /work/thirdparty/xerces-c/src/xercesc/framework/psvi/XSSimpleTypeDefinition.hpp:25,
                 from /work/thirdparty/xerces-c/src/xercesc/validators/datatype/DatatypeValidator.hpp:32,
                 from /work/thirdparty/xerces-c/src/xercesc/framework/XMLAttr.hpp:28,
                 from /work/thirdparty/xerces-c/src/xercesc/framework/XMLDocumentHandler.hpp:27,
                 from /work/thirdparty/xerces-c/src/xercesc/parsers/AbstractDOMParser.hpp:26,
                 from /work/thirdparty/xerces-c/samples/src/XInclude/XInclude.cpp:26:
/work/thirdparty/xerces-c/src/xercesc/framework/psvi/XSConstants.hpp:56:24: warning: 'class xercesc_3_2::XSConstants' only defines private constructors and has no friends [-Wctor-dtor-privacy]
   56 | class XMLPARSER_EXPORT XSConstants
      |                        ^~~~~~~~~~~
In file included from /work/thirdparty/xerces-c/src/xercesc/validators/datatype/DatatypeValidator.hpp:30,
                 from /work/thirdparty/xerces-c/src/xercesc/framework/XMLAttr.hpp:28,
                 from /work/thirdparty/xerces-c/src/xercesc/framework/XMLDocumentHandler.hpp:27,
                 from /work/thirdparty/xerces-c/src/xercesc/parsers/AbstractDOMParser.hpp:26,
                 from /work/thirdparty/xerces-c/samples/src/DOMCount/DOMCount.cpp:26:
/work/thirdparty/xerces-c/src/xercesc/validators/schema/SchemaSymbols.hpp:33:25: warning: 'class xercesc_3_2::SchemaSymbols' only defines private constructors and has no friends [-Wctor-dtor-privacy]
   33 | class VALIDATORS_EXPORT SchemaSymbols
      |                         ^~~~~~~~~~~~~
In file included from /work/thirdparty/xerces-c/src/xercesc/framework/psvi/XSObject.hpp:26,
                 from /work/thirdparty/xerces-c/src/xercesc/framework/psvi/XSTypeDefinition.hpp:25,
                 from /work/thirdparty/xerces-c/src/xercesc/framework/psvi/XSSimpleTypeDefinition.hpp:25,
                 from /work/thirdparty/xerces-c/src/xercesc/validators/datatype/DatatypeValidator.hpp:32,
                 from /work/thirdparty/xerces-c/src/xercesc/framework/XMLAttr.hpp:28,
                 from /work/thirdparty/xerces-c/src/xercesc/framework/XMLDocumentHandler.hpp:27,
                 from /work/thirdparty/xerces-c/src/xercesc/parsers/AbstractDOMParser.hpp:26,
                 from /work/thirdparty/xerces-c/samples/src/DOMCount/DOMCount.cpp:26:
/work/thirdparty/xerces-c/src/xercesc/framework/psvi/XSConstants.hpp:56:24: warning: 'class xercesc_3_2::XSConstants' only defines private constructors and has no friends [-Wctor-dtor-privacy]
   56 | class XMLPARSER_EXPORT XSConstants
      |                        ^~~~~~~~~~~
In file included from /work/thirdparty/xerces-c/src/xercesc/validators/datatype/DatatypeValidator.hpp:30,
                 from /work/thirdparty/xerces-c/src/xercesc/framework/XMLAttr.hpp:28,
                 from /work/thirdparty/xerces-c/src/xercesc/internal/VecAttrListImpl.hpp:26,
                 from /work/thirdparty/xerces-c/src/xercesc/parsers/SAXParser.hpp:26,
                 from /work/thirdparty/xerces-c/samples/src/StdInParse/StdInParse.cpp:27:
/work/thirdparty/xerces-c/src/xercesc/validators/schema/SchemaSymbols.hpp:33:25: warning: 'class xercesc_3_2::SchemaSymbols' only defines private constructors and has no friends [-Wctor-dtor-privacy]
   33 | class VALIDATORS_EXPORT SchemaSymbols
      |                         ^~~~~~~~~~~~~
In file included from /work/thirdparty/xerces-c/src/xercesc/framework/psvi/XSObject.hpp:26,
                 from /work/thirdparty/xerces-c/src/xercesc/framework/psvi/XSTypeDefinition.hpp:25,
                 from /work/thirdparty/xerces-c/src/xercesc/framework/psvi/XSSimpleTypeDefinition.hpp:25,
                 from /work/thirdparty/xerces-c/src/xercesc/validators/datatype/DatatypeValidator.hpp:32,
                 from /work/thirdparty/xerces-c/src/xercesc/framework/XMLAttr.hpp:28,
                 from /work/thirdparty/xerces-c/src/xercesc/internal/VecAttrListImpl.hpp:26,
                 from /work/thirdparty/xerces-c/src/xercesc/parsers/SAXParser.hpp:26,
                 from /work/thirdparty/xerces-c/samples/src/StdInParse/StdInParse.cpp:27:
/work/thirdparty/xerces-c/src/xercesc/framework/psvi/XSConstants.hpp:56:24: warning: 'class xercesc_3_2::XSConstants' only defines private constructors and has no friends [-Wctor-dtor-privacy]
   56 | class XMLPARSER_EXPORT XSConstants
      |                        ^~~~~~~~~~~
In file included from /work/thirdparty/xerces-c/src/xercesc/validators/datatype/DatatypeValidator.hpp:30,
                 from /work/thirdparty/xerces-c/src/xercesc/framework/XMLAttr.hpp:28,
                 from /work/thirdparty/xerces-c/src/xercesc/framework/XMLValidator.hpp:25,
                 from /work/thirdparty/xerces-c/src/xercesc/sax2/SAX2XMLReader.hpp:27,
                 from /work/thirdparty/xerces-c/samples/src/SCMPrint/SCMPrint.cpp:26:
/work/thirdparty/xerces-c/src/xercesc/validators/schema/SchemaSymbols.hpp:33:25: warning: 'class xercesc_3_2::SchemaSymbols' only defines private constructors and has no friends [-Wctor-dtor-privacy]
   33 | class VALIDATORS_EXPORT SchemaSymbols
      |                         ^~~~~~~~~~~~~
In file included from /work/thirdparty/xerces-c/src/xercesc/framework/psvi/XSObject.hpp:26,
                 from /work/thirdparty/xerces-c/src/xercesc/framework/psvi/XSTypeDefinition.hpp:25,
                 from /work/thirdparty/xerces-c/src/xercesc/framework/psvi/XSSimpleTypeDefinition.hpp:25,
                 from /work/thirdparty/xerces-c/src/xercesc/validators/datatype/DatatypeValidator.hpp:32,
                 from /work/thirdparty/xerces-c/src/xercesc/framework/XMLAttr.hpp:28,
                 from /work/thirdparty/xerces-c/src/xercesc/framework/XMLValidator.hpp:25,
                 from /work/thirdparty/xerces-c/src/xercesc/sax2/SAX2XMLReader.hpp:27,
                 from /work/thirdparty/xerces-c/samples/src/SCMPrint/SCMPrint.cpp:26:
/work/thirdparty/xerces-c/src/xercesc/framework/psvi/XSConstants.hpp:56:24: warning: 'class xercesc_3_2::XSConstants' only defines private constructors and has no friends [-Wctor-dtor-privacy]
   56 | class XMLPARSER_EXPORT XSConstants
      |                        ^~~~~~~~~~~
[ 97%] Linking CXX executable XInclude.exe
In file included from /work/thirdparty/xerces-c/src/xercesc/validators/datatype/DatatypeValidator.hpp:30,
                 from /work/thirdparty/xerces-c/src/xercesc/framework/XMLAttr.hpp:28,
                 from /work/thirdparty/xerces-c/src/xercesc/framework/XMLElementDecl.hpp:25,
                 from /work/thirdparty/xerces-c/src/xercesc/validators/common/Grammar.hpp:27,
                 from /work/thirdparty/xerces-c/src/xercesc/dom/DOMLSParser.hpp:29,
                 from /work/thirdparty/xerces-c/src/xercesc/dom/DOM.hpp:59,
                 from /work/thirdparty/xerces-c/samples/src/CreateDOMDocument/CreateDOMDocument.cpp:33:
/work/thirdparty/xerces-c/src/xercesc/validators/schema/SchemaSymbols.hpp:33:25: warning: 'class xercesc_3_2::SchemaSymbols' only defines private constructors and has no friends [-Wctor-dtor-privacy]
   33 | class VALIDATORS_EXPORT SchemaSymbols
      |                         ^~~~~~~~~~~~~
In file included from /work/thirdparty/xerces-c/src/xercesc/framework/psvi/XSObject.hpp:26,
                 from /work/thirdparty/xerces-c/src/xercesc/framework/psvi/XSTypeDefinition.hpp:25,
                 from /work/thirdparty/xerces-c/src/xercesc/framework/psvi/XSSimpleTypeDefinition.hpp:25,
                 from /work/thirdparty/xerces-c/src/xercesc/validators/datatype/DatatypeValidator.hpp:32,
                 from /work/thirdparty/xerces-c/src/xercesc/framework/XMLAttr.hpp:28,
                 from /work/thirdparty/xerces-c/src/xercesc/framework/XMLElementDecl.hpp:25,
                 from /work/thirdparty/xerces-c/src/xercesc/validators/common/Grammar.hpp:27,
                 from /work/thirdparty/xerces-c/src/xercesc/dom/DOMLSParser.hpp:29,
                 from /work/thirdparty/xerces-c/src/xercesc/dom/DOM.hpp:59,
                 from /work/thirdparty/xerces-c/samples/src/CreateDOMDocument/CreateDOMDocument.cpp:33:
/work/thirdparty/xerces-c/src/xercesc/framework/psvi/XSConstants.hpp:56:24: warning: 'class xercesc_3_2::XSConstants' only defines private constructors and has no friends [-Wctor-dtor-privacy]
   56 | class XMLPARSER_EXPORT XSConstants
      |                        ^~~~~~~~~~~
make[2]: Leaving directory '/work/build/win-x64/xerces-c'
[ 97%] Building CXX object samples/CMakeFiles/SAX2Print.dir/src/SAX2Print/SAX2PrintHandlers.cpp.obj
[ 97%] Built target SAXPrint
[ 98%] Building CXX object samples/CMakeFiles/StdInParse.dir/src/StdInParse/StdInParseHandlers.cpp.obj
make[2]: Leaving directory '/work/build/win-x64/xerces-c'
[ 98%] Built target PSVIWriter
/work/thirdparty/xerces-c/samples/src/StdInParse/StdInParse.cpp:60:6: warning: no previous declaration for 'void usage()' [-Wmissing-declarations]
   60 | void usage()
      |      ^~~~~
/work/thirdparty/xerces-c/samples/src/SCMPrint/SCMPrint.cpp: In function 'int main(int, char**)':
/work/thirdparty/xerces-c/samples/src/SCMPrint/SCMPrint.cpp:282:74: warning: cast from type 'const XMLCh*' {aka 'const char16_t*'} to type 'void*' casts away qualifiers [-Wcast-qual]
  282 |         parser->setProperty(XMLUni::fgXercesScannerName, (void *)XMLUni::fgSGXMLScanner);
      |                                                                          ^~~~~~~~~~~~~~
/work/thirdparty/xerces-c/samples/src/SCMPrint/SCMPrint.cpp: In function 'void printCompositorTypeConnector(xercesc_3_2::XSModelGroup::COMPOSITOR_TYPE)':
/work/thirdparty/xerces-c/samples/src/SCMPrint/SCMPrint.cpp:486:12: warning: switch missing default case [-Wswitch-default]
  486 |     switch (type) {
      |            ^
/work/thirdparty/xerces-c/samples/src/SAX2Print/SAX2PrintHandlers.cpp: In member function 'virtual void SAX2PrintHandlers::writeChars(const XMLByte*, XMLSize_t, xercesc_3_2::XMLFormatter*)':
/work/thirdparty/xerces-c/samples/src/SAX2Print/SAX2PrintHandlers.cpp:108:46: warning: cast from type 'const XMLByte* const' {aka 'const unsigned char* const'} to type 'char*' casts away qualifiers [-Wcast-qual]
  108 |     XERCES_STD_QUALIFIER cout.write((char *) toWrite, (int) count);
      |                                              ^~~~~~~
make[2]: Leaving directory '/work/build/win-x64/xerces-c'
[ 98%] Built target XInclude
[ 99%] Linking CXX executable CreateDOMDocument.exe
[ 99%] Linking CXX executable DOMCount.exe
[ 99%] Linking CXX executable StdInParse.exe
[100%] Linking CXX executable SCMPrint.exe
[100%] Linking CXX executable SAX2Print.exe
make[2]: Leaving directory '/work/build/win-x64/xerces-c'
[100%] Built target CreateDOMDocument
make[2]: Leaving directory '/work/build/win-x64/xerces-c'
[100%] Built target DOMCount
make[2]: Leaving directory '/work/build/win-x64/xerces-c'
make[2]: Leaving directory '/work/build/win-x64/xerces-c'
[100%] Built target StdInParse
[100%] Built target SAX2Print
make[2]: Leaving directory '/work/build/win-x64/xerces-c'
[100%] Built target SCMPrint
make[1]: Leaving directory '/work/build/win-x64/xerces-c'
make: Leaving directory '/work/build/win-x64/xerces-c'
make: Entering directory '/work/build/win-x64/xerces-c'
make[1]: Entering directory '/work/build/win-x64/xerces-c'
make[2]: Entering directory '/work/build/win-x64/xerces-c'
make[2]: Leaving directory '/work/build/win-x64/xerces-c'
[ 80%] Built target xerces-c
make[2]: Entering directory '/work/build/win-x64/xerces-c'
make[2]: Leaving directory '/work/build/win-x64/xerces-c'
[ 80%] Built target Char16Test
make[2]: Entering directory '/work/build/win-x64/xerces-c'
make[2]: Leaving directory '/work/build/win-x64/xerces-c'
[ 81%] Built target XSTSHarness
make[2]: Entering directory '/work/build/win-x64/xerces-c'
make[2]: Leaving directory '/work/build/win-x64/xerces-c'
[ 82%] Built target XSerializerTest
make[2]: Entering directory '/work/build/win-x64/xerces-c'
make[2]: Leaving directory '/work/build/win-x64/xerces-c'
[ 83%] Built target Normalizer
make[2]: Entering directory '/work/build/win-x64/xerces-c'
make[2]: Leaving directory '/work/build/win-x64/xerces-c'
[ 84%] Built target DOMMemTest
make[2]: Entering directory '/work/build/win-x64/xerces-c'
make[2]: Leaving directory '/work/build/win-x64/xerces-c'
[ 85%] Built target DOMTypeInfoTest
make[2]: Entering directory '/work/build/win-x64/xerces-c'
make[2]: Leaving directory '/work/build/win-x64/xerces-c'
[ 85%] Built target EncodingTest
make[2]: Entering directory '/work/build/win-x64/xerces-c'
make[2]: Leaving directory '/work/build/win-x64/xerces-c'
[ 85%] Built target DOMTraversalTest
make[2]: Entering directory '/work/build/win-x64/xerces-c'
make[2]: Leaving directory '/work/build/win-x64/xerces-c'
[ 86%] Built target RangeTest
make[2]: Entering directory '/work/build/win-x64/xerces-c'
make[2]: Leaving directory '/work/build/win-x64/xerces-c'
[ 86%] Built target InitTermTest
make[2]: Entering directory '/work/build/win-x64/xerces-c'
make[2]: Leaving directory '/work/build/win-x64/xerces-c'
[ 87%] Built target XSValueTest
make[2]: Entering directory '/work/build/win-x64/xerces-c'
make[2]: Leaving directory '/work/build/win-x64/xerces-c'
[ 88%] Built target MemHandlerTest
make[2]: Entering directory '/work/build/win-x64/xerces-c'
make[2]: Leaving directory '/work/build/win-x64/xerces-c'
[ 89%] Built target DOMTest
make[2]: Entering directory '/work/build/win-x64/xerces-c'
make[2]: Leaving directory '/work/build/win-x64/xerces-c'
[ 89%] Built target NetAccessorTest
make[2]: Entering directory '/work/build/win-x64/xerces-c'
make[2]: Leaving directory '/work/build/win-x64/xerces-c'
[ 90%] Built target SAXCount
make[2]: Entering directory '/work/build/win-x64/xerces-c'
make[2]: Leaving directory '/work/build/win-x64/xerces-c'
[ 91%] Built target Redirect
make[2]: Entering directory '/work/build/win-x64/xerces-c'
make[2]: Leaving directory '/work/build/win-x64/xerces-c'
[ 92%] Built target PSVIWriter
make[2]: Entering directory '/work/build/win-x64/xerces-c'
make[2]: Leaving directory '/work/build/win-x64/xerces-c'
[ 93%] Built target MemParse
make[2]: Entering directory '/work/build/win-x64/xerces-c'
make[2]: Leaving directory '/work/build/win-x64/xerces-c'
[ 94%] Built target DOMPrint
make[2]: Entering directory '/work/build/win-x64/xerces-c'
make[2]: Leaving directory '/work/build/win-x64/xerces-c'
[ 94%] Built target PParse
make[2]: Entering directory '/work/build/win-x64/xerces-c'
make[2]: Leaving directory '/work/build/win-x64/xerces-c'
[ 94%] Built target SAX2Count
make[2]: Entering directory '/work/build/win-x64/xerces-c'
make[2]: Leaving directory '/work/build/win-x64/xerces-c'
[ 95%] Built target EnumVal
make[2]: Entering directory '/work/build/win-x64/xerces-c'
make[2]: Leaving directory '/work/build/win-x64/xerces-c'
[ 95%] Built target SEnumVal
make[2]: Entering directory '/work/build/win-x64/xerces-c'
make[2]: Leaving directory '/work/build/win-x64/xerces-c'
[ 96%] Built target SAXPrint
make[2]: Entering directory '/work/build/win-x64/xerces-c'
make[2]: Leaving directory '/work/build/win-x64/xerces-c'
[ 97%] Built target SAX2Print
make[2]: Entering directory '/work/build/win-x64/xerces-c'
make[2]: Leaving directory '/work/build/win-x64/xerces-c'
[ 97%] Built target DOMCount
make[2]: Entering directory '/work/build/win-x64/xerces-c'
make[2]: Leaving directory '/work/build/win-x64/xerces-c'
[ 98%] Built target StdInParse
make[2]: Entering directory '/work/build/win-x64/xerces-c'
make[2]: Leaving directory '/work/build/win-x64/xerces-c'
[ 98%] Built target XInclude
make[2]: Entering directory '/work/build/win-x64/xerces-c'
make[2]: Leaving directory '/work/build/win-x64/xerces-c'
[ 99%] Built target CreateDOMDocument
make[2]: Entering directory '/work/build/win-x64/xerces-c'
make[2]: Leaving directory '/work/build/win-x64/xerces-c'
[100%] Built target SCMPrint
make[1]: Leaving directory '/work/build/win-x64/xerces-c'
Install the project...
-- Install configuration: "Release"
-- Installing: /work/build/external/win-x86_64/lib/pkgconfig/xerces-c.pc
-- Installing: /work/build/external/win-x86_64/share/doc/xerces-c/html
-- Installing: /work/build/external/win-x86_64/share/doc/xerces-c/html/ApacheDOMC++Binding.html
-- Installing: /work/build/external/win-x86_64/share/doc/xerces-c/html/secadv
-- Installing: /work/build/external/win-x86_64/share/doc/xerces-c/html/secadv/CVE-2015-0252.txt
-- Installing: /work/build/external/win-x86_64/share/doc/xerces-c/html/secadv/CVE-2016-4463.txt
-- Installing: /work/build/external/win-x86_64/share/doc/xerces-c/html/secadv/CVE-2016-0729.txt
-- Installing: /work/build/external/win-x86_64/share/doc/xerces-c/html/secadv/CVE-2017-12627.txt
-- Up-to-date: /work/build/external/win-x86_64/share/doc/xerces-c/html
-- Installing: /work/build/external/win-x86_64/lib/libxerces-c.a
-- Installing: /work/build/external/win-x86_64/cmake/XercesCConfigInternal.cmake
-- Installing: /work/build/external/win-x86_64/cmake/XercesCConfigInternal-release.cmake
-- Installing: /work/build/external/win-x86_64/cmake/XercesCConfig.cmake
-- Installing: /work/build/external/win-x86_64/cmake/XercesCConfigVersion.cmake
-- Installing: /work/build/external/win-x86_64/include/xercesc/util/ArrayIndexOutOfBoundsException.hpp
-- Installing: /work/build/external/win-x86_64/include/xercesc/util/Base64.hpp
-- Installing: /work/build/external/win-x86_64/include/xercesc/util/BaseRefVectorOf.hpp
-- Installing: /work/build/external/win-x86_64/include/xercesc/util/BaseRefVectorOf.c
-- Installing: /work/build/external/win-x86_64/include/xercesc/util/BinFileInputStream.hpp
-- Installing: /work/build/external/win-x86_64/include/xercesc/util/BinInputStream.hpp
-- Installing: /work/build/external/win-x86_64/include/xercesc/util/BinMemInputStream.hpp
-- Installing: /work/build/external/win-x86_64/include/xercesc/util/BitOps.hpp
-- Installing: /work/build/external/win-x86_64/include/xercesc/util/BitSet.hpp
-- Installing: /work/build/external/win-x86_64/include/xercesc/util/CountedPointer.hpp
-- Installing: /work/build/external/win-x86_64/include/xercesc/util/CountedPointer.c
-- Installing: /work/build/external/win-x86_64/include/xercesc/util/DefaultPanicHandler.hpp
-- Installing: /work/build/external/win-x86_64/include/xercesc/util/EmptyStackException.hpp
-- Installing: /work/build/external/win-x86_64/include/xercesc/util/EncodingValidator.hpp
-- Installing: /work/build/external/win-x86_64/include/xercesc/util/FlagJanitor.hpp
-- Installing: /work/build/external/win-x86_64/include/xercesc/util/FlagJanitor.c
-- Installing: /work/build/external/win-x86_64/include/xercesc/util/Hashers.hpp
-- Installing: /work/build/external/win-x86_64/include/xercesc/util/Hash2KeysSetOf.hpp
-- Installing: /work/build/external/win-x86_64/include/xercesc/util/Hash2KeysSetOf.c
-- Installing: /work/build/external/win-x86_64/include/xercesc/util/HexBin.hpp
-- Installing: /work/build/external/win-x86_64/include/xercesc/util/IllegalArgumentException.hpp
-- Installing: /work/build/external/win-x86_64/include/xercesc/util/InvalidCastException.hpp
-- Installing: /work/build/external/win-x86_64/include/xercesc/util/IOException.hpp
-- Installing: /work/build/external/win-x86_64/include/xercesc/util/Janitor.hpp
-- Installing: /work/build/external/win-x86_64/include/xercesc/util/Janitor.c
-- Installing: /work/build/external/win-x86_64/include/xercesc/util/KeyRefPair.hpp
-- Installing: /work/build/external/win-x86_64/include/xercesc/util/KeyRefPair.c
-- Installing: /work/build/external/win-x86_64/include/xercesc/util/KeyValuePair.hpp
-- Installing: /work/build/external/win-x86_64/include/xercesc/util/KeyValuePair.c
-- Installing: /work/build/external/win-x86_64/include/xercesc/util/KVStringPair.hpp
-- Installing: /work/build/external/win-x86_64/include/xercesc/util/Mutexes.hpp
-- Installing: /work/build/external/win-x86_64/include/xercesc/util/LogicalPath.c
-- Installing: /work/build/external/win-x86_64/include/xercesc/util/NameIdPool.hpp
-- Installing: /work/build/external/win-x86_64/include/xercesc/util/NameIdPool.c
-- Installing: /work/build/external/win-x86_64/include/xercesc/util/NoSuchElementException.hpp
-- Installing: /work/build/external/win-x86_64/include/xercesc/util/NullPointerException.hpp
-- Installing: /work/build/external/win-x86_64/include/xercesc/util/NumberFormatException.hpp
-- Installing: /work/build/external/win-x86_64/include/xercesc/util/OutOfMemoryException.hpp
-- Installing: /work/build/external/win-x86_64/include/xercesc/util/PanicHandler.hpp
-- Installing: /work/build/external/win-x86_64/include/xercesc/util/ParseException.hpp
-- Installing: /work/build/external/win-x86_64/include/xercesc/util/PlatformUtils.hpp
-- Installing: /work/build/external/win-x86_64/include/xercesc/util/PSVIUni.hpp
-- Installing: /work/build/external/win-x86_64/include/xercesc/util/QName.hpp
-- Installing: /work/build/external/win-x86_64/include/xercesc/util/RefArrayOf.hpp
-- Installing: /work/build/external/win-x86_64/include/xercesc/util/RefArrayOf.c
-- Installing: /work/build/external/win-x86_64/include/xercesc/util/RefArrayVectorOf.hpp
-- Installing: /work/build/external/win-x86_64/include/xercesc/util/RefArrayVectorOf.c
-- Installing: /work/build/external/win-x86_64/include/xercesc/util/RefHash2KeysTableOf.hpp
-- Installing: /work/build/external/win-x86_64/include/xercesc/util/RefHash2KeysTableOf.c
-- Installing: /work/build/external/win-x86_64/include/xercesc/util/RefHash3KeysIdPool.hpp
-- Installing: /work/build/external/win-x86_64/include/xercesc/util/RefHash3KeysIdPool.c
-- Installing: /work/build/external/win-x86_64/include/xercesc/util/RefHashTableOf.hpp
-- Installing: /work/build/external/win-x86_64/include/xercesc/util/RefHashTableOf.c
-- Installing: /work/build/external/win-x86_64/include/xercesc/util/RefStackOf.hpp
-- Installing: /work/build/external/win-x86_64/include/xercesc/util/RefStackOf.c
-- Installing: /work/build/external/win-x86_64/include/xercesc/util/RefVectorOf.hpp
-- Installing: /work/build/external/win-x86_64/include/xercesc/util/RefVectorOf.c
-- Installing: /work/build/external/win-x86_64/include/xercesc/util/regx/ASCIIRangeFactory.hpp
-- Installing: /work/build/external/win-x86_64/include/xercesc/util/regx/BlockRangeFactory.hpp
-- Installing: /work/build/external/win-x86_64/include/xercesc/util/regx/BMPattern.hpp
-- Installing: /work/build/external/win-x86_64/include/xercesc/util/regx/CharToken.hpp
-- Installing: /work/build/external/win-x86_64/include/xercesc/util/regx/ClosureToken.hpp
-- Installing: /work/build/external/win-x86_64/include/xercesc/util/regx/ConcatToken.hpp
-- Installing: /work/build/external/win-x86_64/include/xercesc/util/regx/Match.hpp
-- Installing: /work/build/external/win-x86_64/include/xercesc/util/regx/Op.hpp
-- Installing: /work/build/external/win-x86_64/include/xercesc/util/regx/OpFactory.hpp
-- Installing: /work/build/external/win-x86_64/include/xercesc/util/regx/ParenToken.hpp
-- Installing: /work/build/external/win-x86_64/include/xercesc/util/regx/ParserForXMLSchema.hpp
-- Installing: /work/build/external/win-x86_64/include/xercesc/util/regx/RangeFactory.hpp
-- Installing: /work/build/external/win-x86_64/include/xercesc/util/regx/RangeToken.hpp
-- Installing: /work/build/external/win-x86_64/include/xercesc/util/regx/RangeTokenMap.hpp
-- Installing: /work/build/external/win-x86_64/include/xercesc/util/regx/RegularExpression.hpp
-- Installing: /work/build/external/win-x86_64/include/xercesc/util/regx/RegxDefs.hpp
-- Installing: /work/build/external/win-x86_64/include/xercesc/util/regx/RegxParser.hpp
-- Installing: /work/build/external/win-x86_64/include/xercesc/util/regx/RegxUtil.hpp
-- Installing: /work/build/external/win-x86_64/include/xercesc/util/regx/StringToken.hpp
-- Installing: /work/build/external/win-x86_64/include/xercesc/util/regx/Token.hpp
-- Installing: /work/build/external/win-x86_64/include/xercesc/util/regx/TokenFactory.hpp
-- Installing: /work/build/external/win-x86_64/include/xercesc/util/regx/TokenInc.hpp
-- Installing: /work/build/external/win-x86_64/include/xercesc/util/regx/UniCharTable.hpp
-- Installing: /work/build/external/win-x86_64/include/xercesc/util/regx/UnicodeRangeFactory.hpp
-- Installing: /work/build/external/win-x86_64/include/xercesc/util/regx/UnionToken.hpp
-- Installing: /work/build/external/win-x86_64/include/xercesc/util/regx/XMLRangeFactory.hpp
-- Installing: /work/build/external/win-x86_64/include/xercesc/util/regx/XMLUniCharacter.hpp
-- Installing: /work/build/external/win-x86_64/include/xercesc/util/RuntimeException.hpp
-- Installing: /work/build/external/win-x86_64/include/xercesc/util/SchemaDateTimeException.hpp
-- Installing: /work/build/external/win-x86_64/include/xercesc/util/SecurityManager.hpp
-- Installing: /work/build/external/win-x86_64/include/xercesc/util/StringPool.hpp
-- Installing: /work/build/external/win-x86_64/include/xercesc/util/SynchronizedStringPool.hpp
-- Installing: /work/build/external/win-x86_64/include/xercesc/util/TranscodingException.hpp
-- Installing: /work/build/external/win-x86_64/include/xercesc/util/TransENameMap.hpp
-- Installing: /work/build/external/win-x86_64/include/xercesc/util/TransENameMap.c
-- Installing: /work/build/external/win-x86_64/include/xercesc/util/TransService.hpp
-- Installing: /work/build/external/win-x86_64/include/xercesc/util/UnexpectedEOFException.hpp
-- Installing: /work/build/external/win-x86_64/include/xercesc/util/UnsupportedEncodingException.hpp
-- Installing: /work/build/external/win-x86_64/include/xercesc/util/UTFDataFormatException.hpp
-- Installing: /work/build/external/win-x86_64/include/xercesc/util/ValueArrayOf.hpp
-- Installing: /work/build/external/win-x86_64/include/xercesc/util/ValueArrayOf.c
-- Installing: /work/build/external/win-x86_64/include/xercesc/util/ValueHashTableOf.hpp
-- Installing: /work/build/external/win-x86_64/include/xercesc/util/ValueHashTableOf.c
-- Installing: /work/build/external/win-x86_64/include/xercesc/util/ValueStackOf.hpp
-- Installing: /work/build/external/win-x86_64/include/xercesc/util/ValueStackOf.c
-- Installing: /work/build/external/win-x86_64/include/xercesc/util/ValueVectorOf.hpp
-- Installing: /work/build/external/win-x86_64/include/xercesc/util/ValueVectorOf.c
-- Installing: /work/build/external/win-x86_64/include/xercesc/util/XercesDefs.hpp
-- Installing: /work/build/external/win-x86_64/include/xercesc/util/XMemory.hpp
-- Installing: /work/build/external/win-x86_64/include/xercesc/util/XML256TableTranscoder.hpp
-- Installing: /work/build/external/win-x86_64/include/xercesc/util/XML88591Transcoder.hpp
-- Installing: /work/build/external/win-x86_64/include/xercesc/util/XMLAbstractDoubleFloat.hpp
-- Installing: /work/build/external/win-x86_64/include/xercesc/util/XMLASCIITranscoder.hpp
-- Installing: /work/build/external/win-x86_64/include/xercesc/util/XMLBigDecimal.hpp
-- Installing: /work/build/external/win-x86_64/include/xercesc/util/XMLBigInteger.hpp
-- Installing: /work/build/external/win-x86_64/include/xercesc/util/XMLChar.hpp
-- Installing: /work/build/external/win-x86_64/include/xercesc/util/XMLChTranscoder.hpp
-- Installing: /work/build/external/win-x86_64/include/xercesc/util/XMLDateTime.hpp
-- Installing: /work/build/external/win-x86_64/include/xercesc/util/XMLDOMMsg.hpp
-- Installing: /work/build/external/win-x86_64/include/xercesc/util/XMLDouble.hpp
-- Installing: /work/build/external/win-x86_64/include/xercesc/util/XMLEBCDICTranscoder.hpp
-- Installing: /work/build/external/win-x86_64/include/xercesc/util/XMLEntityResolver.hpp
-- Installing: /work/build/external/win-x86_64/include/xercesc/util/XMLEnumerator.hpp
-- Installing: /work/build/external/win-x86_64/include/xercesc/util/XMLException.hpp
-- Installing: /work/build/external/win-x86_64/include/xercesc/util/XMLExceptMsgs.hpp
-- Installing: /work/build/external/win-x86_64/include/xercesc/util/XMLFileMgr.hpp
-- Installing: /work/build/external/win-x86_64/include/xercesc/util/XMLFloat.hpp
-- Installing: /work/build/external/win-x86_64/include/xercesc/util/XMLIBM1047Transcoder.hpp
-- Installing: /work/build/external/win-x86_64/include/xercesc/util/XMLIBM1140Transcoder.hpp
-- Installing: /work/build/external/win-x86_64/include/xercesc/util/XMLInitializer.hpp
-- Installing: /work/build/external/win-x86_64/include/xercesc/util/XMLInteger.hpp
-- Installing: /work/build/external/win-x86_64/include/xercesc/util/XMLMutexMgr.hpp
-- Installing: /work/build/external/win-x86_64/include/xercesc/util/XMLMsgLoader.hpp
-- Installing: /work/build/external/win-x86_64/include/xercesc/util/XMLNetAccessor.hpp
-- Installing: /work/build/external/win-x86_64/include/xercesc/util/XMLNumber.hpp
-- Installing: /work/build/external/win-x86_64/include/xercesc/util/XMLResourceIdentifier.hpp
-- Installing: /work/build/external/win-x86_64/include/xercesc/util/XMLString.hpp
-- Installing: /work/build/external/win-x86_64/include/xercesc/util/XMLStringTokenizer.hpp
-- Installing: /work/build/external/win-x86_64/include/xercesc/util/XMLUCS4Transcoder.hpp
-- Installing: /work/build/external/win-x86_64/include/xercesc/util/XMLUni.hpp
-- Installing: /work/build/external/win-x86_64/include/xercesc/util/XMLUniDefs.hpp
-- Installing: /work/build/external/win-x86_64/include/xercesc/util/XMLUri.hpp
-- Installing: /work/build/external/win-x86_64/include/xercesc/util/XMLURL.hpp
-- Installing: /work/build/external/win-x86_64/include/xercesc/util/XMLUTF16Transcoder.hpp
-- Installing: /work/build/external/win-x86_64/include/xercesc/util/XMLUTF8Transcoder.hpp
-- Installing: /work/build/external/win-x86_64/include/xercesc/util/XMLWin1252Transcoder.hpp
-- Installing: /work/build/external/win-x86_64/include/xercesc/dom/DOM.hpp
-- Installing: /work/build/external/win-x86_64/include/xercesc/dom/DOMAttr.hpp
-- Installing: /work/build/external/win-x86_64/include/xercesc/dom/DOMCDATASection.hpp
-- Installing: /work/build/external/win-x86_64/include/xercesc/dom/DOMCharacterData.hpp
-- Installing: /work/build/external/win-x86_64/include/xercesc/dom/DOMComment.hpp
-- Installing: /work/build/external/win-x86_64/include/xercesc/dom/DOMConfiguration.hpp
-- Installing: /work/build/external/win-x86_64/include/xercesc/dom/DOMDocument.hpp
-- Installing: /work/build/external/win-x86_64/include/xercesc/dom/DOMDocumentFragment.hpp
-- Installing: /work/build/external/win-x86_64/include/xercesc/dom/DOMDocumentRange.hpp
-- Installing: /work/build/external/win-x86_64/include/xercesc/dom/DOMDocumentTraversal.hpp
-- Installing: /work/build/external/win-x86_64/include/xercesc/dom/DOMDocumentType.hpp
-- Installing: /work/build/external/win-x86_64/include/xercesc/dom/DOMElement.hpp
-- Installing: /work/build/external/win-x86_64/include/xercesc/dom/DOMEntity.hpp
-- Installing: /work/build/external/win-x86_64/include/xercesc/dom/DOMEntityReference.hpp
-- Installing: /work/build/external/win-x86_64/include/xercesc/dom/DOMError.hpp
-- Installing: /work/build/external/win-x86_64/include/xercesc/dom/DOMErrorHandler.hpp
-- Installing: /work/build/external/win-x86_64/include/xercesc/dom/DOMException.hpp
-- Installing: /work/build/external/win-x86_64/include/xercesc/dom/DOMImplementation.hpp
-- Installing: /work/build/external/win-x86_64/include/xercesc/dom/DOMImplementationList.hpp
-- Installing: /work/build/external/win-x86_64/include/xercesc/dom/DOMImplementationLS.hpp
-- Installing: /work/build/external/win-x86_64/include/xercesc/dom/DOMImplementationRegistry.hpp
-- Installing: /work/build/external/win-x86_64/include/xercesc/dom/DOMImplementationSource.hpp
-- Installing: /work/build/external/win-x86_64/include/xercesc/dom/DOMLocator.hpp
-- Installing: /work/build/external/win-x86_64/include/xercesc/dom/DOMLSException.hpp
-- Installing: /work/build/external/win-x86_64/include/xercesc/dom/DOMLSInput.hpp
-- Installing: /work/build/external/win-x86_64/include/xercesc/dom/DOMLSOutput.hpp
-- Installing: /work/build/external/win-x86_64/include/xercesc/dom/DOMLSParser.hpp
-- Installing: /work/build/external/win-x86_64/include/xercesc/dom/DOMLSParserFilter.hpp
-- Installing: /work/build/external/win-x86_64/include/xercesc/dom/DOMLSResourceResolver.hpp
-- Installing: /work/build/external/win-x86_64/include/xercesc/dom/DOMLSSerializer.hpp
-- Installing: /work/build/external/win-x86_64/include/xercesc/dom/DOMLSSerializerFilter.hpp
-- Installing: /work/build/external/win-x86_64/include/xercesc/dom/DOMMemoryManager.hpp
-- Installing: /work/build/external/win-x86_64/include/xercesc/dom/DOMNamedNodeMap.hpp
-- Installing: /work/build/external/win-x86_64/include/xercesc/dom/DOMNode.hpp
-- Installing: /work/build/external/win-x86_64/include/xercesc/dom/DOMNodeFilter.hpp
-- Installing: /work/build/external/win-x86_64/include/xercesc/dom/DOMNodeIterator.hpp
-- Installing: /work/build/external/win-x86_64/include/xercesc/dom/DOMNodeList.hpp
-- Installing: /work/build/external/win-x86_64/include/xercesc/dom/DOMNotation.hpp
-- Installing: /work/build/external/win-x86_64/include/xercesc/dom/DOMProcessingInstruction.hpp
-- Installing: /work/build/external/win-x86_64/include/xercesc/dom/DOMPSVITypeInfo.hpp
-- Installing: /work/build/external/win-x86_64/include/xercesc/dom/DOMRange.hpp
-- Installing: /work/build/external/win-x86_64/include/xercesc/dom/DOMRangeException.hpp
-- Installing: /work/build/external/win-x86_64/include/xercesc/dom/DOMStringList.hpp
-- Installing: /work/build/external/win-x86_64/include/xercesc/dom/DOMText.hpp
-- Installing: /work/build/external/win-x86_64/include/xercesc/dom/DOMTreeWalker.hpp
-- Installing: /work/build/external/win-x86_64/include/xercesc/dom/DOMTypeInfo.hpp
-- Installing: /work/build/external/win-x86_64/include/xercesc/dom/DOMUserDataHandler.hpp
-- Installing: /work/build/external/win-x86_64/include/xercesc/dom/DOMXPathEvaluator.hpp
-- Installing: /work/build/external/win-x86_64/include/xercesc/dom/DOMXPathException.hpp
-- Installing: /work/build/external/win-x86_64/include/xercesc/dom/DOMXPathExpression.hpp
-- Installing: /work/build/external/win-x86_64/include/xercesc/dom/DOMXPathNamespace.hpp
-- Installing: /work/build/external/win-x86_64/include/xercesc/dom/DOMXPathNSResolver.hpp
-- Installing: /work/build/external/win-x86_64/include/xercesc/dom/DOMXPathResult.hpp
-- Installing: /work/build/external/win-x86_64/include/xercesc/dom/StDOMNode.hpp
-- Installing: /work/build/external/win-x86_64/include/xercesc/dom/impl/DOMAttrImpl.hpp
-- Installing: /work/build/external/win-x86_64/include/xercesc/dom/impl/DOMAttrMapImpl.hpp
-- Installing: /work/build/external/win-x86_64/include/xercesc/dom/impl/DOMAttrNSImpl.hpp
-- Installing: /work/build/external/win-x86_64/include/xercesc/dom/impl/DOMCasts.hpp
-- Installing: /work/build/external/win-x86_64/include/xercesc/dom/impl/DOMCDATASectionImpl.hpp
-- Installing: /work/build/external/win-x86_64/include/xercesc/dom/impl/DOMCharacterDataImpl.hpp
-- Installing: /work/build/external/win-x86_64/include/xercesc/dom/impl/DOMChildNode.hpp
-- Installing: /work/build/external/win-x86_64/include/xercesc/dom/impl/DOMCommentImpl.hpp
-- Installing: /work/build/external/win-x86_64/include/xercesc/dom/impl/DOMConfigurationImpl.hpp
-- Installing: /work/build/external/win-x86_64/include/xercesc/dom/impl/DOMDeepNodeListImpl.hpp
-- Installing: /work/build/external/win-x86_64/include/xercesc/dom/impl/DOMDeepNodeListPool.hpp
-- Installing: /work/build/external/win-x86_64/include/xercesc/dom/impl/DOMDeepNodeListPool.c
-- Installing: /work/build/external/win-x86_64/include/xercesc/dom/impl/DOMDocumentFragmentImpl.hpp
-- Installing: /work/build/external/win-x86_64/include/xercesc/dom/impl/DOMDocumentImpl.hpp
-- Installing: /work/build/external/win-x86_64/include/xercesc/dom/impl/DOMDocumentTypeImpl.hpp
-- Installing: /work/build/external/win-x86_64/include/xercesc/dom/impl/DOMElementImpl.hpp
-- Installing: /work/build/external/win-x86_64/include/xercesc/dom/impl/DOMElementNSImpl.hpp
-- Installing: /work/build/external/win-x86_64/include/xercesc/dom/impl/DOMEntityImpl.hpp
-- Installing: /work/build/external/win-x86_64/include/xercesc/dom/impl/DOMEntityReferenceImpl.hpp
-- Installing: /work/build/external/win-x86_64/include/xercesc/dom/impl/DOMErrorImpl.hpp
-- Installing: /work/build/external/win-x86_64/include/xercesc/dom/impl/DOMImplementationImpl.hpp
-- Installing: /work/build/external/win-x86_64/include/xercesc/dom/impl/DOMImplementationListImpl.hpp
-- Installing: /work/build/external/win-x86_64/include/xercesc/dom/impl/DOMLocatorImpl.hpp
-- Installing: /work/build/external/win-x86_64/include/xercesc/dom/impl/DOMNamedNodeMapImpl.hpp
-- Installing: /work/build/external/win-x86_64/include/xercesc/dom/impl/DOMNodeBase.hpp
-- Installing: /work/build/external/win-x86_64/include/xercesc/dom/impl/DOMNodeIDMap.hpp
-- Installing: /work/build/external/win-x86_64/include/xercesc/dom/impl/DOMNodeImpl.hpp
-- Installing: /work/build/external/win-x86_64/include/xercesc/dom/impl/DOMNodeIteratorImpl.hpp
-- Installing: /work/build/external/win-x86_64/include/xercesc/dom/impl/DOMNodeListImpl.hpp
-- Installing: /work/build/external/win-x86_64/include/xercesc/dom/impl/DOMNodeVector.hpp
-- Installing: /work/build/external/win-x86_64/include/xercesc/dom/impl/DOMNormalizer.hpp
-- Installing: /work/build/external/win-x86_64/include/xercesc/dom/impl/DOMNotationImpl.hpp
-- Installing: /work/build/external/win-x86_64/include/xercesc/dom/impl/DOMParentNode.hpp
-- Installing: /work/build/external/win-x86_64/include/xercesc/dom/impl/DOMProcessingInstructionImpl.hpp
-- Installing: /work/build/external/win-x86_64/include/xercesc/dom/impl/DOMRangeImpl.hpp
-- Installing: /work/build/external/win-x86_64/include/xercesc/dom/impl/DOMStringListImpl.hpp
-- Installing: /work/build/external/win-x86_64/include/xercesc/dom/impl/DOMStringPool.hpp
-- Installing: /work/build/external/win-x86_64/include/xercesc/dom/impl/DOMTextImpl.hpp
-- Installing: /work/build/external/win-x86_64/include/xercesc/dom/impl/DOMTreeWalkerImpl.hpp
-- Installing: /work/build/external/win-x86_64/include/xercesc/dom/impl/DOMTypeInfoImpl.hpp
-- Installing: /work/build/external/win-x86_64/include/xercesc/dom/impl/DOMLSSerializerImpl.hpp
-- Installing: /work/build/external/win-x86_64/include/xercesc/dom/impl/DOMLSInputImpl.hpp
-- Installing: /work/build/external/win-x86_64/include/xercesc/dom/impl/DOMLSOutputImpl.hpp
-- Installing: /work/build/external/win-x86_64/include/xercesc/dom/impl/DOMXPathExpressionImpl.hpp
-- Installing: /work/build/external/win-x86_64/include/xercesc/dom/impl/DOMXPathNSResolverImpl.hpp
-- Installing: /work/build/external/win-x86_64/include/xercesc/dom/impl/DOMXPathResultImpl.hpp
-- Installing: /work/build/external/win-x86_64/include/xercesc/dom/impl/XSDElementNSImpl.hpp
-- Installing: /work/build/external/win-x86_64/include/xercesc/framework/BinOutputStream.hpp
-- Installing: /work/build/external/win-x86_64/include/xercesc/framework/LocalFileFormatTarget.hpp
-- Installing: /work/build/external/win-x86_64/include/xercesc/framework/LocalFileInputSource.hpp
-- Installing: /work/build/external/win-x86_64/include/xercesc/framework/MemBufFormatTarget.hpp
-- Installing: /work/build/external/win-x86_64/include/xercesc/framework/MemBufInputSource.hpp
-- Installing: /work/build/external/win-x86_64/include/xercesc/framework/MemoryManager.hpp
-- Installing: /work/build/external/win-x86_64/include/xercesc/framework/psvi/PSVIAttribute.hpp
-- Installing: /work/build/external/win-x86_64/include/xercesc/framework/psvi/PSVIAttributeList.hpp
-- Installing: /work/build/external/win-x86_64/include/xercesc/framework/psvi/PSVIElement.hpp
-- Installing: /work/build/external/win-x86_64/include/xercesc/framework/psvi/PSVIHandler.hpp
-- Installing: /work/build/external/win-x86_64/include/xercesc/framework/psvi/PSVIItem.hpp
-- Installing: /work/build/external/win-x86_64/include/xercesc/framework/psvi/XSAnnotation.hpp
-- Installing: /work/build/external/win-x86_64/include/xercesc/framework/psvi/XSAttributeDeclaration.hpp
-- Installing: /work/build/external/win-x86_64/include/xercesc/framework/psvi/XSAttributeGroupDefinition.hpp
-- Installing: /work/build/external/win-x86_64/include/xercesc/framework/psvi/XSAttributeUse.hpp
-- Installing: /work/build/external/win-x86_64/include/xercesc/framework/psvi/XSComplexTypeDefinition.hpp
-- Installing: /work/build/external/win-x86_64/include/xercesc/framework/psvi/XSConstants.hpp
-- Installing: /work/build/external/win-x86_64/include/xercesc/framework/psvi/XSElementDeclaration.hpp
-- Installing: /work/build/external/win-x86_64/include/xercesc/framework/psvi/XSFacet.hpp
-- Installing: /work/build/external/win-x86_64/include/xercesc/framework/psvi/XSIDCDefinition.hpp
-- Installing: /work/build/external/win-x86_64/include/xercesc/framework/psvi/XSModel.hpp
-- Installing: /work/build/external/win-x86_64/include/xercesc/framework/psvi/XSModelGroup.hpp
-- Installing: /work/build/external/win-x86_64/include/xercesc/framework/psvi/XSModelGroupDefinition.hpp
-- Installing: /work/build/external/win-x86_64/include/xercesc/framework/psvi/XSMultiValueFacet.hpp
-- Installing: /work/build/external/win-x86_64/include/xercesc/framework/psvi/XSNamedMap.hpp
-- Installing: /work/build/external/win-x86_64/include/xercesc/framework/psvi/XSNamedMap.c
-- Installing: /work/build/external/win-x86_64/include/xercesc/framework/psvi/XSNamespaceItem.hpp
-- Installing: /work/build/external/win-x86_64/include/xercesc/framework/psvi/XSNotationDeclaration.hpp
-- Installing: /work/build/external/win-x86_64/include/xercesc/framework/psvi/XSObject.hpp
-- Installing: /work/build/external/win-x86_64/include/xercesc/framework/psvi/XSParticle.hpp
-- Installing: /work/build/external/win-x86_64/include/xercesc/framework/psvi/XSSimpleTypeDefinition.hpp
-- Installing: /work/build/external/win-x86_64/include/xercesc/framework/psvi/XSTypeDefinition.hpp
-- Installing: /work/build/external/win-x86_64/include/xercesc/framework/psvi/XSValue.hpp
-- Installing: /work/build/external/win-x86_64/include/xercesc/framework/psvi/XSWildcard.hpp
-- Installing: /work/build/external/win-x86_64/include/xercesc/framework/StdInInputSource.hpp
-- Installing: /work/build/external/win-x86_64/include/xercesc/framework/StdOutFormatTarget.hpp
-- Installing: /work/build/external/win-x86_64/include/xercesc/framework/URLInputSource.hpp
-- Installing: /work/build/external/win-x86_64/include/xercesc/framework/ValidationContext.hpp
-- Installing: /work/build/external/win-x86_64/include/xercesc/framework/Wrapper4DOMLSInput.hpp
-- Installing: /work/build/external/win-x86_64/include/xercesc/framework/Wrapper4InputSource.hpp
-- Installing: /work/build/external/win-x86_64/include/xercesc/framework/XMLAttDef.hpp
-- Installing: /work/build/external/win-x86_64/include/xercesc/framework/XMLAttDefList.hpp
-- Installing: /work/build/external/win-x86_64/include/xercesc/framework/XMLAttr.hpp
-- Installing: /work/build/external/win-x86_64/include/xercesc/framework/XMLBuffer.hpp
-- Installing: /work/build/external/win-x86_64/include/xercesc/framework/XMLBufferMgr.hpp
-- Installing: /work/build/external/win-x86_64/include/xercesc/framework/XMLContentModel.hpp
-- Installing: /work/build/external/win-x86_64/include/xercesc/framework/XMLDocumentHandler.hpp
-- Installing: /work/build/external/win-x86_64/include/xercesc/framework/XMLDTDDescription.hpp
-- Installing: /work/build/external/win-x86_64/include/xercesc/framework/XMLElementDecl.hpp
-- Installing: /work/build/external/win-x86_64/include/xercesc/framework/XMLEntityDecl.hpp
-- Installing: /work/build/external/win-x86_64/include/xercesc/framework/XMLEntityHandler.hpp
-- Installing: /work/build/external/win-x86_64/include/xercesc/framework/XMLErrorCodes.hpp
-- Installing: /work/build/external/win-x86_64/include/xercesc/framework/XMLErrorReporter.hpp
-- Installing: /work/build/external/win-x86_64/include/xercesc/framework/XMLFormatter.hpp
-- Installing: /work/build/external/win-x86_64/include/xercesc/framework/XMLGrammarDescription.hpp
-- Installing: /work/build/external/win-x86_64/include/xercesc/framework/XMLGrammarPool.hpp
-- Installing: /work/build/external/win-x86_64/include/xercesc/framework/XMLGrammarPoolImpl.hpp
-- Installing: /work/build/external/win-x86_64/include/xercesc/framework/XMLNotationDecl.hpp
-- Installing: /work/build/external/win-x86_64/include/xercesc/framework/XMLPScanToken.hpp
-- Installing: /work/build/external/win-x86_64/include/xercesc/framework/XMLRecognizer.hpp
-- Installing: /work/build/external/win-x86_64/include/xercesc/framework/XMLRefInfo.hpp
-- Installing: /work/build/external/win-x86_64/include/xercesc/framework/XMLSchemaDescription.hpp
-- Installing: /work/build/external/win-x86_64/include/xercesc/framework/XMLValidator.hpp
-- Installing: /work/build/external/win-x86_64/include/xercesc/framework/XMLValidityCodes.hpp
-- Installing: /work/build/external/win-x86_64/include/xercesc/internal/BinFileOutputStream.hpp
-- Installing: /work/build/external/win-x86_64/include/xercesc/internal/BinMemOutputStream.hpp
-- Installing: /work/build/external/win-x86_64/include/xercesc/internal/CharTypeTables.hpp
-- Installing: /work/build/external/win-x86_64/include/xercesc/internal/DGXMLScanner.hpp
-- Installing: /work/build/external/win-x86_64/include/xercesc/internal/ElemStack.hpp
-- Installing: /work/build/external/win-x86_64/include/xercesc/internal/EndOfEntityException.hpp
-- Installing: /work/build/external/win-x86_64/include/xercesc/internal/IANAEncodings.hpp
-- Installing: /work/build/external/win-x86_64/include/xercesc/internal/IGXMLScanner.hpp
-- Installing: /work/build/external/win-x86_64/include/xercesc/internal/MemoryManagerImpl.hpp
-- Installing: /work/build/external/win-x86_64/include/xercesc/internal/ReaderMgr.hpp
-- Installing: /work/build/external/win-x86_64/include/xercesc/internal/SGXMLScanner.hpp
-- Installing: /work/build/external/win-x86_64/include/xercesc/internal/ValidationContextImpl.hpp
-- Installing: /work/build/external/win-x86_64/include/xercesc/internal/VecAttributesImpl.hpp
-- Installing: /work/build/external/win-x86_64/include/xercesc/internal/VecAttrListImpl.hpp
-- Installing: /work/build/external/win-x86_64/include/xercesc/internal/WFXMLScanner.hpp
-- Installing: /work/build/external/win-x86_64/include/xercesc/internal/XMLInternalErrorHandler.hpp
-- Installing: /work/build/external/win-x86_64/include/xercesc/internal/XMLReader.hpp
-- Installing: /work/build/external/win-x86_64/include/xercesc/internal/XMLScanner.hpp
-- Installing: /work/build/external/win-x86_64/include/xercesc/internal/XMLScannerResolver.hpp
-- Installing: /work/build/external/win-x86_64/include/xercesc/internal/XProtoType.hpp
-- Installing: /work/build/external/win-x86_64/include/xercesc/internal/XSAXMLScanner.hpp
-- Installing: /work/build/external/win-x86_64/include/xercesc/internal/XSerializable.hpp
-- Installing: /work/build/external/win-x86_64/include/xercesc/internal/XSerializationException.hpp
-- Installing: /work/build/external/win-x86_64/include/xercesc/internal/XSerializeEngine.hpp
-- Installing: /work/build/external/win-x86_64/include/xercesc/internal/XSObjectFactory.hpp
-- Installing: /work/build/external/win-x86_64/include/xercesc/internal/XTemplateSerializer.hpp
-- Installing: /work/build/external/win-x86_64/include/xercesc/parsers/AbstractDOMParser.hpp
-- Installing: /work/build/external/win-x86_64/include/xercesc/parsers/DOMLSParserImpl.hpp
-- Installing: /work/build/external/win-x86_64/include/xercesc/parsers/SAX2XMLFilterImpl.hpp
-- Installing: /work/build/external/win-x86_64/include/xercesc/parsers/SAX2XMLReaderImpl.hpp
-- Installing: /work/build/external/win-x86_64/include/xercesc/parsers/SAXParser.hpp
-- Installing: /work/build/external/win-x86_64/include/xercesc/parsers/XercesDOMParser.hpp
-- Installing: /work/build/external/win-x86_64/include/xercesc/sax/AttributeList.hpp
-- Installing: /work/build/external/win-x86_64/include/xercesc/sax/DocumentHandler.hpp
-- Installing: /work/build/external/win-x86_64/include/xercesc/sax/DTDHandler.hpp
-- Installing: /work/build/external/win-x86_64/include/xercesc/sax/EntityResolver.hpp
-- Installing: /work/build/external/win-x86_64/include/xercesc/sax/ErrorHandler.hpp
-- Installing: /work/build/external/win-x86_64/include/xercesc/sax/HandlerBase.hpp
-- Installing: /work/build/external/win-x86_64/include/xercesc/sax/InputSource.hpp
-- Installing: /work/build/external/win-x86_64/include/xercesc/sax/Locator.hpp
-- Installing: /work/build/external/win-x86_64/include/xercesc/sax/Parser.hpp
-- Installing: /work/build/external/win-x86_64/include/xercesc/sax/SAXException.hpp
-- Installing: /work/build/external/win-x86_64/include/xercesc/sax/SAXParseException.hpp
-- Installing: /work/build/external/win-x86_64/include/xercesc/sax2/Attributes.hpp
-- Installing: /work/build/external/win-x86_64/include/xercesc/sax2/ContentHandler.hpp
-- Installing: /work/build/external/win-x86_64/include/xercesc/sax2/DeclHandler.hpp
-- Installing: /work/build/external/win-x86_64/include/xercesc/sax2/DefaultHandler.hpp
-- Installing: /work/build/external/win-x86_64/include/xercesc/sax2/LexicalHandler.hpp
-- Installing: /work/build/external/win-x86_64/include/xercesc/sax2/SAX2XMLFilter.hpp
-- Installing: /work/build/external/win-x86_64/include/xercesc/sax2/SAX2XMLReader.hpp
-- Installing: /work/build/external/win-x86_64/include/xercesc/sax2/XMLReaderFactory.hpp
-- Installing: /work/build/external/win-x86_64/include/xercesc/validators/common/AllContentModel.hpp
-- Installing: /work/build/external/win-x86_64/include/xercesc/validators/common/CMAny.hpp
-- Installing: /work/build/external/win-x86_64/include/xercesc/validators/common/CMBinaryOp.hpp
-- Installing: /work/build/external/win-x86_64/include/xercesc/validators/common/CMLeaf.hpp
-- Installing: /work/build/external/win-x86_64/include/xercesc/validators/common/CMRepeatingLeaf.hpp
-- Installing: /work/build/external/win-x86_64/include/xercesc/validators/common/CMNode.hpp
-- Installing: /work/build/external/win-x86_64/include/xercesc/validators/common/CMStateSet.hpp
-- Installing: /work/build/external/win-x86_64/include/xercesc/validators/common/CMUnaryOp.hpp
-- Installing: /work/build/external/win-x86_64/include/xercesc/validators/common/ContentLeafNameTypeVector.hpp
-- Installing: /work/build/external/win-x86_64/include/xercesc/validators/common/ContentSpecNode.hpp
-- Installing: /work/build/external/win-x86_64/include/xercesc/validators/common/DFAContentModel.hpp
-- Installing: /work/build/external/win-x86_64/include/xercesc/validators/common/Grammar.hpp
-- Installing: /work/build/external/win-x86_64/include/xercesc/validators/common/GrammarResolver.hpp
-- Installing: /work/build/external/win-x86_64/include/xercesc/validators/common/MixedContentModel.hpp
-- Installing: /work/build/external/win-x86_64/include/xercesc/validators/common/SimpleContentModel.hpp
-- Installing: /work/build/external/win-x86_64/include/xercesc/validators/datatype/AbstractNumericFacetValidator.hpp
-- Installing: /work/build/external/win-x86_64/include/xercesc/validators/datatype/AbstractNumericValidator.hpp
-- Installing: /work/build/external/win-x86_64/include/xercesc/validators/datatype/AbstractStringValidator.hpp
-- Installing: /work/build/external/win-x86_64/include/xercesc/validators/datatype/AnySimpleTypeDatatypeValidator.hpp
-- Installing: /work/build/external/win-x86_64/include/xercesc/validators/datatype/AnyURIDatatypeValidator.hpp
-- Installing: /work/build/external/win-x86_64/include/xercesc/validators/datatype/Base64BinaryDatatypeValidator.hpp
-- Installing: /work/build/external/win-x86_64/include/xercesc/validators/datatype/BooleanDatatypeValidator.hpp
-- Installing: /work/build/external/win-x86_64/include/xercesc/validators/datatype/DatatypeValidator.hpp
-- Installing: /work/build/external/win-x86_64/include/xercesc/validators/datatype/DatatypeValidatorFactory.hpp
-- Installing: /work/build/external/win-x86_64/include/xercesc/validators/datatype/DateDatatypeValidator.hpp
-- Installing: /work/build/external/win-x86_64/include/xercesc/validators/datatype/DateTimeDatatypeValidator.hpp
-- Installing: /work/build/external/win-x86_64/include/xercesc/validators/datatype/DateTimeValidator.hpp
-- Installing: /work/build/external/win-x86_64/include/xercesc/validators/datatype/DayDatatypeValidator.hpp
-- Installing: /work/build/external/win-x86_64/include/xercesc/validators/datatype/DecimalDatatypeValidator.hpp
-- Installing: /work/build/external/win-x86_64/include/xercesc/validators/datatype/DoubleDatatypeValidator.hpp
-- Installing: /work/build/external/win-x86_64/include/xercesc/validators/datatype/DurationDatatypeValidator.hpp
-- Installing: /work/build/external/win-x86_64/include/xercesc/validators/datatype/ENTITYDatatypeValidator.hpp
-- Installing: /work/build/external/win-x86_64/include/xercesc/validators/datatype/FloatDatatypeValidator.hpp
-- Installing: /work/build/external/win-x86_64/include/xercesc/validators/datatype/HexBinaryDatatypeValidator.hpp
-- Installing: /work/build/external/win-x86_64/include/xercesc/validators/datatype/IDDatatypeValidator.hpp
-- Installing: /work/build/external/win-x86_64/include/xercesc/validators/datatype/IDREFDatatypeValidator.hpp
-- Installing: /work/build/external/win-x86_64/include/xercesc/validators/datatype/InvalidDatatypeFacetException.hpp
-- Installing: /work/build/external/win-x86_64/include/xercesc/validators/datatype/InvalidDatatypeValueException.hpp
-- Installing: /work/build/external/win-x86_64/include/xercesc/validators/datatype/ListDatatypeValidator.hpp
-- Installing: /work/build/external/win-x86_64/include/xercesc/validators/datatype/MonthDatatypeValidator.hpp
-- Installing: /work/build/external/win-x86_64/include/xercesc/validators/datatype/MonthDayDatatypeValidator.hpp
-- Installing: /work/build/external/win-x86_64/include/xercesc/validators/datatype/NameDatatypeValidator.hpp
-- Installing: /work/build/external/win-x86_64/include/xercesc/validators/datatype/NCNameDatatypeValidator.hpp
-- Installing: /work/build/external/win-x86_64/include/xercesc/validators/datatype/NOTATIONDatatypeValidator.hpp
-- Installing: /work/build/external/win-x86_64/include/xercesc/validators/datatype/QNameDatatypeValidator.hpp
-- Installing: /work/build/external/win-x86_64/include/xercesc/validators/datatype/StringDatatypeValidator.hpp
-- Installing: /work/build/external/win-x86_64/include/xercesc/validators/datatype/TimeDatatypeValidator.hpp
-- Installing: /work/build/external/win-x86_64/include/xercesc/validators/datatype/UnionDatatypeValidator.hpp
-- Installing: /work/build/external/win-x86_64/include/xercesc/validators/datatype/XMLCanRepGroup.hpp
-- Installing: /work/build/external/win-x86_64/include/xercesc/validators/datatype/YearDatatypeValidator.hpp
-- Installing: /work/build/external/win-x86_64/include/xercesc/validators/datatype/YearMonthDatatypeValidator.hpp
-- Installing: /work/build/external/win-x86_64/include/xercesc/validators/DTD/DocTypeHandler.hpp
-- Installing: /work/build/external/win-x86_64/include/xercesc/validators/DTD/DTDAttDef.hpp
-- Installing: /work/build/external/win-x86_64/include/xercesc/validators/DTD/DTDAttDefList.hpp
-- Installing: /work/build/external/win-x86_64/include/xercesc/validators/DTD/DTDElementDecl.hpp
-- Installing: /work/build/external/win-x86_64/include/xercesc/validators/DTD/DTDEntityDecl.hpp
-- Installing: /work/build/external/win-x86_64/include/xercesc/validators/DTD/DTDGrammar.hpp
-- Installing: /work/build/external/win-x86_64/include/xercesc/validators/DTD/DTDScanner.hpp
-- Installing: /work/build/external/win-x86_64/include/xercesc/validators/DTD/DTDValidator.hpp
-- Installing: /work/build/external/win-x86_64/include/xercesc/validators/DTD/XMLDTDDescriptionImpl.hpp
-- Installing: /work/build/external/win-x86_64/include/xercesc/validators/schema/ComplexTypeInfo.hpp
-- Installing: /work/build/external/win-x86_64/include/xercesc/validators/schema/GeneralAttributeCheck.hpp
-- Installing: /work/build/external/win-x86_64/include/xercesc/validators/schema/identity/FieldActivator.hpp
-- Installing: /work/build/external/win-x86_64/include/xercesc/validators/schema/identity/FieldValueMap.hpp
-- Installing: /work/build/external/win-x86_64/include/xercesc/validators/schema/identity/IC_Field.hpp
-- Installing: /work/build/external/win-x86_64/include/xercesc/validators/schema/identity/IC_Key.hpp
-- Installing: /work/build/external/win-x86_64/include/xercesc/validators/schema/identity/IC_KeyRef.hpp
-- Installing: /work/build/external/win-x86_64/include/xercesc/validators/schema/identity/IC_Selector.hpp
-- Installing: /work/build/external/win-x86_64/include/xercesc/validators/schema/identity/IC_Unique.hpp
-- Installing: /work/build/external/win-x86_64/include/xercesc/validators/schema/identity/IdentityConstraint.hpp
-- Installing: /work/build/external/win-x86_64/include/xercesc/validators/schema/identity/IdentityConstraintHandler.hpp
-- Installing: /work/build/external/win-x86_64/include/xercesc/validators/schema/identity/ValueStore.hpp
-- Installing: /work/build/external/win-x86_64/include/xercesc/validators/schema/identity/ValueStoreCache.hpp
-- Installing: /work/build/external/win-x86_64/include/xercesc/validators/schema/identity/XercesXPath.hpp
-- Installing: /work/build/external/win-x86_64/include/xercesc/validators/schema/identity/XPathException.hpp
-- Installing: /work/build/external/win-x86_64/include/xercesc/validators/schema/identity/XPathMatcher.hpp
-- Installing: /work/build/external/win-x86_64/include/xercesc/validators/schema/identity/XPathMatcherStack.hpp
-- Installing: /work/build/external/win-x86_64/include/xercesc/validators/schema/identity/XPathSymbols.hpp
-- Installing: /work/build/external/win-x86_64/include/xercesc/validators/schema/NamespaceScope.hpp
-- Installing: /work/build/external/win-x86_64/include/xercesc/validators/schema/PSVIDefs.hpp
-- Installing: /work/build/external/win-x86_64/include/xercesc/validators/schema/SchemaAttDef.hpp
-- Installing: /work/build/external/win-x86_64/include/xercesc/validators/schema/SchemaAttDefList.hpp
-- Installing: /work/build/external/win-x86_64/include/xercesc/validators/schema/SchemaElementDecl.hpp
-- Installing: /work/build/external/win-x86_64/include/xercesc/validators/schema/SchemaGrammar.hpp
-- Installing: /work/build/external/win-x86_64/include/xercesc/validators/schema/SchemaInfo.hpp
-- Installing: /work/build/external/win-x86_64/include/xercesc/validators/schema/SchemaSymbols.hpp
-- Installing: /work/build/external/win-x86_64/include/xercesc/validators/schema/SchemaValidator.hpp
-- Installing: /work/build/external/win-x86_64/include/xercesc/validators/schema/SubstitutionGroupComparator.hpp
-- Installing: /work/build/external/win-x86_64/include/xercesc/validators/schema/TraverseSchema.hpp
-- Installing: /work/build/external/win-x86_64/include/xercesc/validators/schema/XercesAttGroupInfo.hpp
-- Installing: /work/build/external/win-x86_64/include/xercesc/validators/schema/XercesElementWildcard.hpp
-- Installing: /work/build/external/win-x86_64/include/xercesc/validators/schema/XercesGroupInfo.hpp
-- Installing: /work/build/external/win-x86_64/include/xercesc/validators/schema/XMLSchemaDescriptionImpl.hpp
-- Installing: /work/build/external/win-x86_64/include/xercesc/validators/schema/XSDDOMParser.hpp
-- Installing: /work/build/external/win-x86_64/include/xercesc/validators/schema/XSDErrorReporter.hpp
-- Installing: /work/build/external/win-x86_64/include/xercesc/validators/schema/XSDLocator.hpp
-- Installing: /work/build/external/win-x86_64/include/xercesc/validators/schema/XUtil.hpp
-- Installing: /work/build/external/win-x86_64/include/xercesc/xinclude/XIncludeDOMDocumentProcessor.hpp
-- Installing: /work/build/external/win-x86_64/include/xercesc/xinclude/XIncludeLocation.hpp
-- Installing: /work/build/external/win-x86_64/include/xercesc/xinclude/XIncludeUtils.hpp
-- Installing: /work/build/external/win-x86_64/include/xercesc/util/Transcoders/Win32/Win32TransService.hpp
-- Installing: /work/build/external/win-x86_64/include/xercesc/util/MsgLoaders/InMemory/InMemMsgLoader.hpp
-- Installing: /work/build/external/win-x86_64/include/xercesc/util/MsgLoaders/InMemory/XercesMessages_en_US.hpp
-- Installing: /work/build/external/win-x86_64/include/xercesc/util/MutexManagers/NoThreadMutexMgr.hpp
-- Installing: /work/build/external/win-x86_64/include/xercesc/util/FileManagers/WindowsFileMgr.hpp
-- Installing: /work/build/external/win-x86_64/include/xercesc/util/Xerces_autoconf_config.hpp
-- Installing: /work/build/external/win-x86_64/include/xercesc/util/XercesVersion.hpp
-- Installing: /work/build/external/win-x86_64/bin/CreateDOMDocument.exe
-- Installing: /work/build/external/win-x86_64/bin/DOMCount.exe
-- Installing: /work/build/external/win-x86_64/bin/DOMPrint.exe
-- Installing: /work/build/external/win-x86_64/bin/EnumVal.exe
-- Installing: /work/build/external/win-x86_64/bin/MemParse.exe
-- Installing: /work/build/external/win-x86_64/bin/PParse.exe
-- Installing: /work/build/external/win-x86_64/bin/PSVIWriter.exe
-- Installing: /work/build/external/win-x86_64/bin/Redirect.exe
-- Installing: /work/build/external/win-x86_64/bin/SAX2Count.exe
-- Installing: /work/build/external/win-x86_64/bin/SAX2Print.exe
-- Installing: /work/build/external/win-x86_64/bin/SAXCount.exe
-- Installing: /work/build/external/win-x86_64/bin/SAXPrint.exe
-- Installing: /work/build/external/win-x86_64/bin/SCMPrint.exe
-- Installing: /work/build/external/win-x86_64/bin/SEnumVal.exe
-- Installing: /work/build/external/win-x86_64/bin/StdInParse.exe
-- Installing: /work/build/external/win-x86_64/bin/XInclude.exe
make: Leaving directory '/work/build/win-x64/xerces-c'
Running CMake
== Using MXE wrapper: /usr/src/mxe/usr/bin/x86_64-w64-mingw32.static-cmake
     - cmake version 3.15.4
     - warnings for unused CMAKE_POLICY_DEFAULT variables can be ignored
== Using MXE toolchain: /usr/src/mxe/usr/x86_64-w64-mingw32.static/share/cmake/mxe-conf.cmake
== Using MXE runresult: /usr/src/mxe/usr/share/cmake/modules/TryRunResults.cmake
== Adding "-DCMAKE_BUILD_TYPE=Release"
loading initial cache file /usr/src/mxe/usr/share/cmake/modules/TryRunResults.cmake
-- The C compiler identification is GNU 9.2.0
-- The CXX compiler identification is GNU 9.2.0
-- Check for working C compiler: /usr/src/mxe/usr/bin/x86_64-w64-mingw32.static-gcc
-- Check for working C compiler: /usr/src/mxe/usr/bin/x86_64-w64-mingw32.static-gcc -- works
-- Detecting C compiler ABI info
-- Detecting C compiler ABI info - done
-- Detecting C compile features
-- Detecting C compile features - done
-- Check for working CXX compiler: /usr/src/mxe/usr/bin/x86_64-w64-mingw32.static-g++
-- Check for working CXX compiler: /usr/src/mxe/usr/bin/x86_64-w64-mingw32.static-g++ -- works
-- Detecting CXX compiler ABI info
-- Detecting CXX compiler ABI info - done
-- Detecting CXX compile features
-- Detecting CXX compile features - done
FMU will be installed to: /work/build/install
x86_64
Third parties libraries will use search path: /work/build/external
-- Could NOT find Doxygen (missing: DOXYGEN_EXECUTABLE) 
-- No Doxygen found. Documentation won't be built
-- Could NOT find GTestSrc (missing: GTEST_SOURCE_DIR GTEST_INCLUDE_DIR) 
-- Found PythonInterp: /usr/bin/python (found version "2.7.13") 
-- Found C inline keyword: inline
-- Looking for clock_gettime in rt
-- Looking for clock_gettime in rt - not found
-- Looking for posix_spawnp in rt
-- Looking for posix_spawnp in rt - not found
-- Performing Test HAVE_GNU90
-- Performing Test HAVE_GNU90 - Success
-- Could NOT find POPT (missing: POPT_INCLUDE_DIR POPT_LIBRARY) (found version "")
-- Could NOT find XMLTO (missing: XMLTO_EXECUTABLE) 
-- Could NOT find Doxygen (missing: DOXYGEN_EXECUTABLE) 
-- Building rabbitmq as a shared library - no
-- Building rabbitmq as a static library - yes
-- Looking for pthread.h
-- Looking for pthread.h - found
-- Performing Test CMAKE_HAVE_LIBC_PTHREAD
-- Performing Test CMAKE_HAVE_LIBC_PTHREAD - Success
-- Found Threads: TRUE  
# date: USE_SYSTEM_TZ_DB ON
# date: USE_TZ_DB_IN_DOT OFF
# date: BUILD_TZ_STATIC ON
-- Performing Test COMPILER_SUPPORTS_CXX17
-- Performing Test COMPILER_SUPPORTS_CXX17 - Success
-- Package Xerces-C++ found: 
x86_64
-- Configuring done
-- Generating done
-- Build files have been written to: /work/build/win-x64
Compiling
make: Entering directory '/work/build/win-x64'
/usr/src/mxe/usr/x86_64-pc-linux-gnu/bin/cmake -S/work -B/work/build/win-x64 --check-build-system CMakeFiles/Makefile.cmake 0
/usr/src/mxe/usr/x86_64-pc-linux-gnu/bin/cmake -E cmake_progress_start /work/build/win-x64/CMakeFiles /work/build/win-x64/CMakeFiles/progress.marks
make -f CMakeFiles/Makefile2 all
make[1]: Entering directory '/work/build/win-x64'
make -f thirdparty/googletest/googletest/CMakeFiles/gtest.dir/build.make thirdparty/googletest/googletest/CMakeFiles/gtest.dir/depend
make -f thirdparty/rabbitmq-c/rabbitmq-c/librabbitmq/CMakeFiles/rabbitmq-static.dir/build.make thirdparty/rabbitmq-c/rabbitmq-c/librabbitmq/CMakeFiles/rabbitmq-static.dir/depend
make -f thirdparty/date/date/CMakeFiles/tz.dir/build.make thirdparty/date/date/CMakeFiles/tz.dir/depend
make[2]: Entering directory '/work/build/win-x64'
cd /work/build/win-x64 && /usr/src/mxe/usr/x86_64-pc-linux-gnu/bin/cmake -E cmake_depends "Unix Makefiles" /work /work/thirdparty/googletest/googletest /work/build/win-x64 /work/build/win-x64/thirdparty/googletest/googletest /work/build/win-x64/thirdparty/googletest/googletest/CMakeFiles/gtest.dir/DependInfo.cmake --color=
make[2]: Entering directory '/work/build/win-x64'
cd /work/build/win-x64 && /usr/src/mxe/usr/x86_64-pc-linux-gnu/bin/cmake -E cmake_depends "Unix Makefiles" /work /work/thirdparty/rabbitmq-c/rabbitmq-c/librabbitmq /work/build/win-x64 /work/build/win-x64/thirdparty/rabbitmq-c/rabbitmq-c/librabbitmq /work/build/win-x64/thirdparty/rabbitmq-c/rabbitmq-c/librabbitmq/CMakeFiles/rabbitmq-static.dir/DependInfo.cmake --color=
make[2]: Entering directory '/work/build/win-x64'
cd /work/build/win-x64 && /usr/src/mxe/usr/x86_64-pc-linux-gnu/bin/cmake -E cmake_depends "Unix Makefiles" /work /work/thirdparty/date/date /work/build/win-x64 /work/build/win-x64/thirdparty/date/date /work/build/win-x64/thirdparty/date/date/CMakeFiles/tz.dir/DependInfo.cmake --color=
Scanning dependencies of target gtest
make[2]: Leaving directory '/work/build/win-x64'
make -f thirdparty/googletest/googletest/CMakeFiles/gtest.dir/build.make thirdparty/googletest/googletest/CMakeFiles/gtest.dir/build
make[2]: Entering directory '/work/build/win-x64'
Scanning dependencies of target tz
make[2]: Leaving directory '/work/build/win-x64'
make -f thirdparty/date/date/CMakeFiles/tz.dir/build.make thirdparty/date/date/CMakeFiles/tz.dir/build
[  0%] Building CXX object thirdparty/googletest/googletest/CMakeFiles/gtest.dir/src/gtest-all.cc.obj
cd /work/build/win-x64/thirdparty/googletest/googletest && /usr/src/mxe/usr/bin/x86_64-w64-mingw32.static-g++   @CMakeFiles/gtest.dir/includes_CXX.rsp -O3 -DNDEBUG   -Wall -Wshadow -Werror -Wno-error=dangling-else -DGTEST_HAS_PTHREAD=0 -fexceptions -Wextra -Wno-unused-parameter -Wno-missing-field-initializers -std=c++11 -o CMakeFiles/gtest.dir/src/gtest-all.cc.obj -c /work/thirdparty/googletest/googletest/src/gtest-all.cc
make[2]: Entering directory '/work/build/win-x64'
Scanning dependencies of target rabbitmq-static
make[2]: Leaving directory '/work/build/win-x64'
make -f thirdparty/rabbitmq-c/rabbitmq-c/librabbitmq/CMakeFiles/rabbitmq-static.dir/build.make thirdparty/rabbitmq-c/rabbitmq-c/librabbitmq/CMakeFiles/rabbitmq-static.dir/build
[  0%] Building CXX object thirdparty/date/date/CMakeFiles/tz.dir/src/tz.cpp.obj
cd /work/build/win-x64/thirdparty/date/date && /usr/src/mxe/usr/bin/x86_64-w64-mingw32.static-g++  -DHAS_REMOTE_API=0 -DUSE_AUTOLOAD=0 @CMakeFiles/tz.dir/includes_CXX.rsp -O3 -DNDEBUG   -std=gnu++17 -o CMakeFiles/tz.dir/src/tz.cpp.obj -c /work/thirdparty/date/date/src/tz.cpp
make[2]: Entering directory '/work/build/win-x64'
[  2%] Building C object thirdparty/rabbitmq-c/rabbitmq-c/librabbitmq/CMakeFiles/rabbitmq-static.dir/amqp_framing.c.obj
cd /work/build/win-x64/thirdparty/rabbitmq-c/rabbitmq-c/librabbitmq && /usr/src/mxe/usr/bin/x86_64-w64-mingw32.static-gcc -DAMQP_BUILD -DAMQP_STATIC -DHAVE_CONFIG_H @CMakeFiles/rabbitmq-static.dir/includes_C.rsp -Wall -Wextra -Wstrict-prototypes -Wno-unused-function -fno-common -fvisibility=hidden  -std=gnu90 -O3 -DNDEBUG   -o CMakeFiles/rabbitmq-static.dir/amqp_framing.c.obj   -c /work/thirdparty/rabbitmq-c/rabbitmq-c/librabbitmq/amqp_framing.c
[  5%] Building C object thirdparty/rabbitmq-c/rabbitmq-c/librabbitmq/CMakeFiles/rabbitmq-static.dir/amqp_table.c.obj
cd /work/build/win-x64/thirdparty/rabbitmq-c/rabbitmq-c/librabbitmq && /usr/src/mxe/usr/bin/x86_64-w64-mingw32.static-gcc -DAMQP_BUILD -DAMQP_STATIC -DHAVE_CONFIG_H @CMakeFiles/rabbitmq-static.dir/includes_C.rsp -Wall -Wextra -Wstrict-prototypes -Wno-unused-function -fno-common -fvisibility=hidden  -std=gnu90 -O3 -DNDEBUG   -o CMakeFiles/rabbitmq-static.dir/amqp_table.c.obj   -c /work/thirdparty/rabbitmq-c/rabbitmq-c/librabbitmq/amqp_table.c
[  8%] Building C object thirdparty/rabbitmq-c/rabbitmq-c/librabbitmq/CMakeFiles/rabbitmq-static.dir/amqp_connection.c.obj
[  8%] Building C object thirdparty/rabbitmq-c/rabbitmq-c/librabbitmq/CMakeFiles/rabbitmq-static.dir/amqp_api.c.obj
cd /work/build/win-x64/thirdparty/rabbitmq-c/rabbitmq-c/librabbitmq && /usr/src/mxe/usr/bin/x86_64-w64-mingw32.static-gcc -DAMQP_BUILD -DAMQP_STATIC -DHAVE_CONFIG_H @CMakeFiles/rabbitmq-static.dir/includes_C.rsp -Wall -Wextra -Wstrict-prototypes -Wno-unused-function -fno-common -fvisibility=hidden  -std=gnu90 -O3 -DNDEBUG   -o CMakeFiles/rabbitmq-static.dir/amqp_api.c.obj   -c /work/thirdparty/rabbitmq-c/rabbitmq-c/librabbitmq/amqp_api.c
[  5%] Building C object thirdparty/rabbitmq-c/rabbitmq-c/librabbitmq/CMakeFiles/rabbitmq-static.dir/amqp_socket.c.obj
[  8%] Building C object thirdparty/rabbitmq-c/rabbitmq-c/librabbitmq/CMakeFiles/rabbitmq-static.dir/amqp_mem.c.obj
cd /work/build/win-x64/thirdparty/rabbitmq-c/rabbitmq-c/librabbitmq && /usr/src/mxe/usr/bin/x86_64-w64-mingw32.static-gcc -DAMQP_BUILD -DAMQP_STATIC -DHAVE_CONFIG_H @CMakeFiles/rabbitmq-static.dir/includes_C.rsp -Wall -Wextra -Wstrict-prototypes -Wno-unused-function -fno-common -fvisibility=hidden  -std=gnu90 -O3 -DNDEBUG   -o CMakeFiles/rabbitmq-static.dir/amqp_connection.c.obj   -c /work/thirdparty/rabbitmq-c/rabbitmq-c/librabbitmq/amqp_connection.c
cd /work/build/win-x64/thirdparty/rabbitmq-c/rabbitmq-c/librabbitmq && /usr/src/mxe/usr/bin/x86_64-w64-mingw32.static-gcc -DAMQP_BUILD -DAMQP_STATIC -DHAVE_CONFIG_H @CMakeFiles/rabbitmq-static.dir/includes_C.rsp -Wall -Wextra -Wstrict-prototypes -Wno-unused-function -fno-common -fvisibility=hidden  -std=gnu90 -O3 -DNDEBUG   -o CMakeFiles/rabbitmq-static.dir/amqp_socket.c.obj   -c /work/thirdparty/rabbitmq-c/rabbitmq-c/librabbitmq/amqp_socket.c
cd /work/build/win-x64/thirdparty/rabbitmq-c/rabbitmq-c/librabbitmq && /usr/src/mxe/usr/bin/x86_64-w64-mingw32.static-gcc -DAMQP_BUILD -DAMQP_STATIC -DHAVE_CONFIG_H @CMakeFiles/rabbitmq-static.dir/includes_C.rsp -Wall -Wextra -Wstrict-prototypes -Wno-unused-function -fno-common -fvisibility=hidden  -std=gnu90 -O3 -DNDEBUG   -o CMakeFiles/rabbitmq-static.dir/amqp_mem.c.obj   -c /work/thirdparty/rabbitmq-c/rabbitmq-c/librabbitmq/amqp_mem.c
/work/thirdparty/rabbitmq-c/rabbitmq-c/librabbitmq/amqp_connection.c: In function 'amqp_handle_input':
/work/thirdparty/rabbitmq-c/rabbitmq-c/librabbitmq/amqp_connection.c:267:10: warning: this statement may fall through [-Wimplicit-fallthrough=]
  267 |       if (memcmp(raw_frame, "AMQP", 4) == 0) {
      |          ^
/work/thirdparty/rabbitmq-c/rabbitmq-c/librabbitmq/amqp_connection.c:287:5: note: here
  287 |     case CONNECTION_STATE_HEADER: {
      |     ^~~~
/work/thirdparty/rabbitmq-c/rabbitmq-c/librabbitmq/amqp_connection.c:287:35: warning: this statement may fall through [-Wimplicit-fallthrough=]
  287 |     case CONNECTION_STATE_HEADER: {
      |                                   ^
/work/thirdparty/rabbitmq-c/rabbitmq-c/librabbitmq/amqp_connection.c:334:5: note: here
  334 |     case CONNECTION_STATE_BODY: {
      |     ^~~~
[ 10%] Building C object thirdparty/rabbitmq-c/rabbitmq-c/librabbitmq/CMakeFiles/rabbitmq-static.dir/amqp_url.c.obj
cd /work/build/win-x64/thirdparty/rabbitmq-c/rabbitmq-c/librabbitmq && /usr/src/mxe/usr/bin/x86_64-w64-mingw32.static-gcc -DAMQP_BUILD -DAMQP_STATIC -DHAVE_CONFIG_H @CMakeFiles/rabbitmq-static.dir/includes_C.rsp -Wall -Wextra -Wstrict-prototypes -Wno-unused-function -fno-common -fvisibility=hidden  -std=gnu90 -O3 -DNDEBUG   -o CMakeFiles/rabbitmq-static.dir/amqp_url.c.obj   -c /work/thirdparty/rabbitmq-c/rabbitmq-c/librabbitmq/amqp_url.c
[ 10%] Building C object thirdparty/rabbitmq-c/rabbitmq-c/librabbitmq/CMakeFiles/rabbitmq-static.dir/amqp_tcp_socket.c.obj
cd /work/build/win-x64/thirdparty/rabbitmq-c/rabbitmq-c/librabbitmq && /usr/src/mxe/usr/bin/x86_64-w64-mingw32.static-gcc -DAMQP_BUILD -DAMQP_STATIC -DHAVE_CONFIG_H @CMakeFiles/rabbitmq-static.dir/includes_C.rsp -Wall -Wextra -Wstrict-prototypes -Wno-unused-function -fno-common -fvisibility=hidden  -std=gnu90 -O3 -DNDEBUG   -o CMakeFiles/rabbitmq-static.dir/amqp_tcp_socket.c.obj   -c /work/thirdparty/rabbitmq-c/rabbitmq-c/librabbitmq/amqp_tcp_socket.c
/work/thirdparty/rabbitmq-c/rabbitmq-c/librabbitmq/amqp_socket.c: In function 'connect_socket':
/work/thirdparty/rabbitmq-c/rabbitmq-c/librabbitmq/amqp_socket.c:341:52: warning: passing argument 3 of 'ioctlsocket' from incompatible pointer type [-Wincompatible-pointer-types]
  341 |   if (SOCKET_ERROR == ioctlsocket(sockfd, FIONBIO, &one)) {
      |                                                    ^~~~
      |                                                    |
      |                                                    int *
In file included from /work/thirdparty/rabbitmq-c/rabbitmq-c/librabbitmq/amqp_private.h:62,
                 from /work/thirdparty/rabbitmq-c/rabbitmq-c/librabbitmq/amqp_socket.c:44:
/usr/src/mxe/usr/x86_64-w64-mingw32.static/include/winsock2.h:977:76: note: expected 'u_long *' {aka 'long unsigned int *'} but argument is of type 'int *'
  977 |   WINSOCK_API_LINKAGE int WSAAPI ioctlsocket(SOCKET s,__LONG32 cmd,u_long *argp);
      |                                                                    ~~~~~~~~^~~~
[ 13%] Building C object thirdparty/rabbitmq-c/rabbitmq-c/librabbitmq/CMakeFiles/rabbitmq-static.dir/amqp_time.c.obj
cd /work/build/win-x64/thirdparty/rabbitmq-c/rabbitmq-c/librabbitmq && /usr/src/mxe/usr/bin/x86_64-w64-mingw32.static-gcc -DAMQP_BUILD -DAMQP_STATIC -DHAVE_CONFIG_H @CMakeFiles/rabbitmq-static.dir/includes_C.rsp -Wall -Wextra -Wstrict-prototypes -Wno-unused-function -fno-common -fvisibility=hidden  -std=gnu90 -O3 -DNDEBUG   -o CMakeFiles/rabbitmq-static.dir/amqp_time.c.obj   -c /work/thirdparty/rabbitmq-c/rabbitmq-c/librabbitmq/amqp_time.c
[ 13%] Building C object thirdparty/rabbitmq-c/rabbitmq-c/librabbitmq/CMakeFiles/rabbitmq-static.dir/amqp_consumer.c.obj
cd /work/build/win-x64/thirdparty/rabbitmq-c/rabbitmq-c/librabbitmq && /usr/src/mxe/usr/bin/x86_64-w64-mingw32.static-gcc -DAMQP_BUILD -DAMQP_STATIC -DHAVE_CONFIG_H @CMakeFiles/rabbitmq-static.dir/includes_C.rsp -Wall -Wextra -Wstrict-prototypes -Wno-unused-function -fno-common -fvisibility=hidden  -std=gnu90 -O3 -DNDEBUG   -o CMakeFiles/rabbitmq-static.dir/amqp_consumer.c.obj   -c /work/thirdparty/rabbitmq-c/rabbitmq-c/librabbitmq/amqp_consumer.c
/work/thirdparty/rabbitmq-c/rabbitmq-c/librabbitmq/amqp_tcp_socket.c: In function 'amqp_tcp_socket_send':
/work/thirdparty/rabbitmq-c/rabbitmq-c/librabbitmq/amqp_tcp_socket.c:52:41: warning: unused parameter 'flags' [-Wunused-parameter]
   52 |                                     int flags) {
      |                                     ~~~~^~~~~
[ 16%] Linking C static library liblibrabbitmq.4.a
cd /work/build/win-x64/thirdparty/rabbitmq-c/rabbitmq-c/librabbitmq && /usr/src/mxe/usr/x86_64-pc-linux-gnu/bin/cmake -P CMakeFiles/rabbitmq-static.dir/cmake_clean_target.cmake
cd /work/build/win-x64/thirdparty/rabbitmq-c/rabbitmq-c/librabbitmq && /usr/src/mxe/usr/x86_64-pc-linux-gnu/bin/cmake -E cmake_link_script CMakeFiles/rabbitmq-static.dir/link.txt --verbose=1
/usr/src/mxe/usr/bin/x86_64-w64-mingw32.static-ar qc liblibrabbitmq.4.a  CMakeFiles/rabbitmq-static.dir/amqp_framing.c.obj CMakeFiles/rabbitmq-static.dir/amqp_api.c.obj CMakeFiles/rabbitmq-static.dir/amqp_connection.c.obj CMakeFiles/rabbitmq-static.dir/amqp_mem.c.obj CMakeFiles/rabbitmq-static.dir/amqp_socket.c.obj CMakeFiles/rabbitmq-static.dir/amqp_table.c.obj CMakeFiles/rabbitmq-static.dir/amqp_url.c.obj CMakeFiles/rabbitmq-static.dir/amqp_tcp_socket.c.obj CMakeFiles/rabbitmq-static.dir/amqp_time.c.obj CMakeFiles/rabbitmq-static.dir/amqp_consumer.c.obj
/usr/src/mxe/usr/bin/x86_64-w64-mingw32.static-ranlib liblibrabbitmq.4.a
make[2]: Leaving directory '/work/build/win-x64'
[ 16%] Built target rabbitmq-static
[ 18%] Linking CXX static library libtz.a
cd /work/build/win-x64/thirdparty/date/date && /usr/src/mxe/usr/x86_64-pc-linux-gnu/bin/cmake -P CMakeFiles/tz.dir/cmake_clean_target.cmake
cd /work/build/win-x64/thirdparty/date/date && /usr/src/mxe/usr/x86_64-pc-linux-gnu/bin/cmake -E cmake_link_script CMakeFiles/tz.dir/link.txt --verbose=1
/usr/src/mxe/usr/bin/x86_64-w64-mingw32.static-ar qc libtz.a  CMakeFiles/tz.dir/src/tz.cpp.obj
/usr/src/mxe/usr/bin/x86_64-w64-mingw32.static-ranlib libtz.a
make[2]: Leaving directory '/work/build/win-x64'
[ 18%] Built target tz
make -f rabbitmq-core/CMakeFiles/rabbitmq-core.dir/build.make rabbitmq-core/CMakeFiles/rabbitmq-core.dir/depend
make[2]: Entering directory '/work/build/win-x64'
cd /work/build/win-x64 && /usr/src/mxe/usr/x86_64-pc-linux-gnu/bin/cmake -E cmake_depends "Unix Makefiles" /work /work/rabbitmq-core /work/build/win-x64 /work/build/win-x64/rabbitmq-core /work/build/win-x64/rabbitmq-core/CMakeFiles/rabbitmq-core.dir/DependInfo.cmake --color=
Scanning dependencies of target rabbitmq-core
make[2]: Leaving directory '/work/build/win-x64'
make -f rabbitmq-core/CMakeFiles/rabbitmq-core.dir/build.make rabbitmq-core/CMakeFiles/rabbitmq-core.dir/build
make[2]: Entering directory '/work/build/win-x64'
[ 21%] Building CXX object rabbitmq-core/CMakeFiles/rabbitmq-core.dir/src/FmuContainerCore.cpp.obj
cd /work/build/win-x64/rabbitmq-core && /usr/src/mxe/usr/bin/x86_64-w64-mingw32.static-g++   @CMakeFiles/rabbitmq-core.dir/includes_CXX.rsp -O3 -DNDEBUG   -std=gnu++17 -o CMakeFiles/rabbitmq-core.dir/src/FmuContainerCore.cpp.obj -c /work/rabbitmq-core/src/FmuContainerCore.cpp
In file included from /usr/src/mxe/usr/lib/gcc/x86_64-w64-mingw32.static/9.2.0/include/c++/functional:54,
                 from /usr/src/mxe/usr/lib/gcc/x86_64-w64-mingw32.static/9.2.0/include/c++/pstl/glue_algorithm_defs.h:13,
                 from /usr/src/mxe/usr/lib/gcc/x86_64-w64-mingw32.static/9.2.0/include/c++/algorithm:71,
                 from /work/thirdparty/date/date/include/date/date.h:42,
                 from /work/rabbitmq-core/src/FmuContainerCore.h:11,
                 from /work/rabbitmq-core/src/FmuContainerCore.cpp:5:
/usr/src/mxe/usr/lib/gcc/x86_64-w64-mingw32.static/9.2.0/include/c++/tuple: In instantiation of 'std::pair<_T1, _T2>::pair(std::tuple<_Args1 ...>&, std::tuple<_Args2 ...>&, std::_Index_tuple<_Indexes1 ...>, std::_Index_tuple<_Indexes2 ...>) [with _Args1 = {const unsigned int&}; long long unsigned int ..._Indexes1 = {0}; _Args2 = {}; long long unsigned int ..._Indexes2 = {}; _T1 = const unsigned int; _T2 = std::pair<std::chrono::time_point<std::chrono::_V2::system_clock, std::chrono::duration<long long int, std::ratio<1, 1000> > >, ScalarVariableBaseValue>]':
/usr/src/mxe/usr/lib/gcc/x86_64-w64-mingw32.static/9.2.0/include/c++/tuple:1663:63:   required from 'std::pair<_T1, _T2>::pair(std::piecewise_construct_t, std::tuple<_Args1 ...>, std::tuple<_Args2 ...>) [with _Args1 = {const unsigned int&}; _Args2 = {}; _T1 = const unsigned int; _T2 = std::pair<std::chrono::time_point<std::chrono::_V2::system_clock, std::chrono::duration<long long int, std::ratio<1, 1000> > >, ScalarVariableBaseValue>]'
/usr/src/mxe/usr/lib/gcc/x86_64-w64-mingw32.static/9.2.0/include/c++/ext/new_allocator.h:147:4:   required from 'void __gnu_cxx::new_allocator<_Tp>::construct(_Up*, _Args&& ...) [with _Up = std::pair<const unsigned int, std::pair<std::chrono::time_point<std::chrono::_V2::system_clock, std::chrono::duration<long long int, std::ratio<1, 1000> > >, ScalarVariableBaseValue> >; _Args = {const std::piecewise_construct_t&, std::tuple<const unsigned int&>, std::tuple<>}; _Tp = std::_Rb_tree_node<std::pair<const unsigned int, std::pair<std::chrono::time_point<std::chrono::_V2::system_clock, std::chrono::duration<long long int, std::ratio<1, 1000> > >, ScalarVariableBaseValue> > >]'
/usr/src/mxe/usr/lib/gcc/x86_64-w64-mingw32.static/9.2.0/include/c++/bits/alloc_traits.h:484:4:   required from 'static void std::allocator_traits<std::allocator<_Tp1> >::construct(std::allocator_traits<std::allocator<_Tp1> >::allocator_type&, _Up*, _Args&& ...) [with _Up = std::pair<const unsigned int, std::pair<std::chrono::time_point<std::chrono::_V2::system_clock, std::chrono::duration<long long int, std::ratio<1, 1000> > >, ScalarVariableBaseValue> >; _Args = {const std::piecewise_construct_t&, std::tuple<const unsigned int&>, std::tuple<>}; _Tp = std::_Rb_tree_node<std::pair<const unsigned int, std::pair<std::chrono::time_point<std::chrono::_V2::system_clock, std::chrono::duration<long long int, std::ratio<1, 1000> > >, ScalarVariableBaseValue> > >; std::allocator_traits<std::allocator<_Tp1> >::allocator_type = std::allocator<std::_Rb_tree_node<std::pair<const unsigned int, std::pair<std::chrono::time_point<std::chrono::_V2::system_clock, std::chrono::duration<long long int, std::ratio<1, 1000> > >, ScalarVariableBaseValue> > > >]'
/usr/src/mxe/usr/lib/gcc/x86_64-w64-mingw32.static/9.2.0/include/c++/bits/stl_tree.h:614:32:   required from 'void std::_Rb_tree<_Key, _Val, _KeyOfValue, _Compare, _Alloc>::_M_construct_node(std::_Rb_tree<_Key, _Val, _KeyOfValue, _Compare, _Alloc>::_Link_type, _Args&& ...) [with _Args = {const std::piecewise_construct_t&, std::tuple<const unsigned int&>, std::tuple<>}; _Key = unsigned int; _Val = std::pair<const unsigned int, std::pair<std::chrono::time_point<std::chrono::_V2::system_clock, std::chrono::duration<long long int, std::ratio<1, 1000> > >, ScalarVariableBaseValue> >; _KeyOfValue = std::_Select1st<std::pair<const unsigned int, std::pair<std::chrono::time_point<std::chrono::_V2::system_clock, std::chrono::duration<long long int, std::ratio<1, 1000> > >, ScalarVariableBaseValue> > >; _Compare = std::less<unsigned int>; _Alloc = std::allocator<std::pair<const unsigned int, std::pair<std::chrono::time_point<std::chrono::_V2::system_clock, std::chrono::duration<long long int, std::ratio<1, 1000> > >, ScalarVariableBaseValue> > >; std::_Rb_tree<_Key, _Val, _KeyOfValue, _Compare, _Alloc>::_Link_type = std::_Rb_tree_node<std::pair<const unsigned int, std::pair<std::chrono::time_point<std::chrono::_V2::system_clock, std::chrono::duration<long long int, std::ratio<1, 1000> > >, ScalarVariableBaseValue> > >*]'
/usr/src/mxe/usr/lib/gcc/x86_64-w64-mingw32.static/9.2.0/include/c++/bits/stl_tree.h:631:4:   required from 'std::_Rb_tree_node<_Val>* std::_Rb_tree<_Key, _Val, _KeyOfValue, _Compare, _Alloc>::_M_create_node(_Args&& ...) [with _Args = {const std::piecewise_construct_t&, std::tuple<const unsigned int&>, std::tuple<>}; _Key = unsigned int; _Val = std::pair<const unsigned int, std::pair<std::chrono::time_point<std::chrono::_V2::system_clock, std::chrono::duration<long long int, std::ratio<1, 1000> > >, ScalarVariableBaseValue> >; _KeyOfValue = std::_Select1st<std::pair<const unsigned int, std::pair<std::chrono::time_point<std::chrono::_V2::system_clock, std::chrono::duration<long long int, std::ratio<1, 1000> > >, ScalarVariableBaseValue> > >; _Compare = std::less<unsigned int>; _Alloc = std::allocator<std::pair<const unsigned int, std::pair<std::chrono::time_point<std::chrono::_V2::system_clock, std::chrono::duration<long long int, std::ratio<1, 1000> > >, ScalarVariableBaseValue> > >; std::_Rb_tree<_Key, _Val, _KeyOfValue, _Compare, _Alloc>::_Link_type = std::_Rb_tree_node<std::pair<const unsigned int, std::pair<std::chrono::time_point<std::chrono::_V2::system_clock, std::chrono::duration<long long int, std::ratio<1, 1000> > >, ScalarVariableBaseValue> > >*]'
/usr/src/mxe/usr/lib/gcc/x86_64-w64-mingw32.static/9.2.0/include/c++/bits/stl_tree.h:2455:13:   required from 'std::_Rb_tree<_Key, _Val, _KeyOfValue, _Compare, _Alloc>::iterator std::_Rb_tree<_Key, _Val, _KeyOfValue, _Compare, _Alloc>::_M_emplace_hint_unique(std::_Rb_tree<_Key, _Val, _KeyOfValue, _Compare, _Alloc>::const_iterator, _Args&& ...) [with _Args = {const std::piecewise_construct_t&, std::tuple<const unsigned int&>, std::tuple<>}; _Key = unsigned int; _Val = std::pair<const unsigned int, std::pair<std::chrono::time_point<std::chrono::_V2::system_clock, std::chrono::duration<long long int, std::ratio<1, 1000> > >, ScalarVariableBaseValue> >; _KeyOfValue = std::_Select1st<std::pair<const unsigned int, std::pair<std::chrono::time_point<std::chrono::_V2::system_clock, std::chrono::duration<long long int, std::ratio<1, 1000> > >, ScalarVariableBaseValue> > >; _Compare = std::less<unsigned int>; _Alloc = std::allocator<std::pair<const unsigned int, std::pair<std::chrono::time_point<std::chrono::_V2::system_clock, std::chrono::duration<long long int, std::ratio<1, 1000> > >, ScalarVariableBaseValue> > >; std::_Rb_tree<_Key, _Val, _KeyOfValue, _Compare, _Alloc>::iterator = std::_Rb_tree_iterator<std::pair<const unsigned int, std::pair<std::chrono::time_point<std::chrono::_V2::system_clock, std::chrono::duration<long long int, std::ratio<1, 1000> > >, ScalarVariableBaseValue> > >; std::_Rb_tree<_Key, _Val, _KeyOfValue, _Compare, _Alloc>::const_iterator = std::_Rb_tree_const_iterator<std::pair<const unsigned int, std::pair<std::chrono::time_point<std::chrono::_V2::system_clock, std::chrono::duration<long long int, std::ratio<1, 1000> > >, ScalarVariableBaseValue> > >]'
/usr/src/mxe/usr/lib/gcc/x86_64-w64-mingw32.static/9.2.0/include/c++/bits/stl_map.h:499:8:   required from 'std::map<_Key, _Tp, _Compare, _Alloc>::mapped_type& std::map<_Key, _Tp, _Compare, _Alloc>::operator[](const key_type&) [with _Key = unsigned int; _Tp = std::pair<std::chrono::time_point<std::chrono::_V2::system_clock, std::chrono::duration<long long int, std::ratio<1, 1000> > >, ScalarVariableBaseValue>; _Compare = std::less<unsigned int>; _Alloc = std::allocator<std::pair<const unsigned int, std::pair<std::chrono::time_point<std::chrono::_V2::system_clock, std::chrono::duration<long long int, std::ratio<1, 1000> > >, ScalarVariableBaseValue> > >; std::map<_Key, _Tp, _Compare, _Alloc>::mapped_type = std::pair<std::chrono::time_point<std::chrono::_V2::system_clock, std::chrono::duration<long long int, std::ratio<1, 1000> > >, ScalarVariableBaseValue>; std::map<_Key, _Tp, _Compare, _Alloc>::key_type = unsigned int]'
/work/rabbitmq-core/src/FmuContainerCore.cpp:159:43:   required from 'void FmuContainerCore::processLookahead(Predicate) [with Predicate = FmuContainerCore::initialize()::<lambda(FmuContainerCore::TimedScalarBasicValue&)>]'
/work/rabbitmq-core/src/FmuContainerCore.cpp:220:31:   required from here
/usr/src/mxe/usr/lib/gcc/x86_64-w64-mingw32.static/9.2.0/include/c++/tuple:1674:70: error: no matching function for call to 'std::pair<std::chrono::time_point<std::chrono::_V2::system_clock, std::chrono::duration<long long int, std::ratio<1, 1000> > >, ScalarVariableBaseValue>::pair()'
 1674 |         second(std::forward<_Args2>(std::get<_Indexes2>(__tuple2))...)
      |                                                                      ^
In file included from /usr/src/mxe/usr/lib/gcc/x86_64-w64-mingw32.static/9.2.0/include/c++/bits/stl_algobase.h:64,
                 from /usr/src/mxe/usr/lib/gcc/x86_64-w64-mingw32.static/9.2.0/include/c++/list:60,
                 from /work/rabbitmq-core/src/FmuContainerCore.h:9,
                 from /work/rabbitmq-core/src/FmuContainerCore.cpp:5:
/usr/src/mxe/usr/lib/gcc/x86_64-w64-mingw32.static/9.2.0/include/c++/bits/stl_pair.h:436:9: note: candidate: 'template<class ... _Args1, long long unsigned int ..._Indexes1, class ... _Args2, long long unsigned int ..._Indexes2> std::pair<_T1, _T2>::pair(std::tuple<_Args1 ...>&, std::tuple<_Args2 ...>&, std::_Index_tuple<_Indexes1 ...>, std::_Index_tuple<_Indexes2 ...>)'
  436 |         pair(tuple<_Args1...>&, tuple<_Args2...>&,
      |         ^~~~
/usr/src/mxe/usr/lib/gcc/x86_64-w64-mingw32.static/9.2.0/include/c++/bits/stl_pair.h:436:9: note:   template argument deduction/substitution failed:
In file included from /usr/src/mxe/usr/lib/gcc/x86_64-w64-mingw32.static/9.2.0/include/c++/functional:54,
                 from /usr/src/mxe/usr/lib/gcc/x86_64-w64-mingw32.static/9.2.0/include/c++/pstl/glue_algorithm_defs.h:13,
                 from /usr/src/mxe/usr/lib/gcc/x86_64-w64-mingw32.static/9.2.0/include/c++/algorithm:71,
                 from /work/thirdparty/date/date/include/date/date.h:42,
                 from /work/rabbitmq-core/src/FmuContainerCore.h:11,
                 from /work/rabbitmq-core/src/FmuContainerCore.cpp:5:
/usr/src/mxe/usr/lib/gcc/x86_64-w64-mingw32.static/9.2.0/include/c++/tuple:1674:70: note:   candidate expects 4 arguments, 0 provided
 1674 |         second(std::forward<_Args2>(std::get<_Indexes2>(__tuple2))...)
      |                                                                      ^
In file included from /usr/src/mxe/usr/lib/gcc/x86_64-w64-mingw32.static/9.2.0/include/c++/bits/stl_algobase.h:64,
                 from /usr/src/mxe/usr/lib/gcc/x86_64-w64-mingw32.static/9.2.0/include/c++/list:60,
                 from /work/rabbitmq-core/src/FmuContainerCore.h:9,
                 from /work/rabbitmq-core/src/FmuContainerCore.cpp:5:
/usr/src/mxe/usr/lib/gcc/x86_64-w64-mingw32.static/9.2.0/include/c++/bits/stl_pair.h:375:9: note: candidate: 'template<class ... _Args1, class ... _Args2> std::pair<_T1, _T2>::pair(std::piecewise_construct_t, std::tuple<_Args1 ...>, std::tuple<_Args2 ...>)'
  375 |         pair(piecewise_construct_t, tuple<_Args1...>, tuple<_Args2...>);
      |         ^~~~
/usr/src/mxe/usr/lib/gcc/x86_64-w64-mingw32.static/9.2.0/include/c++/bits/stl_pair.h:375:9: note:   template argument deduction/substitution failed:
In file included from /usr/src/mxe/usr/lib/gcc/x86_64-w64-mingw32.static/9.2.0/include/c++/functional:54,
                 from /usr/src/mxe/usr/lib/gcc/x86_64-w64-mingw32.static/9.2.0/include/c++/pstl/glue_algorithm_defs.h:13,
                 from /usr/src/mxe/usr/lib/gcc/x86_64-w64-mingw32.static/9.2.0/include/c++/algorithm:71,
                 from /work/thirdparty/date/date/include/date/date.h:42,
                 from /work/rabbitmq-core/src/FmuContainerCore.h:11,
                 from /work/rabbitmq-core/src/FmuContainerCore.cpp:5:
/usr/src/mxe/usr/lib/gcc/x86_64-w64-mingw32.static/9.2.0/include/c++/tuple:1674:70: note:   candidate expects 3 arguments, 0 provided
 1674 |         second(std::forward<_Args2>(std::get<_Indexes2>(__tuple2))...)
      |                                                                      ^
In file included from /usr/src/mxe/usr/lib/gcc/x86_64-w64-mingw32.static/9.2.0/include/c++/bits/stl_algobase.h:64,
                 from /usr/src/mxe/usr/lib/gcc/x86_64-w64-mingw32.static/9.2.0/include/c++/list:60,
                 from /work/rabbitmq-core/src/FmuContainerCore.h:9,
                 from /work/rabbitmq-core/src/FmuContainerCore.cpp:5:
/usr/src/mxe/usr/lib/gcc/x86_64-w64-mingw32.static/9.2.0/include/c++/bits/stl_pair.h:370:21: note: candidate: 'template<class _U1, class _U2, typename std::enable_if<(std::_PCC<((! std::is_same<std::chrono::time_point<std::chrono::_V2::system_clock, std::chrono::duration<long long int, std::ratio<1, 1000> > >, _U1>::value) || (! std::is_same<ScalarVariableBaseValue, _U2>::value)), std::chrono::time_point<std::chrono::_V2::system_clock, std::chrono::duration<long long int, std::ratio<1, 1000> > >, ScalarVariableBaseValue>::_MoveConstructiblePair<_U1, _U2>() && (! std::_PCC<((! std::is_same<std::chrono::time_point<std::chrono::_V2::system_clock, std::chrono::duration<long long int, std::ratio<1, 1000> > >, _U1>::value) || (! std::is_same<ScalarVariableBaseValue, _U2>::value)), std::chrono::time_point<std::chrono::_V2::system_clock, std::chrono::duration<long long int, std::ratio<1, 1000> > >, ScalarVariableBaseValue>::_ImplicitlyMoveConvertiblePair<_U1, _U2>())), bool>::type <anonymous> > constexpr std::pair<_T1, _T2>::pair(std::pair<_U1, _U2>&&)'
  370 |  explicit constexpr pair(pair<_U1, _U2>&& __p)
      |                     ^~~~
/usr/src/mxe/usr/lib/gcc/x86_64-w64-mingw32.static/9.2.0/include/c++/bits/stl_pair.h:370:21: note:   template argument deduction/substitution failed:
In file included from /usr/src/mxe/usr/lib/gcc/x86_64-w64-mingw32.static/9.2.0/include/c++/functional:54,
                 from /usr/src/mxe/usr/lib/gcc/x86_64-w64-mingw32.static/9.2.0/include/c++/pstl/glue_algorithm_defs.h:13,
                 from /usr/src/mxe/usr/lib/gcc/x86_64-w64-mingw32.static/9.2.0/include/c++/algorithm:71,
                 from /work/thirdparty/date/date/include/date/date.h:42,
                 from /work/rabbitmq-core/src/FmuContainerCore.h:11,
                 from /work/rabbitmq-core/src/FmuContainerCore.cpp:5:
/usr/src/mxe/usr/lib/gcc/x86_64-w64-mingw32.static/9.2.0/include/c++/tuple:1674:70: note:   candidate expects 1 argument, 0 provided
 1674 |         second(std::forward<_Args2>(std::get<_Indexes2>(__tuple2))...)
      |                                                                      ^
In file included from /usr/src/mxe/usr/lib/gcc/x86_64-w64-mingw32.static/9.2.0/include/c++/bits/stl_algobase.h:64,
                 from /usr/src/mxe/usr/lib/gcc/x86_64-w64-mingw32.static/9.2.0/include/c++/list:60,
                 from /work/rabbitmq-core/src/FmuContainerCore.h:9,
                 from /work/rabbitmq-core/src/FmuContainerCore.cpp:5:
/usr/src/mxe/usr/lib/gcc/x86_64-w64-mingw32.static/9.2.0/include/c++/bits/stl_pair.h:360:12: note: candidate: 'template<class _U1, class _U2, typename std::enable_if<(std::_PCC<((! std::is_same<std::chrono::time_point<std::chrono::_V2::system_clock, std::chrono::duration<long long int, std::ratio<1, 1000> > >, _U1>::value) || (! std::is_same<ScalarVariableBaseValue, _U2>::value)), std::chrono::time_point<std::chrono::_V2::system_clock, std::chrono::duration<long long int, std::ratio<1, 1000> > >, ScalarVariableBaseValue>::_MoveConstructiblePair<_U1, _U2>() && std::_PCC<((! std::is_same<std::chrono::time_point<std::chrono::_V2::system_clock, std::chrono::duration<long long int, std::ratio<1, 1000> > >, _U1>::value) || (! std::is_same<ScalarVariableBaseValue, _U2>::value)), std::chrono::time_point<std::chrono::_V2::system_clock, std::chrono::duration<long long int, std::ratio<1, 1000> > >, ScalarVariableBaseValue>::_ImplicitlyMoveConvertiblePair<_U1, _U2>()), bool>::type <anonymous> > constexpr std::pair<_T1, _T2>::pair(std::pair<_U1, _U2>&&)'
  360 |  constexpr pair(pair<_U1, _U2>&& __p)
      |            ^~~~
/usr/src/mxe/usr/lib/gcc/x86_64-w64-mingw32.static/9.2.0/include/c++/bits/stl_pair.h:360:12: note:   template argument deduction/substitution failed:
In file included from /usr/src/mxe/usr/lib/gcc/x86_64-w64-mingw32.static/9.2.0/include/c++/functional:54,
                 from /usr/src/mxe/usr/lib/gcc/x86_64-w64-mingw32.static/9.2.0/include/c++/pstl/glue_algorithm_defs.h:13,
                 from /usr/src/mxe/usr/lib/gcc/x86_64-w64-mingw32.static/9.2.0/include/c++/algorithm:71,
                 from /work/thirdparty/date/date/include/date/date.h:42,
                 from /work/rabbitmq-core/src/FmuContainerCore.h:11,
                 from /work/rabbitmq-core/src/FmuContainerCore.cpp:5:
/usr/src/mxe/usr/lib/gcc/x86_64-w64-mingw32.static/9.2.0/include/c++/tuple:1674:70: note:   candidate expects 1 argument, 0 provided
 1674 |         second(std::forward<_Args2>(std::get<_Indexes2>(__tuple2))...)
      |                                                                      ^
In file included from /usr/src/mxe/usr/lib/gcc/x86_64-w64-mingw32.static/9.2.0/include/c++/bits/stl_algobase.h:64,
                 from /usr/src/mxe/usr/lib/gcc/x86_64-w64-mingw32.static/9.2.0/include/c++/list:60,
                 from /work/rabbitmq-core/src/FmuContainerCore.h:9,
                 from /work/rabbitmq-core/src/FmuContainerCore.cpp:5:
/usr/src/mxe/usr/lib/gcc/x86_64-w64-mingw32.static/9.2.0/include/c++/bits/stl_pair.h:350:21: note: candidate: 'template<class _U1, class _U2, typename std::enable_if<(_MoveConstructiblePair<_U1, _U2>() && (! _ImplicitlyMoveConvertiblePair<_U1, _U2>())), bool>::type <anonymous> > constexpr std::pair<_T1, _T2>::pair(_U1&&, _U2&&)'
  350 |  explicit constexpr pair(_U1&& __x, _U2&& __y)
      |                     ^~~~
/usr/src/mxe/usr/lib/gcc/x86_64-w64-mingw32.static/9.2.0/include/c++/bits/stl_pair.h:350:21: note:   template argument deduction/substitution failed:
In file included from /usr/src/mxe/usr/lib/gcc/x86_64-w64-mingw32.static/9.2.0/include/c++/functional:54,
                 from /usr/src/mxe/usr/lib/gcc/x86_64-w64-mingw32.static/9.2.0/include/c++/pstl/glue_algorithm_defs.h:13,
                 from /usr/src/mxe/usr/lib/gcc/x86_64-w64-mingw32.static/9.2.0/include/c++/algorithm:71,
                 from /work/thirdparty/date/date/include/date/date.h:42,
                 from /work/rabbitmq-core/src/FmuContainerCore.h:11,
                 from /work/rabbitmq-core/src/FmuContainerCore.cpp:5:
/usr/src/mxe/usr/lib/gcc/x86_64-w64-mingw32.static/9.2.0/include/c++/tuple:1674:70: note:   candidate expects 2 arguments, 0 provided
 1674 |         second(std::forward<_Args2>(std::get<_Indexes2>(__tuple2))...)
      |                                                                      ^
In file included from /usr/src/mxe/usr/lib/gcc/x86_64-w64-mingw32.static/9.2.0/include/c++/bits/stl_algobase.h:64,
                 from /usr/src/mxe/usr/lib/gcc/x86_64-w64-mingw32.static/9.2.0/include/c++/list:60,
                 from /work/rabbitmq-core/src/FmuContainerCore.h:9,
                 from /work/rabbitmq-core/src/FmuContainerCore.cpp:5:
/usr/src/mxe/usr/lib/gcc/x86_64-w64-mingw32.static/9.2.0/include/c++/bits/stl_pair.h:341:12: note: candidate: 'template<class _U1, class _U2, typename std::enable_if<(_MoveConstructiblePair<_U1, _U2>() && _ImplicitlyMoveConvertiblePair<_U1, _U2>()), bool>::type <anonymous> > constexpr std::pair<_T1, _T2>::pair(_U1&&, _U2&&)'
  341 |  constexpr pair(_U1&& __x, _U2&& __y)
      |            ^~~~
/usr/src/mxe/usr/lib/gcc/x86_64-w64-mingw32.static/9.2.0/include/c++/bits/stl_pair.h:341:12: note:   template argument deduction/substitution failed:
In file included from /usr/src/mxe/usr/lib/gcc/x86_64-w64-mingw32.static/9.2.0/include/c++/functional:54,
                 from /usr/src/mxe/usr/lib/gcc/x86_64-w64-mingw32.static/9.2.0/include/c++/pstl/glue_algorithm_defs.h:13,
                 from /usr/src/mxe/usr/lib/gcc/x86_64-w64-mingw32.static/9.2.0/include/c++/algorithm:71,
                 from /work/thirdparty/date/date/include/date/date.h:42,
                 from /work/rabbitmq-core/src/FmuContainerCore.h:11,
                 from /work/rabbitmq-core/src/FmuContainerCore.cpp:5:
/usr/src/mxe/usr/lib/gcc/x86_64-w64-mingw32.static/9.2.0/include/c++/tuple:1674:70: note:   candidate expects 2 arguments, 0 provided
 1674 |         second(std::forward<_Args2>(std::get<_Indexes2>(__tuple2))...)
      |                                                                      ^
In file included from /usr/src/mxe/usr/lib/gcc/x86_64-w64-mingw32.static/9.2.0/include/c++/bits/stl_algobase.h:64,
                 from /usr/src/mxe/usr/lib/gcc/x86_64-w64-mingw32.static/9.2.0/include/c++/list:60,
                 from /work/rabbitmq-core/src/FmuContainerCore.h:9,
                 from /work/rabbitmq-core/src/FmuContainerCore.cpp:5:
/usr/src/mxe/usr/lib/gcc/x86_64-w64-mingw32.static/9.2.0/include/c++/bits/stl_pair.h:332:17: note: candidate: 'template<class _U2, typename std::enable_if<_CopyMovePair<false, std::chrono::time_point<std::chrono::_V2::system_clock, std::chrono::duration<long long int, std::ratio<1, 1000> > >, _U2>(), bool>::type <anonymous> > std::pair<_T1, _T2>::pair(const _T1&, _U2&&)'
  332 |        explicit pair(const _T1& __x, _U2&& __y)
      |                 ^~~~
/usr/src/mxe/usr/lib/gcc/x86_64-w64-mingw32.static/9.2.0/include/c++/bits/stl_pair.h:332:17: note:   template argument deduction/substitution failed:
In file included from /usr/src/mxe/usr/lib/gcc/x86_64-w64-mingw32.static/9.2.0/include/c++/functional:54,
                 from /usr/src/mxe/usr/lib/gcc/x86_64-w64-mingw32.static/9.2.0/include/c++/pstl/glue_algorithm_defs.h:13,
                 from /usr/src/mxe/usr/lib/gcc/x86_64-w64-mingw32.static/9.2.0/include/c++/algorithm:71,
                 from /work/thirdparty/date/date/include/date/date.h:42,
                 from /work/rabbitmq-core/src/FmuContainerCore.h:11,
                 from /work/rabbitmq-core/src/FmuContainerCore.cpp:5:
/usr/src/mxe/usr/lib/gcc/x86_64-w64-mingw32.static/9.2.0/include/c++/tuple:1674:70: note:   candidate expects 2 arguments, 0 provided
 1674 |         second(std::forward<_Args2>(std::get<_Indexes2>(__tuple2))...)
      |                                                                      ^
In file included from /usr/src/mxe/usr/lib/gcc/x86_64-w64-mingw32.static/9.2.0/include/c++/bits/stl_algobase.h:64,
                 from /usr/src/mxe/usr/lib/gcc/x86_64-w64-mingw32.static/9.2.0/include/c++/list:60,
                 from /work/rabbitmq-core/src/FmuContainerCore.h:9,
                 from /work/rabbitmq-core/src/FmuContainerCore.cpp:5:
/usr/src/mxe/usr/lib/gcc/x86_64-w64-mingw32.static/9.2.0/include/c++/bits/stl_pair.h:325:18: note: candidate: 'template<class _U2, typename std::enable_if<_CopyMovePair<true, std::chrono::time_point<std::chrono::_V2::system_clock, std::chrono::duration<long long int, std::ratio<1, 1000> > >, _U2>(), bool>::type <anonymous> > constexpr std::pair<_T1, _T2>::pair(const _T1&, _U2&&)'
  325 |        constexpr pair(const _T1& __x, _U2&& __y)
      |                  ^~~~
/usr/src/mxe/usr/lib/gcc/x86_64-w64-mingw32.static/9.2.0/include/c++/bits/stl_pair.h:325:18: note:   template argument deduction/substitution failed:
In file included from /usr/src/mxe/usr/lib/gcc/x86_64-w64-mingw32.static/9.2.0/include/c++/functional:54,
                 from /usr/src/mxe/usr/lib/gcc/x86_64-w64-mingw32.static/9.2.0/include/c++/pstl/glue_algorithm_defs.h:13,
                 from /usr/src/mxe/usr/lib/gcc/x86_64-w64-mingw32.static/9.2.0/include/c++/algorithm:71,
                 from /work/thirdparty/date/date/include/date/date.h:42,
                 from /work/rabbitmq-core/src/FmuContainerCore.h:11,
                 from /work/rabbitmq-core/src/FmuContainerCore.cpp:5:
/usr/src/mxe/usr/lib/gcc/x86_64-w64-mingw32.static/9.2.0/include/c++/tuple:1674:70: note:   candidate expects 2 arguments, 0 provided
 1674 |         second(std::forward<_Args2>(std::get<_Indexes2>(__tuple2))...)
      |                                                                      ^
In file included from /usr/src/mxe/usr/lib/gcc/x86_64-w64-mingw32.static/9.2.0/include/c++/bits/stl_algobase.h:64,
                 from /usr/src/mxe/usr/lib/gcc/x86_64-w64-mingw32.static/9.2.0/include/c++/list:60,
                 from /work/rabbitmq-core/src/FmuContainerCore.h:9,
                 from /work/rabbitmq-core/src/FmuContainerCore.cpp:5:
/usr/src/mxe/usr/lib/gcc/x86_64-w64-mingw32.static/9.2.0/include/c++/bits/stl_pair.h:318:27: note: candidate: 'template<class _U1, typename std::enable_if<_MoveCopyPair<false, _U1, ScalarVariableBaseValue>(), bool>::type <anonymous> > constexpr std::pair<_T1, _T2>::pair(_U1&&, const _T2&)'
  318 |        explicit constexpr pair(_U1&& __x, const _T2& __y)
      |                           ^~~~
/usr/src/mxe/usr/lib/gcc/x86_64-w64-mingw32.static/9.2.0/include/c++/bits/stl_pair.h:318:27: note:   template argument deduction/substitution failed:
In file included from /usr/src/mxe/usr/lib/gcc/x86_64-w64-mingw32.static/9.2.0/include/c++/functional:54,
                 from /usr/src/mxe/usr/lib/gcc/x86_64-w64-mingw32.static/9.2.0/include/c++/pstl/glue_algorithm_defs.h:13,
                 from /usr/src/mxe/usr/lib/gcc/x86_64-w64-mingw32.static/9.2.0/include/c++/algorithm:71,
                 from /work/thirdparty/date/date/include/date/date.h:42,
                 from /work/rabbitmq-core/src/FmuContainerCore.h:11,
                 from /work/rabbitmq-core/src/FmuContainerCore.cpp:5:
/usr/src/mxe/usr/lib/gcc/x86_64-w64-mingw32.static/9.2.0/include/c++/tuple:1674:70: note:   candidate expects 2 arguments, 0 provided
 1674 |         second(std::forward<_Args2>(std::get<_Indexes2>(__tuple2))...)
      |                                                                      ^
In file included from /usr/src/mxe/usr/lib/gcc/x86_64-w64-mingw32.static/9.2.0/include/c++/bits/stl_algobase.h:64,
                 from /usr/src/mxe/usr/lib/gcc/x86_64-w64-mingw32.static/9.2.0/include/c++/list:60,
                 from /work/rabbitmq-core/src/FmuContainerCore.h:9,
                 from /work/rabbitmq-core/src/FmuContainerCore.cpp:5:
/usr/src/mxe/usr/lib/gcc/x86_64-w64-mingw32.static/9.2.0/include/c++/bits/stl_pair.h:311:18: note: candidate: 'template<class _U1, typename std::enable_if<_MoveCopyPair<true, _U1, ScalarVariableBaseValue>(), bool>::type <anonymous> > constexpr std::pair<_T1, _T2>::pair(_U1&&, const _T2&)'
  311 |        constexpr pair(_U1&& __x, const _T2& __y)
      |                  ^~~~
/usr/src/mxe/usr/lib/gcc/x86_64-w64-mingw32.static/9.2.0/include/c++/bits/stl_pair.h:311:18: note:   template argument deduction/substitution failed:
In file included from /usr/src/mxe/usr/lib/gcc/x86_64-w64-mingw32.static/9.2.0/include/c++/functional:54,
                 from /usr/src/mxe/usr/lib/gcc/x86_64-w64-mingw32.static/9.2.0/include/c++/pstl/glue_algorithm_defs.h:13,
                 from /usr/src/mxe/usr/lib/gcc/x86_64-w64-mingw32.static/9.2.0/include/c++/algorithm:71,
                 from /work/thirdparty/date/date/include/date/date.h:42,
                 from /work/rabbitmq-core/src/FmuContainerCore.h:11,
                 from /work/rabbitmq-core/src/FmuContainerCore.cpp:5:
/usr/src/mxe/usr/lib/gcc/x86_64-w64-mingw32.static/9.2.0/include/c++/tuple:1674:70: note:   candidate expects 2 arguments, 0 provided
 1674 |         second(std::forward<_Args2>(std::get<_Indexes2>(__tuple2))...)
      |                                                                      ^
In file included from /usr/src/mxe/usr/lib/gcc/x86_64-w64-mingw32.static/9.2.0/include/c++/bits/stl_algobase.h:64,
                 from /usr/src/mxe/usr/lib/gcc/x86_64-w64-mingw32.static/9.2.0/include/c++/list:60,
                 from /work/rabbitmq-core/src/FmuContainerCore.h:9,
                 from /work/rabbitmq-core/src/FmuContainerCore.cpp:5:
/usr/src/mxe/usr/lib/gcc/x86_64-w64-mingw32.static/9.2.0/include/c++/bits/stl_pair.h:304:17: note: candidate: 'std::pair<_T1, _T2>::pair(std::pair<_T1, _T2>&&) [with _T1 = std::chrono::time_point<std::chrono::_V2::system_clock, std::chrono::duration<long long int, std::ratio<1, 1000> > >; _T2 = ScalarVariableBaseValue]'
  304 |       constexpr pair(pair&&) = default;
      |                 ^~~~
/usr/src/mxe/usr/lib/gcc/x86_64-w64-mingw32.static/9.2.0/include/c++/bits/stl_pair.h:304:17: note:   candidate expects 1 argument, 0 provided
/usr/src/mxe/usr/lib/gcc/x86_64-w64-mingw32.static/9.2.0/include/c++/bits/stl_pair.h:303:17: note: candidate: 'std::pair<_T1, _T2>::pair(const std::pair<_T1, _T2>&) [with _T1 = std::chrono::time_point<std::chrono::_V2::system_clock, std::chrono::duration<long long int, std::ratio<1, 1000> > >; _T2 = ScalarVariableBaseValue]'
  303 |       constexpr pair(const pair&) = default;
      |                 ^~~~
/usr/src/mxe/usr/lib/gcc/x86_64-w64-mingw32.static/9.2.0/include/c++/bits/stl_pair.h:303:17: note:   candidate expects 1 argument, 0 provided
/usr/src/mxe/usr/lib/gcc/x86_64-w64-mingw32.static/9.2.0/include/c++/bits/stl_pair.h:300:21: note: candidate: 'template<class _U1, class _U2, typename std::enable_if<(std::_PCC<((! std::is_same<std::chrono::time_point<std::chrono::_V2::system_clock, std::chrono::duration<long long int, std::ratio<1, 1000> > >, _U1>::value) || (! std::is_same<ScalarVariableBaseValue, _U2>::value)), std::chrono::time_point<std::chrono::_V2::system_clock, std::chrono::duration<long long int, std::ratio<1, 1000> > >, ScalarVariableBaseValue>::_ConstructiblePair<_U1, _U2>() && (! std::_PCC<((! std::is_same<std::chrono::time_point<std::chrono::_V2::system_clock, std::chrono::duration<long long int, std::ratio<1, 1000> > >, _U1>::value) || (! std::is_same<ScalarVariableBaseValue, _U2>::value)), std::chrono::time_point<std::chrono::_V2::system_clock, std::chrono::duration<long long int, std::ratio<1, 1000> > >, ScalarVariableBaseValue>::_ImplicitlyConvertiblePair<_U1, _U2>())), bool>::type <anonymous> > constexpr std::pair<_T1, _T2>::pair(const std::pair<_U1, _U2>&)'
  300 |  explicit constexpr pair(const pair<_U1, _U2>& __p)
      |                     ^~~~
/usr/src/mxe/usr/lib/gcc/x86_64-w64-mingw32.static/9.2.0/include/c++/bits/stl_pair.h:300:21: note:   template argument deduction/substitution failed:
In file included from /usr/src/mxe/usr/lib/gcc/x86_64-w64-mingw32.static/9.2.0/include/c++/functional:54,
                 from /usr/src/mxe/usr/lib/gcc/x86_64-w64-mingw32.static/9.2.0/include/c++/pstl/glue_algorithm_defs.h:13,
                 from /usr/src/mxe/usr/lib/gcc/x86_64-w64-mingw32.static/9.2.0/include/c++/algorithm:71,
                 from /work/thirdparty/date/date/include/date/date.h:42,
                 from /work/rabbitmq-core/src/FmuContainerCore.h:11,
                 from /work/rabbitmq-core/src/FmuContainerCore.cpp:5:
/usr/src/mxe/usr/lib/gcc/x86_64-w64-mingw32.static/9.2.0/include/c++/tuple:1674:70: note:   candidate expects 1 argument, 0 provided
 1674 |         second(std::forward<_Args2>(std::get<_Indexes2>(__tuple2))...)
      |                                                                      ^
In file included from /usr/src/mxe/usr/lib/gcc/x86_64-w64-mingw32.static/9.2.0/include/c++/bits/stl_algobase.h:64,
                 from /usr/src/mxe/usr/lib/gcc/x86_64-w64-mingw32.static/9.2.0/include/c++/list:60,
                 from /work/rabbitmq-core/src/FmuContainerCore.h:9,
                 from /work/rabbitmq-core/src/FmuContainerCore.cpp:5:
/usr/src/mxe/usr/lib/gcc/x86_64-w64-mingw32.static/9.2.0/include/c++/bits/stl_pair.h:291:19: note: candidate: 'template<class _U1, class _U2, typename std::enable_if<(std::_PCC<((! std::is_same<std::chrono::time_point<std::chrono::_V2::system_clock, std::chrono::duration<long long int, std::ratio<1, 1000> > >, _U1>::value) || (! std::is_same<ScalarVariableBaseValue, _U2>::value)), std::chrono::time_point<std::chrono::_V2::system_clock, std::chrono::duration<long long int, std::ratio<1, 1000> > >, ScalarVariableBaseValue>::_ConstructiblePair<_U1, _U2>() && std::_PCC<((! std::is_same<std::chrono::time_point<std::chrono::_V2::system_clock, std::chrono::duration<long long int, std::ratio<1, 1000> > >, _U1>::value) || (! std::is_same<ScalarVariableBaseValue, _U2>::value)), std::chrono::time_point<std::chrono::_V2::system_clock, std::chrono::duration<long long int, std::ratio<1, 1000> > >, ScalarVariableBaseValue>::_ImplicitlyConvertiblePair<_U1, _U2>()), bool>::type <anonymous> > constexpr std::pair<_T1, _T2>::pair(const std::pair<_U1, _U2>&)'
  291 |         constexpr pair(const pair<_U1, _U2>& __p)
      |                   ^~~~
/usr/src/mxe/usr/lib/gcc/x86_64-w64-mingw32.static/9.2.0/include/c++/bits/stl_pair.h:291:19: note:   template argument deduction/substitution failed:
In file included from /usr/src/mxe/usr/lib/gcc/x86_64-w64-mingw32.static/9.2.0/include/c++/functional:54,
                 from /usr/src/mxe/usr/lib/gcc/x86_64-w64-mingw32.static/9.2.0/include/c++/pstl/glue_algorithm_defs.h:13,
                 from /usr/src/mxe/usr/lib/gcc/x86_64-w64-mingw32.static/9.2.0/include/c++/algorithm:71,
                 from /work/thirdparty/date/date/include/date/date.h:42,
                 from /work/rabbitmq-core/src/FmuContainerCore.h:11,
                 from /work/rabbitmq-core/src/FmuContainerCore.cpp:5:
/usr/src/mxe/usr/lib/gcc/x86_64-w64-mingw32.static/9.2.0/include/c++/tuple:1674:70: note:   candidate expects 1 argument, 0 provided
 1674 |         second(std::forward<_Args2>(std::get<_Indexes2>(__tuple2))...)
      |                                                                      ^
In file included from /usr/src/mxe/usr/lib/gcc/x86_64-w64-mingw32.static/9.2.0/include/c++/bits/stl_algobase.h:64,
                 from /usr/src/mxe/usr/lib/gcc/x86_64-w64-mingw32.static/9.2.0/include/c++/list:60,
                 from /work/rabbitmq-core/src/FmuContainerCore.h:9,
                 from /work/rabbitmq-core/src/FmuContainerCore.cpp:5:
/usr/src/mxe/usr/lib/gcc/x86_64-w64-mingw32.static/9.2.0/include/c++/bits/stl_pair.h:269:26: note: candidate: 'template<class _U1, class _U2, typename std::enable_if<(_ConstructiblePair<_U1, _U2>() && (! _ImplicitlyConvertiblePair<_U1, _U2>())), bool>::type <anonymous> > constexpr std::pair<_T1, _T2>::pair(const _T1&, const _T2&)'
  269 |       explicit constexpr pair(const _T1& __a, const _T2& __b)
      |                          ^~~~
/usr/src/mxe/usr/lib/gcc/x86_64-w64-mingw32.static/9.2.0/include/c++/bits/stl_pair.h:269:26: note:   template argument deduction/substitution failed:
In file included from /usr/src/mxe/usr/lib/gcc/x86_64-w64-mingw32.static/9.2.0/include/c++/functional:54,
                 from /usr/src/mxe/usr/lib/gcc/x86_64-w64-mingw32.static/9.2.0/include/c++/pstl/glue_algorithm_defs.h:13,
                 from /usr/src/mxe/usr/lib/gcc/x86_64-w64-mingw32.static/9.2.0/include/c++/algorithm:71,
                 from /work/thirdparty/date/date/include/date/date.h:42,
                 from /work/rabbitmq-core/src/FmuContainerCore.h:11,
                 from /work/rabbitmq-core/src/FmuContainerCore.cpp:5:
/usr/src/mxe/usr/lib/gcc/x86_64-w64-mingw32.static/9.2.0/include/c++/tuple:1674:70: note:   candidate expects 2 arguments, 0 provided
 1674 |         second(std::forward<_Args2>(std::get<_Indexes2>(__tuple2))...)
      |                                                                      ^
In file included from /usr/src/mxe/usr/lib/gcc/x86_64-w64-mingw32.static/9.2.0/include/c++/bits/stl_algobase.h:64,
                 from /usr/src/mxe/usr/lib/gcc/x86_64-w64-mingw32.static/9.2.0/include/c++/list:60,
                 from /work/rabbitmq-core/src/FmuContainerCore.h:9,
                 from /work/rabbitmq-core/src/FmuContainerCore.cpp:5:
/usr/src/mxe/usr/lib/gcc/x86_64-w64-mingw32.static/9.2.0/include/c++/bits/stl_pair.h:260:17: note: candidate: 'template<class _U1, class _U2, typename std::enable_if<(_ConstructiblePair<_U1, _U2>() && _ImplicitlyConvertiblePair<_U1, _U2>()), bool>::type <anonymous> > constexpr std::pair<_T1, _T2>::pair(const _T1&, const _T2&)'
  260 |       constexpr pair(const _T1& __a, const _T2& __b)
      |                 ^~~~
/usr/src/mxe/usr/lib/gcc/x86_64-w64-mingw32.static/9.2.0/include/c++/bits/stl_pair.h:260:17: note:   template argument deduction/substitution failed:
In file included from /usr/src/mxe/usr/lib/gcc/x86_64-w64-mingw32.static/9.2.0/include/c++/functional:54,
                 from /usr/src/mxe/usr/lib/gcc/x86_64-w64-mingw32.static/9.2.0/include/c++/pstl/glue_algorithm_defs.h:13,
                 from /usr/src/mxe/usr/lib/gcc/x86_64-w64-mingw32.static/9.2.0/include/c++/algorithm:71,
                 from /work/thirdparty/date/date/include/date/date.h:42,
                 from /work/rabbitmq-core/src/FmuContainerCore.h:11,
                 from /work/rabbitmq-core/src/FmuContainerCore.cpp:5:
/usr/src/mxe/usr/lib/gcc/x86_64-w64-mingw32.static/9.2.0/include/c++/tuple:1674:70: note:   candidate expects 2 arguments, 0 provided
 1674 |         second(std::forward<_Args2>(std::get<_Indexes2>(__tuple2))...)
      |                                                                      ^
In file included from /usr/src/mxe/usr/lib/gcc/x86_64-w64-mingw32.static/9.2.0/include/c++/bits/stl_algobase.h:64,
                 from /usr/src/mxe/usr/lib/gcc/x86_64-w64-mingw32.static/9.2.0/include/c++/list:60,
                 from /work/rabbitmq-core/src/FmuContainerCore.h:9,
                 from /work/rabbitmq-core/src/FmuContainerCore.cpp:5:
/usr/src/mxe/usr/lib/gcc/x86_64-w64-mingw32.static/9.2.0/include/c++/bits/stl_pair.h:242:26: note: candidate: 'template<class _U1, class _U2, typename std::enable_if<std::__and_<std::is_default_constructible<_Tp>, std::is_default_constructible<_U2>, std::__not_<std::__and_<std::__is_implicitly_default_constructible<_U1>, std::__is_implicitly_default_constructible<_U2> > > >::value, bool>::type <anonymous> > constexpr std::pair<_T1, _T2>::pair()'
  242 |       explicit constexpr pair()
      |                          ^~~~
/usr/src/mxe/usr/lib/gcc/x86_64-w64-mingw32.static/9.2.0/include/c++/bits/stl_pair.h:242:26: note:   template argument deduction/substitution failed:
/usr/src/mxe/usr/lib/gcc/x86_64-w64-mingw32.static/9.2.0/include/c++/bits/stl_pair.h:241:59: error: no type named 'type' in 'struct std::enable_if<false, bool>'
  241 |                                    ::value, bool>::type = false>
      |                                                           ^~~~~
/usr/src/mxe/usr/lib/gcc/x86_64-w64-mingw32.static/9.2.0/include/c++/bits/stl_pair.h:229:26: note: candidate: 'template<class _U1, class _U2, typename std::enable_if<std::__and_<std::__is_implicitly_default_constructible<_U1>, std::__is_implicitly_default_constructible<_U2> >::value, bool>::type <anonymous> > constexpr std::pair<_T1, _T2>::pair()'
  229 |       _GLIBCXX_CONSTEXPR pair()
      |                          ^~~~
/usr/src/mxe/usr/lib/gcc/x86_64-w64-mingw32.static/9.2.0/include/c++/bits/stl_pair.h:229:26: note:   template argument deduction/substitution failed:
/usr/src/mxe/usr/lib/gcc/x86_64-w64-mingw32.static/9.2.0/include/c++/bits/stl_pair.h:227:59: error: no type named 'type' in 'struct std::enable_if<false, bool>'
  227 |                                    ::value, bool>::type = true>
      |                                                           ^~~~
rabbitmq-core/CMakeFiles/rabbitmq-core.dir/build.make:66: recipe for target 'rabbitmq-core/CMakeFiles/rabbitmq-core.dir/src/FmuContainerCore.cpp.obj' failed
make[2]: Leaving directory '/work/build/win-x64'
CMakeFiles/Makefile2:3172: recipe for target 'rabbitmq-core/CMakeFiles/rabbitmq-core.dir/all' failed
make[2]: *** [rabbitmq-core/CMakeFiles/rabbitmq-core.dir/src/FmuContainerCore.cpp.obj] Error 1
make[1]: *** [rabbitmq-core/CMakeFiles/rabbitmq-core.dir/all] Error 2
make[1]: *** Waiting for unfinished jobs....
[ 24%] Linking CXX static library ../../../lib/libgtest.a
cd /work/build/win-x64/thirdparty/googletest/googletest && /usr/src/mxe/usr/x86_64-pc-linux-gnu/bin/cmake -P CMakeFiles/gtest.dir/cmake_clean_target.cmake
cd /work/build/win-x64/thirdparty/googletest/googletest && /usr/src/mxe/usr/x86_64-pc-linux-gnu/bin/cmake -E cmake_link_script CMakeFiles/gtest.dir/link.txt --verbose=1
/usr/src/mxe/usr/bin/x86_64-w64-mingw32.static-ar qc ../../../lib/libgtest.a  CMakeFiles/gtest.dir/src/gtest-all.cc.obj
/usr/src/mxe/usr/bin/x86_64-w64-mingw32.static-ranlib ../../../lib/libgtest.a
make[2]: Leaving directory '/work/build/win-x64'
[ 24%] Built target gtest
make[1]: Leaving directory '/work/build/win-x64'
Makefile:143: recipe for target 'all' failed
make: Leaving directory '/work/build/win-x64'
make: *** [all] Error 2