FailedConsole Output

Skipping 3,806 KB.. Full Log
e -P CMakeFiles/gtest_main.dir/cmake_clean_target.cmake
cd /work/build/linux-x86/thirdparty/googletest/googletest && /usr/bin/cmake -E cmake_link_script CMakeFiles/gtest_main.dir/link.txt --verbose=1
/usr/i686-linux-gnu/bin/i686-linux-gnu-ar qc ../../../lib/libgtest_main.a  CMakeFiles/gtest_main.dir/src/gtest_main.cc.o
make[2]: Leaving directory '/work/build/linux-x86'
[ 40%] Built target gtest_main
[ 40%] Building CXX object rabbitmq-fmu/CMakeFiles/rabbitmq-main.dir/src/Iso8601TimeParser.cpp.o
cd /work/build/linux-x86/rabbitmq-fmu && /usr/i686-linux-gnu/bin/i686-linux-gnu-g++  -DAMQP_STATIC -DFMI_COSIMULATION -I/work/rabbitmq-fmu/../thirdparty/fmi/include -I/work/thirdparty/rapidjson/include -I/work/thirdparty/googletest/googletest/include -I/work/rabbitmq-fmu/src -I/work/thirdparty/rabbitmq-c/rabbitmq-c/librabbitmq -I/work/thirdparty/date/date -I/work/thirdparty/date/date/include -I/work/rabbitmq-core/src -isystem /work/thirdparty/external/linux-i386/include  -O2 -g -DNDEBUG   -std=gnu++1z -o CMakeFiles/rabbitmq-main.dir/src/Iso8601TimeParser.cpp.o -c /work/rabbitmq-fmu/src/Iso8601TimeParser.cpp
[ 40%] Building CXX object rabbitmq-fmu/CMakeFiles/rabbitmq.dir/src/rabbitmq/RabbitMqHandlerException.cpp.o
cd /work/build/linux-x86/rabbitmq-fmu && /usr/i686-linux-gnu/bin/i686-linux-gnu-g++  -DAMQP_STATIC -DFMI_COSIMULATION -Drabbitmq_EXPORTS -I/work/rabbitmq-fmu/../thirdparty/fmi/include -I/work/thirdparty/rapidjson/include -I/work/thirdparty/googletest/googletest/include -I/work/rabbitmq-fmu/src -I/work/thirdparty/rabbitmq-c/rabbitmq-c/librabbitmq -I/work/thirdparty/date/date -I/work/thirdparty/date/date/include -I/work/rabbitmq-core/src -isystem /work/thirdparty/external/linux-i386/include  -O2 -g -DNDEBUG -fPIC   -std=gnu++1z -o CMakeFiles/rabbitmq.dir/src/rabbitmq/RabbitMqHandlerException.cpp.o -c /work/rabbitmq-fmu/src/rabbitmq/RabbitMqHandlerException.cpp
make[2]: Leaving directory '/work/build/linux-x64'
[ 68%] Built target rabbitmq
[ 71%] Building CXX object rabbitmq-fmu/CMakeFiles/it-test-rabbitmq.dir/src/message/MessageParser.cpp.o
cd /work/build/linux-x64/rabbitmq-fmu && /usr/bin/x86_64-linux-gnu-g++  -DAMQP_STATIC -DFMI_COSIMULATION -I/work/rabbitmq-fmu/../thirdparty/fmi/include -I/work/thirdparty/rapidjson/include -I/work/rabbitmq-fmu/src -I/work/thirdparty/rabbitmq-c/rabbitmq-c/librabbitmq -I/work/thirdparty/date/date -I/work/thirdparty/date/date/include -I/work/rabbitmq-core/src -isystem /work/thirdparty/googletest/googletest/include -isystem /work/thirdparty/googletest/googletest -isystem /work/thirdparty/external/linux-x86_64/include  -O2 -g -DNDEBUG   -std=gnu++1z -o CMakeFiles/it-test-rabbitmq.dir/src/message/MessageParser.cpp.o -c /work/rabbitmq-fmu/src/message/MessageParser.cpp
/work/thirdparty/rabbitmq-c/rabbitmq-c/librabbitmq/amqp_connection.c: In function 'amqp_handle_input':
/work/thirdparty/rabbitmq-c/rabbitmq-c/librabbitmq/amqp_connection.c:267:10: warning: this statement may fall through [-Wimplicit-fallthrough=]
  267 |       if (memcmp(raw_frame, "AMQP", 4) == 0) {
      |          ^
/work/thirdparty/rabbitmq-c/rabbitmq-c/librabbitmq/amqp_connection.c:287:5: note: here
  287 |     case CONNECTION_STATE_HEADER: {
      |     ^~~~
/work/thirdparty/rabbitmq-c/rabbitmq-c/librabbitmq/amqp_connection.c:287:35: warning: this statement may fall through [-Wimplicit-fallthrough=]
  287 |     case CONNECTION_STATE_HEADER: {
      |                                   ^
/work/thirdparty/rabbitmq-c/rabbitmq-c/librabbitmq/amqp_connection.c:334:5: note: here
  334 |     case CONNECTION_STATE_BODY: {
      |     ^~~~
[ 10%] Building C object thirdparty/rabbitmq-c/rabbitmq-c/librabbitmq/CMakeFiles/rabbitmq-static.dir/amqp_url.c.obj
cd /work/build/win-x64/thirdparty/rabbitmq-c/rabbitmq-c/librabbitmq && /usr/src/mxe/usr/bin/x86_64-w64-mingw32.static-gcc -DAMQP_BUILD -DAMQP_STATIC -DHAVE_CONFIG_H @CMakeFiles/rabbitmq-static.dir/includes_C.rsp -Wall -Wextra -Wstrict-prototypes -Wno-unused-function -fno-common -fvisibility=hidden  -std=gnu90 -O3 -DNDEBUG   -o CMakeFiles/rabbitmq-static.dir/amqp_url.c.obj   -c /work/thirdparty/rabbitmq-c/rabbitmq-c/librabbitmq/amqp_url.c
/work/thirdparty/rabbitmq-c/rabbitmq-c/librabbitmq/amqp_socket.c: In function 'connect_socket':
/work/thirdparty/rabbitmq-c/rabbitmq-c/librabbitmq/amqp_socket.c:341:52: warning: passing argument 3 of 'ioctlsocket' from incompatible pointer type [-Wincompatible-pointer-types]
  341 |   if (SOCKET_ERROR == ioctlsocket(sockfd, FIONBIO, &one)) {
      |                                                    ^~~~
      |                                                    |
      |                                                    int *
In file included from /work/thirdparty/rabbitmq-c/rabbitmq-c/librabbitmq/amqp_private.h:62,
                 from /work/thirdparty/rabbitmq-c/rabbitmq-c/librabbitmq/amqp_socket.c:44:
/usr/src/mxe/usr/x86_64-w64-mingw32.static/include/winsock2.h:977:76: note: expected 'u_long *' {aka 'long unsigned int *'} but argument is of type 'int *'
  977 |   WINSOCK_API_LINKAGE int WSAAPI ioctlsocket(SOCKET s,__LONG32 cmd,u_long *argp);
      |                                                                    ~~~~~~~~^~~~
[ 10%] Building C object thirdparty/rabbitmq-c/rabbitmq-c/librabbitmq/CMakeFiles/rabbitmq-static.dir/amqp_tcp_socket.c.obj
cd /work/build/win-x64/thirdparty/rabbitmq-c/rabbitmq-c/librabbitmq && /usr/src/mxe/usr/bin/x86_64-w64-mingw32.static-gcc -DAMQP_BUILD -DAMQP_STATIC -DHAVE_CONFIG_H @CMakeFiles/rabbitmq-static.dir/includes_C.rsp -Wall -Wextra -Wstrict-prototypes -Wno-unused-function -fno-common -fvisibility=hidden  -std=gnu90 -O3 -DNDEBUG   -o CMakeFiles/rabbitmq-static.dir/amqp_tcp_socket.c.obj   -c /work/thirdparty/rabbitmq-c/rabbitmq-c/librabbitmq/amqp_tcp_socket.c
[ 13%] Building C object thirdparty/rabbitmq-c/rabbitmq-c/librabbitmq/CMakeFiles/rabbitmq-static.dir/amqp_time.c.obj
cd /work/build/win-x64/thirdparty/rabbitmq-c/rabbitmq-c/librabbitmq && /usr/src/mxe/usr/bin/x86_64-w64-mingw32.static-gcc -DAMQP_BUILD -DAMQP_STATIC -DHAVE_CONFIG_H @CMakeFiles/rabbitmq-static.dir/includes_C.rsp -Wall -Wextra -Wstrict-prototypes -Wno-unused-function -fno-common -fvisibility=hidden  -std=gnu90 -O3 -DNDEBUG   -o CMakeFiles/rabbitmq-static.dir/amqp_time.c.obj   -c /work/thirdparty/rabbitmq-c/rabbitmq-c/librabbitmq/amqp_time.c
[ 75%] Linking CXX static library ../../../lib/libgmock.a
cd /work/build/linux-x64/thirdparty/googletest/googlemock && /usr/bin/cmake -P CMakeFiles/gmock.dir/cmake_clean_target.cmake
cd /work/build/linux-x64/thirdparty/googletest/googlemock && /usr/bin/cmake -E cmake_link_script CMakeFiles/gmock.dir/link.txt --verbose=1
[ 75%] Linking CXX executable it-test-rabbitmq-core
/usr/bin/x86_64-linux-gnu-ar qc ../../../lib/libgmock.a  CMakeFiles/gmock.dir/src/gmock-all.cc.o
cd /work/build/linux-x64/rabbitmq-core && /usr/bin/cmake -E cmake_link_script CMakeFiles/it-test-rabbitmq-core.dir/link.txt --verbose=1
/usr/bin/x86_64-linux-gnu-g++  -O2 -g -DNDEBUG   CMakeFiles/it-test-rabbitmq-core.dir/src/FmuContainerCore.cpp.o  -o it-test-rabbitmq-core ../lib/libgtest_main.a ../thirdparty/date/date/libtz.a ../lib/libgtest.a -lpthread 
/usr/bin/x86_64-linux-gnu-ranlib ../../../lib/libgmock.a
make[2]: Leaving directory '/work/build/linux-x64'
[ 75%] Built target gmock
[ 75%] Building CXX object rabbitmq-core/CMakeFiles/unit-test-rabbitmq-core.dir/test/FmuContainerCore_test.cpp.o
cd /work/build/linux-x64/rabbitmq-core && /usr/bin/x86_64-linux-gnu-g++   -I/work/rabbitmq-core/src -I/work/thirdparty/date/date -I/work/thirdparty/date/date/include -isystem /work/thirdparty/googletest/googletest/include -isystem /work/thirdparty/googletest/googletest  -O2 -g -DNDEBUG   -std=gnu++1z -o CMakeFiles/unit-test-rabbitmq-core.dir/test/FmuContainerCore_test.cpp.o -c /work/rabbitmq-core/test/FmuContainerCore_test.cpp
[ 75%] Building CXX object rabbitmq-fmu/CMakeFiles/unit-test-rabbitmq.dir/src/Iso8601TimeParser.cpp.o
cd /work/build/linux-x64/rabbitmq-fmu && /usr/bin/x86_64-linux-gnu-g++  -DAMQP_STATIC -DFMI_COSIMULATION -I/work/rabbitmq-fmu/../thirdparty/fmi/include -I/work/thirdparty/rapidjson/include -I/work/rabbitmq-fmu/src -I/work/thirdparty/rabbitmq-c/rabbitmq-c/librabbitmq -I/work/thirdparty/date/date -I/work/thirdparty/date/date/include -I/work/rabbitmq-core/src -isystem /work/thirdparty/googletest/googletest/include -isystem /work/thirdparty/googletest/googletest -isystem /work/thirdparty/external/linux-x86_64/include  -O2 -g -DNDEBUG   -std=gnu++1z -o CMakeFiles/unit-test-rabbitmq.dir/src/Iso8601TimeParser.cpp.o -c /work/rabbitmq-fmu/src/Iso8601TimeParser.cpp
[ 13%] Building C object thirdparty/rabbitmq-c/rabbitmq-c/librabbitmq/CMakeFiles/rabbitmq-static.dir/amqp_consumer.c.obj
cd /work/build/win-x64/thirdparty/rabbitmq-c/rabbitmq-c/librabbitmq && /usr/src/mxe/usr/bin/x86_64-w64-mingw32.static-gcc -DAMQP_BUILD -DAMQP_STATIC -DHAVE_CONFIG_H @CMakeFiles/rabbitmq-static.dir/includes_C.rsp -Wall -Wextra -Wstrict-prototypes -Wno-unused-function -fno-common -fvisibility=hidden  -std=gnu90 -O3 -DNDEBUG   -o CMakeFiles/rabbitmq-static.dir/amqp_consumer.c.obj   -c /work/thirdparty/rabbitmq-c/rabbitmq-c/librabbitmq/amqp_consumer.c
make[2]: Leaving directory '/work/build/linux-x64'
[ 75%] Built target it-test-rabbitmq-core
make -f thirdparty/googletest/googlemock/CMakeFiles/gmock_main.dir/build.make thirdparty/googletest/googlemock/CMakeFiles/gmock_main.dir/depend
make[2]: Entering directory '/work/build/linux-x64'
cd /work/build/linux-x64 && /usr/bin/cmake -E cmake_depends "Unix Makefiles" /work /work/thirdparty/googletest/googlemock /work/build/linux-x64 /work/build/linux-x64/thirdparty/googletest/googlemock /work/build/linux-x64/thirdparty/googletest/googlemock/CMakeFiles/gmock_main.dir/DependInfo.cmake --color=
Scanning dependencies of target gmock_main
make[2]: Leaving directory '/work/build/linux-x64'
make -f thirdparty/googletest/googlemock/CMakeFiles/gmock_main.dir/build.make thirdparty/googletest/googlemock/CMakeFiles/gmock_main.dir/build
make[2]: Entering directory '/work/build/linux-x64'
[ 75%] Building CXX object thirdparty/googletest/googlemock/CMakeFiles/gmock_main.dir/src/gmock_main.cc.o
cd /work/build/linux-x64/thirdparty/googletest/googlemock && /usr/bin/x86_64-linux-gnu-g++   -isystem /work/thirdparty/googletest/googlemock/include -isystem /work/thirdparty/googletest/googlemock -isystem /work/thirdparty/googletest/googletest/include -isystem /work/thirdparty/googletest/googletest  -O2 -g -DNDEBUG   -Wall -Wshadow -Werror -DGTEST_HAS_PTHREAD=1 -fexceptions -Wextra -Wno-unused-parameter -Wno-missing-field-initializers -std=c++11 -o CMakeFiles/gmock_main.dir/src/gmock_main.cc.o -c /work/thirdparty/googletest/googlemock/src/gmock_main.cc
[ 43%] Building CXX object rabbitmq-fmu/CMakeFiles/rabbitmq.dir/src/rabbitmq/RabbitmqHandler.cpp.o
cd /work/build/linux-x86/rabbitmq-fmu && /usr/i686-linux-gnu/bin/i686-linux-gnu-g++  -DAMQP_STATIC -DFMI_COSIMULATION -Drabbitmq_EXPORTS -I/work/rabbitmq-fmu/../thirdparty/fmi/include -I/work/thirdparty/rapidjson/include -I/work/thirdparty/googletest/googletest/include -I/work/rabbitmq-fmu/src -I/work/thirdparty/rabbitmq-c/rabbitmq-c/librabbitmq -I/work/thirdparty/date/date -I/work/thirdparty/date/date/include -I/work/rabbitmq-core/src -isystem /work/thirdparty/external/linux-i386/include  -O2 -g -DNDEBUG -fPIC   -std=gnu++1z -o CMakeFiles/rabbitmq.dir/src/rabbitmq/RabbitmqHandler.cpp.o -c /work/rabbitmq-fmu/src/rabbitmq/RabbitmqHandler.cpp
[ 33%] Building CXX object rabbitmq-fmu/CMakeFiles/rabbitmq.dir/src/Iso8601TimeParser.cpp.o
cd /work/build/darwin-x64/rabbitmq-fmu && /opt/osxcross/target/bin/o64-clang++  -DAMQP_STATIC -DFMI_COSIMULATION -Drabbitmq_EXPORTS -I/work/rabbitmq-fmu/../thirdparty/fmi/include -I/work/thirdparty/rapidjson/include -I/work/thirdparty/googletest/googletest/include -I/work/rabbitmq-fmu/src -isystem /work/thirdparty/external/darwin-x86_64/include -I/work/thirdparty/rabbitmq-c/rabbitmq-c/librabbitmq -I/work/thirdparty/date/date -I/work/thirdparty/date/date/include -I/work/rabbitmq-core/src  -O2 -g -DNDEBUG -isysroot /opt/osxcross/target/SDK/MacOSX10.15.sdk -fPIC   -std=gnu++1z -o CMakeFiles/rabbitmq.dir/src/Iso8601TimeParser.cpp.o -c /work/rabbitmq-fmu/src/Iso8601TimeParser.cpp
[ 36%] Building CXX object rabbitmq-fmu/CMakeFiles/rabbitmq-main.dir/src/rabbitmq/RabbitmqHandler.cpp.o
cd /work/build/darwin-x64/rabbitmq-fmu && /opt/osxcross/target/bin/o64-clang++  -DAMQP_STATIC -DFMI_COSIMULATION -I/work/rabbitmq-fmu/../thirdparty/fmi/include -I/work/thirdparty/rapidjson/include -I/work/thirdparty/googletest/googletest/include -I/work/rabbitmq-fmu/src -isystem /work/thirdparty/external/darwin-x86_64/include -I/work/thirdparty/rabbitmq-c/rabbitmq-c/librabbitmq -I/work/thirdparty/date/date -I/work/thirdparty/date/date/include -I/work/rabbitmq-core/src  -O2 -g -DNDEBUG -isysroot /opt/osxcross/target/SDK/MacOSX10.15.sdk   -std=gnu++1z -o CMakeFiles/rabbitmq-main.dir/src/rabbitmq/RabbitmqHandler.cpp.o -c /work/rabbitmq-fmu/src/rabbitmq/RabbitmqHandler.cpp
make -f rabbitmq-core/CMakeFiles/it-test-rabbitmq-core.dir/build.make rabbitmq-core/CMakeFiles/it-test-rabbitmq-core.dir/depend
make[2]: Entering directory '/work/build/linux-x86'
cd /work/build/linux-x86 && /usr/bin/cmake -E cmake_depends "Unix Makefiles" /work /work/rabbitmq-core /work/build/linux-x86 /work/build/linux-x86/rabbitmq-core /work/build/linux-x86/rabbitmq-core/CMakeFiles/it-test-rabbitmq-core.dir/DependInfo.cmake --color=
Scanning dependencies of target it-test-rabbitmq-core
make[2]: Leaving directory '/work/build/linux-x86'
make -f rabbitmq-core/CMakeFiles/it-test-rabbitmq-core.dir/build.make rabbitmq-core/CMakeFiles/it-test-rabbitmq-core.dir/build
make[2]: Entering directory '/work/build/linux-x86'
[ 46%] Building CXX object rabbitmq-core/CMakeFiles/it-test-rabbitmq-core.dir/src/FmuContainerCore.cpp.o
cd /work/build/linux-x86/rabbitmq-core && /usr/i686-linux-gnu/bin/i686-linux-gnu-g++   -I/work/rabbitmq-core/src -I/work/thirdparty/date/date -I/work/thirdparty/date/date/include -isystem /work/thirdparty/googletest/googletest/include -isystem /work/thirdparty/googletest/googletest  -O2 -g -DNDEBUG   -std=gnu++1z -o CMakeFiles/it-test-rabbitmq-core.dir/src/FmuContainerCore.cpp.o -c /work/rabbitmq-core/src/FmuContainerCore.cpp
[ 36%] Building CXX object rabbitmq-fmu/CMakeFiles/rabbitmq-main.dir/src/main.cpp.o
cd /work/build/darwin-x64/rabbitmq-fmu && /opt/osxcross/target/bin/o64-clang++  -DAMQP_STATIC -DFMI_COSIMULATION -I/work/rabbitmq-fmu/../thirdparty/fmi/include -I/work/thirdparty/rapidjson/include -I/work/thirdparty/googletest/googletest/include -I/work/rabbitmq-fmu/src -isystem /work/thirdparty/external/darwin-x86_64/include -I/work/thirdparty/rabbitmq-c/rabbitmq-c/librabbitmq -I/work/thirdparty/date/date -I/work/thirdparty/date/date/include -I/work/rabbitmq-core/src  -O2 -g -DNDEBUG -isysroot /opt/osxcross/target/SDK/MacOSX10.15.sdk   -std=gnu++1z -o CMakeFiles/rabbitmq-main.dir/src/main.cpp.o -c /work/rabbitmq-fmu/src/main.cpp
[ 36%] Building CXX object rabbitmq-fmu/CMakeFiles/rabbitmq.dir/src/fmu.cpp.o
cd /work/build/darwin-x64/rabbitmq-fmu && /opt/osxcross/target/bin/o64-clang++  -DAMQP_STATIC -DFMI_COSIMULATION -Drabbitmq_EXPORTS -I/work/rabbitmq-fmu/../thirdparty/fmi/include -I/work/thirdparty/rapidjson/include -I/work/thirdparty/googletest/googletest/include -I/work/rabbitmq-fmu/src -isystem /work/thirdparty/external/darwin-x86_64/include -I/work/thirdparty/rabbitmq-c/rabbitmq-c/librabbitmq -I/work/thirdparty/date/date -I/work/thirdparty/date/date/include -I/work/rabbitmq-core/src  -O2 -g -DNDEBUG -isysroot /opt/osxcross/target/SDK/MacOSX10.15.sdk -fPIC   -std=gnu++1z -o CMakeFiles/rabbitmq.dir/src/fmu.cpp.o -c /work/rabbitmq-fmu/src/fmu.cpp
/work/thirdparty/rabbitmq-c/rabbitmq-c/librabbitmq/amqp_tcp_socket.c: In function 'amqp_tcp_socket_send':
/work/thirdparty/rabbitmq-c/rabbitmq-c/librabbitmq/amqp_tcp_socket.c:52:41: warning: unused parameter 'flags' [-Wunused-parameter]
   52 |                                     int flags) {
      |                                     ~~~~^~~~~
[ 16%] Linking C static library liblibrabbitmq.4.a
cd /work/build/win-x64/thirdparty/rabbitmq-c/rabbitmq-c/librabbitmq && /usr/src/mxe/usr/x86_64-pc-linux-gnu/bin/cmake -P CMakeFiles/rabbitmq-static.dir/cmake_clean_target.cmake
cd /work/build/win-x64/thirdparty/rabbitmq-c/rabbitmq-c/librabbitmq && /usr/src/mxe/usr/x86_64-pc-linux-gnu/bin/cmake -E cmake_link_script CMakeFiles/rabbitmq-static.dir/link.txt --verbose=1
/usr/src/mxe/usr/bin/x86_64-w64-mingw32.static-ar qc liblibrabbitmq.4.a  CMakeFiles/rabbitmq-static.dir/amqp_framing.c.obj CMakeFiles/rabbitmq-static.dir/amqp_api.c.obj CMakeFiles/rabbitmq-static.dir/amqp_connection.c.obj CMakeFiles/rabbitmq-static.dir/amqp_mem.c.obj CMakeFiles/rabbitmq-static.dir/amqp_socket.c.obj CMakeFiles/rabbitmq-static.dir/amqp_table.c.obj CMakeFiles/rabbitmq-static.dir/amqp_url.c.obj CMakeFiles/rabbitmq-static.dir/amqp_tcp_socket.c.obj CMakeFiles/rabbitmq-static.dir/amqp_time.c.obj CMakeFiles/rabbitmq-static.dir/amqp_consumer.c.obj
/usr/src/mxe/usr/bin/x86_64-w64-mingw32.static-ranlib liblibrabbitmq.4.a
make[2]: Leaving directory '/work/build/win-x64'
[ 16%] Built target rabbitmq-static
[ 50%] Building CXX object rabbitmq-fmu/CMakeFiles/rabbitmq-main.dir/src/fmu.cpp.o
cd /work/build/linux-x86/rabbitmq-fmu && /usr/i686-linux-gnu/bin/i686-linux-gnu-g++  -DAMQP_STATIC -DFMI_COSIMULATION -I/work/rabbitmq-fmu/../thirdparty/fmi/include -I/work/thirdparty/rapidjson/include -I/work/thirdparty/googletest/googletest/include -I/work/rabbitmq-fmu/src -I/work/thirdparty/rabbitmq-c/rabbitmq-c/librabbitmq -I/work/thirdparty/date/date -I/work/thirdparty/date/date/include -I/work/rabbitmq-core/src -isystem /work/thirdparty/external/linux-i386/include  -O2 -g -DNDEBUG   -std=gnu++1z -o CMakeFiles/rabbitmq-main.dir/src/fmu.cpp.o -c /work/rabbitmq-fmu/src/fmu.cpp
make -f rabbitmq-core/CMakeFiles/unit-test-rabbitmq-core.dir/build.make rabbitmq-core/CMakeFiles/unit-test-rabbitmq-core.dir/depend
make[2]: Entering directory '/work/build/linux-x86'
cd /work/build/linux-x86 && /usr/bin/cmake -E cmake_depends "Unix Makefiles" /work /work/rabbitmq-core /work/build/linux-x86 /work/build/linux-x86/rabbitmq-core /work/build/linux-x86/rabbitmq-core/CMakeFiles/unit-test-rabbitmq-core.dir/DependInfo.cmake --color=
Scanning dependencies of target unit-test-rabbitmq-core
make[2]: Leaving directory '/work/build/linux-x86'
make -f rabbitmq-core/CMakeFiles/unit-test-rabbitmq-core.dir/build.make rabbitmq-core/CMakeFiles/unit-test-rabbitmq-core.dir/build
make[2]: Entering directory '/work/build/linux-x86'
[ 53%] Building CXX object rabbitmq-core/CMakeFiles/unit-test-rabbitmq-core.dir/src/FmuContainerCore.cpp.o
cd /work/build/linux-x86/rabbitmq-core && /usr/i686-linux-gnu/bin/i686-linux-gnu-g++   -I/work/rabbitmq-core/src -I/work/thirdparty/date/date -I/work/thirdparty/date/date/include -isystem /work/thirdparty/googletest/googletest/include -isystem /work/thirdparty/googletest/googletest  -O2 -g -DNDEBUG   -std=gnu++1z -o CMakeFiles/unit-test-rabbitmq-core.dir/src/FmuContainerCore.cpp.o -c /work/rabbitmq-core/src/FmuContainerCore.cpp
[ 39%] Building CXX object rabbitmq-fmu/CMakeFiles/rabbitmq.dir/src/message/MessageParser.cpp.o
cd /work/build/darwin-x64/rabbitmq-fmu && /opt/osxcross/target/bin/o64-clang++  -DAMQP_STATIC -DFMI_COSIMULATION -Drabbitmq_EXPORTS -I/work/rabbitmq-fmu/../thirdparty/fmi/include -I/work/thirdparty/rapidjson/include -I/work/thirdparty/googletest/googletest/include -I/work/rabbitmq-fmu/src -isystem /work/thirdparty/external/darwin-x86_64/include -I/work/thirdparty/rabbitmq-c/rabbitmq-c/librabbitmq -I/work/thirdparty/date/date -I/work/thirdparty/date/date/include -I/work/rabbitmq-core/src  -O2 -g -DNDEBUG -isysroot /opt/osxcross/target/SDK/MacOSX10.15.sdk -fPIC   -std=gnu++1z -o CMakeFiles/rabbitmq.dir/src/message/MessageParser.cpp.o -c /work/rabbitmq-fmu/src/message/MessageParser.cpp
[ 39%] Building CXX object rabbitmq-fmu/CMakeFiles/rabbitmq.dir/src/modeldescription/ModelDescriptionParser.cpp.o
cd /work/build/darwin-x64/rabbitmq-fmu && /opt/osxcross/target/bin/o64-clang++  -DAMQP_STATIC -DFMI_COSIMULATION -Drabbitmq_EXPORTS -I/work/rabbitmq-fmu/../thirdparty/fmi/include -I/work/thirdparty/rapidjson/include -I/work/thirdparty/googletest/googletest/include -I/work/rabbitmq-fmu/src -isystem /work/thirdparty/external/darwin-x86_64/include -I/work/thirdparty/rabbitmq-c/rabbitmq-c/librabbitmq -I/work/thirdparty/date/date -I/work/thirdparty/date/date/include -I/work/rabbitmq-core/src  -O2 -g -DNDEBUG -isysroot /opt/osxcross/target/SDK/MacOSX10.15.sdk -fPIC   -std=gnu++1z -o CMakeFiles/rabbitmq.dir/src/modeldescription/ModelDescriptionParser.cpp.o -c /work/rabbitmq-fmu/src/modeldescription/ModelDescriptionParser.cpp
make -f rabbitmq-fmu/CMakeFiles/unit-test-rabbitmq.dir/build.make rabbitmq-fmu/CMakeFiles/unit-test-rabbitmq.dir/depend
make[2]: Entering directory '/work/build/linux-x86'
cd /work/build/linux-x86 && /usr/bin/cmake -E cmake_depends "Unix Makefiles" /work /work/rabbitmq-fmu /work/build/linux-x86 /work/build/linux-x86/rabbitmq-fmu /work/build/linux-x86/rabbitmq-fmu/CMakeFiles/unit-test-rabbitmq.dir/DependInfo.cmake --color=
Scanning dependencies of target unit-test-rabbitmq
make[2]: Leaving directory '/work/build/linux-x86'
make -f rabbitmq-fmu/CMakeFiles/unit-test-rabbitmq.dir/build.make rabbitmq-fmu/CMakeFiles/unit-test-rabbitmq.dir/build
make[2]: Entering directory '/work/build/linux-x86'
[ 53%] Building C object rabbitmq-fmu/CMakeFiles/unit-test-rabbitmq.dir/src/uri.c.o
cd /work/build/linux-x86/rabbitmq-fmu && /usr/i686-linux-gnu/bin/i686-linux-gnu-gcc -DAMQP_STATIC -DFMI_COSIMULATION -I/work/rabbitmq-fmu/../thirdparty/fmi/include -I/work/thirdparty/rapidjson/include -I/work/rabbitmq-fmu/src -I/work/thirdparty/rabbitmq-c/rabbitmq-c/librabbitmq -I/work/thirdparty/date/date -I/work/thirdparty/date/date/include -I/work/rabbitmq-core/src -isystem /work/thirdparty/googletest/googletest/include -isystem /work/thirdparty/googletest/googletest -isystem /work/thirdparty/external/linux-i386/include  -O2 -g -DNDEBUG   -o CMakeFiles/unit-test-rabbitmq.dir/src/uri.c.o   -c /work/rabbitmq-fmu/src/uri.c
[ 56%] Building CXX object rabbitmq-fmu/CMakeFiles/unit-test-rabbitmq.dir/src/FmuContainer.cpp.o
cd /work/build/linux-x86/rabbitmq-fmu && /usr/i686-linux-gnu/bin/i686-linux-gnu-g++  -DAMQP_STATIC -DFMI_COSIMULATION -I/work/rabbitmq-fmu/../thirdparty/fmi/include -I/work/thirdparty/rapidjson/include -I/work/rabbitmq-fmu/src -I/work/thirdparty/rabbitmq-c/rabbitmq-c/librabbitmq -I/work/thirdparty/date/date -I/work/thirdparty/date/date/include -I/work/rabbitmq-core/src -isystem /work/thirdparty/googletest/googletest/include -isystem /work/thirdparty/googletest/googletest -isystem /work/thirdparty/external/linux-i386/include  -O2 -g -DNDEBUG   -std=gnu++1z -o CMakeFiles/unit-test-rabbitmq.dir/src/FmuContainer.cpp.o -c /work/rabbitmq-fmu/src/FmuContainer.cpp
[ 75%] Building CXX object rabbitmq-fmu/CMakeFiles/it-test-rabbitmq.dir/src/modeldescription/ModelDescriptionParser.cpp.o
cd /work/build/linux-x64/rabbitmq-fmu && /usr/bin/x86_64-linux-gnu-g++  -DAMQP_STATIC -DFMI_COSIMULATION -I/work/rabbitmq-fmu/../thirdparty/fmi/include -I/work/thirdparty/rapidjson/include -I/work/rabbitmq-fmu/src -I/work/thirdparty/rabbitmq-c/rabbitmq-c/librabbitmq -I/work/thirdparty/date/date -I/work/thirdparty/date/date/include -I/work/rabbitmq-core/src -isystem /work/thirdparty/googletest/googletest/include -isystem /work/thirdparty/googletest/googletest -isystem /work/thirdparty/external/linux-x86_64/include  -O2 -g -DNDEBUG   -std=gnu++1z -o CMakeFiles/it-test-rabbitmq.dir/src/modeldescription/ModelDescriptionParser.cpp.o -c /work/rabbitmq-fmu/src/modeldescription/ModelDescriptionParser.cpp
[ 78%] Building CXX object rabbitmq-fmu/CMakeFiles/unit-test-rabbitmq.dir/src/fmu.cpp.o
cd /work/build/linux-x64/rabbitmq-fmu && /usr/bin/x86_64-linux-gnu-g++  -DAMQP_STATIC -DFMI_COSIMULATION -I/work/rabbitmq-fmu/../thirdparty/fmi/include -I/work/thirdparty/rapidjson/include -I/work/rabbitmq-fmu/src -I/work/thirdparty/rabbitmq-c/rabbitmq-c/librabbitmq -I/work/thirdparty/date/date -I/work/thirdparty/date/date/include -I/work/rabbitmq-core/src -isystem /work/thirdparty/googletest/googletest/include -isystem /work/thirdparty/googletest/googletest -isystem /work/thirdparty/external/linux-x86_64/include  -O2 -g -DNDEBUG   -std=gnu++1z -o CMakeFiles/unit-test-rabbitmq.dir/src/fmu.cpp.o -c /work/rabbitmq-fmu/src/fmu.cpp
[ 78%] Building CXX object rabbitmq-fmu/CMakeFiles/it-test-rabbitmq.dir/src/rabbitmq/RabbitMqHandlerException.cpp.o
cd /work/build/linux-x64/rabbitmq-fmu && /usr/bin/x86_64-linux-gnu-g++  -DAMQP_STATIC -DFMI_COSIMULATION -I/work/rabbitmq-fmu/../thirdparty/fmi/include -I/work/thirdparty/rapidjson/include -I/work/rabbitmq-fmu/src -I/work/thirdparty/rabbitmq-c/rabbitmq-c/librabbitmq -I/work/thirdparty/date/date -I/work/thirdparty/date/date/include -I/work/rabbitmq-core/src -isystem /work/thirdparty/googletest/googletest/include -isystem /work/thirdparty/googletest/googletest -isystem /work/thirdparty/external/linux-x86_64/include  -O2 -g -DNDEBUG   -std=gnu++1z -o CMakeFiles/it-test-rabbitmq.dir/src/rabbitmq/RabbitMqHandlerException.cpp.o -c /work/rabbitmq-fmu/src/rabbitmq/RabbitMqHandlerException.cpp
[ 81%] Building CXX object rabbitmq-fmu/CMakeFiles/it-test-rabbitmq.dir/src/rabbitmq/RabbitmqHandler.cpp.o
cd /work/build/linux-x64/rabbitmq-fmu && /usr/bin/x86_64-linux-gnu-g++  -DAMQP_STATIC -DFMI_COSIMULATION -I/work/rabbitmq-fmu/../thirdparty/fmi/include -I/work/thirdparty/rapidjson/include -I/work/rabbitmq-fmu/src -I/work/thirdparty/rabbitmq-c/rabbitmq-c/librabbitmq -I/work/thirdparty/date/date -I/work/thirdparty/date/date/include -I/work/rabbitmq-core/src -isystem /work/thirdparty/googletest/googletest/include -isystem /work/thirdparty/googletest/googletest -isystem /work/thirdparty/external/linux-x86_64/include  -O2 -g -DNDEBUG   -std=gnu++1z -o CMakeFiles/it-test-rabbitmq.dir/src/rabbitmq/RabbitmqHandler.cpp.o -c /work/rabbitmq-fmu/src/rabbitmq/RabbitmqHandler.cpp
[ 81%] Linking CXX static library ../../../lib/libgmock_main.a
cd /work/build/linux-x64/thirdparty/googletest/googlemock && /usr/bin/cmake -P CMakeFiles/gmock_main.dir/cmake_clean_target.cmake
cd /work/build/linux-x64/thirdparty/googletest/googlemock && /usr/bin/cmake -E cmake_link_script CMakeFiles/gmock_main.dir/link.txt --verbose=1
/usr/bin/x86_64-linux-gnu-ar qc ../../../lib/libgmock_main.a  CMakeFiles/gmock_main.dir/src/gmock_main.cc.o
/usr/bin/x86_64-linux-gnu-ranlib ../../../lib/libgmock_main.a
make[2]: Leaving directory '/work/build/linux-x64'
[ 81%] Built target gmock_main
[ 81%] Building CXX object rabbitmq-fmu/CMakeFiles/unit-test-rabbitmq.dir/src/message/MessageParser.cpp.o
cd /work/build/linux-x64/rabbitmq-fmu && /usr/bin/x86_64-linux-gnu-g++  -DAMQP_STATIC -DFMI_COSIMULATION -I/work/rabbitmq-fmu/../thirdparty/fmi/include -I/work/thirdparty/rapidjson/include -I/work/rabbitmq-fmu/src -I/work/thirdparty/rabbitmq-c/rabbitmq-c/librabbitmq -I/work/thirdparty/date/date -I/work/thirdparty/date/date/include -I/work/rabbitmq-core/src -isystem /work/thirdparty/googletest/googletest/include -isystem /work/thirdparty/googletest/googletest -isystem /work/thirdparty/external/linux-x86_64/include  -O2 -g -DNDEBUG   -std=gnu++1z -o CMakeFiles/unit-test-rabbitmq.dir/src/message/MessageParser.cpp.o -c /work/rabbitmq-fmu/src/message/MessageParser.cpp
[ 81%] Building CXX object rabbitmq-fmu/CMakeFiles/unit-test-rabbitmq.dir/src/modeldescription/ModelDescriptionParser.cpp.o
cd /work/build/linux-x64/rabbitmq-fmu && /usr/bin/x86_64-linux-gnu-g++  -DAMQP_STATIC -DFMI_COSIMULATION -I/work/rabbitmq-fmu/../thirdparty/fmi/include -I/work/thirdparty/rapidjson/include -I/work/rabbitmq-fmu/src -I/work/thirdparty/rabbitmq-c/rabbitmq-c/librabbitmq -I/work/thirdparty/date/date -I/work/thirdparty/date/date/include -I/work/rabbitmq-core/src -isystem /work/thirdparty/googletest/googletest/include -isystem /work/thirdparty/googletest/googletest -isystem /work/thirdparty/external/linux-x86_64/include  -O2 -g -DNDEBUG   -std=gnu++1z -o CMakeFiles/unit-test-rabbitmq.dir/src/modeldescription/ModelDescriptionParser.cpp.o -c /work/rabbitmq-fmu/src/modeldescription/ModelDescriptionParser.cpp
[ 42%] Building CXX object rabbitmq-fmu/CMakeFiles/rabbitmq.dir/src/rabbitmq/RabbitMqHandlerException.cpp.o
cd /work/build/darwin-x64/rabbitmq-fmu && /opt/osxcross/target/bin/o64-clang++  -DAMQP_STATIC -DFMI_COSIMULATION -Drabbitmq_EXPORTS -I/work/rabbitmq-fmu/../thirdparty/fmi/include -I/work/thirdparty/rapidjson/include -I/work/thirdparty/googletest/googletest/include -I/work/rabbitmq-fmu/src -isystem /work/thirdparty/external/darwin-x86_64/include -I/work/thirdparty/rabbitmq-c/rabbitmq-c/librabbitmq -I/work/thirdparty/date/date -I/work/thirdparty/date/date/include -I/work/rabbitmq-core/src  -O2 -g -DNDEBUG -isysroot /opt/osxcross/target/SDK/MacOSX10.15.sdk -fPIC   -std=gnu++1z -o CMakeFiles/rabbitmq.dir/src/rabbitmq/RabbitMqHandlerException.cpp.o -c /work/rabbitmq-fmu/src/rabbitmq/RabbitMqHandlerException.cpp
[ 42%] Building CXX object rabbitmq-fmu/CMakeFiles/rabbitmq.dir/src/rabbitmq/RabbitmqHandler.cpp.o
cd /work/build/darwin-x64/rabbitmq-fmu && /opt/osxcross/target/bin/o64-clang++  -DAMQP_STATIC -DFMI_COSIMULATION -Drabbitmq_EXPORTS -I/work/rabbitmq-fmu/../thirdparty/fmi/include -I/work/thirdparty/rapidjson/include -I/work/thirdparty/googletest/googletest/include -I/work/rabbitmq-fmu/src -isystem /work/thirdparty/external/darwin-x86_64/include -I/work/thirdparty/rabbitmq-c/rabbitmq-c/librabbitmq -I/work/thirdparty/date/date -I/work/thirdparty/date/date/include -I/work/rabbitmq-core/src  -O2 -g -DNDEBUG -isysroot /opt/osxcross/target/SDK/MacOSX10.15.sdk -fPIC   -std=gnu++1z -o CMakeFiles/rabbitmq.dir/src/rabbitmq/RabbitmqHandler.cpp.o -c /work/rabbitmq-fmu/src/rabbitmq/RabbitmqHandler.cpp
[ 45%] Linking CXX static library ../../../lib/libgtest.a
cd /work/build/darwin-x64/thirdparty/googletest/googletest && /usr/bin/cmake -P CMakeFiles/gtest.dir/cmake_clean_target.cmake
cd /work/build/darwin-x64/thirdparty/googletest/googletest && /usr/bin/cmake -E cmake_link_script CMakeFiles/gtest.dir/link.txt --verbose=1
/opt/osxcross/target/bin/x86_64-apple-darwin19-ar qc ../../../lib/libgtest.a  CMakeFiles/gtest.dir/src/gtest-all.cc.o
/opt/osxcross/target/bin/x86_64-apple-darwin19-ranlib ../../../lib/libgtest.a
[ 84%] Building CXX object rabbitmq-fmu/CMakeFiles/unit-test-rabbitmq.dir/src/rabbitmq/RabbitMqHandlerException.cpp.o
cd /work/build/linux-x64/rabbitmq-fmu && /usr/bin/x86_64-linux-gnu-g++  -DAMQP_STATIC -DFMI_COSIMULATION -I/work/rabbitmq-fmu/../thirdparty/fmi/include -I/work/thirdparty/rapidjson/include -I/work/rabbitmq-fmu/src -I/work/thirdparty/rabbitmq-c/rabbitmq-c/librabbitmq -I/work/thirdparty/date/date -I/work/thirdparty/date/date/include -I/work/rabbitmq-core/src -isystem /work/thirdparty/googletest/googletest/include -isystem /work/thirdparty/googletest/googletest -isystem /work/thirdparty/external/linux-x86_64/include  -O2 -g -DNDEBUG   -std=gnu++1z -o CMakeFiles/unit-test-rabbitmq.dir/src/rabbitmq/RabbitMqHandlerException.cpp.o -c /work/rabbitmq-fmu/src/rabbitmq/RabbitMqHandlerException.cpp
make[2]: Leaving directory '/work/build/darwin-x64'
[ 45%] Built target gtest
[ 56%] Building CXX object rabbitmq-fmu/CMakeFiles/unit-test-rabbitmq.dir/src/Iso8601TimeParser.cpp.o
cd /work/build/linux-x86/rabbitmq-fmu && /usr/i686-linux-gnu/bin/i686-linux-gnu-g++  -DAMQP_STATIC -DFMI_COSIMULATION -I/work/rabbitmq-fmu/../thirdparty/fmi/include -I/work/thirdparty/rapidjson/include -I/work/rabbitmq-fmu/src -I/work/thirdparty/rabbitmq-c/rabbitmq-c/librabbitmq -I/work/thirdparty/date/date -I/work/thirdparty/date/date/include -I/work/rabbitmq-core/src -isystem /work/thirdparty/googletest/googletest/include -isystem /work/thirdparty/googletest/googletest -isystem /work/thirdparty/external/linux-i386/include  -O2 -g -DNDEBUG   -std=gnu++1z -o CMakeFiles/unit-test-rabbitmq.dir/src/Iso8601TimeParser.cpp.o -c /work/rabbitmq-fmu/src/Iso8601TimeParser.cpp
[ 56%] Linking CXX shared library rabbitmq.so
cd /work/build/linux-x86/rabbitmq-fmu && /usr/bin/cmake -E cmake_link_script CMakeFiles/rabbitmq.dir/link.txt --verbose=1
/usr/i686-linux-gnu/bin/i686-linux-gnu-g++ -fPIC -O2 -g -DNDEBUG -static-libgcc -static-libstdc++ -shared -Wl,-soname,rabbitmq.so -o rabbitmq.so CMakeFiles/rabbitmq.dir/src/uri.c.o CMakeFiles/rabbitmq.dir/src/FmuContainer.cpp.o CMakeFiles/rabbitmq.dir/src/Iso8601TimeParser.cpp.o CMakeFiles/rabbitmq.dir/src/fmu.cpp.o CMakeFiles/rabbitmq.dir/src/message/MessageParser.cpp.o CMakeFiles/rabbitmq.dir/src/modeldescription/ModelDescriptionParser.cpp.o CMakeFiles/rabbitmq.dir/src/rabbitmq/RabbitMqHandlerException.cpp.o CMakeFiles/rabbitmq.dir/src/rabbitmq/RabbitmqHandler.cpp.o -Wl,-rpath,/work/build/linux-x86/rabbitmq-core: ../thirdparty/rabbitmq-c/rabbitmq-c/librabbitmq/librabbitmq.a ../thirdparty/date/date/libtz.a ../rabbitmq-core/librabbitmq-core.so -ldl ../../../thirdparty/external/linux-i386/lib/libxerces-c-3.2.a -lrt ../thirdparty/date/date/libtz.a -lpthread 
[ 84%] Building CXX object rabbitmq-fmu/CMakeFiles/unit-test-rabbitmq.dir/src/rabbitmq/RabbitmqHandler.cpp.o
cd /work/build/linux-x64/rabbitmq-fmu && /usr/bin/x86_64-linux-gnu-g++  -DAMQP_STATIC -DFMI_COSIMULATION -I/work/rabbitmq-fmu/../thirdparty/fmi/include -I/work/thirdparty/rapidjson/include -I/work/rabbitmq-fmu/src -I/work/thirdparty/rabbitmq-c/rabbitmq-c/librabbitmq -I/work/thirdparty/date/date -I/work/thirdparty/date/date/include -I/work/rabbitmq-core/src -isystem /work/thirdparty/googletest/googletest/include -isystem /work/thirdparty/googletest/googletest -isystem /work/thirdparty/external/linux-x86_64/include  -O2 -g -DNDEBUG   -std=gnu++1z -o CMakeFiles/unit-test-rabbitmq.dir/src/rabbitmq/RabbitmqHandler.cpp.o -c /work/rabbitmq-fmu/src/rabbitmq/RabbitmqHandler.cpp
[ 56%] Building CXX object rabbitmq-fmu/CMakeFiles/rabbitmq-main.dir/src/message/MessageParser.cpp.o
cd /work/build/linux-x86/rabbitmq-fmu && /usr/i686-linux-gnu/bin/i686-linux-gnu-g++  -DAMQP_STATIC -DFMI_COSIMULATION -I/work/rabbitmq-fmu/../thirdparty/fmi/include -I/work/thirdparty/rapidjson/include -I/work/thirdparty/googletest/googletest/include -I/work/rabbitmq-fmu/src -I/work/thirdparty/rabbitmq-c/rabbitmq-c/librabbitmq -I/work/thirdparty/date/date -I/work/thirdparty/date/date/include -I/work/rabbitmq-core/src -isystem /work/thirdparty/external/linux-i386/include  -O2 -g -DNDEBUG   -std=gnu++1z -o CMakeFiles/rabbitmq-main.dir/src/message/MessageParser.cpp.o -c /work/rabbitmq-fmu/src/message/MessageParser.cpp
[ 18%] Linking CXX static library libtz.a
cd /work/build/win-x64/thirdparty/date/date && /usr/src/mxe/usr/x86_64-pc-linux-gnu/bin/cmake -P CMakeFiles/tz.dir/cmake_clean_target.cmake
cd /work/build/win-x64/thirdparty/date/date && /usr/src/mxe/usr/x86_64-pc-linux-gnu/bin/cmake -E cmake_link_script CMakeFiles/tz.dir/link.txt --verbose=1
/usr/src/mxe/usr/bin/x86_64-w64-mingw32.static-ar qc libtz.a  CMakeFiles/tz.dir/src/tz.cpp.obj
/usr/src/mxe/usr/bin/x86_64-w64-mingw32.static-ranlib libtz.a
make[2]: Leaving directory '/work/build/win-x64'
[ 18%] Built target tz
make -f rabbitmq-core/CMakeFiles/rabbitmq-core.dir/build.make rabbitmq-core/CMakeFiles/rabbitmq-core.dir/depend
make[2]: Entering directory '/work/build/win-x64'
cd /work/build/win-x64 && /usr/src/mxe/usr/x86_64-pc-linux-gnu/bin/cmake -E cmake_depends "Unix Makefiles" /work /work/rabbitmq-core /work/build/win-x64 /work/build/win-x64/rabbitmq-core /work/build/win-x64/rabbitmq-core/CMakeFiles/rabbitmq-core.dir/DependInfo.cmake --color=
Scanning dependencies of target rabbitmq-core
make[2]: Leaving directory '/work/build/win-x64'
make -f rabbitmq-core/CMakeFiles/rabbitmq-core.dir/build.make rabbitmq-core/CMakeFiles/rabbitmq-core.dir/build
make[2]: Entering directory '/work/build/win-x64'
[ 21%] Building CXX object rabbitmq-core/CMakeFiles/rabbitmq-core.dir/src/FmuContainerCore.cpp.obj
cd /work/build/win-x64/rabbitmq-core && /usr/src/mxe/usr/bin/x86_64-w64-mingw32.static-g++  -Drabbitmq_core_EXPORTS @CMakeFiles/rabbitmq-core.dir/includes_CXX.rsp -O3 -DNDEBUG   -std=gnu++17 -o CMakeFiles/rabbitmq-core.dir/src/FmuContainerCore.cpp.obj -c /work/rabbitmq-core/src/FmuContainerCore.cpp
[ 84%] Building CXX object rabbitmq-fmu/CMakeFiles/it-test-rabbitmq.dir/test/fmu_test_it.cpp.o
cd /work/build/linux-x64/rabbitmq-fmu && /usr/bin/x86_64-linux-gnu-g++  -DAMQP_STATIC -DFMI_COSIMULATION -I/work/rabbitmq-fmu/../thirdparty/fmi/include -I/work/thirdparty/rapidjson/include -I/work/rabbitmq-fmu/src -I/work/thirdparty/rabbitmq-c/rabbitmq-c/librabbitmq -I/work/thirdparty/date/date -I/work/thirdparty/date/date/include -I/work/rabbitmq-core/src -isystem /work/thirdparty/googletest/googletest/include -isystem /work/thirdparty/googletest/googletest -isystem /work/thirdparty/external/linux-x86_64/include  -O2 -g -DNDEBUG   -std=gnu++1z -o CMakeFiles/it-test-rabbitmq.dir/test/fmu_test_it.cpp.o -c /work/rabbitmq-fmu/test/fmu_test_it.cpp
[ 59%] Building CXX object rabbitmq-fmu/CMakeFiles/unit-test-rabbitmq.dir/src/fmu.cpp.o
cd /work/build/linux-x86/rabbitmq-fmu && /usr/i686-linux-gnu/bin/i686-linux-gnu-g++  -DAMQP_STATIC -DFMI_COSIMULATION -I/work/rabbitmq-fmu/../thirdparty/fmi/include -I/work/thirdparty/rapidjson/include -I/work/rabbitmq-fmu/src -I/work/thirdparty/rabbitmq-c/rabbitmq-c/librabbitmq -I/work/thirdparty/date/date -I/work/thirdparty/date/date/include -I/work/rabbitmq-core/src -isystem /work/thirdparty/googletest/googletest/include -isystem /work/thirdparty/googletest/googletest -isystem /work/thirdparty/external/linux-i386/include  -O2 -g -DNDEBUG   -std=gnu++1z -o CMakeFiles/unit-test-rabbitmq.dir/src/fmu.cpp.o -c /work/rabbitmq-fmu/src/fmu.cpp
[ 59%] Linking CXX executable it-test-rabbitmq-core
cd /work/build/linux-x86/rabbitmq-core && /usr/bin/cmake -E cmake_link_script CMakeFiles/it-test-rabbitmq-core.dir/link.txt --verbose=1
/usr/i686-linux-gnu/bin/i686-linux-gnu-g++  -O2 -g -DNDEBUG   CMakeFiles/it-test-rabbitmq-core.dir/src/FmuContainerCore.cpp.o  -o it-test-rabbitmq-core ../lib/libgtest_main.a ../thirdparty/date/date/libtz.a ../lib/libgtest.a -lpthread 
[ 87%] Building CXX object rabbitmq-fmu/CMakeFiles/unit-test-rabbitmq.dir/test/FmuContainer_test.cpp.o
cd /work/build/linux-x64/rabbitmq-fmu && /usr/bin/x86_64-linux-gnu-g++  -DAMQP_STATIC -DFMI_COSIMULATION -I/work/rabbitmq-fmu/../thirdparty/fmi/include -I/work/thirdparty/rapidjson/include -I/work/rabbitmq-fmu/src -I/work/thirdparty/rabbitmq-c/rabbitmq-c/librabbitmq -I/work/thirdparty/date/date -I/work/thirdparty/date/date/include -I/work/rabbitmq-core/src -isystem /work/thirdparty/googletest/googletest/include -isystem /work/thirdparty/googletest/googletest -isystem /work/thirdparty/external/linux-x86_64/include  -O2 -g -DNDEBUG   -std=gnu++1z -o CMakeFiles/unit-test-rabbitmq.dir/test/FmuContainer_test.cpp.o -c /work/rabbitmq-fmu/test/FmuContainer_test.cpp
make[2]: Leaving directory '/work/build/linux-x86'
[ 59%] Built target it-test-rabbitmq-core
[ 59%] Building CXX object rabbitmq-fmu/CMakeFiles/unit-test-rabbitmq.dir/src/message/MessageParser.cpp.o
cd /work/build/linux-x86/rabbitmq-fmu && /usr/i686-linux-gnu/bin/i686-linux-gnu-g++  -DAMQP_STATIC -DFMI_COSIMULATION -I/work/rabbitmq-fmu/../thirdparty/fmi/include -I/work/thirdparty/rapidjson/include -I/work/rabbitmq-fmu/src -I/work/thirdparty/rabbitmq-c/rabbitmq-c/librabbitmq -I/work/thirdparty/date/date -I/work/thirdparty/date/date/include -I/work/rabbitmq-core/src -isystem /work/thirdparty/googletest/googletest/include -isystem /work/thirdparty/googletest/googletest -isystem /work/thirdparty/external/linux-i386/include  -O2 -g -DNDEBUG   -std=gnu++1z -o CMakeFiles/unit-test-rabbitmq.dir/src/message/MessageParser.cpp.o -c /work/rabbitmq-fmu/src/message/MessageParser.cpp
[ 45%] Linking CXX executable rabbitmq-main
cd /work/build/darwin-x64/rabbitmq-fmu && /usr/bin/cmake -E cmake_link_script CMakeFiles/rabbitmq-main.dir/link.txt --verbose=1
/opt/osxcross/target/bin/o64-clang++  -O2 -g -DNDEBUG -isysroot /opt/osxcross/target/SDK/MacOSX10.15.sdk -Wl,-headerpad_max_install_names  CMakeFiles/rabbitmq-main.dir/src/uri.c.o CMakeFiles/rabbitmq-main.dir/src/FmuContainer.cpp.o CMakeFiles/rabbitmq-main.dir/src/Iso8601TimeParser.cpp.o CMakeFiles/rabbitmq-main.dir/src/fmu.cpp.o CMakeFiles/rabbitmq-main.dir/src/message/MessageParser.cpp.o CMakeFiles/rabbitmq-main.dir/src/modeldescription/ModelDescriptionParser.cpp.o CMakeFiles/rabbitmq-main.dir/src/rabbitmq/RabbitMqHandlerException.cpp.o CMakeFiles/rabbitmq-main.dir/src/rabbitmq/RabbitmqHandler.cpp.o CMakeFiles/rabbitmq-main.dir/src/main.cpp.o  -o rabbitmq-main ../thirdparty/rabbitmq-c/rabbitmq-c/librabbitmq/librabbitmq.a ../thirdparty/date/date/libtz.a ../rabbitmq-core/librabbitmq-core.dylib ../../../thirdparty/external/darwin-x86_64/lib/libxerces-c-3.2.a ../thirdparty/date/date/libtz.a 
[ 45%] Linking CXX shared library rabbitmq.dylib
cd /work/build/darwin-x64/rabbitmq-fmu && /usr/bin/cmake -E cmake_link_script CMakeFiles/rabbitmq.dir/link.txt --verbose=1
/opt/osxcross/target/bin/o64-clang++ -O2 -g -DNDEBUG -isysroot /opt/osxcross/target/SDK/MacOSX10.15.sdk -dynamiclib -Wl,-headerpad_max_install_names  -o rabbitmq.dylib -install_name /work/build/darwin-x64/rabbitmq-fmu/rabbitmq.dylib CMakeFiles/rabbitmq.dir/src/uri.c.o CMakeFiles/rabbitmq.dir/src/FmuContainer.cpp.o CMakeFiles/rabbitmq.dir/src/Iso8601TimeParser.cpp.o CMakeFiles/rabbitmq.dir/src/fmu.cpp.o CMakeFiles/rabbitmq.dir/src/message/MessageParser.cpp.o CMakeFiles/rabbitmq.dir/src/modeldescription/ModelDescriptionParser.cpp.o CMakeFiles/rabbitmq.dir/src/rabbitmq/RabbitMqHandlerException.cpp.o CMakeFiles/rabbitmq.dir/src/rabbitmq/RabbitmqHandler.cpp.o ../thirdparty/rabbitmq-c/rabbitmq-c/librabbitmq/librabbitmq.a ../thirdparty/date/date/libtz.a ../rabbitmq-core/librabbitmq-core.dylib ../../../thirdparty/external/darwin-x86_64/lib/libxerces-c-3.2.a ../thirdparty/date/date/libtz.a 
make[2]: Leaving directory '/work/build/darwin-x64'
[ 45%] Built target rabbitmq-main
make[2]: Leaving directory '/work/build/darwin-x64'
[ 45%] Built target rabbitmq
make[1]: Leaving directory '/work/build/darwin-x64'
Makefile:131: recipe for target 'all' failed
make: *** [all] Error 2
make: Leaving directory '/work/build/darwin-x64'
[ 21%] Linking CXX shared library rabbitmq-core.dll
cd /work/build/win-x64/rabbitmq-core && /usr/src/mxe/usr/x86_64-pc-linux-gnu/bin/cmake -E cmake_link_script CMakeFiles/rabbitmq-core.dir/link.txt --verbose=1
/usr/src/mxe/usr/x86_64-pc-linux-gnu/bin/cmake -E remove -f CMakeFiles/rabbitmq-core.dir/objects.a
/usr/src/mxe/usr/bin/x86_64-w64-mingw32.static-ar cr CMakeFiles/rabbitmq-core.dir/objects.a @CMakeFiles/rabbitmq-core.dir/objects1.rsp
/usr/src/mxe/usr/bin/x86_64-w64-mingw32.static-g++  -O3 -DNDEBUG  -shared -o rabbitmq-core.dll -Wl,--out-implib,librabbitmq-core.dll.a -Wl,--major-image-version,0,--minor-image-version,0 -Wl,--whole-archive CMakeFiles/rabbitmq-core.dir/objects.a -Wl,--no-whole-archive @CMakeFiles/rabbitmq-core.dir/linklibs.rsp
[ 87%] Building CXX object rabbitmq-fmu/CMakeFiles/unit-test-rabbitmq.dir/test/json_test.cpp.o
cd /work/build/linux-x64/rabbitmq-fmu && /usr/bin/x86_64-linux-gnu-g++  -DAMQP_STATIC -DFMI_COSIMULATION -I/work/rabbitmq-fmu/../thirdparty/fmi/include -I/work/thirdparty/rapidjson/include -I/work/rabbitmq-fmu/src -I/work/thirdparty/rabbitmq-c/rabbitmq-c/librabbitmq -I/work/thirdparty/date/date -I/work/thirdparty/date/date/include -I/work/rabbitmq-core/src -isystem /work/thirdparty/googletest/googletest/include -isystem /work/thirdparty/googletest/googletest -isystem /work/thirdparty/external/linux-x86_64/include  -O2 -g -DNDEBUG   -std=gnu++1z -o CMakeFiles/unit-test-rabbitmq.dir/test/json_test.cpp.o -c /work/rabbitmq-fmu/test/json_test.cpp
[ 90%] Building CXX object rabbitmq-fmu/CMakeFiles/unit-test-rabbitmq.dir/test/message_parser_test.cpp.o
cd /work/build/linux-x64/rabbitmq-fmu && /usr/bin/x86_64-linux-gnu-g++  -DAMQP_STATIC -DFMI_COSIMULATION -I/work/rabbitmq-fmu/../thirdparty/fmi/include -I/work/thirdparty/rapidjson/include -I/work/rabbitmq-fmu/src -I/work/thirdparty/rabbitmq-c/rabbitmq-c/librabbitmq -I/work/thirdparty/date/date -I/work/thirdparty/date/date/include -I/work/rabbitmq-core/src -isystem /work/thirdparty/googletest/googletest/include -isystem /work/thirdparty/googletest/googletest -isystem /work/thirdparty/external/linux-x86_64/include  -O2 -g -DNDEBUG   -std=gnu++1z -o CMakeFiles/unit-test-rabbitmq.dir/test/message_parser_test.cpp.o -c /work/rabbitmq-fmu/test/message_parser_test.cpp
[ 59%] Building CXX object rabbitmq-core/CMakeFiles/unit-test-rabbitmq-core.dir/test/FmuContainerCore_test.cpp.o
cd /work/build/linux-x86/rabbitmq-core && /usr/i686-linux-gnu/bin/i686-linux-gnu-g++   -I/work/rabbitmq-core/src -I/work/thirdparty/date/date -I/work/thirdparty/date/date/include -isystem /work/thirdparty/googletest/googletest/include -isystem /work/thirdparty/googletest/googletest  -O2 -g -DNDEBUG   -std=gnu++1z -o CMakeFiles/unit-test-rabbitmq-core.dir/test/FmuContainerCore_test.cpp.o -c /work/rabbitmq-core/test/FmuContainerCore_test.cpp
[ 93%] Building CXX object rabbitmq-fmu/CMakeFiles/it-test-rabbitmq.dir/test/rabbitmq_test_it.cpp.o
cd /work/build/linux-x64/rabbitmq-fmu && /usr/bin/x86_64-linux-gnu-g++  -DAMQP_STATIC -DFMI_COSIMULATION -I/work/rabbitmq-fmu/../thirdparty/fmi/include -I/work/thirdparty/rapidjson/include -I/work/rabbitmq-fmu/src -I/work/thirdparty/rabbitmq-c/rabbitmq-c/librabbitmq -I/work/thirdparty/date/date -I/work/thirdparty/date/date/include -I/work/rabbitmq-core/src -isystem /work/thirdparty/googletest/googletest/include -isystem /work/thirdparty/googletest/googletest -isystem /work/thirdparty/external/linux-x86_64/include  -O2 -g -DNDEBUG   -std=gnu++1z -o CMakeFiles/it-test-rabbitmq.dir/test/rabbitmq_test_it.cpp.o -c /work/rabbitmq-fmu/test/rabbitmq_test_it.cpp
[ 62%] Linking CXX static library ../../../lib/libgmock.a
cd /work/build/linux-x86/thirdparty/googletest/googlemock && /usr/bin/cmake -P CMakeFiles/gmock.dir/cmake_clean_target.cmake
cd /work/build/linux-x86/thirdparty/googletest/googlemock && /usr/bin/cmake -E cmake_link_script CMakeFiles/gmock.dir/link.txt --verbose=1
/usr/i686-linux-gnu/bin/i686-linux-gnu-ar qc ../../../lib/libgmock.a  CMakeFiles/gmock.dir/src/gmock-all.cc.o
make[2]: Leaving directory '/work/build/linux-x86'
[ 62%] Built target gmock
make -f rabbitmq-fmu/CMakeFiles/it-test-rabbitmq.dir/build.make rabbitmq-fmu/CMakeFiles/it-test-rabbitmq.dir/depend
[ 24%] Linking CXX static library ../../../lib/libgtest.a
cd /work/build/win-x64/thirdparty/googletest/googletest && /usr/src/mxe/usr/x86_64-pc-linux-gnu/bin/cmake -P CMakeFiles/gtest.dir/cmake_clean_target.cmake
cd /work/build/win-x64/thirdparty/googletest/googletest && /usr/src/mxe/usr/x86_64-pc-linux-gnu/bin/cmake -E cmake_link_script CMakeFiles/gtest.dir/link.txt --verbose=1
/usr/src/mxe/usr/bin/x86_64-w64-mingw32.static-ar qc ../../../lib/libgtest.a  CMakeFiles/gtest.dir/src/gtest-all.cc.obj
/usr/src/mxe/usr/bin/x86_64-w64-mingw32.static-ranlib ../../../lib/libgtest.a
make[2]: Entering directory '/work/build/linux-x86'
cd /work/build/linux-x86 && /usr/bin/cmake -E cmake_depends "Unix Makefiles" /work /work/rabbitmq-fmu /work/build/linux-x86 /work/build/linux-x86/rabbitmq-fmu /work/build/linux-x86/rabbitmq-fmu/CMakeFiles/it-test-rabbitmq.dir/DependInfo.cmake --color=
make[2]: Leaving directory '/work/build/win-x64'
[ 24%] Built target gtest
make -f thirdparty/googletest/googlemock/CMakeFiles/gmock.dir/build.make thirdparty/googletest/googlemock/CMakeFiles/gmock.dir/depend
make -f thirdparty/googletest/googletest/CMakeFiles/gtest_main.dir/build.make thirdparty/googletest/googletest/CMakeFiles/gtest_main.dir/depend
make[2]: Entering directory '/work/build/win-x64'
cd /work/build/win-x64 && /usr/src/mxe/usr/x86_64-pc-linux-gnu/bin/cmake -E cmake_depends "Unix Makefiles" /work /work/thirdparty/googletest/googlemock /work/build/win-x64 /work/build/win-x64/thirdparty/googletest/googlemock /work/build/win-x64/thirdparty/googletest/googlemock/CMakeFiles/gmock.dir/DependInfo.cmake --color=
make[2]: Entering directory '/work/build/win-x64'
cd /work/build/win-x64 && /usr/src/mxe/usr/x86_64-pc-linux-gnu/bin/cmake -E cmake_depends "Unix Makefiles" /work /work/thirdparty/googletest/googletest /work/build/win-x64 /work/build/win-x64/thirdparty/googletest/googletest /work/build/win-x64/thirdparty/googletest/googletest/CMakeFiles/gtest_main.dir/DependInfo.cmake --color=
Scanning dependencies of target it-test-rabbitmq
make[2]: Leaving directory '/work/build/linux-x86'
make -f rabbitmq-fmu/CMakeFiles/it-test-rabbitmq.dir/build.make rabbitmq-fmu/CMakeFiles/it-test-rabbitmq.dir/build
make[2]: Entering directory '/work/build/linux-x86'
[ 65%] Building C object rabbitmq-fmu/CMakeFiles/it-test-rabbitmq.dir/src/uri.c.o
cd /work/build/linux-x86/rabbitmq-fmu && /usr/i686-linux-gnu/bin/i686-linux-gnu-gcc -DAMQP_STATIC -DFMI_COSIMULATION -I/work/rabbitmq-fmu/../thirdparty/fmi/include -I/work/thirdparty/rapidjson/include -I/work/rabbitmq-fmu/src -I/work/thirdparty/rabbitmq-c/rabbitmq-c/librabbitmq -I/work/thirdparty/date/date -I/work/thirdparty/date/date/include -I/work/rabbitmq-core/src -isystem /work/thirdparty/googletest/googletest/include -isystem /work/thirdparty/googletest/googletest -isystem /work/thirdparty/external/linux-i386/include  -O2 -g -DNDEBUG   -o CMakeFiles/it-test-rabbitmq.dir/src/uri.c.o   -c /work/rabbitmq-fmu/src/uri.c
Scanning dependencies of target gtest_main
make[2]: Leaving directory '/work/build/win-x64'
make -f thirdparty/googletest/googletest/CMakeFiles/gtest_main.dir/build.make thirdparty/googletest/googletest/CMakeFiles/gtest_main.dir/build
make[2]: Entering directory '/work/build/win-x64'
Scanning dependencies of target gmock
make[2]: Leaving directory '/work/build/win-x64'
[ 24%] Building CXX object thirdparty/googletest/googletest/CMakeFiles/gtest_main.dir/src/gtest_main.cc.obj
make -f thirdparty/googletest/googlemock/CMakeFiles/gmock.dir/build.make thirdparty/googletest/googlemock/CMakeFiles/gmock.dir/build
make[2]: Entering directory '/work/build/win-x64'
cd /work/build/win-x64/thirdparty/googletest/googletest && /usr/src/mxe/usr/bin/x86_64-w64-mingw32.static-g++   @CMakeFiles/gtest_main.dir/includes_CXX.rsp -O3 -DNDEBUG   -Wall -Wshadow -Werror -Wno-error=dangling-else -DGTEST_HAS_PTHREAD=0 -fexceptions -Wextra -Wno-unused-parameter -Wno-missing-field-initializers -std=c++11 -o CMakeFiles/gtest_main.dir/src/gtest_main.cc.obj -c /work/thirdparty/googletest/googletest/src/gtest_main.cc
[ 24%] Building CXX object thirdparty/googletest/googlemock/CMakeFiles/gmock.dir/src/gmock-all.cc.obj
cd /work/build/win-x64/thirdparty/googletest/googlemock && /usr/src/mxe/usr/bin/x86_64-w64-mingw32.static-g++   @CMakeFiles/gmock.dir/includes_CXX.rsp -O3 -DNDEBUG   -Wall -Wshadow -Werror -Wno-error=dangling-else -DGTEST_HAS_PTHREAD=0 -fexceptions -Wextra -Wno-unused-parameter -Wno-missing-field-initializers -std=c++11 -o CMakeFiles/gmock.dir/src/gmock-all.cc.obj -c /work/thirdparty/googletest/googlemock/src/gmock-all.cc
[ 93%] Building CXX object rabbitmq-fmu/CMakeFiles/unit-test-rabbitmq.dir/test/modeldescription_test.cpp.o
cd /work/build/linux-x64/rabbitmq-fmu && /usr/bin/x86_64-linux-gnu-g++  -DAMQP_STATIC -DFMI_COSIMULATION -I/work/rabbitmq-fmu/../thirdparty/fmi/include -I/work/thirdparty/rapidjson/include -I/work/rabbitmq-fmu/src -I/work/thirdparty/rabbitmq-c/rabbitmq-c/librabbitmq -I/work/thirdparty/date/date -I/work/thirdparty/date/date/include -I/work/rabbitmq-core/src -isystem /work/thirdparty/googletest/googletest/include -isystem /work/thirdparty/googletest/googletest -isystem /work/thirdparty/external/linux-x86_64/include  -O2 -g -DNDEBUG   -std=gnu++1z -o CMakeFiles/unit-test-rabbitmq.dir/test/modeldescription_test.cpp.o -c /work/rabbitmq-fmu/test/modeldescription_test.cpp
[ 65%] Building CXX object rabbitmq-fmu/CMakeFiles/it-test-rabbitmq.dir/src/FmuContainer.cpp.o
cd /work/build/linux-x86/rabbitmq-fmu && /usr/i686-linux-gnu/bin/i686-linux-gnu-g++  -DAMQP_STATIC -DFMI_COSIMULATION -I/work/rabbitmq-fmu/../thirdparty/fmi/include -I/work/thirdparty/rapidjson/include -I/work/rabbitmq-fmu/src -I/work/thirdparty/rabbitmq-c/rabbitmq-c/librabbitmq -I/work/thirdparty/date/date -I/work/thirdparty/date/date/include -I/work/rabbitmq-core/src -isystem /work/thirdparty/googletest/googletest/include -isystem /work/thirdparty/googletest/googletest -isystem /work/thirdparty/external/linux-i386/include  -O2 -g -DNDEBUG   -std=gnu++1z -o CMakeFiles/it-test-rabbitmq.dir/src/FmuContainer.cpp.o -c /work/rabbitmq-fmu/src/FmuContainer.cpp
[ 93%] Building CXX object rabbitmq-fmu/CMakeFiles/it-test-rabbitmq.dir/test/rabbitmqhandler_test_it.cpp.o
make[2]: Leaving directory '/work/build/win-x64'
[ 24%] Built target rabbitmq-core
make -f rabbitmq-fmu/CMakeFiles/rabbitmq.dir/build.make rabbitmq-fmu/CMakeFiles/rabbitmq.dir/depend
make -f rabbitmq-fmu/CMakeFiles/rabbitmq-main.dir/build.make rabbitmq-fmu/CMakeFiles/rabbitmq-main.dir/depend
make[2]: Entering directory '/work/build/win-x64'
cd /work/build/win-x64 && /usr/src/mxe/usr/x86_64-pc-linux-gnu/bin/cmake -E cmake_depends "Unix Makefiles" /work /work/rabbitmq-fmu /work/build/win-x64 /work/build/win-x64/rabbitmq-fmu /work/build/win-x64/rabbitmq-fmu/CMakeFiles/rabbitmq-main.dir/DependInfo.cmake --color=
make[2]: Entering directory '/work/build/win-x64'
cd /work/build/win-x64 && /usr/src/mxe/usr/x86_64-pc-linux-gnu/bin/cmake -E cmake_depends "Unix Makefiles" /work /work/rabbitmq-fmu /work/build/win-x64 /work/build/win-x64/rabbitmq-fmu /work/build/win-x64/rabbitmq-fmu/CMakeFiles/rabbitmq.dir/DependInfo.cmake --color=
[Pipeline] }
cd /work/build/linux-x64/rabbitmq-fmu && /usr/bin/x86_64-linux-gnu-g++  -DAMQP_STATIC -DFMI_COSIMULATION -I/work/rabbitmq-fmu/../thirdparty/fmi/include -I/work/thirdparty/rapidjson/include -I/work/rabbitmq-fmu/src -I/work/thirdparty/rabbitmq-c/rabbitmq-c/librabbitmq -I/work/thirdparty/date/date -I/work/thirdparty/date/date/include -I/work/rabbitmq-core/src -isystem /work/thirdparty/googletest/googletest/include -isystem /work/thirdparty/googletest/googletest -isystem /work/thirdparty/external/linux-x86_64/include  -O2 -g -DNDEBUG   -std=gnu++1z -o CMakeFiles/it-test-rabbitmq.dir/test/rabbitmqhandler_test_it.cpp.o -c /work/rabbitmq-fmu/test/rabbitmqhandler_test_it.cpp
[Pipeline] // stage
[Pipeline] }
Failed in branch Xcompile darwin:
Scanning dependencies of target rabbitmq-main
Scanning dependencies of target rabbitmq
make[2]: Leaving directory '/work/build/win-x64'
make[2]: Leaving directory '/work/build/win-x64'
make -f rabbitmq-fmu/CMakeFiles/rabbitmq-main.dir/build.make rabbitmq-fmu/CMakeFiles/rabbitmq-main.dir/build
make -f rabbitmq-fmu/CMakeFiles/rabbitmq.dir/build.make rabbitmq-fmu/CMakeFiles/rabbitmq.dir/build
make[2]: Entering directory '/work/build/win-x64'
make[2]: Entering directory '/work/build/win-x64'
[ 24%] Building CXX object rabbitmq-fmu/CMakeFiles/rabbitmq-main.dir/src/fmu.cpp.obj
[ 27%] Building CXX object rabbitmq-fmu/CMakeFiles/rabbitmq.dir/src/FmuContainer.cpp.obj
[ 29%] Building CXX object rabbitmq-fmu/CMakeFiles/rabbitmq-main.dir/src/Iso8601TimeParser.cpp.obj
[ 29%] Building C object rabbitmq-fmu/CMakeFiles/rabbitmq.dir/src/uri.c.obj
cd /work/build/win-x64/rabbitmq-fmu && /usr/src/mxe/usr/bin/x86_64-w64-mingw32.static-g++  -DAMQP_STATIC -DFMI_COSIMULATION -Drabbitmq_EXPORTS @CMakeFiles/rabbitmq.dir/includes_CXX.rsp -O3 -DNDEBUG   -std=gnu++17 -o CMakeFiles/rabbitmq.dir/src/FmuContainer.cpp.obj -c /work/rabbitmq-fmu/src/FmuContainer.cpp
[ 29%] Building CXX object rabbitmq-fmu/CMakeFiles/rabbitmq-main.dir/src/FmuContainer.cpp.obj
cd /work/build/win-x64/rabbitmq-fmu && /usr/src/mxe/usr/bin/x86_64-w64-mingw32.static-g++  -DAMQP_STATIC -DFMI_COSIMULATION @CMakeFiles/rabbitmq-main.dir/includes_CXX.rsp -O3 -DNDEBUG   -std=gnu++17 -o CMakeFiles/rabbitmq-main.dir/src/FmuContainer.cpp.obj -c /work/rabbitmq-fmu/src/FmuContainer.cpp
cd /work/build/win-x64/rabbitmq-fmu && /usr/src/mxe/usr/bin/x86_64-w64-mingw32.static-gcc -DAMQP_STATIC -DFMI_COSIMULATION -Drabbitmq_EXPORTS @CMakeFiles/rabbitmq.dir/includes_C.rsp -O3 -DNDEBUG   -o CMakeFiles/rabbitmq.dir/src/uri.c.obj   -c /work/rabbitmq-fmu/src/uri.c
[ 32%] Building C object rabbitmq-fmu/CMakeFiles/rabbitmq-main.dir/src/uri.c.obj
cd /work/build/win-x64/rabbitmq-fmu && /usr/src/mxe/usr/bin/x86_64-w64-mingw32.static-g++  -DAMQP_STATIC -DFMI_COSIMULATION @CMakeFiles/rabbitmq-main.dir/includes_CXX.rsp -O3 -DNDEBUG   -std=gnu++17 -o CMakeFiles/rabbitmq-main.dir/src/fmu.cpp.obj -c /work/rabbitmq-fmu/src/fmu.cpp
cd /work/build/win-x64/rabbitmq-fmu && /usr/src/mxe/usr/bin/x86_64-w64-mingw32.static-g++  -DAMQP_STATIC -DFMI_COSIMULATION @CMakeFiles/rabbitmq-main.dir/includes_CXX.rsp -O3 -DNDEBUG   -std=gnu++17 -o CMakeFiles/rabbitmq-main.dir/src/Iso8601TimeParser.cpp.obj -c /work/rabbitmq-fmu/src/Iso8601TimeParser.cpp
cd /work/build/win-x64/rabbitmq-fmu && /usr/src/mxe/usr/bin/x86_64-w64-mingw32.static-gcc -DAMQP_STATIC -DFMI_COSIMULATION @CMakeFiles/rabbitmq-main.dir/includes_C.rsp -O3 -DNDEBUG   -o CMakeFiles/rabbitmq-main.dir/src/uri.c.obj   -c /work/rabbitmq-fmu/src/uri.c
[ 32%] Building CXX object rabbitmq-fmu/CMakeFiles/rabbitmq.dir/src/Iso8601TimeParser.cpp.obj
cd /work/build/win-x64/rabbitmq-fmu && /usr/src/mxe/usr/bin/x86_64-w64-mingw32.static-g++  -DAMQP_STATIC -DFMI_COSIMULATION -Drabbitmq_EXPORTS @CMakeFiles/rabbitmq.dir/includes_CXX.rsp -O3 -DNDEBUG   -std=gnu++17 -o CMakeFiles/rabbitmq.dir/src/Iso8601TimeParser.cpp.obj -c /work/rabbitmq-fmu/src/Iso8601TimeParser.cpp
[ 35%] Building CXX object rabbitmq-fmu/CMakeFiles/rabbitmq-main.dir/src/message/MessageParser.cpp.obj
cd /work/build/win-x64/rabbitmq-fmu && /usr/src/mxe/usr/bin/x86_64-w64-mingw32.static-g++  -DAMQP_STATIC -DFMI_COSIMULATION @CMakeFiles/rabbitmq-main.dir/includes_CXX.rsp -O3 -DNDEBUG   -std=gnu++17 -o CMakeFiles/rabbitmq-main.dir/src/message/MessageParser.cpp.obj -c /work/rabbitmq-fmu/src/message/MessageParser.cpp
[ 37%] Linking CXX static library ../../../lib/libgtest_main.a
cd /work/build/win-x64/thirdparty/googletest/googletest && /usr/src/mxe/usr/x86_64-pc-linux-gnu/bin/cmake -P CMakeFiles/gtest_main.dir/cmake_clean_target.cmake
make[2]: Leaving directory '/work/build/linux-x86'
[ 65%] Built target rabbitmq
[ 65%] Building CXX object rabbitmq-fmu/CMakeFiles/unit-test-rabbitmq.dir/src/modeldescription/ModelDescriptionParser.cpp.o
cd /work/build/linux-x86/rabbitmq-fmu && /usr/i686-linux-gnu/bin/i686-linux-gnu-g++  -DAMQP_STATIC -DFMI_COSIMULATION -I/work/rabbitmq-fmu/../thirdparty/fmi/include -I/work/thirdparty/rapidjson/include -I/work/rabbitmq-fmu/src -I/work/thirdparty/rabbitmq-c/rabbitmq-c/librabbitmq -I/work/thirdparty/date/date -I/work/thirdparty/date/date/include -I/work/rabbitmq-core/src -isystem /work/thirdparty/googletest/googletest/include -isystem /work/thirdparty/googletest/googletest -isystem /work/thirdparty/external/linux-i386/include  -O2 -g -DNDEBUG   -std=gnu++1z -o CMakeFiles/unit-test-rabbitmq.dir/src/modeldescription/ModelDescriptionParser.cpp.o -c /work/rabbitmq-fmu/src/modeldescription/ModelDescriptionParser.cpp
cd /work/build/win-x64/thirdparty/googletest/googletest && /usr/src/mxe/usr/x86_64-pc-linux-gnu/bin/cmake -E cmake_link_script CMakeFiles/gtest_main.dir/link.txt --verbose=1
/usr/src/mxe/usr/bin/x86_64-w64-mingw32.static-ar qc ../../../lib/libgtest_main.a  CMakeFiles/gtest_main.dir/src/gtest_main.cc.obj
/usr/src/mxe/usr/bin/x86_64-w64-mingw32.static-ranlib ../../../lib/libgtest_main.a
make[2]: Leaving directory '/work/build/win-x64'
[ 68%] Building CXX object rabbitmq-fmu/CMakeFiles/unit-test-rabbitmq.dir/src/rabbitmq/RabbitMqHandlerException.cpp.o
cd /work/build/linux-x86/rabbitmq-fmu && /usr/i686-linux-gnu/bin/i686-linux-gnu-g++  -DAMQP_STATIC -DFMI_COSIMULATION -I/work/rabbitmq-fmu/../thirdparty/fmi/include -I/work/thirdparty/rapidjson/include -I/work/rabbitmq-fmu/src -I/work/thirdparty/rabbitmq-c/rabbitmq-c/librabbitmq -I/work/thirdparty/date/date -I/work/thirdparty/date/date/include -I/work/rabbitmq-core/src -isystem /work/thirdparty/googletest/googletest/include -isystem /work/thirdparty/googletest/googletest -isystem /work/thirdparty/external/linux-i386/include  -O2 -g -DNDEBUG   -std=gnu++1z -o CMakeFiles/unit-test-rabbitmq.dir/src/rabbitmq/RabbitMqHandlerException.cpp.o -c /work/rabbitmq-fmu/src/rabbitmq/RabbitMqHandlerException.cpp
[ 37%] Built target gtest_main
make -f rabbitmq-core/CMakeFiles/unit-test-rabbitmq-core.dir/build.make rabbitmq-core/CMakeFiles/unit-test-rabbitmq-core.dir/depend
make[2]: Entering directory '/work/build/win-x64'
cd /work/build/win-x64 && /usr/src/mxe/usr/x86_64-pc-linux-gnu/bin/cmake -E cmake_depends "Unix Makefiles" /work /work/rabbitmq-core /work/build/win-x64 /work/build/win-x64/rabbitmq-core /work/build/win-x64/rabbitmq-core/CMakeFiles/unit-test-rabbitmq-core.dir/DependInfo.cmake --color=
Scanning dependencies of target unit-test-rabbitmq-core
make[2]: Leaving directory '/work/build/win-x64'
make -f rabbitmq-core/CMakeFiles/unit-test-rabbitmq-core.dir/build.make rabbitmq-core/CMakeFiles/unit-test-rabbitmq-core.dir/build
make[2]: Entering directory '/work/build/win-x64'
[ 40%] Building CXX object rabbitmq-core/CMakeFiles/unit-test-rabbitmq-core.dir/src/FmuContainerCore.cpp.obj
cd /work/build/win-x64/rabbitmq-core && /usr/src/mxe/usr/bin/x86_64-w64-mingw32.static-g++   @CMakeFiles/unit-test-rabbitmq-core.dir/includes_CXX.rsp -O3 -DNDEBUG   -std=gnu++17 -o CMakeFiles/unit-test-rabbitmq-core.dir/src/FmuContainerCore.cpp.obj -c /work/rabbitmq-core/src/FmuContainerCore.cpp
[ 68%] Building CXX object rabbitmq-fmu/CMakeFiles/unit-test-rabbitmq.dir/src/rabbitmq/RabbitmqHandler.cpp.o
cd /work/build/linux-x86/rabbitmq-fmu && /usr/i686-linux-gnu/bin/i686-linux-gnu-g++  -DAMQP_STATIC -DFMI_COSIMULATION -I/work/rabbitmq-fmu/../thirdparty/fmi/include -I/work/thirdparty/rapidjson/include -I/work/rabbitmq-fmu/src -I/work/thirdparty/rabbitmq-c/rabbitmq-c/librabbitmq -I/work/thirdparty/date/date -I/work/thirdparty/date/date/include -I/work/rabbitmq-core/src -isystem /work/thirdparty/googletest/googletest/include -isystem /work/thirdparty/googletest/googletest -isystem /work/thirdparty/external/linux-i386/include  -O2 -g -DNDEBUG   -std=gnu++1z -o CMakeFiles/unit-test-rabbitmq.dir/src/rabbitmq/RabbitmqHandler.cpp.o -c /work/rabbitmq-fmu/src/rabbitmq/RabbitmqHandler.cpp
[ 93%] Building CXX object rabbitmq-fmu/CMakeFiles/unit-test-rabbitmq.dir/test/timetamp_test.cpp.o
cd /work/build/linux-x64/rabbitmq-fmu && /usr/bin/x86_64-linux-gnu-g++  -DAMQP_STATIC -DFMI_COSIMULATION -I/work/rabbitmq-fmu/../thirdparty/fmi/include -I/work/thirdparty/rapidjson/include -I/work/rabbitmq-fmu/src -I/work/thirdparty/rabbitmq-c/rabbitmq-c/librabbitmq -I/work/thirdparty/date/date -I/work/thirdparty/date/date/include -I/work/rabbitmq-core/src -isystem /work/thirdparty/googletest/googletest/include -isystem /work/thirdparty/googletest/googletest -isystem /work/thirdparty/external/linux-x86_64/include  -O2 -g -DNDEBUG   -std=gnu++1z -o CMakeFiles/unit-test-rabbitmq.dir/test/timetamp_test.cpp.o -c /work/rabbitmq-fmu/test/timetamp_test.cpp
[ 96%] Building CXX object rabbitmq-fmu/CMakeFiles/unit-test-rabbitmq.dir/test/xml_test.cpp.o
cd /work/build/linux-x64/rabbitmq-fmu && /usr/bin/x86_64-linux-gnu-g++  -DAMQP_STATIC -DFMI_COSIMULATION -I/work/rabbitmq-fmu/../thirdparty/fmi/include -I/work/thirdparty/rapidjson/include -I/work/rabbitmq-fmu/src -I/work/thirdparty/rabbitmq-c/rabbitmq-c/librabbitmq -I/work/thirdparty/date/date -I/work/thirdparty/date/date/include -I/work/rabbitmq-core/src -isystem /work/thirdparty/googletest/googletest/include -isystem /work/thirdparty/googletest/googletest -isystem /work/thirdparty/external/linux-x86_64/include  -O2 -g -DNDEBUG   -std=gnu++1z -o CMakeFiles/unit-test-rabbitmq.dir/test/xml_test.cpp.o -c /work/rabbitmq-fmu/test/xml_test.cpp
[100%] Linking CXX executable unit-test-rabbitmq-core
cd /work/build/linux-x64/rabbitmq-core && /usr/bin/cmake -E cmake_link_script CMakeFiles/unit-test-rabbitmq-core.dir/link.txt --verbose=1
/usr/bin/x86_64-linux-gnu-g++  -O2 -g -DNDEBUG   CMakeFiles/unit-test-rabbitmq-core.dir/src/FmuContainerCore.cpp.o CMakeFiles/unit-test-rabbitmq-core.dir/test/FmuContainerCore_test.cpp.o  -o unit-test-rabbitmq-core ../lib/libgtest_main.a ../thirdparty/date/date/libtz.a ../lib/libgtest.a -lpthread 
[ 71%] Building CXX object rabbitmq-fmu/CMakeFiles/it-test-rabbitmq.dir/src/Iso8601TimeParser.cpp.o
cd /work/build/linux-x86/rabbitmq-fmu && /usr/i686-linux-gnu/bin/i686-linux-gnu-g++  -DAMQP_STATIC -DFMI_COSIMULATION -I/work/rabbitmq-fmu/../thirdparty/fmi/include -I/work/thirdparty/rapidjson/include -I/work/rabbitmq-fmu/src -I/work/thirdparty/rabbitmq-c/rabbitmq-c/librabbitmq -I/work/thirdparty/date/date -I/work/thirdparty/date/date/include -I/work/rabbitmq-core/src -isystem /work/thirdparty/googletest/googletest/include -isystem /work/thirdparty/googletest/googletest -isystem /work/thirdparty/external/linux-i386/include  -O2 -g -DNDEBUG   -std=gnu++1z -o CMakeFiles/it-test-rabbitmq.dir/src/Iso8601TimeParser.cpp.o -c /work/rabbitmq-fmu/src/Iso8601TimeParser.cpp
[ 75%] Building CXX object rabbitmq-fmu/CMakeFiles/unit-test-rabbitmq.dir/test/FmuContainer_test.cpp.o
cd /work/build/linux-x86/rabbitmq-fmu && /usr/i686-linux-gnu/bin/i686-linux-gnu-g++  -DAMQP_STATIC -DFMI_COSIMULATION -I/work/rabbitmq-fmu/../thirdparty/fmi/include -I/work/thirdparty/rapidjson/include -I/work/rabbitmq-fmu/src -I/work/thirdparty/rabbitmq-c/rabbitmq-c/librabbitmq -I/work/thirdparty/date/date -I/work/thirdparty/date/date/include -I/work/rabbitmq-core/src -isystem /work/thirdparty/googletest/googletest/include -isystem /work/thirdparty/googletest/googletest -isystem /work/thirdparty/external/linux-i386/include  -O2 -g -DNDEBUG   -std=gnu++1z -o CMakeFiles/unit-test-rabbitmq.dir/test/FmuContainer_test.cpp.o -c /work/rabbitmq-fmu/test/FmuContainer_test.cpp
make[2]: Leaving directory '/work/build/linux-x64'
[100%] Built target unit-test-rabbitmq-core
[100%] Linking CXX executable it-test-rabbitmq
cd /work/build/linux-x64/rabbitmq-fmu && /usr/bin/cmake -E cmake_link_script CMakeFiles/it-test-rabbitmq.dir/link.txt --verbose=1
/usr/bin/x86_64-linux-gnu-g++  -O2 -g -DNDEBUG   CMakeFiles/it-test-rabbitmq.dir/src/uri.c.o CMakeFiles/it-test-rabbitmq.dir/src/FmuContainer.cpp.o CMakeFiles/it-test-rabbitmq.dir/src/Iso8601TimeParser.cpp.o CMakeFiles/it-test-rabbitmq.dir/src/fmu.cpp.o CMakeFiles/it-test-rabbitmq.dir/src/message/MessageParser.cpp.o CMakeFiles/it-test-rabbitmq.dir/src/modeldescription/ModelDescriptionParser.cpp.o CMakeFiles/it-test-rabbitmq.dir/src/rabbitmq/RabbitMqHandlerException.cpp.o CMakeFiles/it-test-rabbitmq.dir/src/rabbitmq/RabbitmqHandler.cpp.o CMakeFiles/it-test-rabbitmq.dir/test/fmu_test_it.cpp.o CMakeFiles/it-test-rabbitmq.dir/test/rabbitmq_test_it.cpp.o CMakeFiles/it-test-rabbitmq.dir/test/rabbitmqhandler_test_it.cpp.o  -o it-test-rabbitmq -Wl,-rpath,/work/build/linux-x64/rabbitmq-core ../lib/libgtest_main.a ../thirdparty/rabbitmq-c/rabbitmq-c/librabbitmq/librabbitmq.a ../thirdparty/date/date/libtz.a ../rabbitmq-core/librabbitmq-core.so ../lib/libgtest.a ../../../thirdparty/external/linux-x86_64/lib/libxerces-c-3.2.a -lrt ../thirdparty/date/date/libtz.a -lpthread 
[ 75%] Building CXX object rabbitmq-fmu/CMakeFiles/it-test-rabbitmq.dir/src/fmu.cpp.o
cd /work/build/linux-x86/rabbitmq-fmu && /usr/i686-linux-gnu/bin/i686-linux-gnu-g++  -DAMQP_STATIC -DFMI_COSIMULATION -I/work/rabbitmq-fmu/../thirdparty/fmi/include -I/work/thirdparty/rapidjson/include -I/work/rabbitmq-fmu/src -I/work/thirdparty/rabbitmq-c/rabbitmq-c/librabbitmq -I/work/thirdparty/date/date -I/work/thirdparty/date/date/include -I/work/rabbitmq-core/src -isystem /work/thirdparty/googletest/googletest/include -isystem /work/thirdparty/googletest/googletest -isystem /work/thirdparty/external/linux-i386/include  -O2 -g -DNDEBUG   -std=gnu++1z -o CMakeFiles/it-test-rabbitmq.dir/src/fmu.cpp.o -c /work/rabbitmq-fmu/src/fmu.cpp
[ 75%] Building CXX object rabbitmq-fmu/CMakeFiles/rabbitmq-main.dir/src/modeldescription/ModelDescriptionParser.cpp.o
cd /work/build/linux-x86/rabbitmq-fmu && /usr/i686-linux-gnu/bin/i686-linux-gnu-g++  -DAMQP_STATIC -DFMI_COSIMULATION -I/work/rabbitmq-fmu/../thirdparty/fmi/include -I/work/thirdparty/rapidjson/include -I/work/thirdparty/googletest/googletest/include -I/work/rabbitmq-fmu/src -I/work/thirdparty/rabbitmq-c/rabbitmq-c/librabbitmq -I/work/thirdparty/date/date -I/work/thirdparty/date/date/include -I/work/rabbitmq-core/src -isystem /work/thirdparty/external/linux-i386/include  -O2 -g -DNDEBUG   -std=gnu++1z -o CMakeFiles/rabbitmq-main.dir/src/modeldescription/ModelDescriptionParser.cpp.o -c /work/rabbitmq-fmu/src/modeldescription/ModelDescriptionParser.cpp
[ 78%] Building CXX object rabbitmq-fmu/CMakeFiles/rabbitmq-main.dir/src/rabbitmq/RabbitMqHandlerException.cpp.o
cd /work/build/linux-x86/rabbitmq-fmu && /usr/i686-linux-gnu/bin/i686-linux-gnu-g++  -DAMQP_STATIC -DFMI_COSIMULATION -I/work/rabbitmq-fmu/../thirdparty/fmi/include -I/work/thirdparty/rapidjson/include -I/work/thirdparty/googletest/googletest/include -I/work/rabbitmq-fmu/src -I/work/thirdparty/rabbitmq-c/rabbitmq-c/librabbitmq -I/work/thirdparty/date/date -I/work/thirdparty/date/date/include -I/work/rabbitmq-core/src -isystem /work/thirdparty/external/linux-i386/include  -O2 -g -DNDEBUG   -std=gnu++1z -o CMakeFiles/rabbitmq-main.dir/src/rabbitmq/RabbitMqHandlerException.cpp.o -c /work/rabbitmq-fmu/src/rabbitmq/RabbitMqHandlerException.cpp
[ 43%] Linking CXX static library ../../../lib/libgmock.a
cd /work/build/win-x64/thirdparty/googletest/googlemock && /usr/src/mxe/usr/x86_64-pc-linux-gnu/bin/cmake -P CMakeFiles/gmock.dir/cmake_clean_target.cmake
cd /work/build/win-x64/thirdparty/googletest/googlemock && /usr/src/mxe/usr/x86_64-pc-linux-gnu/bin/cmake -E cmake_link_script CMakeFiles/gmock.dir/link.txt --verbose=1
/usr/src/mxe/usr/bin/x86_64-w64-mingw32.static-ar qc ../../../lib/libgmock.a  CMakeFiles/gmock.dir/src/gmock-all.cc.obj
/usr/src/mxe/usr/bin/x86_64-w64-mingw32.static-ranlib ../../../lib/libgmock.a
make[2]: Leaving directory '/work/build/win-x64'
[ 43%] Built target gmock
make -f rabbitmq-core/CMakeFiles/it-test-rabbitmq-core.dir/build.make rabbitmq-core/CMakeFiles/it-test-rabbitmq-core.dir/depend
make[2]: Entering directory '/work/build/win-x64'
cd /work/build/win-x64 && /usr/src/mxe/usr/x86_64-pc-linux-gnu/bin/cmake -E cmake_depends "Unix Makefiles" /work /work/rabbitmq-core /work/build/win-x64 /work/build/win-x64/rabbitmq-core /work/build/win-x64/rabbitmq-core/CMakeFiles/it-test-rabbitmq-core.dir/DependInfo.cmake --color=
Scanning dependencies of target it-test-rabbitmq-core
make[2]: Leaving directory '/work/build/win-x64'
make -f rabbitmq-core/CMakeFiles/it-test-rabbitmq-core.dir/build.make rabbitmq-core/CMakeFiles/it-test-rabbitmq-core.dir/build
make[2]: Entering directory '/work/build/win-x64'
[ 43%] Building CXX object rabbitmq-core/CMakeFiles/it-test-rabbitmq-core.dir/src/FmuContainerCore.cpp.obj
cd /work/build/win-x64/rabbitmq-core && /usr/src/mxe/usr/bin/x86_64-w64-mingw32.static-g++   @CMakeFiles/it-test-rabbitmq-core.dir/includes_CXX.rsp -O3 -DNDEBUG   -std=gnu++17 -o CMakeFiles/it-test-rabbitmq-core.dir/src/FmuContainerCore.cpp.obj -c /work/rabbitmq-core/src/FmuContainerCore.cpp
make[2]: Leaving directory '/work/build/linux-x64'
[100%] Built target it-test-rabbitmq
[100%] Linking CXX executable unit-test-rabbitmq
cd /work/build/linux-x64/rabbitmq-fmu && /usr/bin/cmake -E cmake_link_script CMakeFiles/unit-test-rabbitmq.dir/link.txt --verbose=1
/usr/bin/x86_64-linux-gnu-g++  -O2 -g -DNDEBUG   CMakeFiles/unit-test-rabbitmq.dir/src/uri.c.o CMakeFiles/unit-test-rabbitmq.dir/src/FmuContainer.cpp.o CMakeFiles/unit-test-rabbitmq.dir/src/Iso8601TimeParser.cpp.o CMakeFiles/unit-test-rabbitmq.dir/src/fmu.cpp.o CMakeFiles/unit-test-rabbitmq.dir/src/message/MessageParser.cpp.o CMakeFiles/unit-test-rabbitmq.dir/src/modeldescription/ModelDescriptionParser.cpp.o CMakeFiles/unit-test-rabbitmq.dir/src/rabbitmq/RabbitMqHandlerException.cpp.o CMakeFiles/unit-test-rabbitmq.dir/src/rabbitmq/RabbitmqHandler.cpp.o CMakeFiles/unit-test-rabbitmq.dir/test/FmuContainer_test.cpp.o CMakeFiles/unit-test-rabbitmq.dir/test/json_test.cpp.o CMakeFiles/unit-test-rabbitmq.dir/test/message_parser_test.cpp.o CMakeFiles/unit-test-rabbitmq.dir/test/modeldescription_test.cpp.o CMakeFiles/unit-test-rabbitmq.dir/test/timetamp_test.cpp.o CMakeFiles/unit-test-rabbitmq.dir/test/xml_test.cpp.o  -o unit-test-rabbitmq -Wl,-rpath,/work/build/linux-x64/rabbitmq-core ../lib/libgtest_main.a ../thirdparty/rabbitmq-c/rabbitmq-c/librabbitmq/librabbitmq.a ../thirdparty/date/date/libtz.a ../rabbitmq-core/librabbitmq-core.so ../lib/libgtest.a ../../../thirdparty/external/linux-x86_64/lib/libxerces-c-3.2.a -lrt ../thirdparty/date/date/libtz.a -lpthread 
make[2]: Leaving directory '/work/build/linux-x64'
[100%] Built target unit-test-rabbitmq
make[1]: Leaving directory '/work/build/linux-x64'
/usr/bin/cmake -E cmake_progress_start /work/build/linux-x64/CMakeFiles 0
make: Leaving directory '/work/build/linux-x64'
make -f thirdparty/googletest/googlemock/CMakeFiles/gmock_main.dir/build.make thirdparty/googletest/googlemock/CMakeFiles/gmock_main.dir/depend
make[2]: Entering directory '/work/build/linux-x86'
cd /work/build/linux-x86 && /usr/bin/cmake -E cmake_depends "Unix Makefiles" /work /work/thirdparty/googletest/googlemock /work/build/linux-x86 /work/build/linux-x86/thirdparty/googletest/googlemock /work/build/linux-x86/thirdparty/googletest/googlemock/CMakeFiles/gmock_main.dir/DependInfo.cmake --color=
Scanning dependencies of target gmock_main
make[2]: Leaving directory '/work/build/linux-x86'
make -f thirdparty/googletest/googlemock/CMakeFiles/gmock_main.dir/build.make thirdparty/googletest/googlemock/CMakeFiles/gmock_main.dir/build
make[2]: Entering directory '/work/build/linux-x86'
[ 78%] Building CXX object thirdparty/googletest/googlemock/CMakeFiles/gmock_main.dir/src/gmock_main.cc.o
cd /work/build/linux-x86/thirdparty/googletest/googlemock && /usr/i686-linux-gnu/bin/i686-linux-gnu-g++   -isystem /work/thirdparty/googletest/googlemock/include -isystem /work/thirdparty/googletest/googlemock -isystem /work/thirdparty/googletest/googletest/include -isystem /work/thirdparty/googletest/googletest  -O2 -g -DNDEBUG   -Wall -Wshadow -Werror -DGTEST_HAS_PTHREAD=1 -fexceptions -Wextra -Wno-unused-parameter -Wno-missing-field-initializers -std=c++11 -o CMakeFiles/gmock_main.dir/src/gmock_main.cc.o -c /work/thirdparty/googletest/googlemock/src/gmock_main.cc
[ 81%] Building CXX object rabbitmq-fmu/CMakeFiles/it-test-rabbitmq.dir/src/message/MessageParser.cpp.o
[ 81%] Building CXX object rabbitmq-fmu/CMakeFiles/unit-test-rabbitmq.dir/test/json_test.cpp.o
cd /work/build/linux-x86/rabbitmq-fmu && /usr/i686-linux-gnu/bin/i686-linux-gnu-g++  -DAMQP_STATIC -DFMI_COSIMULATION -I/work/rabbitmq-fmu/../thirdparty/fmi/include -I/work/thirdparty/rapidjson/include -I/work/rabbitmq-fmu/src -I/work/thirdparty/rabbitmq-c/rabbitmq-c/librabbitmq -I/work/thirdparty/date/date -I/work/thirdparty/date/date/include -I/work/rabbitmq-core/src -isystem /work/thirdparty/googletest/googletest/include -isystem /work/thirdparty/googletest/googletest -isystem /work/thirdparty/external/linux-i386/include  -O2 -g -DNDEBUG   -std=gnu++1z -o CMakeFiles/unit-test-rabbitmq.dir/test/json_test.cpp.o -c /work/rabbitmq-fmu/test/json_test.cpp
cd /work/build/linux-x86/rabbitmq-fmu && /usr/i686-linux-gnu/bin/i686-linux-gnu-g++  -DAMQP_STATIC -DFMI_COSIMULATION -I/work/rabbitmq-fmu/../thirdparty/fmi/include -I/work/thirdparty/rapidjson/include -I/work/rabbitmq-fmu/src -I/work/thirdparty/rabbitmq-c/rabbitmq-c/librabbitmq -I/work/thirdparty/date/date -I/work/thirdparty/date/date/include -I/work/rabbitmq-core/src -isystem /work/thirdparty/googletest/googletest/include -isystem /work/thirdparty/googletest/googletest -isystem /work/thirdparty/external/linux-i386/include  -O2 -g -DNDEBUG   -std=gnu++1z -o CMakeFiles/it-test-rabbitmq.dir/src/message/MessageParser.cpp.o -c /work/rabbitmq-fmu/src/message/MessageParser.cpp
[ 81%] Linking CXX static library ../../../lib/libgmock_main.a
cd /work/build/linux-x86/thirdparty/googletest/googlemock && /usr/bin/cmake -P CMakeFiles/gmock_main.dir/cmake_clean_target.cmake
cd /work/build/linux-x86/thirdparty/googletest/googlemock && /usr/bin/cmake -E cmake_link_script CMakeFiles/gmock_main.dir/link.txt --verbose=1
/usr/i686-linux-gnu/bin/i686-linux-gnu-ar qc ../../../lib/libgmock_main.a  CMakeFiles/gmock_main.dir/src/gmock_main.cc.o
make[2]: Leaving directory '/work/build/linux-x86'
[ 81%] Built target gmock_main
[ 81%] Building CXX object rabbitmq-fmu/CMakeFiles/rabbitmq-main.dir/src/rabbitmq/RabbitmqHandler.cpp.o
cd /work/build/linux-x86/rabbitmq-fmu && /usr/i686-linux-gnu/bin/i686-linux-gnu-g++  -DAMQP_STATIC -DFMI_COSIMULATION -I/work/rabbitmq-fmu/../thirdparty/fmi/include -I/work/thirdparty/rapidjson/include -I/work/thirdparty/googletest/googletest/include -I/work/rabbitmq-fmu/src -I/work/thirdparty/rabbitmq-c/rabbitmq-c/librabbitmq -I/work/thirdparty/date/date -I/work/thirdparty/date/date/include -I/work/rabbitmq-core/src -isystem /work/thirdparty/external/linux-i386/include  -O2 -g -DNDEBUG   -std=gnu++1z -o CMakeFiles/rabbitmq-main.dir/src/rabbitmq/RabbitmqHandler.cpp.o -c /work/rabbitmq-fmu/src/rabbitmq/RabbitmqHandler.cpp
[ 84%] Building CXX object rabbitmq-fmu/CMakeFiles/rabbitmq-main.dir/src/main.cpp.o
[ 43%] Building CXX object rabbitmq-fmu/CMakeFiles/rabbitmq-main.dir/src/modeldescription/ModelDescriptionParser.cpp.obj
cd /work/build/win-x64/rabbitmq-fmu && /usr/src/mxe/usr/bin/x86_64-w64-mingw32.static-g++  -DAMQP_STATIC -DFMI_COSIMULATION @CMakeFiles/rabbitmq-main.dir/includes_CXX.rsp -O3 -DNDEBUG   -std=gnu++17 -o CMakeFiles/rabbitmq-main.dir/src/modeldescription/ModelDescriptionParser.cpp.obj -c /work/rabbitmq-fmu/src/modeldescription/ModelDescriptionParser.cpp
cd /work/build/linux-x86/rabbitmq-fmu && /usr/i686-linux-gnu/bin/i686-linux-gnu-g++  -DAMQP_STATIC -DFMI_COSIMULATION -I/work/rabbitmq-fmu/../thirdparty/fmi/include -I/work/thirdparty/rapidjson/include -I/work/thirdparty/googletest/googletest/include -I/work/rabbitmq-fmu/src -I/work/thirdparty/rabbitmq-c/rabbitmq-c/librabbitmq -I/work/thirdparty/date/date -I/work/thirdparty/date/date/include -I/work/rabbitmq-core/src -isystem /work/thirdparty/external/linux-i386/include  -O2 -g -DNDEBUG   -std=gnu++1z -o CMakeFiles/rabbitmq-main.dir/src/main.cpp.o -c /work/rabbitmq-fmu/src/main.cpp
[ 43%] Building CXX object rabbitmq-core/CMakeFiles/unit-test-rabbitmq-core.dir/test/FmuContainerCore_test.cpp.obj
cd /work/build/win-x64/rabbitmq-core && /usr/src/mxe/usr/bin/x86_64-w64-mingw32.static-g++   @CMakeFiles/unit-test-rabbitmq-core.dir/includes_CXX.rsp -O3 -DNDEBUG   -std=gnu++17 -o CMakeFiles/unit-test-rabbitmq-core.dir/test/FmuContainerCore_test.cpp.obj -c /work/rabbitmq-core/test/FmuContainerCore_test.cpp
[ 87%] Building CXX object rabbitmq-fmu/CMakeFiles/unit-test-rabbitmq.dir/test/message_parser_test.cpp.o
cd /work/build/linux-x86/rabbitmq-fmu && /usr/i686-linux-gnu/bin/i686-linux-gnu-g++  -DAMQP_STATIC -DFMI_COSIMULATION -I/work/rabbitmq-fmu/../thirdparty/fmi/include -I/work/thirdparty/rapidjson/include -I/work/rabbitmq-fmu/src -I/work/thirdparty/rabbitmq-c/rabbitmq-c/librabbitmq -I/work/thirdparty/date/date -I/work/thirdparty/date/date/include -I/work/rabbitmq-core/src -isystem /work/thirdparty/googletest/googletest/include -isystem /work/thirdparty/googletest/googletest -isystem /work/thirdparty/external/linux-i386/include  -O2 -g -DNDEBUG   -std=gnu++1z -o CMakeFiles/unit-test-rabbitmq.dir/test/message_parser_test.cpp.o -c /work/rabbitmq-fmu/test/message_parser_test.cpp
[ 45%] Building CXX object rabbitmq-fmu/CMakeFiles/rabbitmq-main.dir/src/rabbitmq/RabbitMqHandlerException.cpp.obj
cd /work/build/win-x64/rabbitmq-fmu && /usr/src/mxe/usr/bin/x86_64-w64-mingw32.static-g++  -DAMQP_STATIC -DFMI_COSIMULATION @CMakeFiles/rabbitmq-main.dir/includes_CXX.rsp -O3 -DNDEBUG   -std=gnu++17 -o CMakeFiles/rabbitmq-main.dir/src/rabbitmq/RabbitMqHandlerException.cpp.obj -c /work/rabbitmq-fmu/src/rabbitmq/RabbitMqHandlerException.cpp
[ 87%] Building CXX object rabbitmq-fmu/CMakeFiles/it-test-rabbitmq.dir/src/modeldescription/ModelDescriptionParser.cpp.o
cd /work/build/linux-x86/rabbitmq-fmu && /usr/i686-linux-gnu/bin/i686-linux-gnu-g++  -DAMQP_STATIC -DFMI_COSIMULATION -I/work/rabbitmq-fmu/../thirdparty/fmi/include -I/work/thirdparty/rapidjson/include -I/work/rabbitmq-fmu/src -I/work/thirdparty/rabbitmq-c/rabbitmq-c/librabbitmq -I/work/thirdparty/date/date -I/work/thirdparty/date/date/include -I/work/rabbitmq-core/src -isystem /work/thirdparty/googletest/googletest/include -isystem /work/thirdparty/googletest/googletest -isystem /work/thirdparty/external/linux-i386/include  -O2 -g -DNDEBUG   -std=gnu++1z -o CMakeFiles/it-test-rabbitmq.dir/src/modeldescription/ModelDescriptionParser.cpp.o -c /work/rabbitmq-fmu/src/modeldescription/ModelDescriptionParser.cpp
[ 87%] Building CXX object rabbitmq-fmu/CMakeFiles/it-test-rabbitmq.dir/src/rabbitmq/RabbitMqHandlerException.cpp.o
cd /work/build/linux-x86/rabbitmq-fmu && /usr/i686-linux-gnu/bin/i686-linux-gnu-g++  -DAMQP_STATIC -DFMI_COSIMULATION -I/work/rabbitmq-fmu/../thirdparty/fmi/include -I/work/thirdparty/rapidjson/include -I/work/rabbitmq-fmu/src -I/work/thirdparty/rabbitmq-c/rabbitmq-c/librabbitmq -I/work/thirdparty/date/date -I/work/thirdparty/date/date/include -I/work/rabbitmq-core/src -isystem /work/thirdparty/googletest/googletest/include -isystem /work/thirdparty/googletest/googletest -isystem /work/thirdparty/external/linux-i386/include  -O2 -g -DNDEBUG   -std=gnu++1z -o CMakeFiles/it-test-rabbitmq.dir/src/rabbitmq/RabbitMqHandlerException.cpp.o -c /work/rabbitmq-fmu/src/rabbitmq/RabbitMqHandlerException.cpp
[ 48%] Building CXX object rabbitmq-fmu/CMakeFiles/rabbitmq.dir/src/fmu.cpp.obj
cd /work/build/win-x64/rabbitmq-fmu && /usr/src/mxe/usr/bin/x86_64-w64-mingw32.static-g++  -DAMQP_STATIC -DFMI_COSIMULATION -Drabbitmq_EXPORTS @CMakeFiles/rabbitmq.dir/includes_CXX.rsp -O3 -DNDEBUG   -std=gnu++17 -o CMakeFiles/rabbitmq.dir/src/fmu.cpp.obj -c /work/rabbitmq-fmu/src/fmu.cpp
[ 51%] Linking CXX executable it-test-rabbitmq-core.exe
cd /work/build/win-x64/rabbitmq-core && /usr/src/mxe/usr/x86_64-pc-linux-gnu/bin/cmake -E cmake_link_script CMakeFiles/it-test-rabbitmq-core.dir/link.txt --verbose=1
[ 90%] Building CXX object rabbitmq-fmu/CMakeFiles/it-test-rabbitmq.dir/src/rabbitmq/RabbitmqHandler.cpp.o
cd /work/build/linux-x86/rabbitmq-fmu && /usr/i686-linux-gnu/bin/i686-linux-gnu-g++  -DAMQP_STATIC -DFMI_COSIMULATION -I/work/rabbitmq-fmu/../thirdparty/fmi/include -I/work/thirdparty/rapidjson/include -I/work/rabbitmq-fmu/src -I/work/thirdparty/rabbitmq-c/rabbitmq-c/librabbitmq -I/work/thirdparty/date/date -I/work/thirdparty/date/date/include -I/work/rabbitmq-core/src -isystem /work/thirdparty/googletest/googletest/include -isystem /work/thirdparty/googletest/googletest -isystem /work/thirdparty/external/linux-i386/include  -O2 -g -DNDEBUG   -std=gnu++1z -o CMakeFiles/it-test-rabbitmq.dir/src/rabbitmq/RabbitmqHandler.cpp.o -c /work/rabbitmq-fmu/src/rabbitmq/RabbitmqHandler.cpp
/usr/src/mxe/usr/x86_64-pc-linux-gnu/bin/cmake -E remove -f CMakeFiles/it-test-rabbitmq-core.dir/objects.a
/usr/src/mxe/usr/bin/x86_64-w64-mingw32.static-ar cr CMakeFiles/it-test-rabbitmq-core.dir/objects.a @CMakeFiles/it-test-rabbitmq-core.dir/objects1.rsp
/usr/src/mxe/usr/bin/x86_64-w64-mingw32.static-g++ -O3 -DNDEBUG   -Wl,--whole-archive CMakeFiles/it-test-rabbitmq-core.dir/objects.a -Wl,--no-whole-archive  -o it-test-rabbitmq-core.exe -Wl,--out-implib,libit-test-rabbitmq-core.dll.a -Wl,--major-image-version,0,--minor-image-version,0 @CMakeFiles/it-test-rabbitmq-core.dir/linklibs.rsp
[ 90%] Building CXX object rabbitmq-fmu/CMakeFiles/unit-test-rabbitmq.dir/test/modeldescription_test.cpp.o
cd /work/build/linux-x86/rabbitmq-fmu && /usr/i686-linux-gnu/bin/i686-linux-gnu-g++  -DAMQP_STATIC -DFMI_COSIMULATION -I/work/rabbitmq-fmu/../thirdparty/fmi/include -I/work/thirdparty/rapidjson/include -I/work/rabbitmq-fmu/src -I/work/thirdparty/rabbitmq-c/rabbitmq-c/librabbitmq -I/work/thirdparty/date/date -I/work/thirdparty/date/date/include -I/work/rabbitmq-core/src -isystem /work/thirdparty/googletest/googletest/include -isystem /work/thirdparty/googletest/googletest -isystem /work/thirdparty/external/linux-i386/include  -O2 -g -DNDEBUG   -std=gnu++1z -o CMakeFiles/unit-test-rabbitmq.dir/test/modeldescription_test.cpp.o -c /work/rabbitmq-fmu/test/modeldescription_test.cpp
make -f rabbitmq-fmu/CMakeFiles/unit-test-rabbitmq.dir/build.make rabbitmq-fmu/CMakeFiles/unit-test-rabbitmq.dir/depend
make[2]: Entering directory '/work/build/win-x64'
cd /work/build/win-x64 && /usr/src/mxe/usr/x86_64-pc-linux-gnu/bin/cmake -E cmake_depends "Unix Makefiles" /work /work/rabbitmq-fmu /work/build/win-x64 /work/build/win-x64/rabbitmq-fmu /work/build/win-x64/rabbitmq-fmu/CMakeFiles/unit-test-rabbitmq.dir/DependInfo.cmake --color=
make: Entering directory '/work/build/linux-x64/rabbitmq-fmu'
cd /work/build/linux-x64 && /usr/bin/cmake -S/work -B/work/build/linux-x64 --check-build-system CMakeFiles/Makefile.cmake 0
cd /work/build/linux-x64 && /usr/bin/cmake -E cmake_progress_start /work/build/linux-x64/CMakeFiles /work/build/linux-x64/rabbitmq-fmu/CMakeFiles/progress.marks
cd /work/build/linux-x64 && make -f CMakeFiles/Makefile2 rabbitmq-fmu/all
make[1]: Entering directory '/work/build/linux-x64'
make -f thirdparty/date/date/CMakeFiles/tz.dir/build.make thirdparty/date/date/CMakeFiles/tz.dir/depend
make[2]: Entering directory '/work/build/linux-x64'
cd /work/build/linux-x64 && /usr/bin/cmake -E cmake_depends "Unix Makefiles" /work /work/thirdparty/date/date /work/build/linux-x64 /work/build/linux-x64/thirdparty/date/date /work/build/linux-x64/thirdparty/date/date/CMakeFiles/tz.dir/DependInfo.cmake --color=
make[2]: Leaving directory '/work/build/linux-x64'
make -f thirdparty/date/date/CMakeFiles/tz.dir/build.make thirdparty/date/date/CMakeFiles/tz.dir/build
make[2]: Entering directory '/work/build/linux-x64'
make[2]: Nothing to be done for 'thirdparty/date/date/CMakeFiles/tz.dir/build'.
make[2]: Leaving directory '/work/build/linux-x64'
[  3%] Built target tz
make -f rabbitmq-core/CMakeFiles/rabbitmq-core.dir/build.make rabbitmq-core/CMakeFiles/rabbitmq-core.dir/depend
make[2]: Entering directory '/work/build/linux-x64'
cd /work/build/linux-x64 && /usr/bin/cmake -E cmake_depends "Unix Makefiles" /work /work/rabbitmq-core /work/build/linux-x64 /work/build/linux-x64/rabbitmq-core /work/build/linux-x64/rabbitmq-core/CMakeFiles/rabbitmq-core.dir/DependInfo.cmake --color=
make[2]: Leaving directory '/work/build/linux-x64'
make -f rabbitmq-core/CMakeFiles/rabbitmq-core.dir/build.make rabbitmq-core/CMakeFiles/rabbitmq-core.dir/build
make[2]: Entering directory '/work/build/linux-x64'
make[2]: Nothing to be done for 'rabbitmq-core/CMakeFiles/rabbitmq-core.dir/build'.
make[2]: Leaving directory '/work/build/linux-x64'
[  7%] Built target rabbitmq-core
make -f thirdparty/rabbitmq-c/rabbitmq-c/librabbitmq/CMakeFiles/rabbitmq-static.dir/build.make thirdparty/rabbitmq-c/rabbitmq-c/librabbitmq/CMakeFiles/rabbitmq-static.dir/depend
make[2]: Entering directory '/work/build/linux-x64'
cd /work/build/linux-x64 && /usr/bin/cmake -E cmake_depends "Unix Makefiles" /work /work/thirdparty/rabbitmq-c/rabbitmq-c/librabbitmq /work/build/linux-x64 /work/build/linux-x64/thirdparty/rabbitmq-c/rabbitmq-c/librabbitmq /work/build/linux-x64/thirdparty/rabbitmq-c/rabbitmq-c/librabbitmq/CMakeFiles/rabbitmq-static.dir/DependInfo.cmake --color=
make[2]: Leaving directory '/work/build/linux-x64'
make -f thirdparty/rabbitmq-c/rabbitmq-c/librabbitmq/CMakeFiles/rabbitmq-static.dir/build.make thirdparty/rabbitmq-c/rabbitmq-c/librabbitmq/CMakeFiles/rabbitmq-static.dir/build
make[2]: Entering directory '/work/build/linux-x64'
make[2]: Nothing to be done for 'thirdparty/rabbitmq-c/rabbitmq-c/librabbitmq/CMakeFiles/rabbitmq-static.dir/build'.
make[2]: Leaving directory '/work/build/linux-x64'
[ 25%] Built target rabbitmq-static
make -f rabbitmq-fmu/CMakeFiles/rabbitmq-main.dir/build.make rabbitmq-fmu/CMakeFiles/rabbitmq-main.dir/depend
make[2]: Entering directory '/work/build/linux-x64'
cd /work/build/linux-x64 && /usr/bin/cmake -E cmake_depends "Unix Makefiles" /work /work/rabbitmq-fmu /work/build/linux-x64 /work/build/linux-x64/rabbitmq-fmu /work/build/linux-x64/rabbitmq-fmu/CMakeFiles/rabbitmq-main.dir/DependInfo.cmake --color=
make[2]: Leaving directory '/work/build/linux-x64'
make -f rabbitmq-fmu/CMakeFiles/rabbitmq-main.dir/build.make rabbitmq-fmu/CMakeFiles/rabbitmq-main.dir/build
make[2]: Entering directory '/work/build/linux-x64'
make[2]: Nothing to be done for 'rabbitmq-fmu/CMakeFiles/rabbitmq-main.dir/build'.
make[2]: Leaving directory '/work/build/linux-x64'
[ 39%] Built target rabbitmq-main
make -f thirdparty/googletest/googletest/CMakeFiles/gtest.dir/build.make thirdparty/googletest/googletest/CMakeFiles/gtest.dir/depend
make[2]: Entering directory '/work/build/linux-x64'
cd /work/build/linux-x64 && /usr/bin/cmake -E cmake_depends "Unix Makefiles" /work /work/thirdparty/googletest/googletest /work/build/linux-x64 /work/build/linux-x64/thirdparty/googletest/googletest /work/build/linux-x64/thirdparty/googletest/googletest/CMakeFiles/gtest.dir/DependInfo.cmake --color=
make[2]: Leaving directory '/work/build/linux-x64'
make -f thirdparty/googletest/googletest/CMakeFiles/gtest.dir/build.make thirdparty/googletest/googletest/CMakeFiles/gtest.dir/build
make[2]: Entering directory '/work/build/linux-x64'
make[2]: Nothing to be done for 'thirdparty/googletest/googletest/CMakeFiles/gtest.dir/build'.
make[2]: Leaving directory '/work/build/linux-x64'
[ 42%] Built target gtest
make -f thirdparty/googletest/googletest/CMakeFiles/gtest_main.dir/build.make thirdparty/googletest/googletest/CMakeFiles/gtest_main.dir/depend
make[2]: Entering directory '/work/build/linux-x64'
cd /work/build/linux-x64 && /usr/bin/cmake -E cmake_depends "Unix Makefiles" /work /work/thirdparty/googletest/googletest /work/build/linux-x64 /work/build/linux-x64/thirdparty/googletest/googletest /work/build/linux-x64/thirdparty/googletest/googletest/CMakeFiles/gtest_main.dir/DependInfo.cmake --color=
make[2]: Leaving directory '/work/build/linux-x64'
make -f thirdparty/googletest/googletest/CMakeFiles/gtest_main.dir/build.make thirdparty/googletest/googletest/CMakeFiles/gtest_main.dir/build
make[2]: Entering directory '/work/build/linux-x64'
make[2]: Nothing to be done for 'thirdparty/googletest/googletest/CMakeFiles/gtest_main.dir/build'.
make[2]: Leaving directory '/work/build/linux-x64'
[ 46%] Built target gtest_main
make -f rabbitmq-fmu/CMakeFiles/unit-test-rabbitmq.dir/build.make rabbitmq-fmu/CMakeFiles/unit-test-rabbitmq.dir/depend
make[2]: Entering directory '/work/build/linux-x64'
cd /work/build/linux-x64 && /usr/bin/cmake -E cmake_depends "Unix Makefiles" /work /work/rabbitmq-fmu /work/build/linux-x64 /work/build/linux-x64/rabbitmq-fmu /work/build/linux-x64/rabbitmq-fmu/CMakeFiles/unit-test-rabbitmq.dir/DependInfo.cmake --color=
make[2]: Leaving directory '/work/build/linux-x64'
make -f rabbitmq-fmu/CMakeFiles/unit-test-rabbitmq.dir/build.make rabbitmq-fmu/CMakeFiles/unit-test-rabbitmq.dir/build
make[2]: Entering directory '/work/build/linux-x64'
make[2]: Nothing to be done for 'rabbitmq-fmu/CMakeFiles/unit-test-rabbitmq.dir/build'.
make[2]: Leaving directory '/work/build/linux-x64'
[ 67%] Built target unit-test-rabbitmq
make -f rabbitmq-fmu/CMakeFiles/it-test-rabbitmq.dir/build.make rabbitmq-fmu/CMakeFiles/it-test-rabbitmq.dir/depend
make[2]: Entering directory '/work/build/linux-x64'
cd /work/build/linux-x64 && /usr/bin/cmake -E cmake_depends "Unix Makefiles" /work /work/rabbitmq-fmu /work/build/linux-x64 /work/build/linux-x64/rabbitmq-fmu /work/build/linux-x64/rabbitmq-fmu/CMakeFiles/it-test-rabbitmq.dir/DependInfo.cmake --color=
make[2]: Leaving directory '/work/build/linux-x64'
make -f rabbitmq-fmu/CMakeFiles/it-test-rabbitmq.dir/build.make rabbitmq-fmu/CMakeFiles/it-test-rabbitmq.dir/build
make[2]: Entering directory '/work/build/linux-x64'
make[2]: Nothing to be done for 'rabbitmq-fmu/CMakeFiles/it-test-rabbitmq.dir/build'.
make[2]: Leaving directory '/work/build/linux-x64'
[ 85%] Built target it-test-rabbitmq
make -f rabbitmq-fmu/CMakeFiles/rabbitmq.dir/build.make rabbitmq-fmu/CMakeFiles/rabbitmq.dir/depend
make[2]: Entering directory '/work/build/linux-x64'
cd /work/build/linux-x64 && /usr/bin/cmake -E cmake_depends "Unix Makefiles" /work /work/rabbitmq-fmu /work/build/linux-x64 /work/build/linux-x64/rabbitmq-fmu /work/build/linux-x64/rabbitmq-fmu/CMakeFiles/rabbitmq.dir/DependInfo.cmake --color=
make[2]: Leaving directory '/work/build/linux-x64'
make -f rabbitmq-fmu/CMakeFiles/rabbitmq.dir/build.make rabbitmq-fmu/CMakeFiles/rabbitmq.dir/build
make[2]: Entering directory '/work/build/linux-x64'
make[2]: Nothing to be done for 'rabbitmq-fmu/CMakeFiles/rabbitmq.dir/build'.
make[2]: Leaving directory '/work/build/linux-x64'
[100%] Built target rabbitmq
make[1]: Leaving directory '/work/build/linux-x64'
/usr/bin/cmake -E cmake_progress_start /work/build/linux-x64/CMakeFiles 0
cd /work/build/linux-x64 && make -f CMakeFiles/Makefile2 rabbitmq-fmu/preinstall
make[1]: Entering directory '/work/build/linux-x64'
make[1]: Nothing to be done for 'rabbitmq-fmu/preinstall'.
make[1]: Leaving directory '/work/build/linux-x64'
Install the project...
/usr/bin/cmake -P cmake_install.cmake
-- Install configuration: "RelWithDebInfo"
-- Installing: /work/build/install/rabbitmqfmu/binaries/linux64/rabbitmq.so
-- Set runtime path of "/work/build/install/rabbitmqfmu/binaries/linux64/rabbitmq.so" to ""
-- Installing: /work/build/install/rabbitmqfmu/resources/modelDescription.xml
-- Installing: /work/build/install/rabbitmqfmu/modelDescription.xml
make: Leaving directory '/work/build/linux-x64/rabbitmq-fmu'
[ 51%] Building CXX object rabbitmq-fmu/CMakeFiles/rabbitmq-main.dir/src/rabbitmq/RabbitmqHandler.cpp.obj
cd /work/build/win-x64/rabbitmq-fmu && /usr/src/mxe/usr/bin/x86_64-w64-mingw32.static-g++  -DAMQP_STATIC -DFMI_COSIMULATION @CMakeFiles/rabbitmq-main.dir/includes_CXX.rsp -O3 -DNDEBUG   -std=gnu++17 -o CMakeFiles/rabbitmq-main.dir/src/rabbitmq/RabbitmqHandler.cpp.obj -c /work/rabbitmq-fmu/src/rabbitmq/RabbitmqHandler.cpp
Scanning dependencies of target unit-test-rabbitmq
make[2]: Leaving directory '/work/build/win-x64'
make -f rabbitmq-fmu/CMakeFiles/unit-test-rabbitmq.dir/build.make rabbitmq-fmu/CMakeFiles/unit-test-rabbitmq.dir/build
make[2]: Entering directory '/work/build/win-x64'
[ 51%] Building C object rabbitmq-fmu/CMakeFiles/unit-test-rabbitmq.dir/src/uri.c.obj
cd /work/build/win-x64/rabbitmq-fmu && /usr/src/mxe/usr/bin/x86_64-w64-mingw32.static-gcc -DAMQP_STATIC -DFMI_COSIMULATION @CMakeFiles/unit-test-rabbitmq.dir/includes_C.rsp -O3 -DNDEBUG   -o CMakeFiles/unit-test-rabbitmq.dir/src/uri.c.obj   -c /work/rabbitmq-fmu/src/uri.c
[ 93%] Linking CXX executable unit-test-rabbitmq-core
cd /work/build/linux-x86/rabbitmq-core && /usr/bin/cmake -E cmake_link_script CMakeFiles/unit-test-rabbitmq-core.dir/link.txt --verbose=1
/usr/i686-linux-gnu/bin/i686-linux-gnu-g++  -O2 -g -DNDEBUG   CMakeFiles/unit-test-rabbitmq-core.dir/src/FmuContainerCore.cpp.o CMakeFiles/unit-test-rabbitmq-core.dir/test/FmuContainerCore_test.cpp.o  -o unit-test-rabbitmq-core ../lib/libgtest_main.a ../thirdparty/date/date/libtz.a ../lib/libgtest.a -lpthread 
[ 54%] Building CXX object rabbitmq-fmu/CMakeFiles/unit-test-rabbitmq.dir/src/FmuContainer.cpp.obj
cd /work/build/win-x64/rabbitmq-fmu && /usr/src/mxe/usr/bin/x86_64-w64-mingw32.static-g++  -DAMQP_STATIC -DFMI_COSIMULATION @CMakeFiles/unit-test-rabbitmq.dir/includes_CXX.rsp -O3 -DNDEBUG   -std=gnu++17 -o CMakeFiles/unit-test-rabbitmq.dir/src/FmuContainer.cpp.obj -c /work/rabbitmq-fmu/src/FmuContainer.cpp
[ 56%] Building CXX object rabbitmq-fmu/CMakeFiles/rabbitmq.dir/src/modeldescription/ModelDescriptionParser.cpp.obj
[ 56%] Building CXX object rabbitmq-fmu/CMakeFiles/rabbitmq.dir/src/message/MessageParser.cpp.obj
cd /work/build/win-x64/rabbitmq-fmu && /usr/src/mxe/usr/bin/x86_64-w64-mingw32.static-g++  -DAMQP_STATIC -DFMI_COSIMULATION -Drabbitmq_EXPORTS @CMakeFiles/rabbitmq.dir/includes_CXX.rsp -O3 -DNDEBUG   -std=gnu++17 -o CMakeFiles/rabbitmq.dir/src/message/MessageParser.cpp.obj -c /work/rabbitmq-fmu/src/message/MessageParser.cpp
cd /work/build/win-x64/rabbitmq-fmu && /usr/src/mxe/usr/bin/x86_64-w64-mingw32.static-g++  -DAMQP_STATIC -DFMI_COSIMULATION -Drabbitmq_EXPORTS @CMakeFiles/rabbitmq.dir/includes_CXX.rsp -O3 -DNDEBUG   -std=gnu++17 -o CMakeFiles/rabbitmq.dir/src/modeldescription/ModelDescriptionParser.cpp.obj -c /work/rabbitmq-fmu/src/modeldescription/ModelDescriptionParser.cpp
make[2]: Leaving directory '/work/build/win-x64'
[ 56%] Built target it-test-rabbitmq-core
[ 56%] Building CXX object rabbitmq-fmu/CMakeFiles/rabbitmq.dir/src/rabbitmq/RabbitMqHandlerException.cpp.obj
cd /work/build/win-x64/rabbitmq-fmu && /usr/src/mxe/usr/bin/x86_64-w64-mingw32.static-g++  -DAMQP_STATIC -DFMI_COSIMULATION -Drabbitmq_EXPORTS @CMakeFiles/rabbitmq.dir/includes_CXX.rsp -O3 -DNDEBUG   -std=gnu++17 -o CMakeFiles/rabbitmq.dir/src/rabbitmq/RabbitMqHandlerException.cpp.obj -c /work/rabbitmq-fmu/src/rabbitmq/RabbitMqHandlerException.cpp
[ 93%] Building CXX object rabbitmq-fmu/CMakeFiles/unit-test-rabbitmq.dir/test/timetamp_test.cpp.o
cd /work/build/linux-x86/rabbitmq-fmu && /usr/i686-linux-gnu/bin/i686-linux-gnu-g++  -DAMQP_STATIC -DFMI_COSIMULATION -I/work/rabbitmq-fmu/../thirdparty/fmi/include -I/work/thirdparty/rapidjson/include -I/work/rabbitmq-fmu/src -I/work/thirdparty/rabbitmq-c/rabbitmq-c/librabbitmq -I/work/thirdparty/date/date -I/work/thirdparty/date/date/include -I/work/rabbitmq-core/src -isystem /work/thirdparty/googletest/googletest/include -isystem /work/thirdparty/googletest/googletest -isystem /work/thirdparty/external/linux-i386/include  -O2 -g -DNDEBUG   -std=gnu++1z -o CMakeFiles/unit-test-rabbitmq.dir/test/timetamp_test.cpp.o -c /work/rabbitmq-fmu/test/timetamp_test.cpp
make[2]: Leaving directory '/work/build/linux-x86'
[ 93%] Built target unit-test-rabbitmq-core
[ 96%] Building CXX object rabbitmq-fmu/CMakeFiles/unit-test-rabbitmq.dir/test/xml_test.cpp.o
cd /work/build/linux-x86/rabbitmq-fmu && /usr/i686-linux-gnu/bin/i686-linux-gnu-g++  -DAMQP_STATIC -DFMI_COSIMULATION -I/work/rabbitmq-fmu/../thirdparty/fmi/include -I/work/thirdparty/rapidjson/include -I/work/rabbitmq-fmu/src -I/work/thirdparty/rabbitmq-c/rabbitmq-c/librabbitmq -I/work/thirdparty/date/date -I/work/thirdparty/date/date/include -I/work/rabbitmq-core/src -isystem /work/thirdparty/googletest/googletest/include -isystem /work/thirdparty/googletest/googletest -isystem /work/thirdparty/external/linux-i386/include  -O2 -g -DNDEBUG   -std=gnu++1z -o CMakeFiles/unit-test-rabbitmq.dir/test/xml_test.cpp.o -c /work/rabbitmq-fmu/test/xml_test.cpp
Done
[Pipeline] dir
Running in /var/lib/jenkins/workspace/rabbitmq-fmu_kgl_tla-test/build/linux-x64/rabbitmq-fmu
[Pipeline] {
[ 56%] Building CXX object rabbitmq-fmu/CMakeFiles/unit-test-rabbitmq.dir/src/Iso8601TimeParser.cpp.obj
cd /work/build/win-x64/rabbitmq-fmu && /usr/src/mxe/usr/bin/x86_64-w64-mingw32.static-g++  -DAMQP_STATIC -DFMI_COSIMULATION @CMakeFiles/unit-test-rabbitmq.dir/includes_CXX.rsp -O3 -DNDEBUG   -std=gnu++17 -o CMakeFiles/unit-test-rabbitmq.dir/src/Iso8601TimeParser.cpp.obj -c /work/rabbitmq-fmu/src/Iso8601TimeParser.cpp
[Pipeline] script
[Pipeline] {
[Pipeline] sh
+ ./unit-test-rabbitmq
./unit-test-rabbitmq: error while loading shared libraries: librabbitmq-core.so: cannot open shared object file: No such file or directory
[Pipeline] }
[Pipeline] // script
[Pipeline] }
[Pipeline] // dir
[Pipeline] }
[Pipeline] // stage
[Pipeline] }
Failed in branch Xcompile linux64
[ 59%] Building CXX object rabbitmq-fmu/CMakeFiles/rabbitmq-main.dir/src/main.cpp.obj
cd /work/build/win-x64/rabbitmq-fmu && /usr/src/mxe/usr/bin/x86_64-w64-mingw32.static-g++  -DAMQP_STATIC -DFMI_COSIMULATION @CMakeFiles/rabbitmq-main.dir/includes_CXX.rsp -O3 -DNDEBUG   -std=gnu++17 -o CMakeFiles/rabbitmq-main.dir/src/main.cpp.obj -c /work/rabbitmq-fmu/src/main.cpp
make -f rabbitmq-fmu/CMakeFiles/it-test-rabbitmq.dir/build.make rabbitmq-fmu/CMakeFiles/it-test-rabbitmq.dir/depend
make[2]: Entering directory '/work/build/win-x64'
cd /work/build/win-x64 && /usr/src/mxe/usr/x86_64-pc-linux-gnu/bin/cmake -E cmake_depends "Unix Makefiles" /work /work/rabbitmq-fmu /work/build/win-x64 /work/build/win-x64/rabbitmq-fmu /work/build/win-x64/rabbitmq-fmu/CMakeFiles/it-test-rabbitmq.dir/DependInfo.cmake --color=
[ 96%] Building CXX object rabbitmq-fmu/CMakeFiles/it-test-rabbitmq.dir/test/fmu_test_it.cpp.o
cd /work/build/linux-x86/rabbitmq-fmu && /usr/i686-linux-gnu/bin/i686-linux-gnu-g++  -DAMQP_STATIC -DFMI_COSIMULATION -I/work/rabbitmq-fmu/../thirdparty/fmi/include -I/work/thirdparty/rapidjson/include -I/work/rabbitmq-fmu/src -I/work/thirdparty/rabbitmq-c/rabbitmq-c/librabbitmq -I/work/thirdparty/date/date -I/work/thirdparty/date/date/include -I/work/rabbitmq-core/src -isystem /work/thirdparty/googletest/googletest/include -isystem /work/thirdparty/googletest/googletest -isystem /work/thirdparty/external/linux-i386/include  -O2 -g -DNDEBUG   -std=gnu++1z -o CMakeFiles/it-test-rabbitmq.dir/test/fmu_test_it.cpp.o -c /work/rabbitmq-fmu/test/fmu_test_it.cpp
Scanning dependencies of target it-test-rabbitmq
make[2]: Leaving directory '/work/build/win-x64'
make -f rabbitmq-fmu/CMakeFiles/it-test-rabbitmq.dir/build.make rabbitmq-fmu/CMakeFiles/it-test-rabbitmq.dir/build
make[2]: Entering directory '/work/build/win-x64'
[ 59%] Building C object rabbitmq-fmu/CMakeFiles/it-test-rabbitmq.dir/src/uri.c.obj
cd /work/build/win-x64/rabbitmq-fmu && /usr/src/mxe/usr/bin/x86_64-w64-mingw32.static-gcc -DAMQP_STATIC -DFMI_COSIMULATION @CMakeFiles/it-test-rabbitmq.dir/includes_C.rsp -O3 -DNDEBUG   -o CMakeFiles/it-test-rabbitmq.dir/src/uri.c.obj   -c /work/rabbitmq-fmu/src/uri.c
[ 62%] Building CXX object rabbitmq-fmu/CMakeFiles/unit-test-rabbitmq.dir/src/fmu.cpp.obj
cd /work/build/win-x64/rabbitmq-fmu && /usr/src/mxe/usr/bin/x86_64-w64-mingw32.static-g++  -DAMQP_STATIC -DFMI_COSIMULATION @CMakeFiles/unit-test-rabbitmq.dir/includes_CXX.rsp -O3 -DNDEBUG   -std=gnu++17 -o CMakeFiles/unit-test-rabbitmq.dir/src/fmu.cpp.obj -c /work/rabbitmq-fmu/src/fmu.cpp
[100%] Building CXX object rabbitmq-fmu/CMakeFiles/it-test-rabbitmq.dir/test/rabbitmq_test_it.cpp.o
cd /work/build/linux-x86/rabbitmq-fmu && /usr/i686-linux-gnu/bin/i686-linux-gnu-g++  -DAMQP_STATIC -DFMI_COSIMULATION -I/work/rabbitmq-fmu/../thirdparty/fmi/include -I/work/thirdparty/rapidjson/include -I/work/rabbitmq-fmu/src -I/work/thirdparty/rabbitmq-c/rabbitmq-c/librabbitmq -I/work/thirdparty/date/date -I/work/thirdparty/date/date/include -I/work/rabbitmq-core/src -isystem /work/thirdparty/googletest/googletest/include -isystem /work/thirdparty/googletest/googletest -isystem /work/thirdparty/external/linux-i386/include  -O2 -g -DNDEBUG   -std=gnu++1z -o CMakeFiles/it-test-rabbitmq.dir/test/rabbitmq_test_it.cpp.o -c /work/rabbitmq-fmu/test/rabbitmq_test_it.cpp
[100%] Building CXX object rabbitmq-fmu/CMakeFiles/it-test-rabbitmq.dir/test/rabbitmqhandler_test_it.cpp.o
cd /work/build/linux-x86/rabbitmq-fmu && /usr/i686-linux-gnu/bin/i686-linux-gnu-g++  -DAMQP_STATIC -DFMI_COSIMULATION -I/work/rabbitmq-fmu/../thirdparty/fmi/include -I/work/thirdparty/rapidjson/include -I/work/rabbitmq-fmu/src -I/work/thirdparty/rabbitmq-c/rabbitmq-c/librabbitmq -I/work/thirdparty/date/date -I/work/thirdparty/date/date/include -I/work/rabbitmq-core/src -isystem /work/thirdparty/googletest/googletest/include -isystem /work/thirdparty/googletest/googletest -isystem /work/thirdparty/external/linux-i386/include  -O2 -g -DNDEBUG   -std=gnu++1z -o CMakeFiles/it-test-rabbitmq.dir/test/rabbitmqhandler_test_it.cpp.o -c /work/rabbitmq-fmu/test/rabbitmqhandler_test_it.cpp
[ 64%] Building CXX object rabbitmq-fmu/CMakeFiles/it-test-rabbitmq.dir/src/FmuContainer.cpp.obj
cd /work/build/win-x64/rabbitmq-fmu && /usr/src/mxe/usr/bin/x86_64-w64-mingw32.static-g++  -DAMQP_STATIC -DFMI_COSIMULATION @CMakeFiles/it-test-rabbitmq.dir/includes_CXX.rsp -O3 -DNDEBUG   -std=gnu++17 -o CMakeFiles/it-test-rabbitmq.dir/src/FmuContainer.cpp.obj -c /work/rabbitmq-fmu/src/FmuContainer.cpp
[100%] Linking CXX executable rabbitmq-main
cd /work/build/linux-x86/rabbitmq-fmu && /usr/bin/cmake -E cmake_link_script CMakeFiles/rabbitmq-main.dir/link.txt --verbose=1
/usr/i686-linux-gnu/bin/i686-linux-gnu-g++  -O2 -g -DNDEBUG   CMakeFiles/rabbitmq-main.dir/src/uri.c.o CMakeFiles/rabbitmq-main.dir/src/FmuContainer.cpp.o CMakeFiles/rabbitmq-main.dir/src/Iso8601TimeParser.cpp.o CMakeFiles/rabbitmq-main.dir/src/fmu.cpp.o CMakeFiles/rabbitmq-main.dir/src/message/MessageParser.cpp.o CMakeFiles/rabbitmq-main.dir/src/modeldescription/ModelDescriptionParser.cpp.o CMakeFiles/rabbitmq-main.dir/src/rabbitmq/RabbitMqHandlerException.cpp.o CMakeFiles/rabbitmq-main.dir/src/rabbitmq/RabbitmqHandler.cpp.o CMakeFiles/rabbitmq-main.dir/src/main.cpp.o  -o rabbitmq-main -Wl,-rpath,/work/build/linux-x86/rabbitmq-core ../thirdparty/rabbitmq-c/rabbitmq-c/librabbitmq/librabbitmq.a ../thirdparty/date/date/libtz.a ../rabbitmq-core/librabbitmq-core.so ../../../thirdparty/external/linux-i386/lib/libxerces-c-3.2.a -lrt ../thirdparty/date/date/libtz.a -lpthread 
[100%] Linking CXX executable unit-test-rabbitmq
cd /work/build/linux-x86/rabbitmq-fmu && /usr/bin/cmake -E cmake_link_script CMakeFiles/unit-test-rabbitmq.dir/link.txt --verbose=1
/usr/i686-linux-gnu/bin/i686-linux-gnu-g++  -O2 -g -DNDEBUG   CMakeFiles/unit-test-rabbitmq.dir/src/uri.c.o CMakeFiles/unit-test-rabbitmq.dir/src/FmuContainer.cpp.o CMakeFiles/unit-test-rabbitmq.dir/src/Iso8601TimeParser.cpp.o CMakeFiles/unit-test-rabbitmq.dir/src/fmu.cpp.o CMakeFiles/unit-test-rabbitmq.dir/src/message/MessageParser.cpp.o CMakeFiles/unit-test-rabbitmq.dir/src/modeldescription/ModelDescriptionParser.cpp.o CMakeFiles/unit-test-rabbitmq.dir/src/rabbitmq/RabbitMqHandlerException.cpp.o CMakeFiles/unit-test-rabbitmq.dir/src/rabbitmq/RabbitmqHandler.cpp.o CMakeFiles/unit-test-rabbitmq.dir/test/FmuContainer_test.cpp.o CMakeFiles/unit-test-rabbitmq.dir/test/json_test.cpp.o CMakeFiles/unit-test-rabbitmq.dir/test/message_parser_test.cpp.o CMakeFiles/unit-test-rabbitmq.dir/test/modeldescription_test.cpp.o CMakeFiles/unit-test-rabbitmq.dir/test/timetamp_test.cpp.o CMakeFiles/unit-test-rabbitmq.dir/test/xml_test.cpp.o  -o unit-test-rabbitmq -Wl,-rpath,/work/build/linux-x86/rabbitmq-core ../lib/libgtest_main.a ../thirdparty/rabbitmq-c/rabbitmq-c/librabbitmq/librabbitmq.a ../thirdparty/date/date/libtz.a ../rabbitmq-core/librabbitmq-core.so ../lib/libgtest.a ../../../thirdparty/external/linux-i386/lib/libxerces-c-3.2.a -lrt ../thirdparty/date/date/libtz.a -lpthread 
[ 67%] Linking CXX executable unit-test-rabbitmq-core.exe
cd /work/build/win-x64/rabbitmq-core && /usr/src/mxe/usr/x86_64-pc-linux-gnu/bin/cmake -E cmake_link_script CMakeFiles/unit-test-rabbitmq-core.dir/link.txt --verbose=1
/usr/src/mxe/usr/x86_64-pc-linux-gnu/bin/cmake -E remove -f CMakeFiles/unit-test-rabbitmq-core.dir/objects.a
/usr/src/mxe/usr/bin/x86_64-w64-mingw32.static-ar cr CMakeFiles/unit-test-rabbitmq-core.dir/objects.a @CMakeFiles/unit-test-rabbitmq-core.dir/objects1.rsp
/usr/src/mxe/usr/bin/x86_64-w64-mingw32.static-g++ -O3 -DNDEBUG   -Wl,--whole-archive CMakeFiles/unit-test-rabbitmq-core.dir/objects.a -Wl,--no-whole-archive  -o unit-test-rabbitmq-core.exe -Wl,--out-implib,libunit-test-rabbitmq-core.dll.a -Wl,--major-image-version,0,--minor-image-version,0 @CMakeFiles/unit-test-rabbitmq-core.dir/linklibs.rsp
make[2]: Leaving directory '/work/build/linux-x86'
[100%] Built target rabbitmq-main
[100%] Linking CXX executable it-test-rabbitmq
cd /work/build/linux-x86/rabbitmq-fmu && /usr/bin/cmake -E cmake_link_script CMakeFiles/it-test-rabbitmq.dir/link.txt --verbose=1
/usr/i686-linux-gnu/bin/i686-linux-gnu-g++  -O2 -g -DNDEBUG   CMakeFiles/it-test-rabbitmq.dir/src/uri.c.o CMakeFiles/it-test-rabbitmq.dir/src/FmuContainer.cpp.o CMakeFiles/it-test-rabbitmq.dir/src/Iso8601TimeParser.cpp.o CMakeFiles/it-test-rabbitmq.dir/src/fmu.cpp.o CMakeFiles/it-test-rabbitmq.dir/src/message/MessageParser.cpp.o CMakeFiles/it-test-rabbitmq.dir/src/modeldescription/ModelDescriptionParser.cpp.o CMakeFiles/it-test-rabbitmq.dir/src/rabbitmq/RabbitMqHandlerException.cpp.o CMakeFiles/it-test-rabbitmq.dir/src/rabbitmq/RabbitmqHandler.cpp.o CMakeFiles/it-test-rabbitmq.dir/test/fmu_test_it.cpp.o CMakeFiles/it-test-rabbitmq.dir/test/rabbitmq_test_it.cpp.o CMakeFiles/it-test-rabbitmq.dir/test/rabbitmqhandler_test_it.cpp.o  -o it-test-rabbitmq -Wl,-rpath,/work/build/linux-x86/rabbitmq-core ../lib/libgtest_main.a ../thirdparty/rabbitmq-c/rabbitmq-c/librabbitmq/librabbitmq.a ../thirdparty/date/date/libtz.a ../rabbitmq-core/librabbitmq-core.so ../lib/libgtest.a ../../../thirdparty/external/linux-i386/lib/libxerces-c-3.2.a -lrt ../thirdparty/date/date/libtz.a -lpthread 
make[2]: Leaving directory '/work/build/linux-x86'
[100%] Built target unit-test-rabbitmq
make[2]: Leaving directory '/work/build/win-x64'
[ 67%] Built target unit-test-rabbitmq-core
[ 67%] Building CXX object rabbitmq-fmu/CMakeFiles/unit-test-rabbitmq.dir/src/message/MessageParser.cpp.obj
cd /work/build/win-x64/rabbitmq-fmu && /usr/src/mxe/usr/bin/x86_64-w64-mingw32.static-g++  -DAMQP_STATIC -DFMI_COSIMULATION @CMakeFiles/unit-test-rabbitmq.dir/includes_CXX.rsp -O3 -DNDEBUG   -std=gnu++17 -o CMakeFiles/unit-test-rabbitmq.dir/src/message/MessageParser.cpp.obj -c /work/rabbitmq-fmu/src/message/MessageParser.cpp
make[2]: Leaving directory '/work/build/linux-x86'
[100%] Built target it-test-rabbitmq
make[1]: Leaving directory '/work/build/linux-x86'
/usr/bin/cmake -E cmake_progress_start /work/build/linux-x86/CMakeFiles 0
make: Leaving directory '/work/build/linux-x86'
[ 67%] Building CXX object rabbitmq-fmu/CMakeFiles/it-test-rabbitmq.dir/src/Iso8601TimeParser.cpp.obj
cd /work/build/win-x64/rabbitmq-fmu && /usr/src/mxe/usr/bin/x86_64-w64-mingw32.static-g++  -DAMQP_STATIC -DFMI_COSIMULATION @CMakeFiles/it-test-rabbitmq.dir/includes_CXX.rsp -O3 -DNDEBUG   -std=gnu++17 -o CMakeFiles/it-test-rabbitmq.dir/src/Iso8601TimeParser.cpp.obj -c /work/rabbitmq-fmu/src/Iso8601TimeParser.cpp
make -f thirdparty/googletest/googlemock/CMakeFiles/gmock_main.dir/build.make thirdparty/googletest/googlemock/CMakeFiles/gmock_main.dir/depend
[ 70%] Building CXX object rabbitmq-fmu/CMakeFiles/rabbitmq.dir/src/rabbitmq/RabbitmqHandler.cpp.obj
cd /work/build/win-x64/rabbitmq-fmu && /usr/src/mxe/usr/bin/x86_64-w64-mingw32.static-g++  -DAMQP_STATIC -DFMI_COSIMULATION -Drabbitmq_EXPORTS @CMakeFiles/rabbitmq.dir/includes_CXX.rsp -O3 -DNDEBUG   -std=gnu++17 -o CMakeFiles/rabbitmq.dir/src/rabbitmq/RabbitmqHandler.cpp.obj -c /work/rabbitmq-fmu/src/rabbitmq/RabbitmqHandler.cpp
[ 70%] Linking CXX executable rabbitmq-main.exe
cd /work/build/win-x64/rabbitmq-fmu && /usr/src/mxe/usr/x86_64-pc-linux-gnu/bin/cmake -E cmake_link_script CMakeFiles/rabbitmq-main.dir/link.txt --verbose=1
[ 72%] Building CXX object rabbitmq-fmu/CMakeFiles/unit-test-rabbitmq.dir/src/modeldescription/ModelDescriptionParser.cpp.obj
cd /work/build/win-x64/rabbitmq-fmu && /usr/src/mxe/usr/bin/x86_64-w64-mingw32.static-g++  -DAMQP_STATIC -DFMI_COSIMULATION @CMakeFiles/unit-test-rabbitmq.dir/includes_CXX.rsp -O3 -DNDEBUG   -std=gnu++17 -o CMakeFiles/unit-test-rabbitmq.dir/src/modeldescription/ModelDescriptionParser.cpp.obj -c /work/rabbitmq-fmu/src/modeldescription/ModelDescriptionParser.cpp
[ 75%] Building CXX object rabbitmq-fmu/CMakeFiles/it-test-rabbitmq.dir/src/fmu.cpp.obj
cd /work/build/win-x64/rabbitmq-fmu && /usr/src/mxe/usr/bin/x86_64-w64-mingw32.static-g++  -DAMQP_STATIC -DFMI_COSIMULATION @CMakeFiles/it-test-rabbitmq.dir/includes_CXX.rsp -O3 -DNDEBUG   -std=gnu++17 -o CMakeFiles/it-test-rabbitmq.dir/src/fmu.cpp.obj -c /work/rabbitmq-fmu/src/fmu.cpp
make[2]: Entering directory '/work/build/win-x64'
cd /work/build/win-x64 && /usr/src/mxe/usr/x86_64-pc-linux-gnu/bin/cmake -E cmake_depends "Unix Makefiles" /work /work/thirdparty/googletest/googlemock /work/build/win-x64 /work/build/win-x64/thirdparty/googletest/googlemock /work/build/win-x64/thirdparty/googletest/googlemock/CMakeFiles/gmock_main.dir/DependInfo.cmake --color=
/usr/src/mxe/usr/x86_64-pc-linux-gnu/bin/cmake -E remove -f CMakeFiles/rabbitmq-main.dir/objects.a
/usr/src/mxe/usr/bin/x86_64-w64-mingw32.static-ar cr CMakeFiles/rabbitmq-main.dir/objects.a @CMakeFiles/rabbitmq-main.dir/objects1.rsp
Scanning dependencies of target gmock_main
make[2]: Leaving directory '/work/build/win-x64'
make -f thirdparty/googletest/googlemock/CMakeFiles/gmock_main.dir/build.make thirdparty/googletest/googlemock/CMakeFiles/gmock_main.dir/build
make[2]: Entering directory '/work/build/win-x64'
[ 75%] Building CXX object thirdparty/googletest/googlemock/CMakeFiles/gmock_main.dir/src/gmock_main.cc.obj
cd /work/build/win-x64/thirdparty/googletest/googlemock && /usr/src/mxe/usr/bin/x86_64-w64-mingw32.static-g++   @CMakeFiles/gmock_main.dir/includes_CXX.rsp -O3 -DNDEBUG   -Wall -Wshadow -Werror -Wno-error=dangling-else -DGTEST_HAS_PTHREAD=0 -fexceptions -Wextra -Wno-unused-parameter -Wno-missing-field-initializers -std=c++11 -o CMakeFiles/gmock_main.dir/src/gmock_main.cc.obj -c /work/thirdparty/googletest/googlemock/src/gmock_main.cc
/usr/src/mxe/usr/bin/x86_64-w64-mingw32.static-g++ -O3 -DNDEBUG   -static-libstdc++ -static-libgcc -Wl,--whole-archive CMakeFiles/rabbitmq-main.dir/objects.a -Wl,--no-whole-archive  -o rabbitmq-main.exe -Wl,--out-implib,librabbitmq-main.dll.a -Wl,--major-image-version,0,--minor-image-version,0 @CMakeFiles/rabbitmq-main.dir/linklibs.rsp
[ 75%] Building CXX object rabbitmq-fmu/CMakeFiles/unit-test-rabbitmq.dir/src/rabbitmq/RabbitMqHandlerException.cpp.obj
cd /work/build/win-x64/rabbitmq-fmu && /usr/src/mxe/usr/bin/x86_64-w64-mingw32.static-g++  -DAMQP_STATIC -DFMI_COSIMULATION @CMakeFiles/unit-test-rabbitmq.dir/includes_CXX.rsp -O3 -DNDEBUG   -std=gnu++17 -o CMakeFiles/unit-test-rabbitmq.dir/src/rabbitmq/RabbitMqHandlerException.cpp.obj -c /work/rabbitmq-fmu/src/rabbitmq/RabbitMqHandlerException.cpp
[ 78%] Building CXX object rabbitmq-fmu/CMakeFiles/unit-test-rabbitmq.dir/src/rabbitmq/RabbitmqHandler.cpp.obj
cd /work/build/win-x64/rabbitmq-fmu && /usr/src/mxe/usr/bin/x86_64-w64-mingw32.static-g++  -DAMQP_STATIC -DFMI_COSIMULATION @CMakeFiles/unit-test-rabbitmq.dir/includes_CXX.rsp -O3 -DNDEBUG   -std=gnu++17 -o CMakeFiles/unit-test-rabbitmq.dir/src/rabbitmq/RabbitmqHandler.cpp.obj -c /work/rabbitmq-fmu/src/rabbitmq/RabbitmqHandler.cpp
[ 78%] Linking CXX shared library rabbitmq.dll
cd /work/build/win-x64/rabbitmq-fmu && /usr/src/mxe/usr/x86_64-pc-linux-gnu/bin/cmake -E cmake_link_script CMakeFiles/rabbitmq.dir/link.txt --verbose=1
[ 78%] Building CXX object rabbitmq-fmu/CMakeFiles/it-test-rabbitmq.dir/src/message/MessageParser.cpp.obj
cd /work/build/win-x64/rabbitmq-fmu && /usr/src/mxe/usr/bin/x86_64-w64-mingw32.static-g++  -DAMQP_STATIC -DFMI_COSIMULATION @CMakeFiles/it-test-rabbitmq.dir/includes_CXX.rsp -O3 -DNDEBUG   -std=gnu++17 -o CMakeFiles/it-test-rabbitmq.dir/src/message/MessageParser.cpp.obj -c /work/rabbitmq-fmu/src/message/MessageParser.cpp
/usr/src/mxe/usr/x86_64-pc-linux-gnu/bin/cmake -E remove -f CMakeFiles/rabbitmq.dir/objects.a
/usr/src/mxe/usr/bin/x86_64-w64-mingw32.static-ar cr CMakeFiles/rabbitmq.dir/objects.a @CMakeFiles/rabbitmq.dir/objects1.rsp
/usr/src/mxe/usr/bin/x86_64-w64-mingw32.static-g++  -O3 -DNDEBUG -static-libgcc -static-libstdc++ -shared -o rabbitmq.dll -Wl,--out-implib,librabbitmq.dll.a -Wl,--major-image-version,0,--minor-image-version,0 -Wl,--whole-archive CMakeFiles/rabbitmq.dir/objects.a -Wl,--no-whole-archive @CMakeFiles/rabbitmq.dir/linklibs.rsp
[ 81%] Linking CXX static library ../../../lib/libgmock_main.a
cd /work/build/win-x64/thirdparty/googletest/googlemock && /usr/src/mxe/usr/x86_64-pc-linux-gnu/bin/cmake -P CMakeFiles/gmock_main.dir/cmake_clean_target.cmake
cd /work/build/win-x64/thirdparty/googletest/googlemock && /usr/src/mxe/usr/x86_64-pc-linux-gnu/bin/cmake -E cmake_link_script CMakeFiles/gmock_main.dir/link.txt --verbose=1
/usr/src/mxe/usr/bin/x86_64-w64-mingw32.static-ar qc ../../../lib/libgmock_main.a  CMakeFiles/gmock_main.dir/src/gmock_main.cc.obj
/usr/src/mxe/usr/bin/x86_64-w64-mingw32.static-ranlib ../../../lib/libgmock_main.a
make[2]: Leaving directory '/work/build/win-x64'
[ 81%] Built target gmock_main
[ 81%] Building CXX object rabbitmq-fmu/CMakeFiles/unit-test-rabbitmq.dir/test/FmuContainer_test.cpp.obj
cd /work/build/win-x64/rabbitmq-fmu && /usr/src/mxe/usr/bin/x86_64-w64-mingw32.static-g++  -DAMQP_STATIC -DFMI_COSIMULATION @CMakeFiles/unit-test-rabbitmq.dir/includes_CXX.rsp -O3 -DNDEBUG   -std=gnu++17 -o CMakeFiles/unit-test-rabbitmq.dir/test/FmuContainer_test.cpp.obj -c /work/rabbitmq-fmu/test/FmuContainer_test.cpp
[ 83%] Building CXX object rabbitmq-fmu/CMakeFiles/it-test-rabbitmq.dir/src/modeldescription/ModelDescriptionParser.cpp.obj
cd /work/build/win-x64/rabbitmq-fmu && /usr/src/mxe/usr/bin/x86_64-w64-mingw32.static-g++  -DAMQP_STATIC -DFMI_COSIMULATION @CMakeFiles/it-test-rabbitmq.dir/includes_CXX.rsp -O3 -DNDEBUG   -std=gnu++17 -o CMakeFiles/it-test-rabbitmq.dir/src/modeldescription/ModelDescriptionParser.cpp.obj -c /work/rabbitmq-fmu/src/modeldescription/ModelDescriptionParser.cpp
[ 86%] Building CXX object rabbitmq-fmu/CMakeFiles/unit-test-rabbitmq.dir/test/json_test.cpp.obj
cd /work/build/win-x64/rabbitmq-fmu && /usr/src/mxe/usr/bin/x86_64-w64-mingw32.static-g++  -DAMQP_STATIC -DFMI_COSIMULATION @CMakeFiles/unit-test-rabbitmq.dir/includes_CXX.rsp -O3 -DNDEBUG   -std=gnu++17 -o CMakeFiles/unit-test-rabbitmq.dir/test/json_test.cpp.obj -c /work/rabbitmq-fmu/test/json_test.cpp
make[2]: Leaving directory '/work/build/win-x64'
[ 86%] Built target rabbitmq-main
[ 86%] Building CXX object rabbitmq-fmu/CMakeFiles/unit-test-rabbitmq.dir/test/message_parser_test.cpp.obj
cd /work/build/win-x64/rabbitmq-fmu && /usr/src/mxe/usr/bin/x86_64-w64-mingw32.static-g++  -DAMQP_STATIC -DFMI_COSIMULATION @CMakeFiles/unit-test-rabbitmq.dir/includes_CXX.rsp -O3 -DNDEBUG   -std=gnu++17 -o CMakeFiles/unit-test-rabbitmq.dir/test/message_parser_test.cpp.obj -c /work/rabbitmq-fmu/test/message_parser_test.cpp
[ 86%] Building CXX object rabbitmq-fmu/CMakeFiles/it-test-rabbitmq.dir/src/rabbitmq/RabbitMqHandlerException.cpp.obj
cd /work/build/win-x64/rabbitmq-fmu && /usr/src/mxe/usr/bin/x86_64-w64-mingw32.static-g++  -DAMQP_STATIC -DFMI_COSIMULATION @CMakeFiles/it-test-rabbitmq.dir/includes_CXX.rsp -O3 -DNDEBUG   -std=gnu++17 -o CMakeFiles/it-test-rabbitmq.dir/src/rabbitmq/RabbitMqHandlerException.cpp.obj -c /work/rabbitmq-fmu/src/rabbitmq/RabbitMqHandlerException.cpp
make[2]: Leaving directory '/work/build/win-x64'
[ 86%] Built target rabbitmq
[ 89%] Building CXX object rabbitmq-fmu/CMakeFiles/it-test-rabbitmq.dir/src/rabbitmq/RabbitmqHandler.cpp.obj
cd /work/build/win-x64/rabbitmq-fmu && /usr/src/mxe/usr/bin/x86_64-w64-mingw32.static-g++  -DAMQP_STATIC -DFMI_COSIMULATION @CMakeFiles/it-test-rabbitmq.dir/includes_CXX.rsp -O3 -DNDEBUG   -std=gnu++17 -o CMakeFiles/it-test-rabbitmq.dir/src/rabbitmq/RabbitmqHandler.cpp.obj -c /work/rabbitmq-fmu/src/rabbitmq/RabbitmqHandler.cpp
[ 89%] Building CXX object rabbitmq-fmu/CMakeFiles/it-test-rabbitmq.dir/test/fmu_test_it.cpp.obj
cd /work/build/win-x64/rabbitmq-fmu && /usr/src/mxe/usr/bin/x86_64-w64-mingw32.static-g++  -DAMQP_STATIC -DFMI_COSIMULATION @CMakeFiles/it-test-rabbitmq.dir/includes_CXX.rsp -O3 -DNDEBUG   -std=gnu++17 -o CMakeFiles/it-test-rabbitmq.dir/test/fmu_test_it.cpp.obj -c /work/rabbitmq-fmu/test/fmu_test_it.cpp
[ 91%] Building CXX object rabbitmq-fmu/CMakeFiles/unit-test-rabbitmq.dir/test/modeldescription_test.cpp.obj
cd /work/build/win-x64/rabbitmq-fmu && /usr/src/mxe/usr/bin/x86_64-w64-mingw32.static-g++  -DAMQP_STATIC -DFMI_COSIMULATION @CMakeFiles/unit-test-rabbitmq.dir/includes_CXX.rsp -O3 -DNDEBUG   -std=gnu++17 -o CMakeFiles/unit-test-rabbitmq.dir/test/modeldescription_test.cpp.obj -c /work/rabbitmq-fmu/test/modeldescription_test.cpp
[ 94%] Building CXX object rabbitmq-fmu/CMakeFiles/it-test-rabbitmq.dir/test/rabbitmq_test_it.cpp.obj
cd /work/build/win-x64/rabbitmq-fmu && /usr/src/mxe/usr/bin/x86_64-w64-mingw32.static-g++  -DAMQP_STATIC -DFMI_COSIMULATION @CMakeFiles/it-test-rabbitmq.dir/includes_CXX.rsp -O3 -DNDEBUG   -std=gnu++17 -o CMakeFiles/it-test-rabbitmq.dir/test/rabbitmq_test_it.cpp.obj -c /work/rabbitmq-fmu/test/rabbitmq_test_it.cpp
[ 94%] Building CXX object rabbitmq-fmu/CMakeFiles/it-test-rabbitmq.dir/test/rabbitmqhandler_test_it.cpp.obj
cd /work/build/win-x64/rabbitmq-fmu && /usr/src/mxe/usr/bin/x86_64-w64-mingw32.static-g++  -DAMQP_STATIC -DFMI_COSIMULATION @CMakeFiles/it-test-rabbitmq.dir/includes_CXX.rsp -O3 -DNDEBUG   -std=gnu++17 -o CMakeFiles/it-test-rabbitmq.dir/test/rabbitmqhandler_test_it.cpp.obj -c /work/rabbitmq-fmu/test/rabbitmqhandler_test_it.cpp
[ 94%] Building CXX object rabbitmq-fmu/CMakeFiles/unit-test-rabbitmq.dir/test/timetamp_test.cpp.obj
cd /work/build/win-x64/rabbitmq-fmu && /usr/src/mxe/usr/bin/x86_64-w64-mingw32.static-g++  -DAMQP_STATIC -DFMI_COSIMULATION @CMakeFiles/unit-test-rabbitmq.dir/includes_CXX.rsp -O3 -DNDEBUG   -std=gnu++17 -o CMakeFiles/unit-test-rabbitmq.dir/test/timetamp_test.cpp.obj -c /work/rabbitmq-fmu/test/timetamp_test.cpp
make: Entering directory '/work/build/linux-x86/rabbitmq-fmu'
cd /work/build/linux-x86 && /usr/bin/cmake -S/work -B/work/build/linux-x86 --check-build-system CMakeFiles/Makefile.cmake 0
cd /work/build/linux-x86 && /usr/bin/cmake -E cmake_progress_start /work/build/linux-x86/CMakeFiles /work/build/linux-x86/rabbitmq-fmu/CMakeFiles/progress.marks
cd /work/build/linux-x86 && make -f CMakeFiles/Makefile2 rabbitmq-fmu/all
make[1]: Entering directory '/work/build/linux-x86'
make -f thirdparty/date/date/CMakeFiles/tz.dir/build.make thirdparty/date/date/CMakeFiles/tz.dir/depend
make[2]: Entering directory '/work/build/linux-x86'
cd /work/build/linux-x86 && /usr/bin/cmake -E cmake_depends "Unix Makefiles" /work /work/thirdparty/date/date /work/build/linux-x86 /work/build/linux-x86/thirdparty/date/date /work/build/linux-x86/thirdparty/date/date/CMakeFiles/tz.dir/DependInfo.cmake --color=
make[2]: Leaving directory '/work/build/linux-x86'
make -f thirdparty/date/date/CMakeFiles/tz.dir/build.make thirdparty/date/date/CMakeFiles/tz.dir/build
make[2]: Entering directory '/work/build/linux-x86'
make[2]: Nothing to be done for 'thirdparty/date/date/CMakeFiles/tz.dir/build'.
make[2]: Leaving directory '/work/build/linux-x86'
[  3%] Built target tz
make -f rabbitmq-core/CMakeFiles/rabbitmq-core.dir/build.make rabbitmq-core/CMakeFiles/rabbitmq-core.dir/depend
make[2]: Entering directory '/work/build/linux-x86'
cd /work/build/linux-x86 && /usr/bin/cmake -E cmake_depends "Unix Makefiles" /work /work/rabbitmq-core /work/build/linux-x86 /work/build/linux-x86/rabbitmq-core /work/build/linux-x86/rabbitmq-core/CMakeFiles/rabbitmq-core.dir/DependInfo.cmake --color=
make[2]: Leaving directory '/work/build/linux-x86'
make -f rabbitmq-core/CMakeFiles/rabbitmq-core.dir/build.make rabbitmq-core/CMakeFiles/rabbitmq-core.dir/build
make[2]: Entering directory '/work/build/linux-x86'
make[2]: Nothing to be done for 'rabbitmq-core/CMakeFiles/rabbitmq-core.dir/build'.
make[2]: Leaving directory '/work/build/linux-x86'
[  7%] Built target rabbitmq-core
make -f thirdparty/rabbitmq-c/rabbitmq-c/librabbitmq/CMakeFiles/rabbitmq-static.dir/build.make thirdparty/rabbitmq-c/rabbitmq-c/librabbitmq/CMakeFiles/rabbitmq-static.dir/depend
make[2]: Entering directory '/work/build/linux-x86'
cd /work/build/linux-x86 && /usr/bin/cmake -E cmake_depends "Unix Makefiles" /work /work/thirdparty/rabbitmq-c/rabbitmq-c/librabbitmq /work/build/linux-x86 /work/build/linux-x86/thirdparty/rabbitmq-c/rabbitmq-c/librabbitmq /work/build/linux-x86/thirdparty/rabbitmq-c/rabbitmq-c/librabbitmq/CMakeFiles/rabbitmq-static.dir/DependInfo.cmake --color=
make[2]: Leaving directory '/work/build/linux-x86'
make -f thirdparty/rabbitmq-c/rabbitmq-c/librabbitmq/CMakeFiles/rabbitmq-static.dir/build.make thirdparty/rabbitmq-c/rabbitmq-c/librabbitmq/CMakeFiles/rabbitmq-static.dir/build
make[2]: Entering directory '/work/build/linux-x86'
make[2]: Nothing to be done for 'thirdparty/rabbitmq-c/rabbitmq-c/librabbitmq/CMakeFiles/rabbitmq-static.dir/build'.
make[2]: Leaving directory '/work/build/linux-x86'
[ 25%] Built target rabbitmq-static
make -f rabbitmq-fmu/CMakeFiles/rabbitmq-main.dir/build.make rabbitmq-fmu/CMakeFiles/rabbitmq-main.dir/depend
make[2]: Entering directory '/work/build/linux-x86'
cd /work/build/linux-x86 && /usr/bin/cmake -E cmake_depends "Unix Makefiles" /work /work/rabbitmq-fmu /work/build/linux-x86 /work/build/linux-x86/rabbitmq-fmu /work/build/linux-x86/rabbitmq-fmu/CMakeFiles/rabbitmq-main.dir/DependInfo.cmake --color=
make[2]: Leaving directory '/work/build/linux-x86'
make -f rabbitmq-fmu/CMakeFiles/rabbitmq-main.dir/build.make rabbitmq-fmu/CMakeFiles/rabbitmq-main.dir/build
make[2]: Entering directory '/work/build/linux-x86'
make[2]: Nothing to be done for 'rabbitmq-fmu/CMakeFiles/rabbitmq-main.dir/build'.
make[2]: Leaving directory '/work/build/linux-x86'
[ 39%] Built target rabbitmq-main
make -f thirdparty/googletest/googletest/CMakeFiles/gtest.dir/build.make thirdparty/googletest/googletest/CMakeFiles/gtest.dir/depend
make[2]: Entering directory '/work/build/linux-x86'
cd /work/build/linux-x86 && /usr/bin/cmake -E cmake_depends "Unix Makefiles" /work /work/thirdparty/googletest/googletest /work/build/linux-x86 /work/build/linux-x86/thirdparty/googletest/googletest /work/build/linux-x86/thirdparty/googletest/googletest/CMakeFiles/gtest.dir/DependInfo.cmake --color=
make[2]: Leaving directory '/work/build/linux-x86'
make -f thirdparty/googletest/googletest/CMakeFiles/gtest.dir/build.make thirdparty/googletest/googletest/CMakeFiles/gtest.dir/build
make[2]: Entering directory '/work/build/linux-x86'
make[2]: Nothing to be done for 'thirdparty/googletest/googletest/CMakeFiles/gtest.dir/build'.
make[2]: Leaving directory '/work/build/linux-x86'
[ 42%] Built target gtest
make -f thirdparty/googletest/googletest/CMakeFiles/gtest_main.dir/build.make thirdparty/googletest/googletest/CMakeFiles/gtest_main.dir/depend
make[2]: Entering directory '/work/build/linux-x86'
cd /work/build/linux-x86 && /usr/bin/cmake -E cmake_depends "Unix Makefiles" /work /work/thirdparty/googletest/googletest /work/build/linux-x86 /work/build/linux-x86/thirdparty/googletest/googletest /work/build/linux-x86/thirdparty/googletest/googletest/CMakeFiles/gtest_main.dir/DependInfo.cmake --color=
make[2]: Leaving directory '/work/build/linux-x86'
make -f thirdparty/googletest/googletest/CMakeFiles/gtest_main.dir/build.make thirdparty/googletest/googletest/CMakeFiles/gtest_main.dir/build
make[2]: Entering directory '/work/build/linux-x86'
make[2]: Nothing to be done for 'thirdparty/googletest/googletest/CMakeFiles/gtest_main.dir/build'.
make[2]: Leaving directory '/work/build/linux-x86'
[ 46%] Built target gtest_main
make -f rabbitmq-fmu/CMakeFiles/unit-test-rabbitmq.dir/build.make rabbitmq-fmu/CMakeFiles/unit-test-rabbitmq.dir/depend
make[2]: Entering directory '/work/build/linux-x86'
cd /work/build/linux-x86 && /usr/bin/cmake -E cmake_depends "Unix Makefiles" /work /work/rabbitmq-fmu /work/build/linux-x86 /work/build/linux-x86/rabbitmq-fmu /work/build/linux-x86/rabbitmq-fmu/CMakeFiles/unit-test-rabbitmq.dir/DependInfo.cmake --color=
make[2]: Leaving directory '/work/build/linux-x86'
make -f rabbitmq-fmu/CMakeFiles/unit-test-rabbitmq.dir/build.make rabbitmq-fmu/CMakeFiles/unit-test-rabbitmq.dir/build
make[2]: Entering directory '/work/build/linux-x86'
make[2]: Nothing to be done for 'rabbitmq-fmu/CMakeFiles/unit-test-rabbitmq.dir/build'.
make[2]: Leaving directory '/work/build/linux-x86'
[ 67%] Built target unit-test-rabbitmq
make -f rabbitmq-fmu/CMakeFiles/it-test-rabbitmq.dir/build.make rabbitmq-fmu/CMakeFiles/it-test-rabbitmq.dir/depend
make[2]: Entering directory '/work/build/linux-x86'
cd /work/build/linux-x86 && /usr/bin/cmake -E cmake_depends "Unix Makefiles" /work /work/rabbitmq-fmu /work/build/linux-x86 /work/build/linux-x86/rabbitmq-fmu /work/build/linux-x86/rabbitmq-fmu/CMakeFiles/it-test-rabbitmq.dir/DependInfo.cmake --color=
make[2]: Leaving directory '/work/build/linux-x86'
make -f rabbitmq-fmu/CMakeFiles/it-test-rabbitmq.dir/build.make rabbitmq-fmu/CMakeFiles/it-test-rabbitmq.dir/build
make[2]: Entering directory '/work/build/linux-x86'
make[2]: Nothing to be done for 'rabbitmq-fmu/CMakeFiles/it-test-rabbitmq.dir/build'.
make[2]: Leaving directory '/work/build/linux-x86'
[ 85%] Built target it-test-rabbitmq
make -f rabbitmq-fmu/CMakeFiles/rabbitmq.dir/build.make rabbitmq-fmu/CMakeFiles/rabbitmq.dir/depend
make[2]: Entering directory '/work/build/linux-x86'
cd /work/build/linux-x86 && /usr/bin/cmake -E cmake_depends "Unix Makefiles" /work /work/rabbitmq-fmu /work/build/linux-x86 /work/build/linux-x86/rabbitmq-fmu /work/build/linux-x86/rabbitmq-fmu/CMakeFiles/rabbitmq.dir/DependInfo.cmake --color=
make[2]: Leaving directory '/work/build/linux-x86'
make -f rabbitmq-fmu/CMakeFiles/rabbitmq.dir/build.make rabbitmq-fmu/CMakeFiles/rabbitmq.dir/build
make[2]: Entering directory '/work/build/linux-x86'
make[2]: Nothing to be done for 'rabbitmq-fmu/CMakeFiles/rabbitmq.dir/build'.
make[2]: Leaving directory '/work/build/linux-x86'
[100%] Built target rabbitmq
make[1]: Leaving directory '/work/build/linux-x86'
/usr/bin/cmake -E cmake_progress_start /work/build/linux-x86/CMakeFiles 0
cd /work/build/linux-x86 && make -f CMakeFiles/Makefile2 rabbitmq-fmu/preinstall
make[1]: Entering directory '/work/build/linux-x86'
make[1]: Nothing to be done for 'rabbitmq-fmu/preinstall'.
make[1]: Leaving directory '/work/build/linux-x86'
Install the project...
/usr/bin/cmake -P cmake_install.cmake
-- Install configuration: "RelWithDebInfo"
-- Installing: /work/build/install/rabbitmqfmu/binaries/linux32/rabbitmq.so
-- Set runtime path of "/work/build/install/rabbitmqfmu/binaries/linux32/rabbitmq.so" to ""
-- Up-to-date: /work/build/install/rabbitmqfmu/resources/modelDescription.xml
-- Up-to-date: /work/build/install/rabbitmqfmu/modelDescription.xml
make: Leaving directory '/work/build/linux-x86/rabbitmq-fmu'
[ 97%] Building CXX object rabbitmq-fmu/CMakeFiles/unit-test-rabbitmq.dir/test/xml_test.cpp.obj
cd /work/build/win-x64/rabbitmq-fmu && /usr/src/mxe/usr/bin/x86_64-w64-mingw32.static-g++  -DAMQP_STATIC -DFMI_COSIMULATION @CMakeFiles/unit-test-rabbitmq.dir/includes_CXX.rsp -O3 -DNDEBUG   -std=gnu++17 -o CMakeFiles/unit-test-rabbitmq.dir/test/xml_test.cpp.obj -c /work/rabbitmq-fmu/test/xml_test.cpp
Done
[Pipeline] }
[Pipeline] // stage
[Pipeline] }
[100%] Linking CXX executable it-test-rabbitmq.exe
cd /work/build/win-x64/rabbitmq-fmu && /usr/src/mxe/usr/x86_64-pc-linux-gnu/bin/cmake -E cmake_link_script CMakeFiles/it-test-rabbitmq.dir/link.txt --verbose=1
/usr/src/mxe/usr/x86_64-pc-linux-gnu/bin/cmake -E remove -f CMakeFiles/it-test-rabbitmq.dir/objects.a
/usr/src/mxe/usr/bin/x86_64-w64-mingw32.static-ar cr CMakeFiles/it-test-rabbitmq.dir/objects.a @CMakeFiles/it-test-rabbitmq.dir/objects1.rsp
/usr/src/mxe/usr/bin/x86_64-w64-mingw32.static-g++ -O3 -DNDEBUG   -static-libstdc++ -static-libgcc -Wl,--whole-archive CMakeFiles/it-test-rabbitmq.dir/objects.a -Wl,--no-whole-archive  -o it-test-rabbitmq.exe -Wl,--out-implib,libit-test-rabbitmq.dll.a -Wl,--major-image-version,0,--minor-image-version,0 @CMakeFiles/it-test-rabbitmq.dir/linklibs.rsp
[100%] Linking CXX executable unit-test-rabbitmq.exe
cd /work/build/win-x64/rabbitmq-fmu && /usr/src/mxe/usr/x86_64-pc-linux-gnu/bin/cmake -E cmake_link_script CMakeFiles/unit-test-rabbitmq.dir/link.txt --verbose=1
/usr/src/mxe/usr/x86_64-pc-linux-gnu/bin/cmake -E remove -f CMakeFiles/unit-test-rabbitmq.dir/objects.a
/usr/src/mxe/usr/bin/x86_64-w64-mingw32.static-ar cr CMakeFiles/unit-test-rabbitmq.dir/objects.a @CMakeFiles/unit-test-rabbitmq.dir/objects1.rsp
/usr/src/mxe/usr/bin/x86_64-w64-mingw32.static-g++ -O3 -DNDEBUG   -static-libstdc++ -static-libgcc -Wl,--whole-archive CMakeFiles/unit-test-rabbitmq.dir/objects.a -Wl,--no-whole-archive  -o unit-test-rabbitmq.exe -Wl,--out-implib,libunit-test-rabbitmq.dll.a -Wl,--major-image-version,0,--minor-image-version,0 @CMakeFiles/unit-test-rabbitmq.dir/linklibs.rsp
make[2]: Leaving directory '/work/build/win-x64'
[100%] Built target it-test-rabbitmq
make[2]: Leaving directory '/work/build/win-x64'
[100%] Built target unit-test-rabbitmq
make[1]: Leaving directory '/work/build/win-x64'
/usr/src/mxe/usr/x86_64-pc-linux-gnu/bin/cmake -E cmake_progress_start /work/build/win-x64/CMakeFiles 0
make: Leaving directory '/work/build/win-x64'
make: Entering directory '/work/build/win-x64/rabbitmq-fmu'
cd /work/build/win-x64 && /usr/src/mxe/usr/x86_64-pc-linux-gnu/bin/cmake -S/work -B/work/build/win-x64 --check-build-system CMakeFiles/Makefile.cmake 0
cd /work/build/win-x64 && /usr/src/mxe/usr/x86_64-pc-linux-gnu/bin/cmake -E cmake_progress_start /work/build/win-x64/CMakeFiles /work/build/win-x64/rabbitmq-fmu/CMakeFiles/progress.marks
cd /work/build/win-x64 && make -f CMakeFiles/Makefile2 rabbitmq-fmu/all
make[1]: Entering directory '/work/build/win-x64'
make -f thirdparty/date/date/CMakeFiles/tz.dir/build.make thirdparty/date/date/CMakeFiles/tz.dir/depend
make[2]: Entering directory '/work/build/win-x64'
cd /work/build/win-x64 && /usr/src/mxe/usr/x86_64-pc-linux-gnu/bin/cmake -E cmake_depends "Unix Makefiles" /work /work/thirdparty/date/date /work/build/win-x64 /work/build/win-x64/thirdparty/date/date /work/build/win-x64/thirdparty/date/date/CMakeFiles/tz.dir/DependInfo.cmake --color=
make[2]: Leaving directory '/work/build/win-x64'
make -f thirdparty/date/date/CMakeFiles/tz.dir/build.make thirdparty/date/date/CMakeFiles/tz.dir/build
make[2]: Entering directory '/work/build/win-x64'
make[2]: Nothing to be done for 'thirdparty/date/date/CMakeFiles/tz.dir/build'.
make[2]: Leaving directory '/work/build/win-x64'
[  3%] Built target tz
make -f rabbitmq-core/CMakeFiles/rabbitmq-core.dir/build.make rabbitmq-core/CMakeFiles/rabbitmq-core.dir/depend
make[2]: Entering directory '/work/build/win-x64'
cd /work/build/win-x64 && /usr/src/mxe/usr/x86_64-pc-linux-gnu/bin/cmake -E cmake_depends "Unix Makefiles" /work /work/rabbitmq-core /work/build/win-x64 /work/build/win-x64/rabbitmq-core /work/build/win-x64/rabbitmq-core/CMakeFiles/rabbitmq-core.dir/DependInfo.cmake --color=
make[2]: Leaving directory '/work/build/win-x64'
make -f rabbitmq-core/CMakeFiles/rabbitmq-core.dir/build.make rabbitmq-core/CMakeFiles/rabbitmq-core.dir/build
make[2]: Entering directory '/work/build/win-x64'
make[2]: Nothing to be done for 'rabbitmq-core/CMakeFiles/rabbitmq-core.dir/build'.
make[2]: Leaving directory '/work/build/win-x64'
[  6%] Built target rabbitmq-core
make -f thirdparty/googletest/googletest/CMakeFiles/gtest.dir/build.make thirdparty/googletest/googletest/CMakeFiles/gtest.dir/depend
make[2]: Entering directory '/work/build/win-x64'
cd /work/build/win-x64 && /usr/src/mxe/usr/x86_64-pc-linux-gnu/bin/cmake -E cmake_depends "Unix Makefiles" /work /work/thirdparty/googletest/googletest /work/build/win-x64 /work/build/win-x64/thirdparty/googletest/googletest /work/build/win-x64/thirdparty/googletest/googletest/CMakeFiles/gtest.dir/DependInfo.cmake --color=
make[2]: Leaving directory '/work/build/win-x64'
make -f thirdparty/googletest/googletest/CMakeFiles/gtest.dir/build.make thirdparty/googletest/googletest/CMakeFiles/gtest.dir/build
make[2]: Entering directory '/work/build/win-x64'
make[2]: Nothing to be done for 'thirdparty/googletest/googletest/CMakeFiles/gtest.dir/build'.
make[2]: Leaving directory '/work/build/win-x64'
[  9%] Built target gtest
make -f thirdparty/googletest/googletest/CMakeFiles/gtest_main.dir/build.make thirdparty/googletest/googletest/CMakeFiles/gtest_main.dir/depend
make[2]: Entering directory '/work/build/win-x64'
cd /work/build/win-x64 && /usr/src/mxe/usr/x86_64-pc-linux-gnu/bin/cmake -E cmake_depends "Unix Makefiles" /work /work/thirdparty/googletest/googletest /work/build/win-x64 /work/build/win-x64/thirdparty/googletest/googletest /work/build/win-x64/thirdparty/googletest/googletest/CMakeFiles/gtest_main.dir/DependInfo.cmake --color=
make[2]: Leaving directory '/work/build/win-x64'
make -f thirdparty/googletest/googletest/CMakeFiles/gtest_main.dir/build.make thirdparty/googletest/googletest/CMakeFiles/gtest_main.dir/build
make[2]: Entering directory '/work/build/win-x64'
make[2]: Nothing to be done for 'thirdparty/googletest/googletest/CMakeFiles/gtest_main.dir/build'.
make[2]: Leaving directory '/work/build/win-x64'
[ 12%] Built target gtest_main
make -f thirdparty/rabbitmq-c/rabbitmq-c/librabbitmq/CMakeFiles/rabbitmq-static.dir/build.make thirdparty/rabbitmq-c/rabbitmq-c/librabbitmq/CMakeFiles/rabbitmq-static.dir/depend
make[2]: Entering directory '/work/build/win-x64'
cd /work/build/win-x64 && /usr/src/mxe/usr/x86_64-pc-linux-gnu/bin/cmake -E cmake_depends "Unix Makefiles" /work /work/thirdparty/rabbitmq-c/rabbitmq-c/librabbitmq /work/build/win-x64 /work/build/win-x64/thirdparty/rabbitmq-c/rabbitmq-c/librabbitmq /work/build/win-x64/thirdparty/rabbitmq-c/rabbitmq-c/librabbitmq/CMakeFiles/rabbitmq-static.dir/DependInfo.cmake --color=
make[2]: Leaving directory '/work/build/win-x64'
make -f thirdparty/rabbitmq-c/rabbitmq-c/librabbitmq/CMakeFiles/rabbitmq-static.dir/build.make thirdparty/rabbitmq-c/rabbitmq-c/librabbitmq/CMakeFiles/rabbitmq-static.dir/build
make[2]: Entering directory '/work/build/win-x64'
make[2]: Nothing to be done for 'thirdparty/rabbitmq-c/rabbitmq-c/librabbitmq/CMakeFiles/rabbitmq-static.dir/build'.
make[2]: Leaving directory '/work/build/win-x64'
[ 31%] Built target rabbitmq-static
make -f rabbitmq-fmu/CMakeFiles/unit-test-rabbitmq.dir/build.make rabbitmq-fmu/CMakeFiles/unit-test-rabbitmq.dir/depend
make[2]: Entering directory '/work/build/win-x64'
cd /work/build/win-x64 && /usr/src/mxe/usr/x86_64-pc-linux-gnu/bin/cmake -E cmake_depends "Unix Makefiles" /work /work/rabbitmq-fmu /work/build/win-x64 /work/build/win-x64/rabbitmq-fmu /work/build/win-x64/rabbitmq-fmu/CMakeFiles/unit-test-rabbitmq.dir/DependInfo.cmake --color=
make[2]: Leaving directory '/work/build/win-x64'
make -f rabbitmq-fmu/CMakeFiles/unit-test-rabbitmq.dir/build.make rabbitmq-fmu/CMakeFiles/unit-test-rabbitmq.dir/build
make[2]: Entering directory '/work/build/win-x64'
make[2]: Nothing to be done for 'rabbitmq-fmu/CMakeFiles/unit-test-rabbitmq.dir/build'.
make[2]: Leaving directory '/work/build/win-x64'
[ 53%] Built target unit-test-rabbitmq
make -f rabbitmq-fmu/CMakeFiles/it-test-rabbitmq.dir/build.make rabbitmq-fmu/CMakeFiles/it-test-rabbitmq.dir/depend
make[2]: Entering directory '/work/build/win-x64'
cd /work/build/win-x64 && /usr/src/mxe/usr/x86_64-pc-linux-gnu/bin/cmake -E cmake_depends "Unix Makefiles" /work /work/rabbitmq-fmu /work/build/win-x64 /work/build/win-x64/rabbitmq-fmu /work/build/win-x64/rabbitmq-fmu/CMakeFiles/it-test-rabbitmq.dir/DependInfo.cmake --color=
make[2]: Leaving directory '/work/build/win-x64'
make -f rabbitmq-fmu/CMakeFiles/it-test-rabbitmq.dir/build.make rabbitmq-fmu/CMakeFiles/it-test-rabbitmq.dir/build
make[2]: Entering directory '/work/build/win-x64'
make[2]: Nothing to be done for 'rabbitmq-fmu/CMakeFiles/it-test-rabbitmq.dir/build'.
make[2]: Leaving directory '/work/build/win-x64'
[ 71%] Built target it-test-rabbitmq
make -f rabbitmq-fmu/CMakeFiles/rabbitmq.dir/build.make rabbitmq-fmu/CMakeFiles/rabbitmq.dir/depend
make[2]: Entering directory '/work/build/win-x64'
cd /work/build/win-x64 && /usr/src/mxe/usr/x86_64-pc-linux-gnu/bin/cmake -E cmake_depends "Unix Makefiles" /work /work/rabbitmq-fmu /work/build/win-x64 /work/build/win-x64/rabbitmq-fmu /work/build/win-x64/rabbitmq-fmu/CMakeFiles/rabbitmq.dir/DependInfo.cmake --color=
make[2]: Leaving directory '/work/build/win-x64'
make -f rabbitmq-fmu/CMakeFiles/rabbitmq.dir/build.make rabbitmq-fmu/CMakeFiles/rabbitmq.dir/build
make[2]: Entering directory '/work/build/win-x64'
make[2]: Nothing to be done for 'rabbitmq-fmu/CMakeFiles/rabbitmq.dir/build'.
make[2]: Leaving directory '/work/build/win-x64'
[ 84%] Built target rabbitmq
make -f rabbitmq-fmu/CMakeFiles/rabbitmq-main.dir/build.make rabbitmq-fmu/CMakeFiles/rabbitmq-main.dir/depend
make[2]: Entering directory '/work/build/win-x64'
cd /work/build/win-x64 && /usr/src/mxe/usr/x86_64-pc-linux-gnu/bin/cmake -E cmake_depends "Unix Makefiles" /work /work/rabbitmq-fmu /work/build/win-x64 /work/build/win-x64/rabbitmq-fmu /work/build/win-x64/rabbitmq-fmu/CMakeFiles/rabbitmq-main.dir/DependInfo.cmake --color=
make[2]: Leaving directory '/work/build/win-x64'
make -f rabbitmq-fmu/CMakeFiles/rabbitmq-main.dir/build.make rabbitmq-fmu/CMakeFiles/rabbitmq-main.dir/build
make[2]: Entering directory '/work/build/win-x64'
make[2]: Nothing to be done for 'rabbitmq-fmu/CMakeFiles/rabbitmq-main.dir/build'.
make[2]: Leaving directory '/work/build/win-x64'
[100%] Built target rabbitmq-main
make[1]: Leaving directory '/work/build/win-x64'
/usr/src/mxe/usr/x86_64-pc-linux-gnu/bin/cmake -E cmake_progress_start /work/build/win-x64/CMakeFiles 0
cd /work/build/win-x64 && make -f CMakeFiles/Makefile2 rabbitmq-fmu/preinstall
make[1]: Entering directory '/work/build/win-x64'
make[1]: Nothing to be done for 'rabbitmq-fmu/preinstall'.
make[1]: Leaving directory '/work/build/win-x64'
Install the project...
/usr/src/mxe/usr/x86_64-pc-linux-gnu/bin/cmake -P cmake_install.cmake
-- Install configuration: "Release"
-- Installing: /work/build/install/rabbitmqfmu/binaries/win64/librabbitmq.dll.a
-- Installing: /work/build/install/rabbitmqfmu/binaries/win64/rabbitmq.dll
-- Up-to-date: /work/build/install/rabbitmqfmu/resources/modelDescription.xml
-- Up-to-date: /work/build/install/rabbitmqfmu/modelDescription.xml
make: Leaving directory '/work/build/win-x64/rabbitmq-fmu'
Done
[Pipeline] }
[Pipeline] // stage
[Pipeline] }
[Pipeline] // parallel
[Pipeline] }
[Pipeline] // stage
[Pipeline] stage
[Pipeline] { (Pack FMU)
Stage "Pack FMU" skipped due to earlier failure(s)
[Pipeline] }
[Pipeline] // stage
[Pipeline] stage
[Pipeline] { (Publish)
Stage "Publish" skipped due to earlier failure(s)
[Pipeline] }
[Pipeline] // stage
[Pipeline] }
[Pipeline] // withEnv
[Pipeline] }
[Pipeline] // node
[Pipeline] End of Pipeline

GitHub has been notified of this commit’s build result

ERROR: script returned exit code 2
Finished: FAILURE