FailedConsole Output

Skipping 178 KB.. Full Log
er.cpp.o -c /home/jenkins/builds/workspace/shm-fmi-pipe_development/testfmu-integration/runner/testrunner.cpp
[ 44%] Building C object libshmfmu/CMakeFiles/libshmfmu.dir/__/third_party/uuid4/src/uuid4.c.o
[ 46%] Linking CXX static library libgtest.a
cd /home/jenkins/builds/workspace/shm-fmi-pipe_development/build/linux64/libshmfmu && /usr/bin/cc  -Dlibshmfmu_EXPORTS -I/home/jenkins/builds/workspace/shm-fmi-pipe_development/third_party/uuid4/src -I/home/jenkins/builds/workspace/shm-fmi-pipe_development/libshmfmu/includes/fmi -I/home/jenkins/builds/workspace/shm-fmi-pipe_development/libshmfmi/include -I/home/jenkins/builds/workspace/shm-fmi-pipe_development/libshmfmi -I/home/jenkins/builds/workspace/shm-fmi-pipe_development/libshmipc -I/home/jenkins/builds/workspace/shm-fmi-pipe_development/build/linux64/libshmfmi  -DFMI_COSIMULATION -fPIC   -o CMakeFiles/libshmfmu.dir/__/third_party/uuid4/src/uuid4.c.o   -c /home/jenkins/builds/workspace/shm-fmi-pipe_development/third_party/uuid4/src/uuid4.c
cd /home/jenkins/builds/workspace/shm-fmi-pipe_development/build/linux64/third_party/googletest/googletest && /usr/bin/cmake -P CMakeFiles/gtest.dir/cmake_clean_target.cmake
Scanning dependencies of target sharedmemory
make[2]: Leaving directory '/home/jenkins/builds/workspace/shm-fmi-pipe_development/build/linux64'
make -f shmfmi-server/CMakeFiles/sharedmemory.dir/build.make shmfmi-server/CMakeFiles/sharedmemory.dir/build
make[2]: Entering directory '/home/jenkins/builds/workspace/shm-fmi-pipe_development/build/linux64'
cd /home/jenkins/builds/workspace/shm-fmi-pipe_development/build/linux64/third_party/googletest/googletest && /usr/bin/cmake -E cmake_link_script CMakeFiles/gtest.dir/link.txt --verbose=1
[ 48%] Building CXX object shmfmi-server/CMakeFiles/sharedmemory.dir/src/main/native/sharedmemory.cpp.o
cd /home/jenkins/builds/workspace/shm-fmi-pipe_development/build/linux64/shmfmi-server && /usr/bin/c++   -Dsharedmemory_EXPORTS -I/home/jenkins/builds/workspace/shm-fmi-pipe_development/shmfmi-server/../third_party/jvm/linux64/include -I/home/jenkins/builds/workspace/shm-fmi-pipe_development/shmfmi-server/../third_party/jvm/linux64/include/linux -I/home/jenkins/builds/workspace/shm-fmi-pipe_development/libshmfmi/include -I/home/jenkins/builds/workspace/shm-fmi-pipe_development/libshmfmi -I/home/jenkins/builds/workspace/shm-fmi-pipe_development/libshmipc -I/home/jenkins/builds/workspace/shm-fmi-pipe_development/build/linux64/libshmfmi  -std=c++11 -fPIC   -o CMakeFiles/sharedmemory.dir/src/main/native/sharedmemory.cpp.o -c /home/jenkins/builds/workspace/shm-fmi-pipe_development/shmfmi-server/src/main/native/sharedmemory.cpp
/usr/bin/ar qc libgtest.a  CMakeFiles/gtest.dir/src/gtest-all.cc.o
/usr/bin/ranlib libgtest.a
[ 50%] Building C object libshmfmu/CMakeFiles/libshmfmu.dir/uri.c.o
cd /home/jenkins/builds/workspace/shm-fmi-pipe_development/build/linux64/libshmfmu && /usr/bin/cc  -Dlibshmfmu_EXPORTS -I/home/jenkins/builds/workspace/shm-fmi-pipe_development/third_party/uuid4/src -I/home/jenkins/builds/workspace/shm-fmi-pipe_development/libshmfmu/includes/fmi -I/home/jenkins/builds/workspace/shm-fmi-pipe_development/libshmfmi/include -I/home/jenkins/builds/workspace/shm-fmi-pipe_development/libshmfmi -I/home/jenkins/builds/workspace/shm-fmi-pipe_development/libshmipc -I/home/jenkins/builds/workspace/shm-fmi-pipe_development/build/linux64/libshmfmi  -DFMI_COSIMULATION -fPIC   -o CMakeFiles/libshmfmu.dir/uri.c.o   -c /home/jenkins/builds/workspace/shm-fmi-pipe_development/libshmfmu/uri.c
make[2]: Leaving directory '/home/jenkins/builds/workspace/shm-fmi-pipe_development/build/linux64'
[ 50%] Built target gtest
[ 51%] Building CXX object shmfmi-server/CMakeFiles/sharedmemory.dir/src/main/native/sharedmemoryserver.cpp.o
cd /home/jenkins/builds/workspace/shm-fmi-pipe_development/build/linux64/shmfmi-server && /usr/bin/c++   -Dsharedmemory_EXPORTS -I/home/jenkins/builds/workspace/shm-fmi-pipe_development/shmfmi-server/../third_party/jvm/linux64/include -I/home/jenkins/builds/workspace/shm-fmi-pipe_development/shmfmi-server/../third_party/jvm/linux64/include/linux -I/home/jenkins/builds/workspace/shm-fmi-pipe_development/libshmfmi/include -I/home/jenkins/builds/workspace/shm-fmi-pipe_development/libshmfmi -I/home/jenkins/builds/workspace/shm-fmi-pipe_development/libshmipc -I/home/jenkins/builds/workspace/shm-fmi-pipe_development/build/linux64/libshmfmi  -std=c++11 -fPIC   -o CMakeFiles/sharedmemory.dir/src/main/native/sharedmemoryserver.cpp.o -c /home/jenkins/builds/workspace/shm-fmi-pipe_development/shmfmi-server/src/main/native/sharedmemoryserver.cpp
[ 53%] Building CXX object libshmfmu/CMakeFiles/libshmfmu.dir/fmu.cpp.o
cd /home/jenkins/builds/workspace/shm-fmi-pipe_development/build/linux64/libshmfmu && /usr/bin/c++   -Dlibshmfmu_EXPORTS -I/home/jenkins/builds/workspace/shm-fmi-pipe_development/third_party/uuid4/src -I/home/jenkins/builds/workspace/shm-fmi-pipe_development/libshmfmu/includes/fmi -I/home/jenkins/builds/workspace/shm-fmi-pipe_development/libshmfmi/include -I/home/jenkins/builds/workspace/shm-fmi-pipe_development/libshmfmi -I/home/jenkins/builds/workspace/shm-fmi-pipe_development/libshmipc -I/home/jenkins/builds/workspace/shm-fmi-pipe_development/build/linux64/libshmfmi  -std=c++11 -DFMI_COSIMULATION -fPIC   -o CMakeFiles/libshmfmu.dir/fmu.cpp.o -c /home/jenkins/builds/workspace/shm-fmi-pipe_development/libshmfmu/fmu.cpp
[ 55%] Building CXX object testfmu-integration/CMakeFiles/testfmu-integration-driver.dir/RemoteTestDriver.cpp.o
cd /home/jenkins/builds/workspace/shm-fmi-pipe_development/build/linux64/testfmu-integration && /usr/bin/c++    -I/home/jenkins/builds/workspace/shm-fmi-pipe_development/testfmu-integration/include/fmi -I/home/jenkins/builds/workspace/shm-fmi-pipe_development/testfmu-integration/include -I/home/jenkins/builds/workspace/shm-fmi-pipe_development/libshmfmi/include -I/home/jenkins/builds/workspace/shm-fmi-pipe_development/libshmfmi -I/home/jenkins/builds/workspace/shm-fmi-pipe_development/libshmipc -I/home/jenkins/builds/workspace/shm-fmi-pipe_development/build/linux64/libshmfmi -I/home/jenkins/builds/workspace/shm-fmi-pipe_development/third_party/googletest/googletest/include  -std=c++11 -DFMI_COSIMULATION -DFMULIB=\"/home/jenkins/builds/workspace/shm-fmi-pipe_development/build/linux64/libshmfmu/liblibshmfmu.so\" -DTEST_RUNNER_DRIVER_PATH=\"/home/jenkins/builds/workspace/shm-fmi-pipe_development/build/linux64/testfmu-integration/testfmu-integration-driver\"   -o CMakeFiles/testfmu-integration-driver.dir/RemoteTestDriver.cpp.o -c /home/jenkins/builds/workspace/shm-fmi-pipe_development/testfmu-integration/RemoteTestDriver.cpp
[ 57%] Building CXX object libshmfmu/CMakeFiles/libshmfmu.dir/FmuContainer.cpp.o
cd /home/jenkins/builds/workspace/shm-fmi-pipe_development/build/linux64/libshmfmu && /usr/bin/c++   -Dlibshmfmu_EXPORTS -I/home/jenkins/builds/workspace/shm-fmi-pipe_development/third_party/uuid4/src -I/home/jenkins/builds/workspace/shm-fmi-pipe_development/libshmfmu/includes/fmi -I/home/jenkins/builds/workspace/shm-fmi-pipe_development/libshmfmi/include -I/home/jenkins/builds/workspace/shm-fmi-pipe_development/libshmfmi -I/home/jenkins/builds/workspace/shm-fmi-pipe_development/libshmipc -I/home/jenkins/builds/workspace/shm-fmi-pipe_development/build/linux64/libshmfmi  -std=c++11 -DFMI_COSIMULATION -fPIC   -o CMakeFiles/libshmfmu.dir/FmuContainer.cpp.o -c /home/jenkins/builds/workspace/shm-fmi-pipe_development/libshmfmu/FmuContainer.cpp
[ 59%] Linking CXX shared library libsharedmemory.so
cd /home/jenkins/builds/workspace/shm-fmi-pipe_development/build/linux64/shmfmi-server && /usr/bin/cmake -E cmake_link_script CMakeFiles/sharedmemory.dir/link.txt --verbose=1
/usr/bin/c++  -fPIC  -std=c++11  -shared -Wl,-soname,libsharedmemory.so -o libsharedmemory.so CMakeFiles/sharedmemory.dir/src/main/native/sharedmemory.cpp.o CMakeFiles/sharedmemory.dir/src/main/native/sharedmemoryserver.cpp.o ../libshmfmi/liblibshmfmi.a /home/privatejenkins/shm-dependencies/linux64/usr/protobuf/lib/libprotobuf.a -lpthread -lrt -ldl -Wl,-Bstatic -lstdc++ -lpthread -Wl,-Bdynamic 
make[2]: Leaving directory '/home/jenkins/builds/workspace/shm-fmi-pipe_development/build/linux64'
[ 59%] Built target sharedmemory
make -f third_party/googletest/googletest/CMakeFiles/gtest_main.dir/build.make third_party/googletest/googletest/CMakeFiles/gtest_main.dir/depend
make[2]: Entering directory '/home/jenkins/builds/workspace/shm-fmi-pipe_development/build/linux64'
cd /home/jenkins/builds/workspace/shm-fmi-pipe_development/build/linux64 && /usr/bin/cmake -E cmake_depends "Unix Makefiles" /home/jenkins/builds/workspace/shm-fmi-pipe_development /home/jenkins/builds/workspace/shm-fmi-pipe_development/third_party/googletest/googletest /home/jenkins/builds/workspace/shm-fmi-pipe_development/build/linux64 /home/jenkins/builds/workspace/shm-fmi-pipe_development/build/linux64/third_party/googletest/googletest /home/jenkins/builds/workspace/shm-fmi-pipe_development/build/linux64/third_party/googletest/googletest/CMakeFiles/gtest_main.dir/DependInfo.cmake --color=
Scanning dependencies of target gtest_main
make[2]: Leaving directory '/home/jenkins/builds/workspace/shm-fmi-pipe_development/build/linux64'
make -f third_party/googletest/googletest/CMakeFiles/gtest_main.dir/build.make third_party/googletest/googletest/CMakeFiles/gtest_main.dir/build
make[2]: Entering directory '/home/jenkins/builds/workspace/shm-fmi-pipe_development/build/linux64'
[ 61%] Building CXX object third_party/googletest/googletest/CMakeFiles/gtest_main.dir/src/gtest_main.cc.o
cd /home/jenkins/builds/workspace/shm-fmi-pipe_development/build/linux64/third_party/googletest/googletest && /usr/bin/c++    -I/home/jenkins/builds/workspace/shm-fmi-pipe_development/third_party/googletest/googletest/include -I/home/jenkins/builds/workspace/shm-fmi-pipe_development/third_party/googletest/googletest  -Wall -Wshadow -DGTEST_HAS_PTHREAD=1 -fexceptions -Wextra -Wno-unused-parameter -Wno-missing-field-initializers -o CMakeFiles/gtest_main.dir/src/gtest_main.cc.o -c /home/jenkins/builds/workspace/shm-fmi-pipe_development/third_party/googletest/googletest/src/gtest_main.cc
[ 62%] Building CXX object libshmfmu/CMakeFiles/libshmfmu.dir/JavaLauncher.cpp.o
cd /home/jenkins/builds/workspace/shm-fmi-pipe_development/build/linux64/libshmfmu && /usr/bin/c++   -Dlibshmfmu_EXPORTS -I/home/jenkins/builds/workspace/shm-fmi-pipe_development/third_party/uuid4/src -I/home/jenkins/builds/workspace/shm-fmi-pipe_development/libshmfmu/includes/fmi -I/home/jenkins/builds/workspace/shm-fmi-pipe_development/libshmfmi/include -I/home/jenkins/builds/workspace/shm-fmi-pipe_development/libshmfmi -I/home/jenkins/builds/workspace/shm-fmi-pipe_development/libshmipc -I/home/jenkins/builds/workspace/shm-fmi-pipe_development/build/linux64/libshmfmi  -std=c++11 -DFMI_COSIMULATION -fPIC   -o CMakeFiles/libshmfmu.dir/JavaLauncher.cpp.o -c /home/jenkins/builds/workspace/shm-fmi-pipe_development/libshmfmu/JavaLauncher.cpp
[ 64%] Linking CXX static library libgtest_main.a
cd /home/jenkins/builds/workspace/shm-fmi-pipe_development/build/linux64/third_party/googletest/googletest && /usr/bin/cmake -P CMakeFiles/gtest_main.dir/cmake_clean_target.cmake
[ 66%] Building CXX object libshmfmu/CMakeFiles/libshmfmu.dir/ConfigFile.cpp.o
cd /home/jenkins/builds/workspace/shm-fmi-pipe_development/build/linux64/libshmfmu && /usr/bin/c++   -Dlibshmfmu_EXPORTS -I/home/jenkins/builds/workspace/shm-fmi-pipe_development/third_party/uuid4/src -I/home/jenkins/builds/workspace/shm-fmi-pipe_development/libshmfmu/includes/fmi -I/home/jenkins/builds/workspace/shm-fmi-pipe_development/libshmfmi/include -I/home/jenkins/builds/workspace/shm-fmi-pipe_development/libshmfmi -I/home/jenkins/builds/workspace/shm-fmi-pipe_development/libshmipc -I/home/jenkins/builds/workspace/shm-fmi-pipe_development/build/linux64/libshmfmi  -std=c++11 -DFMI_COSIMULATION -fPIC   -o CMakeFiles/libshmfmu.dir/ConfigFile.cpp.o -c /home/jenkins/builds/workspace/shm-fmi-pipe_development/libshmfmu/ConfigFile.cpp
cd /home/jenkins/builds/workspace/shm-fmi-pipe_development/build/linux64/third_party/googletest/googletest && /usr/bin/cmake -E cmake_link_script CMakeFiles/gtest_main.dir/link.txt --verbose=1
/usr/bin/ar qc libgtest_main.a  CMakeFiles/gtest_main.dir/src/gtest_main.cc.o
/usr/bin/ranlib libgtest_main.a
make[2]: Leaving directory '/home/jenkins/builds/workspace/shm-fmi-pipe_development/build/linux64'
[ 66%] Built target gtest_main
make -f testlibshmipc/CMakeFiles/testlibshmipc.dir/build.make testlibshmipc/CMakeFiles/testlibshmipc.dir/depend
make[2]: Entering directory '/home/jenkins/builds/workspace/shm-fmi-pipe_development/build/linux64'
cd /home/jenkins/builds/workspace/shm-fmi-pipe_development/build/linux64 && /usr/bin/cmake -E cmake_depends "Unix Makefiles" /home/jenkins/builds/workspace/shm-fmi-pipe_development /home/jenkins/builds/workspace/shm-fmi-pipe_development/testlibshmipc /home/jenkins/builds/workspace/shm-fmi-pipe_development/build/linux64 /home/jenkins/builds/workspace/shm-fmi-pipe_development/build/linux64/testlibshmipc /home/jenkins/builds/workspace/shm-fmi-pipe_development/build/linux64/testlibshmipc/CMakeFiles/testlibshmipc.dir/DependInfo.cmake --color=
Scanning dependencies of target testlibshmipc
make[2]: Leaving directory '/home/jenkins/builds/workspace/shm-fmi-pipe_development/build/linux64'
make -f testlibshmipc/CMakeFiles/testlibshmipc.dir/build.make testlibshmipc/CMakeFiles/testlibshmipc.dir/build
make[2]: Entering directory '/home/jenkins/builds/workspace/shm-fmi-pipe_development/build/linux64'
[ 68%] Building CXX object testlibshmipc/CMakeFiles/testlibshmipc.dir/FmiIpc_Tests.cpp.o
cd /home/jenkins/builds/workspace/shm-fmi-pipe_development/build/linux64/testlibshmipc && /usr/bin/c++    -I/home/jenkins/builds/workspace/shm-fmi-pipe_development/libshmipc -I/home/jenkins/builds/workspace/shm-fmi-pipe_development/third_party/googletest/googletest/include  -std=c++11   -o CMakeFiles/testlibshmipc.dir/FmiIpc_Tests.cpp.o -c /home/jenkins/builds/workspace/shm-fmi-pipe_development/testlibshmipc/FmiIpc_Tests.cpp
[ 70%] Linking CXX executable testfmu-integration-driver
cd /home/jenkins/builds/workspace/shm-fmi-pipe_development/build/linux64/testfmu-integration && /usr/bin/cmake -E cmake_link_script CMakeFiles/testfmu-integration-driver.dir/link.txt --verbose=1
/usr/bin/c++    -std=c++11 -DFMI_COSIMULATION -DFMULIB=\"/home/jenkins/builds/workspace/shm-fmi-pipe_development/build/linux64/libshmfmu/liblibshmfmu.so\" -DTEST_RUNNER_DRIVER_PATH=\"/home/jenkins/builds/workspace/shm-fmi-pipe_development/build/linux64/testfmu-integration/testfmu-integration-driver\"   CMakeFiles/testfmu-integration-driver.dir/runner/testrunner.cpp.o CMakeFiles/testfmu-integration-driver.dir/RemoteTestDriver.cpp.o  -o testfmu-integration-driver -rdynamic ../libshmfmi/liblibshmfmi.a /home/privatejenkins/shm-dependencies/linux64/usr/protobuf/lib/libprotobuf.a -lpthread -lrt -ldl 
make -f testlibshmfmi/CMakeFiles/testlibshmfmi.dir/build.make testlibshmfmi/CMakeFiles/testlibshmfmi.dir/depend
make[2]: Entering directory '/home/jenkins/builds/workspace/shm-fmi-pipe_development/build/linux64'
cd /home/jenkins/builds/workspace/shm-fmi-pipe_development/build/linux64 && /usr/bin/cmake -E cmake_depends "Unix Makefiles" /home/jenkins/builds/workspace/shm-fmi-pipe_development /home/jenkins/builds/workspace/shm-fmi-pipe_development/testlibshmfmi /home/jenkins/builds/workspace/shm-fmi-pipe_development/build/linux64 /home/jenkins/builds/workspace/shm-fmi-pipe_development/build/linux64/testlibshmfmi /home/jenkins/builds/workspace/shm-fmi-pipe_development/build/linux64/testlibshmfmi/CMakeFiles/testlibshmfmi.dir/DependInfo.cmake --color=
Scanning dependencies of target testlibshmfmi
make[2]: Leaving directory '/home/jenkins/builds/workspace/shm-fmi-pipe_development/build/linux64'
make -f testlibshmfmi/CMakeFiles/testlibshmfmi.dir/build.make testlibshmfmi/CMakeFiles/testlibshmfmi.dir/build
make[2]: Entering directory '/home/jenkins/builds/workspace/shm-fmi-pipe_development/build/linux64'
[ 72%] Building CXX object testlibshmfmi/CMakeFiles/testlibshmfmi.dir/RemoteTestDriver.cpp.o
cd /home/jenkins/builds/workspace/shm-fmi-pipe_development/build/linux64/testlibshmfmi && /usr/bin/c++    -I/home/jenkins/builds/workspace/shm-fmi-pipe_development/libshmfmi/include -I/home/jenkins/builds/workspace/shm-fmi-pipe_development/libshmfmi -I/home/jenkins/builds/workspace/shm-fmi-pipe_development/libshmipc -I/home/jenkins/builds/workspace/shm-fmi-pipe_development/build/linux64/libshmfmi -I/home/jenkins/builds/workspace/shm-fmi-pipe_development/third_party/googletest/googletest/include  -std=c++11   -o CMakeFiles/testlibshmfmi.dir/RemoteTestDriver.cpp.o -c /home/jenkins/builds/workspace/shm-fmi-pipe_development/testlibshmfmi/RemoteTestDriver.cpp
[ 74%] Linking CXX shared library liblibshmfmu.so
cd /home/jenkins/builds/workspace/shm-fmi-pipe_development/build/linux64/libshmfmu && /usr/bin/cmake -E cmake_link_script CMakeFiles/libshmfmu.dir/link.txt --verbose=1
/usr/bin/c++  -fPIC  -std=c++11 -DFMI_COSIMULATION  -shared -Wl,-soname,liblibshmfmu.so -o liblibshmfmu.so CMakeFiles/libshmfmu.dir/__/third_party/uuid4/src/uuid4.c.o CMakeFiles/libshmfmu.dir/uri.c.o CMakeFiles/libshmfmu.dir/fmu.cpp.o CMakeFiles/libshmfmu.dir/FmuContainer.cpp.o CMakeFiles/libshmfmu.dir/JavaLauncher.cpp.o CMakeFiles/libshmfmu.dir/ConfigFile.cpp.o ../libshmfmi/liblibshmfmi.a /home/privatejenkins/shm-dependencies/linux64/usr/protobuf/lib/libprotobuf.a -lpthread -lrt -ldl -Wl,-Bstatic -lstdc++ -lpthread -Wl,-Bdynamic 
make[2]: Leaving directory '/home/jenkins/builds/workspace/shm-fmi-pipe_development/build/linux64'
[ 74%] Built target testfmu-integration-driver
[ 75%] Building CXX object testlibshmfmi/CMakeFiles/testlibshmfmi.dir/FmuProxy_Tests.cpp.o
cd /home/jenkins/builds/workspace/shm-fmi-pipe_development/build/linux64/testlibshmfmi && /usr/bin/c++    -I/home/jenkins/builds/workspace/shm-fmi-pipe_development/libshmfmi/include -I/home/jenkins/builds/workspace/shm-fmi-pipe_development/libshmfmi -I/home/jenkins/builds/workspace/shm-fmi-pipe_development/libshmipc -I/home/jenkins/builds/workspace/shm-fmi-pipe_development/build/linux64/libshmfmi -I/home/jenkins/builds/workspace/shm-fmi-pipe_development/third_party/googletest/googletest/include  -std=c++11   -o CMakeFiles/testlibshmfmi.dir/FmuProxy_Tests.cpp.o -c /home/jenkins/builds/workspace/shm-fmi-pipe_development/testlibshmfmi/FmuProxy_Tests.cpp
make -f testlibshmfmu/CMakeFiles/testlibshmfmu.dir/build.make testlibshmfmu/CMakeFiles/testlibshmfmu.dir/depend
make[2]: Entering directory '/home/jenkins/builds/workspace/shm-fmi-pipe_development/build/linux64'
cd /home/jenkins/builds/workspace/shm-fmi-pipe_development/build/linux64 && /usr/bin/cmake -E cmake_depends "Unix Makefiles" /home/jenkins/builds/workspace/shm-fmi-pipe_development /home/jenkins/builds/workspace/shm-fmi-pipe_development/testlibshmfmu /home/jenkins/builds/workspace/shm-fmi-pipe_development/build/linux64 /home/jenkins/builds/workspace/shm-fmi-pipe_development/build/linux64/testlibshmfmu /home/jenkins/builds/workspace/shm-fmi-pipe_development/build/linux64/testlibshmfmu/CMakeFiles/testlibshmfmu.dir/DependInfo.cmake --color=
Scanning dependencies of target testlibshmfmu
make[2]: Leaving directory '/home/jenkins/builds/workspace/shm-fmi-pipe_development/build/linux64'
make -f testlibshmfmu/CMakeFiles/testlibshmfmu.dir/build.make testlibshmfmu/CMakeFiles/testlibshmfmu.dir/build
make[2]: Entering directory '/home/jenkins/builds/workspace/shm-fmi-pipe_development/build/linux64'
[ 77%] Building CXX object testlibshmfmu/CMakeFiles/testlibshmfmu.dir/JavaLauncher_Tests.cpp.o
cd /home/jenkins/builds/workspace/shm-fmi-pipe_development/build/linux64/testlibshmfmu && /usr/bin/c++   -DSOURCE_ROOT=\"/home/jenkins/builds/workspace/shm-fmi-pipe_development/testlibshmfmu\" -I/home/jenkins/builds/workspace/shm-fmi-pipe_development/libshmfmu -I/home/jenkins/builds/workspace/shm-fmi-pipe_development/libshmfmu/include -I/home/jenkins/builds/workspace/shm-fmi-pipe_development/libshmfmi/include -I/home/jenkins/builds/workspace/shm-fmi-pipe_development/libshmfmi -I/home/jenkins/builds/workspace/shm-fmi-pipe_development/libshmipc -I/home/jenkins/builds/workspace/shm-fmi-pipe_development/build/linux64/libshmfmi -I/home/jenkins/builds/workspace/shm-fmi-pipe_development/third_party/googletest/googletest/include  -std=c++11   -o CMakeFiles/testlibshmfmu.dir/JavaLauncher_Tests.cpp.o -c /home/jenkins/builds/workspace/shm-fmi-pipe_development/testlibshmfmu/JavaLauncher_Tests.cpp
make[2]: Leaving directory '/home/jenkins/builds/workspace/shm-fmi-pipe_development/build/linux64'
[ 77%] Built target libshmfmu
[ 79%] Building CXX object testlibshmfmu/CMakeFiles/testlibshmfmu.dir/ConfigFile_Tests.cpp.o
cd /home/jenkins/builds/workspace/shm-fmi-pipe_development/build/linux64/testlibshmfmu && /usr/bin/c++   -DSOURCE_ROOT=\"/home/jenkins/builds/workspace/shm-fmi-pipe_development/testlibshmfmu\" -I/home/jenkins/builds/workspace/shm-fmi-pipe_development/libshmfmu -I/home/jenkins/builds/workspace/shm-fmi-pipe_development/libshmfmu/include -I/home/jenkins/builds/workspace/shm-fmi-pipe_development/libshmfmi/include -I/home/jenkins/builds/workspace/shm-fmi-pipe_development/libshmfmi -I/home/jenkins/builds/workspace/shm-fmi-pipe_development/libshmipc -I/home/jenkins/builds/workspace/shm-fmi-pipe_development/build/linux64/libshmfmi -I/home/jenkins/builds/workspace/shm-fmi-pipe_development/third_party/googletest/googletest/include  -std=c++11   -o CMakeFiles/testlibshmfmu.dir/ConfigFile_Tests.cpp.o -c /home/jenkins/builds/workspace/shm-fmi-pipe_development/testlibshmfmu/ConfigFile_Tests.cpp
[ 81%] Linking CXX executable testlibshmipc
cd /home/jenkins/builds/workspace/shm-fmi-pipe_development/build/linux64/testlibshmipc && /usr/bin/cmake -E cmake_link_script CMakeFiles/testlibshmipc.dir/link.txt --verbose=1
/usr/bin/c++    -std=c++11   CMakeFiles/testlibshmipc.dir/FmiIpc_Tests.cpp.o  -o testlibshmipc -rdynamic ../third_party/googletest/googletest/libgtest_main.a ../libshmfmi/liblibshmfmi.a -lrt ../third_party/googletest/googletest/libgtest.a -lpthread 
make[2]: Leaving directory '/home/jenkins/builds/workspace/shm-fmi-pipe_development/build/linux64'
[ 81%] Built target testlibshmipc
[ 83%] Building CXX object testlibshmfmu/CMakeFiles/testlibshmfmu.dir/URI_Tests.cpp.o
cd /home/jenkins/builds/workspace/shm-fmi-pipe_development/build/linux64/testlibshmfmu && /usr/bin/c++   -DSOURCE_ROOT=\"/home/jenkins/builds/workspace/shm-fmi-pipe_development/testlibshmfmu\" -I/home/jenkins/builds/workspace/shm-fmi-pipe_development/libshmfmu -I/home/jenkins/builds/workspace/shm-fmi-pipe_development/libshmfmu/include -I/home/jenkins/builds/workspace/shm-fmi-pipe_development/libshmfmi/include -I/home/jenkins/builds/workspace/shm-fmi-pipe_development/libshmfmi -I/home/jenkins/builds/workspace/shm-fmi-pipe_development/libshmipc -I/home/jenkins/builds/workspace/shm-fmi-pipe_development/build/linux64/libshmfmi -I/home/jenkins/builds/workspace/shm-fmi-pipe_development/third_party/googletest/googletest/include  -std=c++11   -o CMakeFiles/testlibshmfmu.dir/URI_Tests.cpp.o -c /home/jenkins/builds/workspace/shm-fmi-pipe_development/testlibshmfmu/URI_Tests.cpp
make -f testfmu-integration/CMakeFiles/testfmu-integration.dir/build.make testfmu-integration/CMakeFiles/testfmu-integration.dir/depend
make[2]: Entering directory '/home/jenkins/builds/workspace/shm-fmi-pipe_development/build/linux64'
cd /home/jenkins/builds/workspace/shm-fmi-pipe_development/build/linux64 && /usr/bin/cmake -E cmake_depends "Unix Makefiles" /home/jenkins/builds/workspace/shm-fmi-pipe_development /home/jenkins/builds/workspace/shm-fmi-pipe_development/testfmu-integration /home/jenkins/builds/workspace/shm-fmi-pipe_development/build/linux64 /home/jenkins/builds/workspace/shm-fmi-pipe_development/build/linux64/testfmu-integration /home/jenkins/builds/workspace/shm-fmi-pipe_development/build/linux64/testfmu-integration/CMakeFiles/testfmu-integration.dir/DependInfo.cmake --color=
Scanning dependencies of target testfmu-integration
make[2]: Leaving directory '/home/jenkins/builds/workspace/shm-fmi-pipe_development/build/linux64'
make -f testfmu-integration/CMakeFiles/testfmu-integration.dir/build.make testfmu-integration/CMakeFiles/testfmu-integration.dir/build
make[2]: Entering directory '/home/jenkins/builds/workspace/shm-fmi-pipe_development/build/linux64'
[ 85%] Building C object testfmu-integration/CMakeFiles/testfmu-integration.dir/fmu-loader.c.o
cd /home/jenkins/builds/workspace/shm-fmi-pipe_development/build/linux64/testfmu-integration && /usr/bin/cc   -I/home/jenkins/builds/workspace/shm-fmi-pipe_development/testfmu-integration/include/fmi -I/home/jenkins/builds/workspace/shm-fmi-pipe_development/testfmu-integration/include -I/home/jenkins/builds/workspace/shm-fmi-pipe_development/libshmfmi/include -I/home/jenkins/builds/workspace/shm-fmi-pipe_development/libshmfmi -I/home/jenkins/builds/workspace/shm-fmi-pipe_development/libshmipc -I/home/jenkins/builds/workspace/shm-fmi-pipe_development/build/linux64/libshmfmi -I/home/jenkins/builds/workspace/shm-fmi-pipe_development/third_party/googletest/googletest/include  -pthread -DFMI_COSIMULATION -DFMULIB=\"/home/jenkins/builds/workspace/shm-fmi-pipe_development/build/linux64/libshmfmu/liblibshmfmu.so\"   -o CMakeFiles/testfmu-integration.dir/fmu-loader.c.o   -c /home/jenkins/builds/workspace/shm-fmi-pipe_development/testfmu-integration/fmu-loader.c
[ 87%] Building C object testfmu-integration/CMakeFiles/testfmu-integration.dir/fmuLogger.c.o
cd /home/jenkins/builds/workspace/shm-fmi-pipe_development/build/linux64/testfmu-integration && /usr/bin/cc   -I/home/jenkins/builds/workspace/shm-fmi-pipe_development/testfmu-integration/include/fmi -I/home/jenkins/builds/workspace/shm-fmi-pipe_development/testfmu-integration/include -I/home/jenkins/builds/workspace/shm-fmi-pipe_development/libshmfmi/include -I/home/jenkins/builds/workspace/shm-fmi-pipe_development/libshmfmi -I/home/jenkins/builds/workspace/shm-fmi-pipe_development/libshmipc -I/home/jenkins/builds/workspace/shm-fmi-pipe_development/build/linux64/libshmfmi -I/home/jenkins/builds/workspace/shm-fmi-pipe_development/third_party/googletest/googletest/include  -pthread -DFMI_COSIMULATION -DFMULIB=\"/home/jenkins/builds/workspace/shm-fmi-pipe_development/build/linux64/libshmfmu/liblibshmfmu.so\"   -o CMakeFiles/testfmu-integration.dir/fmuLogger.c.o   -c /home/jenkins/builds/workspace/shm-fmi-pipe_development/testfmu-integration/fmuLogger.c
[ 88%] Building CXX object testfmu-integration/CMakeFiles/testfmu-integration.dir/FMU_Tests.cpp.o
cd /home/jenkins/builds/workspace/shm-fmi-pipe_development/build/linux64/testfmu-integration && /usr/bin/c++    -I/home/jenkins/builds/workspace/shm-fmi-pipe_development/testfmu-integration/include/fmi -I/home/jenkins/builds/workspace/shm-fmi-pipe_development/testfmu-integration/include -I/home/jenkins/builds/workspace/shm-fmi-pipe_development/libshmfmi/include -I/home/jenkins/builds/workspace/shm-fmi-pipe_development/libshmfmi -I/home/jenkins/builds/workspace/shm-fmi-pipe_development/libshmipc -I/home/jenkins/builds/workspace/shm-fmi-pipe_development/build/linux64/libshmfmi -I/home/jenkins/builds/workspace/shm-fmi-pipe_development/third_party/googletest/googletest/include  -std=c++11 -DFMI_COSIMULATION -DFMULIB=\"/home/jenkins/builds/workspace/shm-fmi-pipe_development/build/linux64/libshmfmu/liblibshmfmu.so\" -DTEST_RUNNER_DRIVER_PATH=\"/home/jenkins/builds/workspace/shm-fmi-pipe_development/build/linux64/testfmu-integration/testfmu-integration-driver\"   -o CMakeFiles/testfmu-integration.dir/FMU_Tests.cpp.o -c /home/jenkins/builds/workspace/shm-fmi-pipe_development/testfmu-integration/FMU_Tests.cpp
[ 90%] Building CXX object testfmu-integration/CMakeFiles/testfmu-integration.dir/LibraryLoad_Tests.cpp.o
cd /home/jenkins/builds/workspace/shm-fmi-pipe_development/build/linux64/testfmu-integration && /usr/bin/c++    -I/home/jenkins/builds/workspace/shm-fmi-pipe_development/testfmu-integration/include/fmi -I/home/jenkins/builds/workspace/shm-fmi-pipe_development/testfmu-integration/include -I/home/jenkins/builds/workspace/shm-fmi-pipe_development/libshmfmi/include -I/home/jenkins/builds/workspace/shm-fmi-pipe_development/libshmfmi -I/home/jenkins/builds/workspace/shm-fmi-pipe_development/libshmipc -I/home/jenkins/builds/workspace/shm-fmi-pipe_development/build/linux64/libshmfmi -I/home/jenkins/builds/workspace/shm-fmi-pipe_development/third_party/googletest/googletest/include  -std=c++11 -DFMI_COSIMULATION -DFMULIB=\"/home/jenkins/builds/workspace/shm-fmi-pipe_development/build/linux64/libshmfmu/liblibshmfmu.so\" -DTEST_RUNNER_DRIVER_PATH=\"/home/jenkins/builds/workspace/shm-fmi-pipe_development/build/linux64/testfmu-integration/testfmu-integration-driver\"   -o CMakeFiles/testfmu-integration.dir/LibraryLoad_Tests.cpp.o -c /home/jenkins/builds/workspace/shm-fmi-pipe_development/testfmu-integration/LibraryLoad_Tests.cpp
[ 92%] Linking CXX executable testlibshmfmi
cd /home/jenkins/builds/workspace/shm-fmi-pipe_development/build/linux64/testlibshmfmi && /usr/bin/cmake -E cmake_link_script CMakeFiles/testlibshmfmi.dir/link.txt --verbose=1
/usr/bin/c++    -std=c++11   CMakeFiles/testlibshmfmi.dir/RemoteTestDriver.cpp.o CMakeFiles/testlibshmfmi.dir/FmuProxy_Tests.cpp.o  -o testlibshmfmi -rdynamic ../third_party/googletest/googletest/libgtest_main.a ../libshmfmi/liblibshmfmi.a /home/privatejenkins/shm-dependencies/linux64/usr/protobuf/lib/libprotobuf.a -lpthread -lrt -ldl ../third_party/googletest/googletest/libgtest.a -lpthread 
[ 94%] Linking CXX executable testlibshmfmu
cd /home/jenkins/builds/workspace/shm-fmi-pipe_development/build/linux64/testlibshmfmu && /usr/bin/cmake -E cmake_link_script CMakeFiles/testlibshmfmu.dir/link.txt --verbose=1
/usr/bin/c++    -std=c++11   CMakeFiles/testlibshmfmu.dir/JavaLauncher_Tests.cpp.o CMakeFiles/testlibshmfmu.dir/ConfigFile_Tests.cpp.o CMakeFiles/testlibshmfmu.dir/URI_Tests.cpp.o  -o testlibshmfmu -rdynamic ../third_party/googletest/googletest/libgtest_main.a ../libshmfmu/liblibshmfmu_static.a /home/privatejenkins/shm-dependencies/linux64/usr/protobuf/lib/libprotobuf.a -lpthread -lrt -ldl ../third_party/googletest/googletest/libgtest.a -lpthread 
make[2]: Leaving directory '/home/jenkins/builds/workspace/shm-fmi-pipe_development/build/linux64'
[ 94%] Built target testlibshmfmi
[ 96%] Building CXX object testfmu-integration/CMakeFiles/testfmu-integration.dir/FMU_DualLoad_Tests.cpp.o
cd /home/jenkins/builds/workspace/shm-fmi-pipe_development/build/linux64/testfmu-integration && /usr/bin/c++    -I/home/jenkins/builds/workspace/shm-fmi-pipe_development/testfmu-integration/include/fmi -I/home/jenkins/builds/workspace/shm-fmi-pipe_development/testfmu-integration/include -I/home/jenkins/builds/workspace/shm-fmi-pipe_development/libshmfmi/include -I/home/jenkins/builds/workspace/shm-fmi-pipe_development/libshmfmi -I/home/jenkins/builds/workspace/shm-fmi-pipe_development/libshmipc -I/home/jenkins/builds/workspace/shm-fmi-pipe_development/build/linux64/libshmfmi -I/home/jenkins/builds/workspace/shm-fmi-pipe_development/third_party/googletest/googletest/include  -std=c++11 -DFMI_COSIMULATION -DFMULIB=\"/home/jenkins/builds/workspace/shm-fmi-pipe_development/build/linux64/libshmfmu/liblibshmfmu.so\" -DTEST_RUNNER_DRIVER_PATH=\"/home/jenkins/builds/workspace/shm-fmi-pipe_development/build/linux64/testfmu-integration/testfmu-integration-driver\"   -o CMakeFiles/testfmu-integration.dir/FMU_DualLoad_Tests.cpp.o -c /home/jenkins/builds/workspace/shm-fmi-pipe_development/testfmu-integration/FMU_DualLoad_Tests.cpp
make[2]: Leaving directory '/home/jenkins/builds/workspace/shm-fmi-pipe_development/build/linux64'
[ 96%] Built target testlibshmfmu
[ 98%] Building CXX object testfmu-integration/CMakeFiles/testfmu-integration.dir/resource_location.cpp.o
cd /home/jenkins/builds/workspace/shm-fmi-pipe_development/build/linux64/testfmu-integration && /usr/bin/c++    -I/home/jenkins/builds/workspace/shm-fmi-pipe_development/testfmu-integration/include/fmi -I/home/jenkins/builds/workspace/shm-fmi-pipe_development/testfmu-integration/include -I/home/jenkins/builds/workspace/shm-fmi-pipe_development/libshmfmi/include -I/home/jenkins/builds/workspace/shm-fmi-pipe_development/libshmfmi -I/home/jenkins/builds/workspace/shm-fmi-pipe_development/libshmipc -I/home/jenkins/builds/workspace/shm-fmi-pipe_development/build/linux64/libshmfmi -I/home/jenkins/builds/workspace/shm-fmi-pipe_development/third_party/googletest/googletest/include  -std=c++11 -DFMI_COSIMULATION -DFMULIB=\"/home/jenkins/builds/workspace/shm-fmi-pipe_development/build/linux64/libshmfmu/liblibshmfmu.so\" -DTEST_RUNNER_DRIVER_PATH=\"/home/jenkins/builds/workspace/shm-fmi-pipe_development/build/linux64/testfmu-integration/testfmu-integration-driver\"   -o CMakeFiles/testfmu-integration.dir/resource_location.cpp.o -c /home/jenkins/builds/workspace/shm-fmi-pipe_development/testfmu-integration/resource_location.cpp
[100%] Linking CXX executable testfmu-integration
cd /home/jenkins/builds/workspace/shm-fmi-pipe_development/build/linux64/testfmu-integration && /usr/bin/cmake -E cmake_link_script CMakeFiles/testfmu-integration.dir/link.txt --verbose=1
/usr/bin/c++    -std=c++11 -DFMI_COSIMULATION -DFMULIB=\"/home/jenkins/builds/workspace/shm-fmi-pipe_development/build/linux64/libshmfmu/liblibshmfmu.so\" -DTEST_RUNNER_DRIVER_PATH=\"/home/jenkins/builds/workspace/shm-fmi-pipe_development/build/linux64/testfmu-integration/testfmu-integration-driver\"   CMakeFiles/testfmu-integration.dir/fmu-loader.c.o CMakeFiles/testfmu-integration.dir/fmuLogger.c.o CMakeFiles/testfmu-integration.dir/FMU_Tests.cpp.o CMakeFiles/testfmu-integration.dir/LibraryLoad_Tests.cpp.o CMakeFiles/testfmu-integration.dir/FMU_DualLoad_Tests.cpp.o CMakeFiles/testfmu-integration.dir/resource_location.cpp.o  -o testfmu-integration -rdynamic ../third_party/googletest/googletest/libgtest_main.a -lrt -ldl ../third_party/googletest/googletest/libgtest.a -lpthread 
make[2]: Leaving directory '/home/jenkins/builds/workspace/shm-fmi-pipe_development/build/linux64'
[100%] Built target testfmu-integration
make[1]: Leaving directory '/home/jenkins/builds/workspace/shm-fmi-pipe_development/build/linux64'
/usr/bin/cmake -E cmake_progress_start /home/jenkins/builds/workspace/shm-fmi-pipe_development/build/linux64/CMakeFiles 0
make: Leaving directory '/home/jenkins/builds/workspace/shm-fmi-pipe_development/build/linux64'
make: Entering directory '/home/jenkins/builds/workspace/shm-fmi-pipe_development/build/linux64'
Running tests...
/usr/bin/ctest --force-new-ctest-process 
Test project /home/jenkins/builds/workspace/shm-fmi-pipe_development/build/linux64
    Start 1: AllTestsIn-testlibshmipc
1/4 Test #1: AllTestsIn-testlibshmipc .........   Passed    0.41 sec
    Start 2: AllTestsIn-testlibshmfmi
2/4 Test #2: AllTestsIn-testlibshmfmi .........   Passed    3.82 sec
    Start 3: AllTestsIn-testlibshmfmu
3/4 Test #3: AllTestsIn-testlibshmfmu .........   Passed    0.01 sec
    Start 4: AllTestsIn-testfmu-integration
4/4 Test #4: AllTestsIn-testfmu-integration ...   Passed   32.30 sec

100% tests passed, 0 tests failed out of 4

Total Test time (real) =  36.54 sec
make: Leaving directory '/home/jenkins/builds/workspace/shm-fmi-pipe_development/build/linux64'
[Pipeline] }
Lock released on resource [SHM-FMI-TEST]
[Pipeline] // lock
[Pipeline] sh
+ ./list-dependencies.sh
Listing dependencies

*.dylib
./build/darwin64/shmfmi-server/libsharedmemory.dylib
./build/darwin64/shmfmi-server/libsharedmemory.dylib:
	/home/jenkins/builds/workspace/shm-fmi-pipe_development/build/darwin64/shmfmi-server/libsharedmemory.dylib (compatibility version 0.0.0, current version 0.0.0)
	/usr/lib/libSystem.B.dylib (compatibility version 1.0.0, current version 1225.1.1)
./build/darwin64/libshmfmu/liblibshmfmu.dylib
./build/darwin64/libshmfmu/liblibshmfmu.dylib:
	/home/jenkins/builds/workspace/shm-fmi-pipe_development/build/darwin64/libshmfmu/liblibshmfmu.dylib (compatibility version 0.0.0, current version 0.0.0)
	/usr/lib/libSystem.B.dylib (compatibility version 1.0.0, current version 1225.1.1)
./coe-test/fmus/singlewatertank/binaries/darwin64/singlewatertank.dylib
./coe-test/fmus/singlewatertank/binaries/darwin64/singlewatertank.dylib:
	../../../target/fmu/binaries/darwin64/singlewatertank.dylib (compatibility version 0.0.0, current version 0.0.0)
	/usr/lib/libSystem.B.dylib (compatibility version 1.0.0, current version 1213.0.0)

*.so
./build/linux32/shmfmi-server/libsharedmemory.so
	linux-gate.so.1 =>  (0xf774a000)
	libpthread.so.0 => /lib/i386-linux-gnu/libpthread.so.0 (0xf75eb000)
	librt.so.1 => /lib/i386-linux-gnu/librt.so.1 (0xf75e2000)
	libgcc_s.so.1 => /lib/i386-linux-gnu/libgcc_s.so.1 (0xf75c4000)
	libc.so.6 => /lib/i386-linux-gnu/libc.so.6 (0xf740e000)
	/lib/ld-linux.so.2 (0x56556000)
./build/linux32/libshmfmu/liblibshmfmu.so
	linux-gate.so.1 =>  (0xf775d000)
	libpthread.so.0 => /lib/i386-linux-gnu/libpthread.so.0 (0xf72cd000)
	librt.so.1 => /lib/i386-linux-gnu/librt.so.1 (0xf72c4000)
	libm.so.6 => /lib/i386-linux-gnu/libm.so.6 (0xf726e000)
	libgcc_s.so.1 => /lib/i386-linux-gnu/libgcc_s.so.1 (0xf7251000)
	libc.so.6 => /lib/i386-linux-gnu/libc.so.6 (0xf709b000)
	/lib/ld-linux.so.2 (0x565a1000)
./build/linux64/shmfmi-server/libsharedmemory.so
	linux-vdso.so.1 =>  (0x00007fffb75f3000)
	libpthread.so.0 => /lib/x86_64-linux-gnu/libpthread.so.0 (0x00007f5174e6d000)
	librt.so.1 => /lib/x86_64-linux-gnu/librt.so.1 (0x00007f5174c65000)
	libgcc_s.so.1 => /lib/x86_64-linux-gnu/libgcc_s.so.1 (0x00007f5174a4e000)
	libc.so.6 => /lib/x86_64-linux-gnu/libc.so.6 (0x00007f5174685000)
	/lib64/ld-linux-x86-64.so.2 (0x000056078314c000)
./build/linux64/libshmfmu/liblibshmfmu.so
	linux-vdso.so.1 =>  (0x00007ffc3b12e000)
	libpthread.so.0 => /lib/x86_64-linux-gnu/libpthread.so.0 (0x00007f2ab282f000)
	librt.so.1 => /lib/x86_64-linux-gnu/librt.so.1 (0x00007f2ab2627000)
	libm.so.6 => /lib/x86_64-linux-gnu/libm.so.6 (0x00007f2ab231d000)
	libgcc_s.so.1 => /lib/x86_64-linux-gnu/libgcc_s.so.1 (0x00007f2ab2107000)
	libc.so.6 => /lib/x86_64-linux-gnu/libc.so.6 (0x00007f2ab1d3e000)
	/lib64/ld-linux-x86-64.so.2 (0x000055b199c4e000)
./coe-test/fmus/singlewatertank/binaries/linux32/singlewatertank.so
	linux-gate.so.1 =>  (0xf77ee000)
	libc.so.6 => /lib/i386-linux-gnu/libc.so.6 (0xf7617000)
	/lib/ld-linux.so.2 (0x565f5000)
./coe-test/fmus/singlewatertank/binaries/linux64/singlewatertank.so
	linux-vdso.so.1 =>  (0x00007fff303de000)
	libc.so.6 => /lib/x86_64-linux-gnu/libc.so.6 (0x00007fa61eeb2000)
	/lib64/ld-linux-x86-64.so.2 (0x000055e65a4e5000)

*.dll
./build/win32/shmfmi-server/sharedmemory.dll
	DLL Name: KERNEL32.dll
	DLL Name: msvcrt.dll
./build/win32/libshmfmu/libshmfmu.dll
	DLL Name: ADVAPI32.dll
	DLL Name: KERNEL32.dll
	DLL Name: msvcrt.dll
	DLL Name: USER32.dll
./build/win64/shmfmi-server/sharedmemory.dll
	DLL Name: KERNEL32.dll
	DLL Name: msvcrt.dll
./build/win64/libshmfmu/libshmfmu.dll
	DLL Name: ADVAPI32.dll
	DLL Name: KERNEL32.dll
	DLL Name: msvcrt.dll
	DLL Name: USER32.dll
./coe-test/fmus/singlewatertank/binaries/win32/singlewatertank.dll
	DLL Name: KERNEL32.dll
	DLL Name: msvcrt.dll
./coe-test/fmus/singlewatertank/binaries/win64/singlewatertank.dll
	DLL Name: KERNEL32.dll
	DLL Name: msvcrt.dll
[Pipeline] stash
Stashed 24 file(s)
[Pipeline] }
Running on jenkinscrosscompiler in /home/jenkins/builds/workspace/shm-fmi-pipe_development
[Pipeline] // node
[Pipeline] {
[Pipeline] }
[Pipeline] checkout
using credential swengaudk
Fetching changes from the remote Git repository
Fetching without tags
 > /usr/bin/git rev-parse --is-inside-work-tree # timeout=10
 > /usr/bin/git config remote.origin.url https://github.com/overturetool/shm-fmi.git # timeout=10
Fetching upstream changes from https://github.com/overturetool/shm-fmi.git
 > /usr/bin/git --version # timeout=10
using GIT_ASKPASS to set credentials swengaudk token on github
 > /usr/bin/git fetch --no-tags --progress https://github.com/overturetool/shm-fmi.git +refs/heads/development:refs/remotes/origin/development # timeout=10
Checking out Revision f6e3b5cde8b2c3a81eb284cf3203a9dfb368abc5 (development)
Commit message: "corrected external job and do not wait"
 > /usr/bin/git config core.sparsecheckout # timeout=10
 > /usr/bin/git checkout -f f6e3b5cde8b2c3a81eb284cf3203a9dfb368abc5 # timeout=10
[Pipeline] sh
+ git submodule update --init
[Pipeline] lock
Trying to acquire lock on [SHM-FMI-TEST]
Lock acquired on [SHM-FMI-TEST]
[Pipeline] {
[Pipeline] sh
+ SHM_DEPENDENCIES_ROOT=/home/privatejenkins/shm-dependencies ./xcompile.sh -win32
Building with dependencies from: '/home/privatejenkins/shm-dependencies' using make -j4
Storing git info in git-info.txt
Building Win32 .dll
-- The C compiler identification is GNU 5.3.1
-- The CXX compiler identification is GNU 5.3.1
-- Check for working C compiler: /usr/bin/i686-w64-mingw32-gcc
-- Check for working C compiler: /usr/bin/i686-w64-mingw32-gcc -- works
-- Detecting C compiler ABI info
-- Detecting C compiler ABI info - done
-- Detecting C compile features
-- Detecting C compile features - done
-- Check for working CXX compiler: /usr/bin/i686-w64-mingw32-g++
-- Check for working CXX compiler: /usr/bin/i686-w64-mingw32-g++ -- works
-- Detecting CXX compiler ABI info
-- Detecting CXX compiler ABI info - done
-- Detecting CXX compile features
-- Detecting CXX compile features - done
-- Performing Test COMPILER_SUPPORTS_CXX11
-- Performing Test COMPILER_SUPPORTS_CXX11 - Success
-- Performing Test COMPILER_SUPPORTS_CXX0X
-- Performing Test COMPILER_SUPPORTS_CXX0X - Success
-- Found Protobuf: /home/privatejenkins/shm-dependencies/win32/usr/protobuf/lib/libprotobuf.a  
-- Static linking with libstdc++.a in /usr/lib/gcc/i686-w64-mingw32/5.3-win32/libstdc++.a
-- Static linking with libstdc++.a in /usr/lib/gcc/i686-w64-mingw32/5.3-win32/libstdc++.a
-- Found PythonInterp: /usr/bin/python (found version "2.7.12") 
CMake Warning (dev) at testfmu-integration/CMakeLists.txt:24 (get_property):
  Policy CMP0026 is not set: Disallow use of the LOCATION target property.
  Run "cmake --help-policy CMP0026" for policy details.  Use the cmake_policy
  command to set the policy and suppress this warning.

  The LOCATION property should not be read from target "libshmfmu".  Use the
  target name directly with add_custom_command, or use the generator
  expression $<TARGET_FILE>, as appropriate.

This warning is for project developers.  Use -Wno-dev to suppress it.

-- Configuring done
-- Generating done
-- Build files have been written to: /home/jenkins/builds/workspace/shm-fmi-pipe_development/build/win32
make: Entering directory '/home/jenkins/builds/workspace/shm-fmi-pipe_development/build/win32'
/usr/bin/cmake -H/home/jenkins/builds/workspace/shm-fmi-pipe_development -B/home/jenkins/builds/workspace/shm-fmi-pipe_development/build/win32 --check-build-system CMakeFiles/Makefile.cmake 0
/usr/bin/cmake -E cmake_progress_start /home/jenkins/builds/workspace/shm-fmi-pipe_development/build/win32/CMakeFiles /home/jenkins/builds/workspace/shm-fmi-pipe_development/build/win32/CMakeFiles/progress.marks
make -f CMakeFiles/Makefile2 all
make[1]: Entering directory '/home/jenkins/builds/workspace/shm-fmi-pipe_development/build/win32'
make -f libshmipc/CMakeFiles/libshmipc.dir/build.make libshmipc/CMakeFiles/libshmipc.dir/depend
make -f libshmfmi/CMakeFiles/libshmfmi.dir/build.make libshmfmi/CMakeFiles/libshmfmi.dir/depend
make -f libshmfmu/CMakeFiles/libshmfmu_static.dir/build.make libshmfmu/CMakeFiles/libshmfmu_static.dir/depend
make -f third_party/googletest/googletest/CMakeFiles/gtest.dir/build.make third_party/googletest/googletest/CMakeFiles/gtest.dir/depend
make[2]: Entering directory '/home/jenkins/builds/workspace/shm-fmi-pipe_development/build/win32'
cd /home/jenkins/builds/workspace/shm-fmi-pipe_development/build/win32 && /usr/bin/cmake -E cmake_depends "Unix Makefiles" /home/jenkins/builds/workspace/shm-fmi-pipe_development /home/jenkins/builds/workspace/shm-fmi-pipe_development/third_party/googletest/googletest /home/jenkins/builds/workspace/shm-fmi-pipe_development/build/win32 /home/jenkins/builds/workspace/shm-fmi-pipe_development/build/win32/third_party/googletest/googletest /home/jenkins/builds/workspace/shm-fmi-pipe_development/build/win32/third_party/googletest/googletest/CMakeFiles/gtest.dir/DependInfo.cmake --color=
make[2]: Entering directory '/home/jenkins/builds/workspace/shm-fmi-pipe_development/build/win32'
cd /home/jenkins/builds/workspace/shm-fmi-pipe_development/build/win32 && /usr/bin/cmake -E cmake_depends "Unix Makefiles" /home/jenkins/builds/workspace/shm-fmi-pipe_development /home/jenkins/builds/workspace/shm-fmi-pipe_development/libshmipc /home/jenkins/builds/workspace/shm-fmi-pipe_development/build/win32 /home/jenkins/builds/workspace/shm-fmi-pipe_development/build/win32/libshmipc /home/jenkins/builds/workspace/shm-fmi-pipe_development/build/win32/libshmipc/CMakeFiles/libshmipc.dir/DependInfo.cmake --color=
make[2]: Entering directory '/home/jenkins/builds/workspace/shm-fmi-pipe_development/build/win32'
cd /home/jenkins/builds/workspace/shm-fmi-pipe_development/build/win32 && /usr/bin/cmake -E cmake_depends "Unix Makefiles" /home/jenkins/builds/workspace/shm-fmi-pipe_development /home/jenkins/builds/workspace/shm-fmi-pipe_development/libshmfmu /home/jenkins/builds/workspace/shm-fmi-pipe_development/build/win32 /home/jenkins/builds/workspace/shm-fmi-pipe_development/build/win32/libshmfmu /home/jenkins/builds/workspace/shm-fmi-pipe_development/build/win32/libshmfmu/CMakeFiles/libshmfmu_static.dir/DependInfo.cmake --color=
make[2]: Entering directory '/home/jenkins/builds/workspace/shm-fmi-pipe_development/build/win32'
[  1%] Running C++ protocol buffer compiler on ../proto/service.proto
cd /home/jenkins/builds/workspace/shm-fmi-pipe_development/build/win32/libshmfmi && /usr/bin/protoc --cpp_out /home/jenkins/builds/workspace/shm-fmi-pipe_development/build/win32/libshmfmi -I /home/jenkins/builds/workspace/shm-fmi-pipe_development/proto /home/jenkins/builds/workspace/shm-fmi-pipe_development/proto/service.proto
Scanning dependencies of target gtest
make[2]: Leaving directory '/home/jenkins/builds/workspace/shm-fmi-pipe_development/build/win32'
make -f third_party/googletest/googletest/CMakeFiles/gtest.dir/build.make third_party/googletest/googletest/CMakeFiles/gtest.dir/build
make[2]: Entering directory '/home/jenkins/builds/workspace/shm-fmi-pipe_development/build/win32'
Scanning dependencies of target libshmipc
Scanning dependencies of target libshmfmu_static
make[2]: Leaving directory '/home/jenkins/builds/workspace/shm-fmi-pipe_development/build/win32'
make -f libshmfmu/CMakeFiles/libshmfmu_static.dir/build.make libshmfmu/CMakeFiles/libshmfmu_static.dir/build
[  3%] Building CXX object third_party/googletest/googletest/CMakeFiles/gtest.dir/src/gtest-all.cc.obj
cd /home/jenkins/builds/workspace/shm-fmi-pipe_development/build/win32/third_party/googletest/googletest && /usr/bin/i686-w64-mingw32-g++    @CMakeFiles/gtest.dir/includes_CXX.rsp -Wall -Wshadow -DGTEST_HAS_PTHREAD=0 -fexceptions -Wextra -Wno-unused-parameter -Wno-missing-field-initializers -o CMakeFiles/gtest.dir/src/gtest-all.cc.obj -c /home/jenkins/builds/workspace/shm-fmi-pipe_development/third_party/googletest/googletest/src/gtest-all.cc
make[2]: Leaving directory '/home/jenkins/builds/workspace/shm-fmi-pipe_development/build/win32'
make -f libshmipc/CMakeFiles/libshmipc.dir/build.make libshmipc/CMakeFiles/libshmipc.dir/build
make[2]: Entering directory '/home/jenkins/builds/workspace/shm-fmi-pipe_development/build/win32'
make[2]: Entering directory '/home/jenkins/builds/workspace/shm-fmi-pipe_development/build/win32'
[  5%] Building CXX object libshmipc/CMakeFiles/libshmipc.dir/ipcmain.cpp.obj
[  7%] Building C object libshmfmu/CMakeFiles/libshmfmu_static.dir/__/third_party/uuid4/src/uuid4.c.obj
cd /home/jenkins/builds/workspace/shm-fmi-pipe_development/build/win32/libshmipc && /usr/bin/i686-w64-mingw32-g++    @CMakeFiles/libshmipc.dir/includes_CXX.rsp -std=c++11 -pthread   -o CMakeFiles/libshmipc.dir/ipcmain.cpp.obj -c /home/jenkins/builds/workspace/shm-fmi-pipe_development/libshmipc/ipcmain.cpp
cd /home/jenkins/builds/workspace/shm-fmi-pipe_development/build/win32/libshmfmu && /usr/bin/i686-w64-mingw32-gcc   @CMakeFiles/libshmfmu_static.dir/includes_C.rsp -DFMI_COSIMULATION   -o CMakeFiles/libshmfmu_static.dir/__/third_party/uuid4/src/uuid4.c.obj   -c /home/jenkins/builds/workspace/shm-fmi-pipe_development/third_party/uuid4/src/uuid4.c
cd /home/jenkins/builds/workspace/shm-fmi-pipe_development/build/win32 && /usr/bin/cmake -E cmake_depends "Unix Makefiles" /home/jenkins/builds/workspace/shm-fmi-pipe_development /home/jenkins/builds/workspace/shm-fmi-pipe_development/libshmfmi /home/jenkins/builds/workspace/shm-fmi-pipe_development/build/win32 /home/jenkins/builds/workspace/shm-fmi-pipe_development/build/win32/libshmfmi /home/jenkins/builds/workspace/shm-fmi-pipe_development/build/win32/libshmfmi/CMakeFiles/libshmfmi.dir/DependInfo.cmake --color=
Scanning dependencies of target libshmfmi
make[2]: Leaving directory '/home/jenkins/builds/workspace/shm-fmi-pipe_development/build/win32'
make -f libshmfmi/CMakeFiles/libshmfmi.dir/build.make libshmfmi/CMakeFiles/libshmfmi.dir/build
make[2]: Entering directory '/home/jenkins/builds/workspace/shm-fmi-pipe_development/build/win32'
[  9%] Building CXX object libshmfmi/CMakeFiles/libshmfmi.dir/__/libshmipc/sem_timedwait.cpp.obj
cd /home/jenkins/builds/workspace/shm-fmi-pipe_development/build/win32/libshmfmi && /usr/bin/i686-w64-mingw32-g++    @CMakeFiles/libshmfmi.dir/includes_CXX.rsp -std=c++11   -o CMakeFiles/libshmfmi.dir/__/libshmipc/sem_timedwait.cpp.obj -c /home/jenkins/builds/workspace/shm-fmi-pipe_development/libshmipc/sem_timedwait.cpp
[ 11%] Building CXX object libshmfmi/CMakeFiles/libshmfmi.dir/__/libshmipc/IpcBase.cpp.obj
cd /home/jenkins/builds/workspace/shm-fmi-pipe_development/build/win32/libshmfmi && /usr/bin/i686-w64-mingw32-g++    @CMakeFiles/libshmfmi.dir/includes_CXX.rsp -std=c++11   -o CMakeFiles/libshmfmi.dir/__/libshmipc/IpcBase.cpp.obj -c /home/jenkins/builds/workspace/shm-fmi-pipe_development/libshmipc/IpcBase.cpp
[ 12%] Building C object libshmfmu/CMakeFiles/libshmfmu_static.dir/uri.c.obj
cd /home/jenkins/builds/workspace/shm-fmi-pipe_development/build/win32/libshmfmu && /usr/bin/i686-w64-mingw32-gcc   @CMakeFiles/libshmfmu_static.dir/includes_C.rsp -DFMI_COSIMULATION   -o CMakeFiles/libshmfmu_static.dir/uri.c.obj   -c /home/jenkins/builds/workspace/shm-fmi-pipe_development/libshmfmu/uri.c
[ 14%] Building CXX object libshmfmu/CMakeFiles/libshmfmu_static.dir/fmu.cpp.obj
cd /home/jenkins/builds/workspace/shm-fmi-pipe_development/build/win32/libshmfmu && /usr/bin/i686-w64-mingw32-g++    @CMakeFiles/libshmfmu_static.dir/includes_CXX.rsp -std=c++11 -DFMI_COSIMULATION   -o CMakeFiles/libshmfmu_static.dir/fmu.cpp.obj -c /home/jenkins/builds/workspace/shm-fmi-pipe_development/libshmfmu/fmu.cpp
[ 16%] Building CXX object libshmfmi/CMakeFiles/libshmfmi.dir/__/libshmipc/IpcServer.cpp.obj
cd /home/jenkins/builds/workspace/shm-fmi-pipe_development/build/win32/libshmfmi && /usr/bin/i686-w64-mingw32-g++    @CMakeFiles/libshmfmi.dir/includes_CXX.rsp -std=c++11   -o CMakeFiles/libshmfmi.dir/__/libshmipc/IpcServer.cpp.obj -c /home/jenkins/builds/workspace/shm-fmi-pipe_development/libshmipc/IpcServer.cpp
[ 18%] Building CXX object libshmipc/CMakeFiles/libshmipc.dir/IpcBase.cpp.obj
cd /home/jenkins/builds/workspace/shm-fmi-pipe_development/build/win32/libshmipc && /usr/bin/i686-w64-mingw32-g++    @CMakeFiles/libshmipc.dir/includes_CXX.rsp -std=c++11 -pthread   -o CMakeFiles/libshmipc.dir/IpcBase.cpp.obj -c /home/jenkins/builds/workspace/shm-fmi-pipe_development/libshmipc/IpcBase.cpp
[ 20%] Building CXX object libshmipc/CMakeFiles/libshmipc.dir/IpcClient.cpp.obj
cd /home/jenkins/builds/workspace/shm-fmi-pipe_development/build/win32/libshmipc && /usr/bin/i686-w64-mingw32-g++    @CMakeFiles/libshmipc.dir/includes_CXX.rsp -std=c++11 -pthread   -o CMakeFiles/libshmipc.dir/IpcClient.cpp.obj -c /home/jenkins/builds/workspace/shm-fmi-pipe_development/libshmipc/IpcClient.cpp
[ 22%] Building CXX object libshmfmi/CMakeFiles/libshmfmi.dir/__/libshmipc/IpcClient.cpp.obj
cd /home/jenkins/builds/workspace/shm-fmi-pipe_development/build/win32/libshmfmi && /usr/bin/i686-w64-mingw32-g++    @CMakeFiles/libshmfmi.dir/includes_CXX.rsp -std=c++11   -o CMakeFiles/libshmfmi.dir/__/libshmipc/IpcClient.cpp.obj -c /home/jenkins/builds/workspace/shm-fmi-pipe_development/libshmipc/IpcClient.cpp
[ 24%] Building CXX object libshmfmu/CMakeFiles/libshmfmu_static.dir/FmuContainer.cpp.obj
cd /home/jenkins/builds/workspace/shm-fmi-pipe_development/build/win32/libshmfmu && /usr/bin/i686-w64-mingw32-g++    @CMakeFiles/libshmfmu_static.dir/includes_CXX.rsp -std=c++11 -DFMI_COSIMULATION   -o CMakeFiles/libshmfmu_static.dir/FmuContainer.cpp.obj -c /home/jenkins/builds/workspace/shm-fmi-pipe_development/libshmfmu/FmuContainer.cpp
[ 25%] Building CXX object libshmipc/CMakeFiles/libshmipc.dir/sem_timedwait.cpp.obj
cd /home/jenkins/builds/workspace/shm-fmi-pipe_development/build/win32/libshmipc && /usr/bin/i686-w64-mingw32-g++    @CMakeFiles/libshmipc.dir/includes_CXX.rsp -std=c++11 -pthread   -o CMakeFiles/libshmipc.dir/sem_timedwait.cpp.obj -c /home/jenkins/builds/workspace/shm-fmi-pipe_development/libshmipc/sem_timedwait.cpp
[ 27%] Building CXX object libshmipc/CMakeFiles/libshmipc.dir/IpcServer.cpp.obj
cd /home/jenkins/builds/workspace/shm-fmi-pipe_development/build/win32/libshmipc && /usr/bin/i686-w64-mingw32-g++    @CMakeFiles/libshmipc.dir/includes_CXX.rsp -std=c++11 -pthread   -o CMakeFiles/libshmipc.dir/IpcServer.cpp.obj -c /home/jenkins/builds/workspace/shm-fmi-pipe_development/libshmipc/IpcServer.cpp
[ 29%] Building CXX object libshmfmi/CMakeFiles/libshmfmi.dir/service.pb.cc.obj
cd /home/jenkins/builds/workspace/shm-fmi-pipe_development/build/win32/libshmfmi && /usr/bin/i686-w64-mingw32-g++    @CMakeFiles/libshmfmi.dir/includes_CXX.rsp -std=c++11   -o CMakeFiles/libshmfmi.dir/service.pb.cc.obj -c /home/jenkins/builds/workspace/shm-fmi-pipe_development/build/win32/libshmfmi/service.pb.cc
[ 31%] Linking CXX executable libshmipc.exe
cd /home/jenkins/builds/workspace/shm-fmi-pipe_development/build/win32/libshmipc && /usr/bin/cmake -E cmake_link_script CMakeFiles/libshmipc.dir/link.txt --verbose=1
/usr/bin/cmake -E remove -f CMakeFiles/libshmipc.dir/objects.a
/usr/bin/i686-w64-mingw32-ar cr CMakeFiles/libshmipc.dir/objects.a @CMakeFiles/libshmipc.dir/objects1.rsp
/usr/bin/i686-w64-mingw32-g++   -std=c++11 -pthread   -static-libstdc++ -static-libgcc -Wl,--whole-archive CMakeFiles/libshmipc.dir/objects.a -Wl,--no-whole-archive  -o libshmipc.exe -Wl,--out-implib,liblibshmipc.dll.a -Wl,--major-image-version,0,--minor-image-version,0 @CMakeFiles/libshmipc.dir/linklibs.rsp
make[2]: Leaving directory '/home/jenkins/builds/workspace/shm-fmi-pipe_development/build/win32'
[ 31%] Built target libshmipc
[ 33%] Building CXX object libshmfmi/CMakeFiles/libshmfmi.dir/FmuProxy.cpp.obj
cd /home/jenkins/builds/workspace/shm-fmi-pipe_development/build/win32/libshmfmi && /usr/bin/i686-w64-mingw32-g++    @CMakeFiles/libshmfmi.dir/includes_CXX.rsp -std=c++11   -o CMakeFiles/libshmfmi.dir/FmuProxy.cpp.obj -c /home/jenkins/builds/workspace/shm-fmi-pipe_development/libshmfmi/FmuProxy.cpp
[ 35%] Building CXX object libshmfmu/CMakeFiles/libshmfmu_static.dir/JavaLauncher.cpp.obj
cd /home/jenkins/builds/workspace/shm-fmi-pipe_development/build/win32/libshmfmu && /usr/bin/i686-w64-mingw32-g++    @CMakeFiles/libshmfmu_static.dir/includes_CXX.rsp -std=c++11 -DFMI_COSIMULATION   -o CMakeFiles/libshmfmu_static.dir/JavaLauncher.cpp.obj -c /home/jenkins/builds/workspace/shm-fmi-pipe_development/libshmfmu/JavaLauncher.cpp
[ 37%] Linking CXX static library libgtest.a
cd /home/jenkins/builds/workspace/shm-fmi-pipe_development/build/win32/third_party/googletest/googletest && /usr/bin/cmake -P CMakeFiles/gtest.dir/cmake_clean_target.cmake
[ 38%] Building CXX object libshmfmu/CMakeFiles/libshmfmu_static.dir/ConfigFile.cpp.obj
cd /home/jenkins/builds/workspace/shm-fmi-pipe_development/build/win32/libshmfmu && /usr/bin/i686-w64-mingw32-g++    @CMakeFiles/libshmfmu_static.dir/includes_CXX.rsp -std=c++11 -DFMI_COSIMULATION   -o CMakeFiles/libshmfmu_static.dir/ConfigFile.cpp.obj -c /home/jenkins/builds/workspace/shm-fmi-pipe_development/libshmfmu/ConfigFile.cpp
cd /home/jenkins/builds/workspace/shm-fmi-pipe_development/build/win32/third_party/googletest/googletest && /usr/bin/cmake -E cmake_link_script CMakeFiles/gtest.dir/link.txt --verbose=1
/usr/bin/i686-w64-mingw32-ar qc libgtest.a  CMakeFiles/gtest.dir/src/gtest-all.cc.obj
/usr/bin/i686-w64-mingw32-ranlib libgtest.a
make[2]: Leaving directory '/home/jenkins/builds/workspace/shm-fmi-pipe_development/build/win32'
[ 38%] Built target gtest
make -f third_party/googletest/googletest/CMakeFiles/gtest_main.dir/build.make third_party/googletest/googletest/CMakeFiles/gtest_main.dir/depend
make[2]: Entering directory '/home/jenkins/builds/workspace/shm-fmi-pipe_development/build/win32'
cd /home/jenkins/builds/workspace/shm-fmi-pipe_development/build/win32 && /usr/bin/cmake -E cmake_depends "Unix Makefiles" /home/jenkins/builds/workspace/shm-fmi-pipe_development /home/jenkins/builds/workspace/shm-fmi-pipe_development/third_party/googletest/googletest /home/jenkins/builds/workspace/shm-fmi-pipe_development/build/win32 /home/jenkins/builds/workspace/shm-fmi-pipe_development/build/win32/third_party/googletest/googletest /home/jenkins/builds/workspace/shm-fmi-pipe_development/build/win32/third_party/googletest/googletest/CMakeFiles/gtest_main.dir/DependInfo.cmake --color=
Scanning dependencies of target gtest_main
make[2]: Leaving directory '/home/jenkins/builds/workspace/shm-fmi-pipe_development/build/win32'
make -f third_party/googletest/googletest/CMakeFiles/gtest_main.dir/build.make third_party/googletest/googletest/CMakeFiles/gtest_main.dir/build
make[2]: Entering directory '/home/jenkins/builds/workspace/shm-fmi-pipe_development/build/win32'
[ 40%] Building CXX object third_party/googletest/googletest/CMakeFiles/gtest_main.dir/src/gtest_main.cc.obj
cd /home/jenkins/builds/workspace/shm-fmi-pipe_development/build/win32/third_party/googletest/googletest && /usr/bin/i686-w64-mingw32-g++    @CMakeFiles/gtest_main.dir/includes_CXX.rsp -Wall -Wshadow -DGTEST_HAS_PTHREAD=0 -fexceptions -Wextra -Wno-unused-parameter -Wno-missing-field-initializers -o CMakeFiles/gtest_main.dir/src/gtest_main.cc.obj -c /home/jenkins/builds/workspace/shm-fmi-pipe_development/third_party/googletest/googletest/src/gtest_main.cc
[ 42%] Linking CXX static library liblibshmfmu_static.a
cd /home/jenkins/builds/workspace/shm-fmi-pipe_development/build/win32/libshmfmu && /usr/bin/cmake -P CMakeFiles/libshmfmu_static.dir/cmake_clean_target.cmake
cd /home/jenkins/builds/workspace/shm-fmi-pipe_development/build/win32/libshmfmu && /usr/bin/cmake -E cmake_link_script CMakeFiles/libshmfmu_static.dir/link.txt --verbose=1
[ 44%] Linking CXX static library liblibshmfmi.a
cd /home/jenkins/builds/workspace/shm-fmi-pipe_development/build/win32/libshmfmi && /usr/bin/cmake -P CMakeFiles/libshmfmi.dir/cmake_clean_target.cmake
/usr/bin/i686-w64-mingw32-ar qc liblibshmfmu_static.a  CMakeFiles/libshmfmu_static.dir/__/third_party/uuid4/src/uuid4.c.obj CMakeFiles/libshmfmu_static.dir/uri.c.obj CMakeFiles/libshmfmu_static.dir/fmu.cpp.obj CMakeFiles/libshmfmu_static.dir/FmuContainer.cpp.obj CMakeFiles/libshmfmu_static.dir/JavaLauncher.cpp.obj CMakeFiles/libshmfmu_static.dir/ConfigFile.cpp.obj
/usr/bin/i686-w64-mingw32-ranlib liblibshmfmu_static.a
cd /home/jenkins/builds/workspace/shm-fmi-pipe_development/build/win32/libshmfmi && /usr/bin/cmake -E cmake_link_script CMakeFiles/libshmfmi.dir/link.txt --verbose=1
make[2]: Leaving directory '/home/jenkins/builds/workspace/shm-fmi-pipe_development/build/win32'
/usr/bin/i686-w64-mingw32-ar qc liblibshmfmi.a  CMakeFiles/libshmfmi.dir/__/libshmipc/sem_timedwait.cpp.obj CMakeFiles/libshmfmi.dir/__/libshmipc/IpcBase.cpp.obj CMakeFiles/libshmfmi.dir/__/libshmipc/IpcServer.cpp.obj CMakeFiles/libshmfmi.dir/__/libshmipc/IpcClient.cpp.obj CMakeFiles/libshmfmi.dir/service.pb.cc.obj CMakeFiles/libshmfmi.dir/FmuProxy.cpp.obj
[ 44%] Built target libshmfmu_static
/usr/bin/i686-w64-mingw32-ranlib liblibshmfmi.a
make[2]: Leaving directory '/home/jenkins/builds/workspace/shm-fmi-pipe_development/build/win32'
[ 44%] Built target libshmfmi
make -f libshmfmu/CMakeFiles/libshmfmu.dir/build.make libshmfmu/CMakeFiles/libshmfmu.dir/depend
make -f shmfmi-server/CMakeFiles/sharedmemory.dir/build.make shmfmi-server/CMakeFiles/sharedmemory.dir/depend
make -f testfmu-integration/CMakeFiles/testfmu-integration-driver.dir/build.make testfmu-integration/CMakeFiles/testfmu-integration-driver.dir/depend
make[2]: Entering directory '/home/jenkins/builds/workspace/shm-fmi-pipe_development/build/win32'
cd /home/jenkins/builds/workspace/shm-fmi-pipe_development/build/win32 && /usr/bin/cmake -E cmake_depends "Unix Makefiles" /home/jenkins/builds/workspace/shm-fmi-pipe_development /home/jenkins/builds/workspace/shm-fmi-pipe_development/testfmu-integration /home/jenkins/builds/workspace/shm-fmi-pipe_development/build/win32 /home/jenkins/builds/workspace/shm-fmi-pipe_development/build/win32/testfmu-integration /home/jenkins/builds/workspace/shm-fmi-pipe_development/build/win32/testfmu-integration/CMakeFiles/testfmu-integration-driver.dir/DependInfo.cmake --color=
make[2]: Entering directory '/home/jenkins/builds/workspace/shm-fmi-pipe_development/build/win32'
cd /home/jenkins/builds/workspace/shm-fmi-pipe_development/build/win32 && /usr/bin/cmake -E cmake_depends "Unix Makefiles" /home/jenkins/builds/workspace/shm-fmi-pipe_development /home/jenkins/builds/workspace/shm-fmi-pipe_development/shmfmi-server /home/jenkins/builds/workspace/shm-fmi-pipe_development/build/win32 /home/jenkins/builds/workspace/shm-fmi-pipe_development/build/win32/shmfmi-server /home/jenkins/builds/workspace/shm-fmi-pipe_development/build/win32/shmfmi-server/CMakeFiles/sharedmemory.dir/DependInfo.cmake --color=
make[2]: Entering directory '/home/jenkins/builds/workspace/shm-fmi-pipe_development/build/win32'
cd /home/jenkins/builds/workspace/shm-fmi-pipe_development/build/win32 && /usr/bin/cmake -E cmake_depends "Unix Makefiles" /home/jenkins/builds/workspace/shm-fmi-pipe_development /home/jenkins/builds/workspace/shm-fmi-pipe_development/libshmfmu /home/jenkins/builds/workspace/shm-fmi-pipe_development/build/win32 /home/jenkins/builds/workspace/shm-fmi-pipe_development/build/win32/libshmfmu /home/jenkins/builds/workspace/shm-fmi-pipe_development/build/win32/libshmfmu/CMakeFiles/libshmfmu.dir/DependInfo.cmake --color=
Scanning dependencies of target testfmu-integration-driver
make[2]: Leaving directory '/home/jenkins/builds/workspace/shm-fmi-pipe_development/build/win32'
make -f testfmu-integration/CMakeFiles/testfmu-integration-driver.dir/build.make testfmu-integration/CMakeFiles/testfmu-integration-driver.dir/build
make[2]: Entering directory '/home/jenkins/builds/workspace/shm-fmi-pipe_development/build/win32'
Scanning dependencies of target libshmfmu
[ 46%] Building CXX object testfmu-integration/CMakeFiles/testfmu-integration-driver.dir/runner/testrunner.cpp.obj
cd /home/jenkins/builds/workspace/shm-fmi-pipe_development/build/win32/testfmu-integration && /usr/bin/i686-w64-mingw32-g++    @CMakeFiles/testfmu-integration-driver.dir/includes_CXX.rsp -std=c++11 -DFMI_COSIMULATION -DFMULIB=\"/home/jenkins/builds/workspace/shm-fmi-pipe_development/build/win32/libshmfmu/libshmfmu.dll\" -DTEST_RUNNER_DRIVER_PATH=\"/home/jenkins/builds/workspace/shm-fmi-pipe_development/build/win32/testfmu-integration/testfmu-integration-driver\"   -o CMakeFiles/testfmu-integration-driver.dir/runner/testrunner.cpp.obj -c /home/jenkins/builds/workspace/shm-fmi-pipe_development/testfmu-integration/runner/testrunner.cpp
make[2]: Leaving directory '/home/jenkins/builds/workspace/shm-fmi-pipe_development/build/win32'
make -f libshmfmu/CMakeFiles/libshmfmu.dir/build.make libshmfmu/CMakeFiles/libshmfmu.dir/build
make[2]: Entering directory '/home/jenkins/builds/workspace/shm-fmi-pipe_development/build/win32'
[ 48%] Building C object libshmfmu/CMakeFiles/libshmfmu.dir/__/third_party/uuid4/src/uuid4.c.obj
cd /home/jenkins/builds/workspace/shm-fmi-pipe_development/build/win32/libshmfmu && /usr/bin/i686-w64-mingw32-gcc  -Dlibshmfmu_EXPORTS @CMakeFiles/libshmfmu.dir/includes_C.rsp -DFMI_COSIMULATION   -o CMakeFiles/libshmfmu.dir/__/third_party/uuid4/src/uuid4.c.obj   -c /home/jenkins/builds/workspace/shm-fmi-pipe_development/third_party/uuid4/src/uuid4.c
Scanning dependencies of target sharedmemory
make[2]: Leaving directory '/home/jenkins/builds/workspace/shm-fmi-pipe_development/build/win32'
make -f shmfmi-server/CMakeFiles/sharedmemory.dir/build.make shmfmi-server/CMakeFiles/sharedmemory.dir/build
make[2]: Entering directory '/home/jenkins/builds/workspace/shm-fmi-pipe_development/build/win32'
[ 50%] Building CXX object shmfmi-server/CMakeFiles/sharedmemory.dir/src/main/native/sharedmemory.cpp.obj
cd /home/jenkins/builds/workspace/shm-fmi-pipe_development/build/win32/shmfmi-server && /usr/bin/i686-w64-mingw32-g++   -Dsharedmemory_EXPORTS @CMakeFiles/sharedmemory.dir/includes_CXX.rsp -std=c++11   -o CMakeFiles/sharedmemory.dir/src/main/native/sharedmemory.cpp.obj -c /home/jenkins/builds/workspace/shm-fmi-pipe_development/shmfmi-server/src/main/native/sharedmemory.cpp
[ 51%] Linking CXX static library libgtest_main.a
cd /home/jenkins/builds/workspace/shm-fmi-pipe_development/build/win32/third_party/googletest/googletest && /usr/bin/cmake -P CMakeFiles/gtest_main.dir/cmake_clean_target.cmake
[ 53%] Building CXX object testfmu-integration/CMakeFiles/testfmu-integration-driver.dir/RemoteTestDriver.cpp.obj
cd /home/jenkins/builds/workspace/shm-fmi-pipe_development/build/win32/testfmu-integration && /usr/bin/i686-w64-mingw32-g++    @CMakeFiles/testfmu-integration-driver.dir/includes_CXX.rsp -std=c++11 -DFMI_COSIMULATION -DFMULIB=\"/home/jenkins/builds/workspace/shm-fmi-pipe_development/build/win32/libshmfmu/libshmfmu.dll\" -DTEST_RUNNER_DRIVER_PATH=\"/home/jenkins/builds/workspace/shm-fmi-pipe_development/build/win32/testfmu-integration/testfmu-integration-driver\"   -o CMakeFiles/testfmu-integration-driver.dir/RemoteTestDriver.cpp.obj -c /home/jenkins/builds/workspace/shm-fmi-pipe_development/testfmu-integration/RemoteTestDriver.cpp
cd /home/jenkins/builds/workspace/shm-fmi-pipe_development/build/win32/third_party/googletest/googletest && /usr/bin/cmake -E cmake_link_script CMakeFiles/gtest_main.dir/link.txt --verbose=1
/usr/bin/i686-w64-mingw32-ar qc libgtest_main.a  CMakeFiles/gtest_main.dir/src/gtest_main.cc.obj
/usr/bin/i686-w64-mingw32-ranlib libgtest_main.a
make[2]: Leaving directory '/home/jenkins/builds/workspace/shm-fmi-pipe_development/build/win32'
[ 55%] Building C object libshmfmu/CMakeFiles/libshmfmu.dir/uri.c.obj
[ 55%] Built target gtest_main
cd /home/jenkins/builds/workspace/shm-fmi-pipe_development/build/win32/libshmfmu && /usr/bin/i686-w64-mingw32-gcc  -Dlibshmfmu_EXPORTS @CMakeFiles/libshmfmu.dir/includes_C.rsp -DFMI_COSIMULATION   -o CMakeFiles/libshmfmu.dir/uri.c.obj   -c /home/jenkins/builds/workspace/shm-fmi-pipe_development/libshmfmu/uri.c
[ 57%] Building CXX object libshmfmu/CMakeFiles/libshmfmu.dir/fmu.cpp.obj
cd /home/jenkins/builds/workspace/shm-fmi-pipe_development/build/win32/libshmfmu && /usr/bin/i686-w64-mingw32-g++   -Dlibshmfmu_EXPORTS @CMakeFiles/libshmfmu.dir/includes_CXX.rsp -std=c++11 -DFMI_COSIMULATION   -o CMakeFiles/libshmfmu.dir/fmu.cpp.obj -c /home/jenkins/builds/workspace/shm-fmi-pipe_development/libshmfmu/fmu.cpp
make -f testlibshmipc/CMakeFiles/testlibshmipc.dir/build.make testlibshmipc/CMakeFiles/testlibshmipc.dir/depend
make[2]: Entering directory '/home/jenkins/builds/workspace/shm-fmi-pipe_development/build/win32'
cd /home/jenkins/builds/workspace/shm-fmi-pipe_development/build/win32 && /usr/bin/cmake -E cmake_depends "Unix Makefiles" /home/jenkins/builds/workspace/shm-fmi-pipe_development /home/jenkins/builds/workspace/shm-fmi-pipe_development/testlibshmipc /home/jenkins/builds/workspace/shm-fmi-pipe_development/build/win32 /home/jenkins/builds/workspace/shm-fmi-pipe_development/build/win32/testlibshmipc /home/jenkins/builds/workspace/shm-fmi-pipe_development/build/win32/testlibshmipc/CMakeFiles/testlibshmipc.dir/DependInfo.cmake --color=
Scanning dependencies of target testlibshmipc
make[2]: Leaving directory '/home/jenkins/builds/workspace/shm-fmi-pipe_development/build/win32'
make -f testlibshmipc/CMakeFiles/testlibshmipc.dir/build.make testlibshmipc/CMakeFiles/testlibshmipc.dir/build
make[2]: Entering directory '/home/jenkins/builds/workspace/shm-fmi-pipe_development/build/win32'
[ 59%] Building CXX object testlibshmipc/CMakeFiles/testlibshmipc.dir/FmiIpc_Tests.cpp.obj
cd /home/jenkins/builds/workspace/shm-fmi-pipe_development/build/win32/testlibshmipc && /usr/bin/i686-w64-mingw32-g++    @CMakeFiles/testlibshmipc.dir/includes_CXX.rsp -std=c++11   -o CMakeFiles/testlibshmipc.dir/FmiIpc_Tests.cpp.obj -c /home/jenkins/builds/workspace/shm-fmi-pipe_development/testlibshmipc/FmiIpc_Tests.cpp
[ 61%] Building CXX object shmfmi-server/CMakeFiles/sharedmemory.dir/src/main/native/sharedmemoryserver.cpp.obj
cd /home/jenkins/builds/workspace/shm-fmi-pipe_development/build/win32/shmfmi-server && /usr/bin/i686-w64-mingw32-g++   -Dsharedmemory_EXPORTS @CMakeFiles/sharedmemory.dir/includes_CXX.rsp -std=c++11   -o CMakeFiles/sharedmemory.dir/src/main/native/sharedmemoryserver.cpp.obj -c /home/jenkins/builds/workspace/shm-fmi-pipe_development/shmfmi-server/src/main/native/sharedmemoryserver.cpp
[ 62%] Linking CXX executable testfmu-integration-driver.exe
cd /home/jenkins/builds/workspace/shm-fmi-pipe_development/build/win32/testfmu-integration && /usr/bin/cmake -E cmake_link_script CMakeFiles/testfmu-integration-driver.dir/link.txt --verbose=1
/usr/bin/cmake -E remove -f CMakeFiles/testfmu-integration-driver.dir/objects.a
/usr/bin/i686-w64-mingw32-ar cr CMakeFiles/testfmu-integration-driver.dir/objects.a @CMakeFiles/testfmu-integration-driver.dir/objects1.rsp
/usr/bin/i686-w64-mingw32-g++   -std=c++11 -DFMI_COSIMULATION -DFMULIB=\"/home/jenkins/builds/workspace/shm-fmi-pipe_development/build/win32/libshmfmu/libshmfmu.dll\" -DTEST_RUNNER_DRIVER_PATH=\"/home/jenkins/builds/workspace/shm-fmi-pipe_development/build/win32/testfmu-integration/testfmu-integration-driver\"   -static-libstdc++ -static-libgcc -Wl,--whole-archive CMakeFiles/testfmu-integration-driver.dir/objects.a -Wl,--no-whole-archive  -o testfmu-integration-driver.exe -Wl,--out-implib,libtestfmu-integration-driver.dll.a -Wl,--major-image-version,0,--minor-image-version,0 @CMakeFiles/testfmu-integration-driver.dir/linklibs.rsp
[ 64%] Linking CXX shared library sharedmemory.dll
cd /home/jenkins/builds/workspace/shm-fmi-pipe_development/build/win32/shmfmi-server && /usr/bin/cmake -E cmake_link_script CMakeFiles/sharedmemory.dir/link.txt --verbose=1
/usr/bin/cmake -E remove -f CMakeFiles/sharedmemory.dir/objects.a
/usr/bin/i686-w64-mingw32-ar cr CMakeFiles/sharedmemory.dir/objects.a @CMakeFiles/sharedmemory.dir/objects1.rsp
/usr/bin/i686-w64-mingw32-g++    -std=c++11  -Wl,--add-stdcall-alias -static-libstdc++ -static-libgcc -shared -o sharedmemory.dll -Wl,--out-implib,libsharedmemory.dll.a -Wl,--major-image-version,0,--minor-image-version,0 -Wl,--whole-archive CMakeFiles/sharedmemory.dir/objects.a -Wl,--no-whole-archive @CMakeFiles/sharedmemory.dir/linklibs.rsp
[ 66%] Building CXX object libshmfmu/CMakeFiles/libshmfmu.dir/FmuContainer.cpp.obj
cd /home/jenkins/builds/workspace/shm-fmi-pipe_development/build/win32/libshmfmu && /usr/bin/i686-w64-mingw32-g++   -Dlibshmfmu_EXPORTS @CMakeFiles/libshmfmu.dir/includes_CXX.rsp -std=c++11 -DFMI_COSIMULATION   -o CMakeFiles/libshmfmu.dir/FmuContainer.cpp.obj -c /home/jenkins/builds/workspace/shm-fmi-pipe_development/libshmfmu/FmuContainer.cpp
make[2]: Leaving directory '/home/jenkins/builds/workspace/shm-fmi-pipe_development/build/win32'
[ 66%] Built target sharedmemory
[ 68%] Building CXX object libshmfmu/CMakeFiles/libshmfmu.dir/JavaLauncher.cpp.obj
cd /home/jenkins/builds/workspace/shm-fmi-pipe_development/build/win32/libshmfmu && /usr/bin/i686-w64-mingw32-g++   -Dlibshmfmu_EXPORTS @CMakeFiles/libshmfmu.dir/includes_CXX.rsp -std=c++11 -DFMI_COSIMULATION   -o CMakeFiles/libshmfmu.dir/JavaLauncher.cpp.obj -c /home/jenkins/builds/workspace/shm-fmi-pipe_development/libshmfmu/JavaLauncher.cpp
make[2]: Leaving directory '/home/jenkins/builds/workspace/shm-fmi-pipe_development/build/win32'
[ 68%] Built target testfmu-integration-driver
[ 70%] Building CXX object libshmfmu/CMakeFiles/libshmfmu.dir/ConfigFile.cpp.obj
cd /home/jenkins/builds/workspace/shm-fmi-pipe_development/build/win32/libshmfmu && /usr/bin/i686-w64-mingw32-g++   -Dlibshmfmu_EXPORTS @CMakeFiles/libshmfmu.dir/includes_CXX.rsp -std=c++11 -DFMI_COSIMULATION   -o CMakeFiles/libshmfmu.dir/ConfigFile.cpp.obj -c /home/jenkins/builds/workspace/shm-fmi-pipe_development/libshmfmu/ConfigFile.cpp
[ 72%] Linking CXX executable testlibshmipc.exe
cd /home/jenkins/builds/workspace/shm-fmi-pipe_development/build/win32/testlibshmipc && /usr/bin/cmake -E cmake_link_script CMakeFiles/testlibshmipc.dir/link.txt --verbose=1
/usr/bin/cmake -E remove -f CMakeFiles/testlibshmipc.dir/objects.a
/usr/bin/i686-w64-mingw32-ar cr CMakeFiles/testlibshmipc.dir/objects.a @CMakeFiles/testlibshmipc.dir/objects1.rsp
/usr/bin/i686-w64-mingw32-g++   -std=c++11   -static-libstdc++ -static-libgcc -Wl,--whole-archive CMakeFiles/testlibshmipc.dir/objects.a -Wl,--no-whole-archive  -o testlibshmipc.exe -Wl,--out-implib,libtestlibshmipc.dll.a -Wl,--major-image-version,0,--minor-image-version,0 @CMakeFiles/testlibshmipc.dir/linklibs.rsp
make -f testlibshmfmi/CMakeFiles/testlibshmfmi.dir/build.make testlibshmfmi/CMakeFiles/testlibshmfmi.dir/depend
make[2]: Entering directory '/home/jenkins/builds/workspace/shm-fmi-pipe_development/build/win32'
cd /home/jenkins/builds/workspace/shm-fmi-pipe_development/build/win32 && /usr/bin/cmake -E cmake_depends "Unix Makefiles" /home/jenkins/builds/workspace/shm-fmi-pipe_development /home/jenkins/builds/workspace/shm-fmi-pipe_development/testlibshmfmi /home/jenkins/builds/workspace/shm-fmi-pipe_development/build/win32 /home/jenkins/builds/workspace/shm-fmi-pipe_development/build/win32/testlibshmfmi /home/jenkins/builds/workspace/shm-fmi-pipe_development/build/win32/testlibshmfmi/CMakeFiles/testlibshmfmi.dir/DependInfo.cmake --color=
make -f testlibshmfmu/CMakeFiles/testlibshmfmu.dir/build.make testlibshmfmu/CMakeFiles/testlibshmfmu.dir/depend
make[2]: Entering directory '/home/jenkins/builds/workspace/shm-fmi-pipe_development/build/win32'
cd /home/jenkins/builds/workspace/shm-fmi-pipe_development/build/win32 && /usr/bin/cmake -E cmake_depends "Unix Makefiles" /home/jenkins/builds/workspace/shm-fmi-pipe_development /home/jenkins/builds/workspace/shm-fmi-pipe_development/testlibshmfmu /home/jenkins/builds/workspace/shm-fmi-pipe_development/build/win32 /home/jenkins/builds/workspace/shm-fmi-pipe_development/build/win32/testlibshmfmu /home/jenkins/builds/workspace/shm-fmi-pipe_development/build/win32/testlibshmfmu/CMakeFiles/testlibshmfmu.dir/DependInfo.cmake --color=
Scanning dependencies of target testlibshmfmi
make[2]: Leaving directory '/home/jenkins/builds/workspace/shm-fmi-pipe_development/build/win32'
make -f testlibshmfmi/CMakeFiles/testlibshmfmi.dir/build.make testlibshmfmi/CMakeFiles/testlibshmfmi.dir/build
make[2]: Entering directory '/home/jenkins/builds/workspace/shm-fmi-pipe_development/build/win32'
[ 74%] Building CXX object testlibshmfmi/CMakeFiles/testlibshmfmi.dir/RemoteTestDriver.cpp.obj
cd /home/jenkins/builds/workspace/shm-fmi-pipe_development/build/win32/testlibshmfmi && /usr/bin/i686-w64-mingw32-g++    @CMakeFiles/testlibshmfmi.dir/includes_CXX.rsp -std=c++11   -o CMakeFiles/testlibshmfmi.dir/RemoteTestDriver.cpp.obj -c /home/jenkins/builds/workspace/shm-fmi-pipe_development/testlibshmfmi/RemoteTestDriver.cpp
Scanning dependencies of target testlibshmfmu
make[2]: Leaving directory '/home/jenkins/builds/workspace/shm-fmi-pipe_development/build/win32'
make -f testlibshmfmu/CMakeFiles/testlibshmfmu.dir/build.make testlibshmfmu/CMakeFiles/testlibshmfmu.dir/build
make[2]: Entering directory '/home/jenkins/builds/workspace/shm-fmi-pipe_development/build/win32'
[ 75%] Building CXX object testlibshmfmu/CMakeFiles/testlibshmfmu.dir/JavaLauncher_Tests.cpp.obj
cd /home/jenkins/builds/workspace/shm-fmi-pipe_development/build/win32/testlibshmfmu && /usr/bin/i686-w64-mingw32-g++   -DSOURCE_ROOT=\"/home/jenkins/builds/workspace/shm-fmi-pipe_development/testlibshmfmu\" @CMakeFiles/testlibshmfmu.dir/includes_CXX.rsp -std=c++11   -o CMakeFiles/testlibshmfmu.dir/JavaLauncher_Tests.cpp.obj -c /home/jenkins/builds/workspace/shm-fmi-pipe_development/testlibshmfmu/JavaLauncher_Tests.cpp
[ 77%] Linking CXX shared library libshmfmu.dll
cd /home/jenkins/builds/workspace/shm-fmi-pipe_development/build/win32/libshmfmu && /usr/bin/cmake -E cmake_link_script CMakeFiles/libshmfmu.dir/link.txt --verbose=1
/usr/bin/cmake -E remove -f CMakeFiles/libshmfmu.dir/objects.a
/usr/bin/i686-w64-mingw32-ar cr CMakeFiles/libshmfmu.dir/objects.a @CMakeFiles/libshmfmu.dir/objects1.rsp
/usr/bin/i686-w64-mingw32-g++    -std=c++11 -DFMI_COSIMULATION  -static-libstdc++ -static-libgcc -shared -o libshmfmu.dll -Wl,--out-implib,liblibshmfmu.dll.a -Wl,--major-image-version,0,--minor-image-version,0 -Wl,--whole-archive CMakeFiles/libshmfmu.dir/objects.a -Wl,--no-whole-archive @CMakeFiles/libshmfmu.dir/linklibs.rsp
make[2]: Leaving directory '/home/jenkins/builds/workspace/shm-fmi-pipe_development/build/win32'
[ 77%] Built target testlibshmipc
[ 79%] Building CXX object testlibshmfmu/CMakeFiles/testlibshmfmu.dir/ConfigFile_Tests.cpp.obj
cd /home/jenkins/builds/workspace/shm-fmi-pipe_development/build/win32/testlibshmfmu && /usr/bin/i686-w64-mingw32-g++   -DSOURCE_ROOT=\"/home/jenkins/builds/workspace/shm-fmi-pipe_development/testlibshmfmu\" @CMakeFiles/testlibshmfmu.dir/includes_CXX.rsp -std=c++11   -o CMakeFiles/testlibshmfmu.dir/ConfigFile_Tests.cpp.obj -c /home/jenkins/builds/workspace/shm-fmi-pipe_development/testlibshmfmu/ConfigFile_Tests.cpp
make[2]: Leaving directory '/home/jenkins/builds/workspace/shm-fmi-pipe_development/build/win32'
[ 79%] Built target libshmfmu
[ 81%] Building CXX object testlibshmfmi/CMakeFiles/testlibshmfmi.dir/FmuProxy_Tests.cpp.obj
cd /home/jenkins/builds/workspace/shm-fmi-pipe_development/build/win32/testlibshmfmi && /usr/bin/i686-w64-mingw32-g++    @CMakeFiles/testlibshmfmi.dir/includes_CXX.rsp -std=c++11   -o CMakeFiles/testlibshmfmi.dir/FmuProxy_Tests.cpp.obj -c /home/jenkins/builds/workspace/shm-fmi-pipe_development/testlibshmfmi/FmuProxy_Tests.cpp
make -f testfmu-integration/CMakeFiles/testfmu-integration.dir/build.make testfmu-integration/CMakeFiles/testfmu-integration.dir/depend
make[2]: Entering directory '/home/jenkins/builds/workspace/shm-fmi-pipe_development/build/win32'
cd /home/jenkins/builds/workspace/shm-fmi-pipe_development/build/win32 && /usr/bin/cmake -E cmake_depends "Unix Makefiles" /home/jenkins/builds/workspace/shm-fmi-pipe_development /home/jenkins/builds/workspace/shm-fmi-pipe_development/testfmu-integration /home/jenkins/builds/workspace/shm-fmi-pipe_development/build/win32 /home/jenkins/builds/workspace/shm-fmi-pipe_development/build/win32/testfmu-integration /home/jenkins/builds/workspace/shm-fmi-pipe_development/build/win32/testfmu-integration/CMakeFiles/testfmu-integration.dir/DependInfo.cmake --color=
[ 83%] Building CXX object testlibshmfmu/CMakeFiles/testlibshmfmu.dir/URI_Tests.cpp.obj
cd /home/jenkins/builds/workspace/shm-fmi-pipe_development/build/win32/testlibshmfmu && /usr/bin/i686-w64-mingw32-g++   -DSOURCE_ROOT=\"/home/jenkins/builds/workspace/shm-fmi-pipe_development/testlibshmfmu\" @CMakeFiles/testlibshmfmu.dir/includes_CXX.rsp -std=c++11   -o CMakeFiles/testlibshmfmu.dir/URI_Tests.cpp.obj -c /home/jenkins/builds/workspace/shm-fmi-pipe_development/testlibshmfmu/URI_Tests.cpp
Scanning dependencies of target testfmu-integration
make[2]: Leaving directory '/home/jenkins/builds/workspace/shm-fmi-pipe_development/build/win32'
make -f testfmu-integration/CMakeFiles/testfmu-integration.dir/build.make testfmu-integration/CMakeFiles/testfmu-integration.dir/build
make[2]: Entering directory '/home/jenkins/builds/workspace/shm-fmi-pipe_development/build/win32'
[ 85%] Building C object testfmu-integration/CMakeFiles/testfmu-integration.dir/fmu-loader.c.obj
cd /home/jenkins/builds/workspace/shm-fmi-pipe_development/build/win32/testfmu-integration && /usr/bin/i686-w64-mingw32-gcc   @CMakeFiles/testfmu-integration.dir/includes_C.rsp -pthread -DFMI_COSIMULATION -DFMULIB=\"/home/jenkins/builds/workspace/shm-fmi-pipe_development/build/win32/libshmfmu/libshmfmu.dll\"   -o CMakeFiles/testfmu-integration.dir/fmu-loader.c.obj   -c /home/jenkins/builds/workspace/shm-fmi-pipe_development/testfmu-integration/fmu-loader.c
[ 87%] Building C object testfmu-integration/CMakeFiles/testfmu-integration.dir/fmuLogger.c.obj
cd /home/jenkins/builds/workspace/shm-fmi-pipe_development/build/win32/testfmu-integration && /usr/bin/i686-w64-mingw32-gcc   @CMakeFiles/testfmu-integration.dir/includes_C.rsp -pthread -DFMI_COSIMULATION -DFMULIB=\"/home/jenkins/builds/workspace/shm-fmi-pipe_development/build/win32/libshmfmu/libshmfmu.dll\"   -o CMakeFiles/testfmu-integration.dir/fmuLogger.c.obj   -c /home/jenkins/builds/workspace/shm-fmi-pipe_development/testfmu-integration/fmuLogger.c
[ 88%] Building CXX object testfmu-integration/CMakeFiles/testfmu-integration.dir/FMU_Tests.cpp.obj
cd /home/jenkins/builds/workspace/shm-fmi-pipe_development/build/win32/testfmu-integration && /usr/bin/i686-w64-mingw32-g++    @CMakeFiles/testfmu-integration.dir/includes_CXX.rsp -std=c++11 -DFMI_COSIMULATION -DFMULIB=\"/home/jenkins/builds/workspace/shm-fmi-pipe_development/build/win32/libshmfmu/libshmfmu.dll\" -DTEST_RUNNER_DRIVER_PATH=\"/home/jenkins/builds/workspace/shm-fmi-pipe_development/build/win32/testfmu-integration/testfmu-integration-driver\"   -o CMakeFiles/testfmu-integration.dir/FMU_Tests.cpp.obj -c /home/jenkins/builds/workspace/shm-fmi-pipe_development/testfmu-integration/FMU_Tests.cpp
[ 90%] Building CXX object testfmu-integration/CMakeFiles/testfmu-integration.dir/LibraryLoad_Tests.cpp.obj
cd /home/jenkins/builds/workspace/shm-fmi-pipe_development/build/win32/testfmu-integration && /usr/bin/i686-w64-mingw32-g++    @CMakeFiles/testfmu-integration.dir/includes_CXX.rsp -std=c++11 -DFMI_COSIMULATION -DFMULIB=\"/home/jenkins/builds/workspace/shm-fmi-pipe_development/build/win32/libshmfmu/libshmfmu.dll\" -DTEST_RUNNER_DRIVER_PATH=\"/home/jenkins/builds/workspace/shm-fmi-pipe_development/build/win32/testfmu-integration/testfmu-integration-driver\"   -o CMakeFiles/testfmu-integration.dir/LibraryLoad_Tests.cpp.obj -c /home/jenkins/builds/workspace/shm-fmi-pipe_development/testfmu-integration/LibraryLoad_Tests.cpp
[ 92%] Linking CXX executable testlibshmfmu.exe
cd /home/jenkins/builds/workspace/shm-fmi-pipe_development/build/win32/testlibshmfmu && /usr/bin/cmake -E cmake_link_script CMakeFiles/testlibshmfmu.dir/link.txt --verbose=1
/usr/bin/cmake -E remove -f CMakeFiles/testlibshmfmu.dir/objects.a
/usr/bin/i686-w64-mingw32-ar cr CMakeFiles/testlibshmfmu.dir/objects.a @CMakeFiles/testlibshmfmu.dir/objects1.rsp
/usr/bin/i686-w64-mingw32-g++   -std=c++11   -static-libstdc++ -static-libgcc -Wl,--whole-archive CMakeFiles/testlibshmfmu.dir/objects.a -Wl,--no-whole-archive  -o testlibshmfmu.exe -Wl,--out-implib,libtestlibshmfmu.dll.a -Wl,--major-image-version,0,--minor-image-version,0 @CMakeFiles/testlibshmfmu.dir/linklibs.rsp
[ 94%] Linking CXX executable testlibshmfmi.exe
cd /home/jenkins/builds/workspace/shm-fmi-pipe_development/build/win32/testlibshmfmi && /usr/bin/cmake -E cmake_link_script CMakeFiles/testlibshmfmi.dir/link.txt --verbose=1
/usr/bin/cmake -E remove -f CMakeFiles/testlibshmfmi.dir/objects.a
/usr/bin/i686-w64-mingw32-ar cr CMakeFiles/testlibshmfmi.dir/objects.a @CMakeFiles/testlibshmfmi.dir/objects1.rsp
/usr/bin/i686-w64-mingw32-g++   -std=c++11   -static-libstdc++ -static-libgcc -Wl,--whole-archive CMakeFiles/testlibshmfmi.dir/objects.a -Wl,--no-whole-archive  -o testlibshmfmi.exe -Wl,--out-implib,libtestlibshmfmi.dll.a -Wl,--major-image-version,0,--minor-image-version,0 @CMakeFiles/testlibshmfmi.dir/linklibs.rsp
make[2]: Leaving directory '/home/jenkins/builds/workspace/shm-fmi-pipe_development/build/win32'
[ 94%] Built target testlibshmfmu
[ 96%] Building CXX object testfmu-integration/CMakeFiles/testfmu-integration.dir/FMU_DualLoad_Tests.cpp.obj
cd /home/jenkins/builds/workspace/shm-fmi-pipe_development/build/win32/testfmu-integration && /usr/bin/i686-w64-mingw32-g++    @CMakeFiles/testfmu-integration.dir/includes_CXX.rsp -std=c++11 -DFMI_COSIMULATION -DFMULIB=\"/home/jenkins/builds/workspace/shm-fmi-pipe_development/build/win32/libshmfmu/libshmfmu.dll\" -DTEST_RUNNER_DRIVER_PATH=\"/home/jenkins/builds/workspace/shm-fmi-pipe_development/build/win32/testfmu-integration/testfmu-integration-driver\"   -o CMakeFiles/testfmu-integration.dir/FMU_DualLoad_Tests.cpp.obj -c /home/jenkins/builds/workspace/shm-fmi-pipe_development/testfmu-integration/FMU_DualLoad_Tests.cpp
make[2]: Leaving directory '/home/jenkins/builds/workspace/shm-fmi-pipe_development/build/win32'
[ 96%] Built target testlibshmfmi
[ 98%] Building CXX object testfmu-integration/CMakeFiles/testfmu-integration.dir/resource_location.cpp.obj
cd /home/jenkins/builds/workspace/shm-fmi-pipe_development/build/win32/testfmu-integration && /usr/bin/i686-w64-mingw32-g++    @CMakeFiles/testfmu-integration.dir/includes_CXX.rsp -std=c++11 -DFMI_COSIMULATION -DFMULIB=\"/home/jenkins/builds/workspace/shm-fmi-pipe_development/build/win32/libshmfmu/libshmfmu.dll\" -DTEST_RUNNER_DRIVER_PATH=\"/home/jenkins/builds/workspace/shm-fmi-pipe_development/build/win32/testfmu-integration/testfmu-integration-driver\"   -o CMakeFiles/testfmu-integration.dir/resource_location.cpp.obj -c /home/jenkins/builds/workspace/shm-fmi-pipe_development/testfmu-integration/resource_location.cpp
[100%] Linking CXX executable testfmu-integration.exe
cd /home/jenkins/builds/workspace/shm-fmi-pipe_development/build/win32/testfmu-integration && /usr/bin/cmake -E cmake_link_script CMakeFiles/testfmu-integration.dir/link.txt --verbose=1
/usr/bin/cmake -E remove -f CMakeFiles/testfmu-integration.dir/objects.a
/usr/bin/i686-w64-mingw32-ar cr CMakeFiles/testfmu-integration.dir/objects.a @CMakeFiles/testfmu-integration.dir/objects1.rsp
/usr/bin/i686-w64-mingw32-g++   -std=c++11 -DFMI_COSIMULATION -DFMULIB=\"/home/jenkins/builds/workspace/shm-fmi-pipe_development/build/win32/libshmfmu/libshmfmu.dll\" -DTEST_RUNNER_DRIVER_PATH=\"/home/jenkins/builds/workspace/shm-fmi-pipe_development/build/win32/testfmu-integration/testfmu-integration-driver\"   -static-libstdc++ -static-libgcc -Wl,--whole-archive CMakeFiles/testfmu-integration.dir/objects.a -Wl,--no-whole-archive  -o testfmu-integration.exe -Wl,--out-implib,libtestfmu-integration.dll.a -Wl,--major-image-version,0,--minor-image-version,0 @CMakeFiles/testfmu-integration.dir/linklibs.rsp
make[2]: Leaving directory '/home/jenkins/builds/workspace/shm-fmi-pipe_development/build/win32'
[100%] Built target testfmu-integration
make[1]: Leaving directory '/home/jenkins/builds/workspace/shm-fmi-pipe_development/build/win32'
/usr/bin/cmake -E cmake_progress_start /home/jenkins/builds/workspace/shm-fmi-pipe_development/build/win32/CMakeFiles 0
make: Leaving directory '/home/jenkins/builds/workspace/shm-fmi-pipe_development/build/win32'
make: Entering directory '/home/jenkins/builds/workspace/shm-fmi-pipe_development/build/win32'
Running tests...
/usr/bin/ctest --force-new-ctest-process 
Test project /home/jenkins/builds/workspace/shm-fmi-pipe_development/build/win32
    Start 1: AllTestsIn-testlibshmipc
1/4 Test #1: AllTestsIn-testlibshmipc .........***Failed    8.86 sec
    Start 2: AllTestsIn-testlibshmfmi
2/4 Test #2: AllTestsIn-testlibshmfmi .........   Passed    8.06 sec
    Start 3: AllTestsIn-testlibshmfmu
3/4 Test #3: AllTestsIn-testlibshmfmu .........   Passed    4.83 sec
    Start 4: AllTestsIn-testfmu-integration
4/4 Test #4: AllTestsIn-testfmu-integration ...   Passed   36.96 sec

75% tests passed, 1 tests failed out of 4

Total Test time (real) =  58.71 sec

The following tests FAILED:
	  1 - AllTestsIn-testlibshmipc (Failed)
Errors while running CTest
Makefile:108: recipe for target 'test' failed
make: *** [test] Error 8
make: Leaving directory '/home/jenkins/builds/workspace/shm-fmi-pipe_development/build/win32'
[Pipeline] }
Lock released on resource [SHM-FMI-TEST]
[Pipeline] // lock
[Pipeline] }
Running on jenkinscrosscompiler in /home/jenkins/builds/workspace/shm-fmi-pipe_development
[Pipeline] // node
[Pipeline] {
[Pipeline] }
Failed in branch win32
[Pipeline] checkout
using credential swengaudk
Fetching changes from the remote Git repository
Fetching without tags
 > /usr/bin/git rev-parse --is-inside-work-tree # timeout=10
 > /usr/bin/git config remote.origin.url https://github.com/overturetool/shm-fmi.git # timeout=10
Fetching upstream changes from https://github.com/overturetool/shm-fmi.git
 > /usr/bin/git --version # timeout=10
using GIT_ASKPASS to set credentials swengaudk token on github
 > /usr/bin/git fetch --no-tags --progress https://github.com/overturetool/shm-fmi.git +refs/heads/development:refs/remotes/origin/development # timeout=10
Checking out Revision f6e3b5cde8b2c3a81eb284cf3203a9dfb368abc5 (development)
Commit message: "corrected external job and do not wait"
 > /usr/bin/git config core.sparsecheckout # timeout=10
 > /usr/bin/git checkout -f f6e3b5cde8b2c3a81eb284cf3203a9dfb368abc5 # timeout=10
[Pipeline] sh
+ git submodule update --init
[Pipeline] lock
Trying to acquire lock on [SHM-FMI-TEST]
Lock acquired on [SHM-FMI-TEST]
[Pipeline] {
[Pipeline] sh
+ SHM_DEPENDENCIES_ROOT=/home/privatejenkins/shm-dependencies ./xcompile.sh -win64
Building with dependencies from: '/home/privatejenkins/shm-dependencies' using make -j4
Storing git info in git-info.txt
Building Win64 .dll
-- The C compiler identification is GNU 5.3.1
-- The CXX compiler identification is GNU 5.3.1
-- Check for working C compiler: /usr/bin/x86_64-w64-mingw32-gcc
-- Check for working C compiler: /usr/bin/x86_64-w64-mingw32-gcc -- works
-- Detecting C compiler ABI info
-- Detecting C compiler ABI info - done
-- Detecting C compile features
-- Detecting C compile features - done
-- Check for working CXX compiler: /usr/bin/x86_64-w64-mingw32-g++
-- Check for working CXX compiler: /usr/bin/x86_64-w64-mingw32-g++ -- works
-- Detecting CXX compiler ABI info
-- Detecting CXX compiler ABI info - done
-- Detecting CXX compile features
-- Detecting CXX compile features - done
-- Performing Test COMPILER_SUPPORTS_CXX11
-- Performing Test COMPILER_SUPPORTS_CXX11 - Success
-- Performing Test COMPILER_SUPPORTS_CXX0X
-- Performing Test COMPILER_SUPPORTS_CXX0X - Success
-- Found Protobuf: /home/privatejenkins/shm-dependencies/win64/usr/protobuf/lib/libprotobuf.a  
-- Static linking with libstdc++.a in /usr/lib/gcc/x86_64-w64-mingw32/5.3-win32/libstdc++.a
-- Static linking with libstdc++.a in /usr/lib/gcc/x86_64-w64-mingw32/5.3-win32/libstdc++.a
-- Found PythonInterp: /usr/bin/python (found version "2.7.12") 
CMake Warning (dev) at testfmu-integration/CMakeLists.txt:24 (get_property):
  Policy CMP0026 is not set: Disallow use of the LOCATION target property.
  Run "cmake --help-policy CMP0026" for policy details.  Use the cmake_policy
  command to set the policy and suppress this warning.

  The LOCATION property should not be read from target "libshmfmu".  Use the
  target name directly with add_custom_command, or use the generator
  expression $<TARGET_FILE>, as appropriate.

This warning is for project developers.  Use -Wno-dev to suppress it.

-- Configuring done
-- Generating done
-- Build files have been written to: /home/jenkins/builds/workspace/shm-fmi-pipe_development/build/win64
make: Entering directory '/home/jenkins/builds/workspace/shm-fmi-pipe_development/build/win64'
/usr/bin/cmake -H/home/jenkins/builds/workspace/shm-fmi-pipe_development -B/home/jenkins/builds/workspace/shm-fmi-pipe_development/build/win64 --check-build-system CMakeFiles/Makefile.cmake 0
/usr/bin/cmake -E cmake_progress_start /home/jenkins/builds/workspace/shm-fmi-pipe_development/build/win64/CMakeFiles /home/jenkins/builds/workspace/shm-fmi-pipe_development/build/win64/CMakeFiles/progress.marks
make -f CMakeFiles/Makefile2 all
make[1]: Entering directory '/home/jenkins/builds/workspace/shm-fmi-pipe_development/build/win64'
make -f libshmipc/CMakeFiles/libshmipc.dir/build.make libshmipc/CMakeFiles/libshmipc.dir/depend
make -f libshmfmi/CMakeFiles/libshmfmi.dir/build.make libshmfmi/CMakeFiles/libshmfmi.dir/depend
make -f libshmfmu/CMakeFiles/libshmfmu_static.dir/build.make libshmfmu/CMakeFiles/libshmfmu_static.dir/depend
make -f third_party/googletest/googletest/CMakeFiles/gtest.dir/build.make third_party/googletest/googletest/CMakeFiles/gtest.dir/depend
make[2]: Entering directory '/home/jenkins/builds/workspace/shm-fmi-pipe_development/build/win64'
cd /home/jenkins/builds/workspace/shm-fmi-pipe_development/build/win64 && /usr/bin/cmake -E cmake_depends "Unix Makefiles" /home/jenkins/builds/workspace/shm-fmi-pipe_development /home/jenkins/builds/workspace/shm-fmi-pipe_development/third_party/googletest/googletest /home/jenkins/builds/workspace/shm-fmi-pipe_development/build/win64 /home/jenkins/builds/workspace/shm-fmi-pipe_development/build/win64/third_party/googletest/googletest /home/jenkins/builds/workspace/shm-fmi-pipe_development/build/win64/third_party/googletest/googletest/CMakeFiles/gtest.dir/DependInfo.cmake --color=
make[2]: Entering directory '/home/jenkins/builds/workspace/shm-fmi-pipe_development/build/win64'
cd /home/jenkins/builds/workspace/shm-fmi-pipe_development/build/win64 && /usr/bin/cmake -E cmake_depends "Unix Makefiles" /home/jenkins/builds/workspace/shm-fmi-pipe_development /home/jenkins/builds/workspace/shm-fmi-pipe_development/libshmipc /home/jenkins/builds/workspace/shm-fmi-pipe_development/build/win64 /home/jenkins/builds/workspace/shm-fmi-pipe_development/build/win64/libshmipc /home/jenkins/builds/workspace/shm-fmi-pipe_development/build/win64/libshmipc/CMakeFiles/libshmipc.dir/DependInfo.cmake --color=
make[2]: Entering directory '/home/jenkins/builds/workspace/shm-fmi-pipe_development/build/win64'
make[2]: Entering directory '/home/jenkins/builds/workspace/shm-fmi-pipe_development/build/win64'
cd /home/jenkins/builds/workspace/shm-fmi-pipe_development/build/win64 && /usr/bin/cmake -E cmake_depends "Unix Makefiles" /home/jenkins/builds/workspace/shm-fmi-pipe_development /home/jenkins/builds/workspace/shm-fmi-pipe_development/libshmfmu /home/jenkins/builds/workspace/shm-fmi-pipe_development/build/win64 /home/jenkins/builds/workspace/shm-fmi-pipe_development/build/win64/libshmfmu /home/jenkins/builds/workspace/shm-fmi-pipe_development/build/win64/libshmfmu/CMakeFiles/libshmfmu_static.dir/DependInfo.cmake --color=
Scanning dependencies of target libshmipc
make[2]: Leaving directory '/home/jenkins/builds/workspace/shm-fmi-pipe_development/build/win64'
make -f libshmipc/CMakeFiles/libshmipc.dir/build.make libshmipc/CMakeFiles/libshmipc.dir/build
make[2]: Entering directory '/home/jenkins/builds/workspace/shm-fmi-pipe_development/build/win64'
Scanning dependencies of target gtest
[  1%] Running C++ protocol buffer compiler on ../proto/service.proto
make[2]: Leaving directory '/home/jenkins/builds/workspace/shm-fmi-pipe_development/build/win64'
make -f third_party/googletest/googletest/CMakeFiles/gtest.dir/build.make third_party/googletest/googletest/CMakeFiles/gtest.dir/build
cd /home/jenkins/builds/workspace/shm-fmi-pipe_development/build/win64/libshmfmi && /usr/bin/protoc --cpp_out /home/jenkins/builds/workspace/shm-fmi-pipe_development/build/win64/libshmfmi -I /home/jenkins/builds/workspace/shm-fmi-pipe_development/proto /home/jenkins/builds/workspace/shm-fmi-pipe_development/proto/service.proto
make[2]: Entering directory '/home/jenkins/builds/workspace/shm-fmi-pipe_development/build/win64'
[  3%] Building CXX object libshmipc/CMakeFiles/libshmipc.dir/ipcmain.cpp.obj
cd /home/jenkins/builds/workspace/shm-fmi-pipe_development/build/win64/libshmipc && /usr/bin/x86_64-w64-mingw32-g++    @CMakeFiles/libshmipc.dir/includes_CXX.rsp -std=c++11 -pthread   -o CMakeFiles/libshmipc.dir/ipcmain.cpp.obj -c /home/jenkins/builds/workspace/shm-fmi-pipe_development/libshmipc/ipcmain.cpp
[  5%] Building CXX object third_party/googletest/googletest/CMakeFiles/gtest.dir/src/gtest-all.cc.obj
cd /home/jenkins/builds/workspace/shm-fmi-pipe_development/build/win64/third_party/googletest/googletest && /usr/bin/x86_64-w64-mingw32-g++    @CMakeFiles/gtest.dir/includes_CXX.rsp -Wall -Wshadow -DGTEST_HAS_PTHREAD=0 -fexceptions -Wextra -Wno-unused-parameter -Wno-missing-field-initializers -o CMakeFiles/gtest.dir/src/gtest-all.cc.obj -c /home/jenkins/builds/workspace/shm-fmi-pipe_development/third_party/googletest/googletest/src/gtest-all.cc
Scanning dependencies of target libshmfmu_static
make[2]: Leaving directory '/home/jenkins/builds/workspace/shm-fmi-pipe_development/build/win64'
make -f libshmfmu/CMakeFiles/libshmfmu_static.dir/build.make libshmfmu/CMakeFiles/libshmfmu_static.dir/build
make[2]: Entering directory '/home/jenkins/builds/workspace/shm-fmi-pipe_development/build/win64'
cd /home/jenkins/builds/workspace/shm-fmi-pipe_development/build/win64 && /usr/bin/cmake -E cmake_depends "Unix Makefiles" /home/jenkins/builds/workspace/shm-fmi-pipe_development /home/jenkins/builds/workspace/shm-fmi-pipe_development/libshmfmi /home/jenkins/builds/workspace/shm-fmi-pipe_development/build/win64 /home/jenkins/builds/workspace/shm-fmi-pipe_development/build/win64/libshmfmi /home/jenkins/builds/workspace/shm-fmi-pipe_development/build/win64/libshmfmi/CMakeFiles/libshmfmi.dir/DependInfo.cmake --color=
[  7%] Building C object libshmfmu/CMakeFiles/libshmfmu_static.dir/__/third_party/uuid4/src/uuid4.c.obj
cd /home/jenkins/builds/workspace/shm-fmi-pipe_development/build/win64/libshmfmu && /usr/bin/x86_64-w64-mingw32-gcc   @CMakeFiles/libshmfmu_static.dir/includes_C.rsp -DFMI_COSIMULATION   -o CMakeFiles/libshmfmu_static.dir/__/third_party/uuid4/src/uuid4.c.obj   -c /home/jenkins/builds/workspace/shm-fmi-pipe_development/third_party/uuid4/src/uuid4.c
Scanning dependencies of target libshmfmi
make[2]: Leaving directory '/home/jenkins/builds/workspace/shm-fmi-pipe_development/build/win64'
make -f libshmfmi/CMakeFiles/libshmfmi.dir/build.make libshmfmi/CMakeFiles/libshmfmi.dir/build
make[2]: Entering directory '/home/jenkins/builds/workspace/shm-fmi-pipe_development/build/win64'
[  9%] Building CXX object libshmfmi/CMakeFiles/libshmfmi.dir/__/libshmipc/sem_timedwait.cpp.obj
cd /home/jenkins/builds/workspace/shm-fmi-pipe_development/build/win64/libshmfmi && /usr/bin/x86_64-w64-mingw32-g++    @CMakeFiles/libshmfmi.dir/includes_CXX.rsp -std=c++11   -o CMakeFiles/libshmfmi.dir/__/libshmipc/sem_timedwait.cpp.obj -c /home/jenkins/builds/workspace/shm-fmi-pipe_development/libshmipc/sem_timedwait.cpp
[ 11%] Building CXX object libshmfmi/CMakeFiles/libshmfmi.dir/__/libshmipc/IpcBase.cpp.obj
cd /home/jenkins/builds/workspace/shm-fmi-pipe_development/build/win64/libshmfmi && /usr/bin/x86_64-w64-mingw32-g++    @CMakeFiles/libshmfmi.dir/includes_CXX.rsp -std=c++11   -o CMakeFiles/libshmfmi.dir/__/libshmipc/IpcBase.cpp.obj -c /home/jenkins/builds/workspace/shm-fmi-pipe_development/libshmipc/IpcBase.cpp
[ 12%] Building C object libshmfmu/CMakeFiles/libshmfmu_static.dir/uri.c.obj
cd /home/jenkins/builds/workspace/shm-fmi-pipe_development/build/win64/libshmfmu && /usr/bin/x86_64-w64-mingw32-gcc   @CMakeFiles/libshmfmu_static.dir/includes_C.rsp -DFMI_COSIMULATION   -o CMakeFiles/libshmfmu_static.dir/uri.c.obj   -c /home/jenkins/builds/workspace/shm-fmi-pipe_development/libshmfmu/uri.c
[ 14%] Building CXX object libshmfmu/CMakeFiles/libshmfmu_static.dir/fmu.cpp.obj
cd /home/jenkins/builds/workspace/shm-fmi-pipe_development/build/win64/libshmfmu && /usr/bin/x86_64-w64-mingw32-g++    @CMakeFiles/libshmfmu_static.dir/includes_CXX.rsp -std=c++11 -DFMI_COSIMULATION   -o CMakeFiles/libshmfmu_static.dir/fmu.cpp.obj -c /home/jenkins/builds/workspace/shm-fmi-pipe_development/libshmfmu/fmu.cpp
[ 16%] Building CXX object libshmfmi/CMakeFiles/libshmfmi.dir/__/libshmipc/IpcServer.cpp.obj
cd /home/jenkins/builds/workspace/shm-fmi-pipe_development/build/win64/libshmfmi && /usr/bin/x86_64-w64-mingw32-g++    @CMakeFiles/libshmfmi.dir/includes_CXX.rsp -std=c++11   -o CMakeFiles/libshmfmi.dir/__/libshmipc/IpcServer.cpp.obj -c /home/jenkins/builds/workspace/shm-fmi-pipe_development/libshmipc/IpcServer.cpp
[ 18%] Building CXX object libshmipc/CMakeFiles/libshmipc.dir/IpcBase.cpp.obj
cd /home/jenkins/builds/workspace/shm-fmi-pipe_development/build/win64/libshmipc && /usr/bin/x86_64-w64-mingw32-g++    @CMakeFiles/libshmipc.dir/includes_CXX.rsp -std=c++11 -pthread   -o CMakeFiles/libshmipc.dir/IpcBase.cpp.obj -c /home/jenkins/builds/workspace/shm-fmi-pipe_development/libshmipc/IpcBase.cpp
[ 20%] Building CXX object libshmipc/CMakeFiles/libshmipc.dir/IpcClient.cpp.obj
cd /home/jenkins/builds/workspace/shm-fmi-pipe_development/build/win64/libshmipc && /usr/bin/x86_64-w64-mingw32-g++    @CMakeFiles/libshmipc.dir/includes_CXX.rsp -std=c++11 -pthread   -o CMakeFiles/libshmipc.dir/IpcClient.cpp.obj -c /home/jenkins/builds/workspace/shm-fmi-pipe_development/libshmipc/IpcClient.cpp
[ 22%] Building CXX object libshmfmu/CMakeFiles/libshmfmu_static.dir/FmuContainer.cpp.obj
cd /home/jenkins/builds/workspace/shm-fmi-pipe_development/build/win64/libshmfmu && /usr/bin/x86_64-w64-mingw32-g++    @CMakeFiles/libshmfmu_static.dir/includes_CXX.rsp -std=c++11 -DFMI_COSIMULATION   -o CMakeFiles/libshmfmu_static.dir/FmuContainer.cpp.obj -c /home/jenkins/builds/workspace/shm-fmi-pipe_development/libshmfmu/FmuContainer.cpp
[ 24%] Building CXX object libshmfmi/CMakeFiles/libshmfmi.dir/__/libshmipc/IpcClient.cpp.obj
cd /home/jenkins/builds/workspace/shm-fmi-pipe_development/build/win64/libshmfmi && /usr/bin/x86_64-w64-mingw32-g++    @CMakeFiles/libshmfmi.dir/includes_CXX.rsp -std=c++11   -o CMakeFiles/libshmfmi.dir/__/libshmipc/IpcClient.cpp.obj -c /home/jenkins/builds/workspace/shm-fmi-pipe_development/libshmipc/IpcClient.cpp
[ 25%] Building CXX object libshmipc/CMakeFiles/libshmipc.dir/sem_timedwait.cpp.obj
cd /home/jenkins/builds/workspace/shm-fmi-pipe_development/build/win64/libshmipc && /usr/bin/x86_64-w64-mingw32-g++    @CMakeFiles/libshmipc.dir/includes_CXX.rsp -std=c++11 -pthread   -o CMakeFiles/libshmipc.dir/sem_timedwait.cpp.obj -c /home/jenkins/builds/workspace/shm-fmi-pipe_development/libshmipc/sem_timedwait.cpp
[ 27%] Building CXX object libshmipc/CMakeFiles/libshmipc.dir/IpcServer.cpp.obj
cd /home/jenkins/builds/workspace/shm-fmi-pipe_development/build/win64/libshmipc && /usr/bin/x86_64-w64-mingw32-g++    @CMakeFiles/libshmipc.dir/includes_CXX.rsp -std=c++11 -pthread   -o CMakeFiles/libshmipc.dir/IpcServer.cpp.obj -c /home/jenkins/builds/workspace/shm-fmi-pipe_development/libshmipc/IpcServer.cpp
[ 29%] Building CXX object libshmfmi/CMakeFiles/libshmfmi.dir/service.pb.cc.obj
cd /home/jenkins/builds/workspace/shm-fmi-pipe_development/build/win64/libshmfmi && /usr/bin/x86_64-w64-mingw32-g++    @CMakeFiles/libshmfmi.dir/includes_CXX.rsp -std=c++11   -o CMakeFiles/libshmfmi.dir/service.pb.cc.obj -c /home/jenkins/builds/workspace/shm-fmi-pipe_development/build/win64/libshmfmi/service.pb.cc
[ 31%] Building CXX object libshmfmu/CMakeFiles/libshmfmu_static.dir/JavaLauncher.cpp.obj
cd /home/jenkins/builds/workspace/shm-fmi-pipe_development/build/win64/libshmfmu && /usr/bin/x86_64-w64-mingw32-g++    @CMakeFiles/libshmfmu_static.dir/includes_CXX.rsp -std=c++11 -DFMI_COSIMULATION   -o CMakeFiles/libshmfmu_static.dir/JavaLauncher.cpp.obj -c /home/jenkins/builds/workspace/shm-fmi-pipe_development/libshmfmu/JavaLauncher.cpp
[ 33%] Linking CXX static library libgtest.a
cd /home/jenkins/builds/workspace/shm-fmi-pipe_development/build/win64/third_party/googletest/googletest && /usr/bin/cmake -P CMakeFiles/gtest.dir/cmake_clean_target.cmake
cd /home/jenkins/builds/workspace/shm-fmi-pipe_development/build/win64/third_party/googletest/googletest && /usr/bin/cmake -E cmake_link_script CMakeFiles/gtest.dir/link.txt --verbose=1
/usr/bin/x86_64-w64-mingw32-ar qc libgtest.a  CMakeFiles/gtest.dir/src/gtest-all.cc.obj
[ 35%] Linking CXX executable libshmipc.exe
cd /home/jenkins/builds/workspace/shm-fmi-pipe_development/build/win64/libshmipc && /usr/bin/cmake -E cmake_link_script CMakeFiles/libshmipc.dir/link.txt --verbose=1
/usr/bin/cmake -E remove -f CMakeFiles/libshmipc.dir/objects.a
/usr/bin/x86_64-w64-mingw32-ar cr CMakeFiles/libshmipc.dir/objects.a @CMakeFiles/libshmipc.dir/objects1.rsp
/usr/bin/x86_64-w64-mingw32-g++   -std=c++11 -pthread   -static-libstdc++ -static-libgcc -Wl,--whole-archive CMakeFiles/libshmipc.dir/objects.a -Wl,--no-whole-archive  -o libshmipc.exe -Wl,--out-implib,liblibshmipc.dll.a -Wl,--major-image-version,0,--minor-image-version,0 @CMakeFiles/libshmipc.dir/linklibs.rsp
make[2]: Leaving directory '/home/jenkins/builds/workspace/shm-fmi-pipe_development/build/win64'
[ 35%] Built target libshmipc
[ 37%] Building CXX object libshmfmi/CMakeFiles/libshmfmi.dir/FmuProxy.cpp.obj
cd /home/jenkins/builds/workspace/shm-fmi-pipe_development/build/win64/libshmfmi && /usr/bin/x86_64-w64-mingw32-g++    @CMakeFiles/libshmfmi.dir/includes_CXX.rsp -std=c++11   -o CMakeFiles/libshmfmi.dir/FmuProxy.cpp.obj -c /home/jenkins/builds/workspace/shm-fmi-pipe_development/libshmfmi/FmuProxy.cpp
[ 38%] Building CXX object libshmfmu/CMakeFiles/libshmfmu_static.dir/ConfigFile.cpp.obj
cd /home/jenkins/builds/workspace/shm-fmi-pipe_development/build/win64/libshmfmu && /usr/bin/x86_64-w64-mingw32-g++    @CMakeFiles/libshmfmu_static.dir/includes_CXX.rsp -std=c++11 -DFMI_COSIMULATION   -o CMakeFiles/libshmfmu_static.dir/ConfigFile.cpp.obj -c /home/jenkins/builds/workspace/shm-fmi-pipe_development/libshmfmu/ConfigFile.cpp
/usr/bin/x86_64-w64-mingw32-ranlib libgtest.a
[ 40%] Linking CXX static library liblibshmfmu_static.a
cd /home/jenkins/builds/workspace/shm-fmi-pipe_development/build/win64/libshmfmu && /usr/bin/cmake -P CMakeFiles/libshmfmu_static.dir/cmake_clean_target.cmake
cd /home/jenkins/builds/workspace/shm-fmi-pipe_development/build/win64/libshmfmu && /usr/bin/cmake -E cmake_link_script CMakeFiles/libshmfmu_static.dir/link.txt --verbose=1
/usr/bin/x86_64-w64-mingw32-ar qc liblibshmfmu_static.a  CMakeFiles/libshmfmu_static.dir/__/third_party/uuid4/src/uuid4.c.obj CMakeFiles/libshmfmu_static.dir/uri.c.obj CMakeFiles/libshmfmu_static.dir/fmu.cpp.obj CMakeFiles/libshmfmu_static.dir/FmuContainer.cpp.obj CMakeFiles/libshmfmu_static.dir/JavaLauncher.cpp.obj CMakeFiles/libshmfmu_static.dir/ConfigFile.cpp.obj
/usr/bin/x86_64-w64-mingw32-ranlib liblibshmfmu_static.a
make[2]: Leaving directory '/home/jenkins/builds/workspace/shm-fmi-pipe_development/build/win64'
[ 40%] Built target libshmfmu_static
make[2]: Leaving directory '/home/jenkins/builds/workspace/shm-fmi-pipe_development/build/win64'
[ 40%] Built target gtest
make -f third_party/googletest/googletest/CMakeFiles/gtest_main.dir/build.make third_party/googletest/googletest/CMakeFiles/gtest_main.dir/depend
make[2]: Entering directory '/home/jenkins/builds/workspace/shm-fmi-pipe_development/build/win64'
cd /home/jenkins/builds/workspace/shm-fmi-pipe_development/build/win64 && /usr/bin/cmake -E cmake_depends "Unix Makefiles" /home/jenkins/builds/workspace/shm-fmi-pipe_development /home/jenkins/builds/workspace/shm-fmi-pipe_development/third_party/googletest/googletest /home/jenkins/builds/workspace/shm-fmi-pipe_development/build/win64 /home/jenkins/builds/workspace/shm-fmi-pipe_development/build/win64/third_party/googletest/googletest /home/jenkins/builds/workspace/shm-fmi-pipe_development/build/win64/third_party/googletest/googletest/CMakeFiles/gtest_main.dir/DependInfo.cmake --color=
Scanning dependencies of target gtest_main
make[2]: Leaving directory '/home/jenkins/builds/workspace/shm-fmi-pipe_development/build/win64'
make -f third_party/googletest/googletest/CMakeFiles/gtest_main.dir/build.make third_party/googletest/googletest/CMakeFiles/gtest_main.dir/build
make[2]: Entering directory '/home/jenkins/builds/workspace/shm-fmi-pipe_development/build/win64'
[ 42%] Building CXX object third_party/googletest/googletest/CMakeFiles/gtest_main.dir/src/gtest_main.cc.obj
cd /home/jenkins/builds/workspace/shm-fmi-pipe_development/build/win64/third_party/googletest/googletest && /usr/bin/x86_64-w64-mingw32-g++    @CMakeFiles/gtest_main.dir/includes_CXX.rsp -Wall -Wshadow -DGTEST_HAS_PTHREAD=0 -fexceptions -Wextra -Wno-unused-parameter -Wno-missing-field-initializers -o CMakeFiles/gtest_main.dir/src/gtest_main.cc.obj -c /home/jenkins/builds/workspace/shm-fmi-pipe_development/third_party/googletest/googletest/src/gtest_main.cc
[ 44%] Linking CXX static library liblibshmfmi.a
cd /home/jenkins/builds/workspace/shm-fmi-pipe_development/build/win64/libshmfmi && /usr/bin/cmake -P CMakeFiles/libshmfmi.dir/cmake_clean_target.cmake
cd /home/jenkins/builds/workspace/shm-fmi-pipe_development/build/win64/libshmfmi && /usr/bin/cmake -E cmake_link_script CMakeFiles/libshmfmi.dir/link.txt --verbose=1
/usr/bin/x86_64-w64-mingw32-ar qc liblibshmfmi.a  CMakeFiles/libshmfmi.dir/__/libshmipc/sem_timedwait.cpp.obj CMakeFiles/libshmfmi.dir/__/libshmipc/IpcBase.cpp.obj CMakeFiles/libshmfmi.dir/__/libshmipc/IpcServer.cpp.obj CMakeFiles/libshmfmi.dir/__/libshmipc/IpcClient.cpp.obj CMakeFiles/libshmfmi.dir/service.pb.cc.obj CMakeFiles/libshmfmi.dir/FmuProxy.cpp.obj
/usr/bin/x86_64-w64-mingw32-ranlib liblibshmfmi.a
make[2]: Leaving directory '/home/jenkins/builds/workspace/shm-fmi-pipe_development/build/win64'
[ 44%] Built target libshmfmi
make -f libshmfmu/CMakeFiles/libshmfmu.dir/build.make libshmfmu/CMakeFiles/libshmfmu.dir/depend
make -f shmfmi-server/CMakeFiles/sharedmemory.dir/build.make shmfmi-server/CMakeFiles/sharedmemory.dir/depend
make -f testfmu-integration/CMakeFiles/testfmu-integration-driver.dir/build.make testfmu-integration/CMakeFiles/testfmu-integration-driver.dir/depend
make[2]: Entering directory '/home/jenkins/builds/workspace/shm-fmi-pipe_development/build/win64'
cd /home/jenkins/builds/workspace/shm-fmi-pipe_development/build/win64 && /usr/bin/cmake -E cmake_depends "Unix Makefiles" /home/jenkins/builds/workspace/shm-fmi-pipe_development /home/jenkins/builds/workspace/shm-fmi-pipe_development/testfmu-integration /home/jenkins/builds/workspace/shm-fmi-pipe_development/build/win64 /home/jenkins/builds/workspace/shm-fmi-pipe_development/build/win64/testfmu-integration /home/jenkins/builds/workspace/shm-fmi-pipe_development/build/win64/testfmu-integration/CMakeFiles/testfmu-integration-driver.dir/DependInfo.cmake --color=
make[2]: Entering directory '/home/jenkins/builds/workspace/shm-fmi-pipe_development/build/win64'
cd /home/jenkins/builds/workspace/shm-fmi-pipe_development/build/win64 && /usr/bin/cmake -E cmake_depends "Unix Makefiles" /home/jenkins/builds/workspace/shm-fmi-pipe_development /home/jenkins/builds/workspace/shm-fmi-pipe_development/libshmfmu /home/jenkins/builds/workspace/shm-fmi-pipe_development/build/win64 /home/jenkins/builds/workspace/shm-fmi-pipe_development/build/win64/libshmfmu /home/jenkins/builds/workspace/shm-fmi-pipe_development/build/win64/libshmfmu/CMakeFiles/libshmfmu.dir/DependInfo.cmake --color=
make[2]: Entering directory '/home/jenkins/builds/workspace/shm-fmi-pipe_development/build/win64'
cd /home/jenkins/builds/workspace/shm-fmi-pipe_development/build/win64 && /usr/bin/cmake -E cmake_depends "Unix Makefiles" /home/jenkins/builds/workspace/shm-fmi-pipe_development /home/jenkins/builds/workspace/shm-fmi-pipe_development/shmfmi-server /home/jenkins/builds/workspace/shm-fmi-pipe_development/build/win64 /home/jenkins/builds/workspace/shm-fmi-pipe_development/build/win64/shmfmi-server /home/jenkins/builds/workspace/shm-fmi-pipe_development/build/win64/shmfmi-server/CMakeFiles/sharedmemory.dir/DependInfo.cmake --color=
Scanning dependencies of target testfmu-integration-driver
make[2]: Leaving directory '/home/jenkins/builds/workspace/shm-fmi-pipe_development/build/win64'
make -f testfmu-integration/CMakeFiles/testfmu-integration-driver.dir/build.make testfmu-integration/CMakeFiles/testfmu-integration-driver.dir/build
make[2]: Entering directory '/home/jenkins/builds/workspace/shm-fmi-pipe_development/build/win64'
Scanning dependencies of target libshmfmu
[ 46%] Building CXX object testfmu-integration/CMakeFiles/testfmu-integration-driver.dir/runner/testrunner.cpp.obj
make[2]: Leaving directory '/home/jenkins/builds/workspace/shm-fmi-pipe_development/build/win64'
make -f libshmfmu/CMakeFiles/libshmfmu.dir/build.make libshmfmu/CMakeFiles/libshmfmu.dir/build
cd /home/jenkins/builds/workspace/shm-fmi-pipe_development/build/win64/testfmu-integration && /usr/bin/x86_64-w64-mingw32-g++    @CMakeFiles/testfmu-integration-driver.dir/includes_CXX.rsp -std=c++11 -DFMI_COSIMULATION -DFMULIB=\"/home/jenkins/builds/workspace/shm-fmi-pipe_development/build/win64/libshmfmu/libshmfmu.dll\" -DTEST_RUNNER_DRIVER_PATH=\"/home/jenkins/builds/workspace/shm-fmi-pipe_development/build/win64/testfmu-integration/testfmu-integration-driver\"   -o CMakeFiles/testfmu-integration-driver.dir/runner/testrunner.cpp.obj -c /home/jenkins/builds/workspace/shm-fmi-pipe_development/testfmu-integration/runner/testrunner.cpp
make[2]: Entering directory '/home/jenkins/builds/workspace/shm-fmi-pipe_development/build/win64'
[ 48%] Building C object libshmfmu/CMakeFiles/libshmfmu.dir/__/third_party/uuid4/src/uuid4.c.obj
cd /home/jenkins/builds/workspace/shm-fmi-pipe_development/build/win64/libshmfmu && /usr/bin/x86_64-w64-mingw32-gcc  -Dlibshmfmu_EXPORTS @CMakeFiles/libshmfmu.dir/includes_C.rsp -DFMI_COSIMULATION   -o CMakeFiles/libshmfmu.dir/__/third_party/uuid4/src/uuid4.c.obj   -c /home/jenkins/builds/workspace/shm-fmi-pipe_development/third_party/uuid4/src/uuid4.c
Scanning dependencies of target sharedmemory
make[2]: Leaving directory '/home/jenkins/builds/workspace/shm-fmi-pipe_development/build/win64'
make -f shmfmi-server/CMakeFiles/sharedmemory.dir/build.make shmfmi-server/CMakeFiles/sharedmemory.dir/build
make[2]: Entering directory '/home/jenkins/builds/workspace/shm-fmi-pipe_development/build/win64'
[ 50%] Building CXX object shmfmi-server/CMakeFiles/sharedmemory.dir/src/main/native/sharedmemory.cpp.obj
cd /home/jenkins/builds/workspace/shm-fmi-pipe_development/build/win64/shmfmi-server && /usr/bin/x86_64-w64-mingw32-g++   -Dsharedmemory_EXPORTS @CMakeFiles/sharedmemory.dir/includes_CXX.rsp -std=c++11   -o CMakeFiles/sharedmemory.dir/src/main/native/sharedmemory.cpp.obj -c /home/jenkins/builds/workspace/shm-fmi-pipe_development/shmfmi-server/src/main/native/sharedmemory.cpp
[ 51%] Linking CXX static library libgtest_main.a
cd /home/jenkins/builds/workspace/shm-fmi-pipe_development/build/win64/third_party/googletest/googletest && /usr/bin/cmake -P CMakeFiles/gtest_main.dir/cmake_clean_target.cmake
cd /home/jenkins/builds/workspace/shm-fmi-pipe_development/build/win64/third_party/googletest/googletest && /usr/bin/cmake -E cmake_link_script CMakeFiles/gtest_main.dir/link.txt --verbose=1
[ 53%] Building CXX object testfmu-integration/CMakeFiles/testfmu-integration-driver.dir/RemoteTestDriver.cpp.obj
cd /home/jenkins/builds/workspace/shm-fmi-pipe_development/build/win64/testfmu-integration && /usr/bin/x86_64-w64-mingw32-g++    @CMakeFiles/testfmu-integration-driver.dir/includes_CXX.rsp -std=c++11 -DFMI_COSIMULATION -DFMULIB=\"/home/jenkins/builds/workspace/shm-fmi-pipe_development/build/win64/libshmfmu/libshmfmu.dll\" -DTEST_RUNNER_DRIVER_PATH=\"/home/jenkins/builds/workspace/shm-fmi-pipe_development/build/win64/testfmu-integration/testfmu-integration-driver\"   -o CMakeFiles/testfmu-integration-driver.dir/RemoteTestDriver.cpp.obj -c /home/jenkins/builds/workspace/shm-fmi-pipe_development/testfmu-integration/RemoteTestDriver.cpp
/usr/bin/x86_64-w64-mingw32-ar qc libgtest_main.a  CMakeFiles/gtest_main.dir/src/gtest_main.cc.obj
/usr/bin/x86_64-w64-mingw32-ranlib libgtest_main.a
make[2]: Leaving directory '/home/jenkins/builds/workspace/shm-fmi-pipe_development/build/win64'
[ 53%] Built target gtest_main
[ 55%] Building CXX object shmfmi-server/CMakeFiles/sharedmemory.dir/src/main/native/sharedmemoryserver.cpp.obj
cd /home/jenkins/builds/workspace/shm-fmi-pipe_development/build/win64/shmfmi-server && /usr/bin/x86_64-w64-mingw32-g++   -Dsharedmemory_EXPORTS @CMakeFiles/sharedmemory.dir/includes_CXX.rsp -std=c++11   -o CMakeFiles/sharedmemory.dir/src/main/native/sharedmemoryserver.cpp.obj -c /home/jenkins/builds/workspace/shm-fmi-pipe_development/shmfmi-server/src/main/native/sharedmemoryserver.cpp
[ 57%] Building C object libshmfmu/CMakeFiles/libshmfmu.dir/uri.c.obj
cd /home/jenkins/builds/workspace/shm-fmi-pipe_development/build/win64/libshmfmu && /usr/bin/x86_64-w64-mingw32-gcc  -Dlibshmfmu_EXPORTS @CMakeFiles/libshmfmu.dir/includes_C.rsp -DFMI_COSIMULATION   -o CMakeFiles/libshmfmu.dir/uri.c.obj   -c /home/jenkins/builds/workspace/shm-fmi-pipe_development/libshmfmu/uri.c
[ 59%] Building CXX object libshmfmu/CMakeFiles/libshmfmu.dir/fmu.cpp.obj
cd /home/jenkins/builds/workspace/shm-fmi-pipe_development/build/win64/libshmfmu && /usr/bin/x86_64-w64-mingw32-g++   -Dlibshmfmu_EXPORTS @CMakeFiles/libshmfmu.dir/includes_CXX.rsp -std=c++11 -DFMI_COSIMULATION   -o CMakeFiles/libshmfmu.dir/fmu.cpp.obj -c /home/jenkins/builds/workspace/shm-fmi-pipe_development/libshmfmu/fmu.cpp
[ 61%] Building CXX object libshmfmu/CMakeFiles/libshmfmu.dir/FmuContainer.cpp.obj
cd /home/jenkins/builds/workspace/shm-fmi-pipe_development/build/win64/libshmfmu && /usr/bin/x86_64-w64-mingw32-g++   -Dlibshmfmu_EXPORTS @CMakeFiles/libshmfmu.dir/includes_CXX.rsp -std=c++11 -DFMI_COSIMULATION   -o CMakeFiles/libshmfmu.dir/FmuContainer.cpp.obj -c /home/jenkins/builds/workspace/shm-fmi-pipe_development/libshmfmu/FmuContainer.cpp
[ 62%] Linking CXX shared library sharedmemory.dll
cd /home/jenkins/builds/workspace/shm-fmi-pipe_development/build/win64/shmfmi-server && /usr/bin/cmake -E cmake_link_script CMakeFiles/sharedmemory.dir/link.txt --verbose=1
/usr/bin/cmake -E remove -f CMakeFiles/sharedmemory.dir/objects.a
/usr/bin/x86_64-w64-mingw32-ar cr CMakeFiles/sharedmemory.dir/objects.a @CMakeFiles/sharedmemory.dir/objects1.rsp
/usr/bin/x86_64-w64-mingw32-g++    -std=c++11  -Wl,--add-stdcall-alias -static-libstdc++ -static-libgcc -shared -o sharedmemory.dll -Wl,--out-implib,libsharedmemory.dll.a -Wl,--major-image-version,0,--minor-image-version,0 -Wl,--whole-archive CMakeFiles/sharedmemory.dir/objects.a -Wl,--no-whole-archive @CMakeFiles/sharedmemory.dir/linklibs.rsp
[ 64%] Linking CXX executable testfmu-integration-driver.exe
cd /home/jenkins/builds/workspace/shm-fmi-pipe_development/build/win64/testfmu-integration && /usr/bin/cmake -E cmake_link_script CMakeFiles/testfmu-integration-driver.dir/link.txt --verbose=1
/usr/bin/cmake -E remove -f CMakeFiles/testfmu-integration-driver.dir/objects.a
/usr/bin/x86_64-w64-mingw32-ar cr CMakeFiles/testfmu-integration-driver.dir/objects.a @CMakeFiles/testfmu-integration-driver.dir/objects1.rsp
/usr/bin/x86_64-w64-mingw32-g++   -std=c++11 -DFMI_COSIMULATION -DFMULIB=\"/home/jenkins/builds/workspace/shm-fmi-pipe_development/build/win64/libshmfmu/libshmfmu.dll\" -DTEST_RUNNER_DRIVER_PATH=\"/home/jenkins/builds/workspace/shm-fmi-pipe_development/build/win64/testfmu-integration/testfmu-integration-driver\"   -static-libstdc++ -static-libgcc -Wl,--whole-archive CMakeFiles/testfmu-integration-driver.dir/objects.a -Wl,--no-whole-archive  -o testfmu-integration-driver.exe -Wl,--out-implib,libtestfmu-integration-driver.dll.a -Wl,--major-image-version,0,--minor-image-version,0 @CMakeFiles/testfmu-integration-driver.dir/linklibs.rsp
[ 66%] Building CXX object libshmfmu/CMakeFiles/libshmfmu.dir/JavaLauncher.cpp.obj
cd /home/jenkins/builds/workspace/shm-fmi-pipe_development/build/win64/libshmfmu && /usr/bin/x86_64-w64-mingw32-g++   -Dlibshmfmu_EXPORTS @CMakeFiles/libshmfmu.dir/includes_CXX.rsp -std=c++11 -DFMI_COSIMULATION   -o CMakeFiles/libshmfmu.dir/JavaLauncher.cpp.obj -c /home/jenkins/builds/workspace/shm-fmi-pipe_development/libshmfmu/JavaLauncher.cpp
make[2]: Leaving directory '/home/jenkins/builds/workspace/shm-fmi-pipe_development/build/win64'
[ 66%] Built target sharedmemory
[ 68%] Building CXX object libshmfmu/CMakeFiles/libshmfmu.dir/ConfigFile.cpp.obj
cd /home/jenkins/builds/workspace/shm-fmi-pipe_development/build/win64/libshmfmu && /usr/bin/x86_64-w64-mingw32-g++   -Dlibshmfmu_EXPORTS @CMakeFiles/libshmfmu.dir/includes_CXX.rsp -std=c++11 -DFMI_COSIMULATION   -o CMakeFiles/libshmfmu.dir/ConfigFile.cpp.obj -c /home/jenkins/builds/workspace/shm-fmi-pipe_development/libshmfmu/ConfigFile.cpp
make -f testlibshmipc/CMakeFiles/testlibshmipc.dir/build.make testlibshmipc/CMakeFiles/testlibshmipc.dir/depend
make[2]: Entering directory '/home/jenkins/builds/workspace/shm-fmi-pipe_development/build/win64'
cd /home/jenkins/builds/workspace/shm-fmi-pipe_development/build/win64 && /usr/bin/cmake -E cmake_depends "Unix Makefiles" /home/jenkins/builds/workspace/shm-fmi-pipe_development /home/jenkins/builds/workspace/shm-fmi-pipe_development/testlibshmipc /home/jenkins/builds/workspace/shm-fmi-pipe_development/build/win64 /home/jenkins/builds/workspace/shm-fmi-pipe_development/build/win64/testlibshmipc /home/jenkins/builds/workspace/shm-fmi-pipe_development/build/win64/testlibshmipc/CMakeFiles/testlibshmipc.dir/DependInfo.cmake --color=
Scanning dependencies of target testlibshmipc
make[2]: Leaving directory '/home/jenkins/builds/workspace/shm-fmi-pipe_development/build/win64'
make -f testlibshmipc/CMakeFiles/testlibshmipc.dir/build.make testlibshmipc/CMakeFiles/testlibshmipc.dir/build
make[2]: Entering directory '/home/jenkins/builds/workspace/shm-fmi-pipe_development/build/win64'
[ 70%] Building CXX object testlibshmipc/CMakeFiles/testlibshmipc.dir/FmiIpc_Tests.cpp.obj
cd /home/jenkins/builds/workspace/shm-fmi-pipe_development/build/win64/testlibshmipc && /usr/bin/x86_64-w64-mingw32-g++    @CMakeFiles/testlibshmipc.dir/includes_CXX.rsp -std=c++11   -o CMakeFiles/testlibshmipc.dir/FmiIpc_Tests.cpp.obj -c /home/jenkins/builds/workspace/shm-fmi-pipe_development/testlibshmipc/FmiIpc_Tests.cpp
make -f testlibshmfmi/CMakeFiles/testlibshmfmi.dir/build.make testlibshmfmi/CMakeFiles/testlibshmfmi.dir/depend
make[2]: Entering directory '/home/jenkins/builds/workspace/shm-fmi-pipe_development/build/win64'
cd /home/jenkins/builds/workspace/shm-fmi-pipe_development/build/win64 && /usr/bin/cmake -E cmake_depends "Unix Makefiles" /home/jenkins/builds/workspace/shm-fmi-pipe_development /home/jenkins/builds/workspace/shm-fmi-pipe_development/testlibshmfmi /home/jenkins/builds/workspace/shm-fmi-pipe_development/build/win64 /home/jenkins/builds/workspace/shm-fmi-pipe_development/build/win64/testlibshmfmi /home/jenkins/builds/workspace/shm-fmi-pipe_development/build/win64/testlibshmfmi/CMakeFiles/testlibshmfmi.dir/DependInfo.cmake --color=
Scanning dependencies of target testlibshmfmi
make[2]: Leaving directory '/home/jenkins/builds/workspace/shm-fmi-pipe_development/build/win64'
make -f testlibshmfmi/CMakeFiles/testlibshmfmi.dir/build.make testlibshmfmi/CMakeFiles/testlibshmfmi.dir/build
make[2]: Entering directory '/home/jenkins/builds/workspace/shm-fmi-pipe_development/build/win64'
[ 72%] Building CXX object testlibshmfmi/CMakeFiles/testlibshmfmi.dir/RemoteTestDriver.cpp.obj
cd /home/jenkins/builds/workspace/shm-fmi-pipe_development/build/win64/testlibshmfmi && /usr/bin/x86_64-w64-mingw32-g++    @CMakeFiles/testlibshmfmi.dir/includes_CXX.rsp -std=c++11   -o CMakeFiles/testlibshmfmi.dir/RemoteTestDriver.cpp.obj -c /home/jenkins/builds/workspace/shm-fmi-pipe_development/testlibshmfmi/RemoteTestDriver.cpp
[ 74%] Linking CXX shared library libshmfmu.dll
cd /home/jenkins/builds/workspace/shm-fmi-pipe_development/build/win64/libshmfmu && /usr/bin/cmake -E cmake_link_script CMakeFiles/libshmfmu.dir/link.txt --verbose=1
/usr/bin/cmake -E remove -f CMakeFiles/libshmfmu.dir/objects.a
/usr/bin/x86_64-w64-mingw32-ar cr CMakeFiles/libshmfmu.dir/objects.a @CMakeFiles/libshmfmu.dir/objects1.rsp
/usr/bin/x86_64-w64-mingw32-g++    -std=c++11 -DFMI_COSIMULATION  -static-libstdc++ -static-libgcc -shared -o libshmfmu.dll -Wl,--out-implib,liblibshmfmu.dll.a -Wl,--major-image-version,0,--minor-image-version,0 -Wl,--whole-archive CMakeFiles/libshmfmu.dir/objects.a -Wl,--no-whole-archive @CMakeFiles/libshmfmu.dir/linklibs.rsp
make[2]: Leaving directory '/home/jenkins/builds/workspace/shm-fmi-pipe_development/build/win64'
[ 74%] Built target testfmu-integration-driver
make -f testlibshmfmu/CMakeFiles/testlibshmfmu.dir/build.make testlibshmfmu/CMakeFiles/testlibshmfmu.dir/depend
make[2]: Entering directory '/home/jenkins/builds/workspace/shm-fmi-pipe_development/build/win64'
cd /home/jenkins/builds/workspace/shm-fmi-pipe_development/build/win64 && /usr/bin/cmake -E cmake_depends "Unix Makefiles" /home/jenkins/builds/workspace/shm-fmi-pipe_development /home/jenkins/builds/workspace/shm-fmi-pipe_development/testlibshmfmu /home/jenkins/builds/workspace/shm-fmi-pipe_development/build/win64 /home/jenkins/builds/workspace/shm-fmi-pipe_development/build/win64/testlibshmfmu /home/jenkins/builds/workspace/shm-fmi-pipe_development/build/win64/testlibshmfmu/CMakeFiles/testlibshmfmu.dir/DependInfo.cmake --color=
Scanning dependencies of target testlibshmfmu
make[2]: Leaving directory '/home/jenkins/builds/workspace/shm-fmi-pipe_development/build/win64'
make -f testlibshmfmu/CMakeFiles/testlibshmfmu.dir/build.make testlibshmfmu/CMakeFiles/testlibshmfmu.dir/build
make[2]: Entering directory '/home/jenkins/builds/workspace/shm-fmi-pipe_development/build/win64'
[ 75%] Building CXX object testlibshmfmu/CMakeFiles/testlibshmfmu.dir/JavaLauncher_Tests.cpp.obj
cd /home/jenkins/builds/workspace/shm-fmi-pipe_development/build/win64/testlibshmfmu && /usr/bin/x86_64-w64-mingw32-g++   -DSOURCE_ROOT=\"/home/jenkins/builds/workspace/shm-fmi-pipe_development/testlibshmfmu\" @CMakeFiles/testlibshmfmu.dir/includes_CXX.rsp -std=c++11   -o CMakeFiles/testlibshmfmu.dir/JavaLauncher_Tests.cpp.obj -c /home/jenkins/builds/workspace/shm-fmi-pipe_development/testlibshmfmu/JavaLauncher_Tests.cpp
make[2]: Leaving directory '/home/jenkins/builds/workspace/shm-fmi-pipe_development/build/win64'
[ 75%] Built target libshmfmu
[ 77%] Building CXX object testlibshmfmu/CMakeFiles/testlibshmfmu.dir/ConfigFile_Tests.cpp.obj
cd /home/jenkins/builds/workspace/shm-fmi-pipe_development/build/win64/testlibshmfmu && /usr/bin/x86_64-w64-mingw32-g++   -DSOURCE_ROOT=\"/home/jenkins/builds/workspace/shm-fmi-pipe_development/testlibshmfmu\" @CMakeFiles/testlibshmfmu.dir/includes_CXX.rsp -std=c++11   -o CMakeFiles/testlibshmfmu.dir/ConfigFile_Tests.cpp.obj -c /home/jenkins/builds/workspace/shm-fmi-pipe_development/testlibshmfmu/ConfigFile_Tests.cpp
[ 79%] Linking CXX executable testlibshmipc.exe
cd /home/jenkins/builds/workspace/shm-fmi-pipe_development/build/win64/testlibshmipc && /usr/bin/cmake -E cmake_link_script CMakeFiles/testlibshmipc.dir/link.txt --verbose=1
/usr/bin/cmake -E remove -f CMakeFiles/testlibshmipc.dir/objects.a
/usr/bin/x86_64-w64-mingw32-ar cr CMakeFiles/testlibshmipc.dir/objects.a @CMakeFiles/testlibshmipc.dir/objects1.rsp
/usr/bin/x86_64-w64-mingw32-g++   -std=c++11   -static-libstdc++ -static-libgcc -Wl,--whole-archive CMakeFiles/testlibshmipc.dir/objects.a -Wl,--no-whole-archive  -o testlibshmipc.exe -Wl,--out-implib,libtestlibshmipc.dll.a -Wl,--major-image-version,0,--minor-image-version,0 @CMakeFiles/testlibshmipc.dir/linklibs.rsp
[ 81%] Building CXX object testlibshmfmi/CMakeFiles/testlibshmfmi.dir/FmuProxy_Tests.cpp.obj
cd /home/jenkins/builds/workspace/shm-fmi-pipe_development/build/win64/testlibshmfmi && /usr/bin/x86_64-w64-mingw32-g++    @CMakeFiles/testlibshmfmi.dir/includes_CXX.rsp -std=c++11   -o CMakeFiles/testlibshmfmi.dir/FmuProxy_Tests.cpp.obj -c /home/jenkins/builds/workspace/shm-fmi-pipe_development/testlibshmfmi/FmuProxy_Tests.cpp
make -f testfmu-integration/CMakeFiles/testfmu-integration.dir/build.make testfmu-integration/CMakeFiles/testfmu-integration.dir/depend
make[2]: Entering directory '/home/jenkins/builds/workspace/shm-fmi-pipe_development/build/win64'
cd /home/jenkins/builds/workspace/shm-fmi-pipe_development/build/win64 && /usr/bin/cmake -E cmake_depends "Unix Makefiles" /home/jenkins/builds/workspace/shm-fmi-pipe_development /home/jenkins/builds/workspace/shm-fmi-pipe_development/testfmu-integration /home/jenkins/builds/workspace/shm-fmi-pipe_development/build/win64 /home/jenkins/builds/workspace/shm-fmi-pipe_development/build/win64/testfmu-integration /home/jenkins/builds/workspace/shm-fmi-pipe_development/build/win64/testfmu-integration/CMakeFiles/testfmu-integration.dir/DependInfo.cmake --color=
Scanning dependencies of target testfmu-integration
make[2]: Leaving directory '/home/jenkins/builds/workspace/shm-fmi-pipe_development/build/win64'
make -f testfmu-integration/CMakeFiles/testfmu-integration.dir/build.make testfmu-integration/CMakeFiles/testfmu-integration.dir/build
make[2]: Entering directory '/home/jenkins/builds/workspace/shm-fmi-pipe_development/build/win64'
[ 83%] Building C object testfmu-integration/CMakeFiles/testfmu-integration.dir/fmu-loader.c.obj
cd /home/jenkins/builds/workspace/shm-fmi-pipe_development/build/win64/testfmu-integration && /usr/bin/x86_64-w64-mingw32-gcc   @CMakeFiles/testfmu-integration.dir/includes_C.rsp -pthread -DFMI_COSIMULATION -DFMULIB=\"/home/jenkins/builds/workspace/shm-fmi-pipe_development/build/win64/libshmfmu/libshmfmu.dll\"   -o CMakeFiles/testfmu-integration.dir/fmu-loader.c.obj   -c /home/jenkins/builds/workspace/shm-fmi-pipe_development/testfmu-integration/fmu-loader.c
[ 85%] Building CXX object testlibshmfmu/CMakeFiles/testlibshmfmu.dir/URI_Tests.cpp.obj
cd /home/jenkins/builds/workspace/shm-fmi-pipe_development/build/win64/testlibshmfmu && /usr/bin/x86_64-w64-mingw32-g++   -DSOURCE_ROOT=\"/home/jenkins/builds/workspace/shm-fmi-pipe_development/testlibshmfmu\" @CMakeFiles/testlibshmfmu.dir/includes_CXX.rsp -std=c++11   -o CMakeFiles/testlibshmfmu.dir/URI_Tests.cpp.obj -c /home/jenkins/builds/workspace/shm-fmi-pipe_development/testlibshmfmu/URI_Tests.cpp
[ 87%] Building C object testfmu-integration/CMakeFiles/testfmu-integration.dir/fmuLogger.c.obj
cd /home/jenkins/builds/workspace/shm-fmi-pipe_development/build/win64/testfmu-integration && /usr/bin/x86_64-w64-mingw32-gcc   @CMakeFiles/testfmu-integration.dir/includes_C.rsp -pthread -DFMI_COSIMULATION -DFMULIB=\"/home/jenkins/builds/workspace/shm-fmi-pipe_development/build/win64/libshmfmu/libshmfmu.dll\"   -o CMakeFiles/testfmu-integration.dir/fmuLogger.c.obj   -c /home/jenkins/builds/workspace/shm-fmi-pipe_development/testfmu-integration/fmuLogger.c
[ 88%] Building CXX object testfmu-integration/CMakeFiles/testfmu-integration.dir/FMU_Tests.cpp.obj
cd /home/jenkins/builds/workspace/shm-fmi-pipe_development/build/win64/testfmu-integration && /usr/bin/x86_64-w64-mingw32-g++    @CMakeFiles/testfmu-integration.dir/includes_CXX.rsp -std=c++11 -DFMI_COSIMULATION -DFMULIB=\"/home/jenkins/builds/workspace/shm-fmi-pipe_development/build/win64/libshmfmu/libshmfmu.dll\" -DTEST_RUNNER_DRIVER_PATH=\"/home/jenkins/builds/workspace/shm-fmi-pipe_development/build/win64/testfmu-integration/testfmu-integration-driver\"   -o CMakeFiles/testfmu-integration.dir/FMU_Tests.cpp.obj -c /home/jenkins/builds/workspace/shm-fmi-pipe_development/testfmu-integration/FMU_Tests.cpp
make[2]: Leaving directory '/home/jenkins/builds/workspace/shm-fmi-pipe_development/build/win64'
[ 88%] Built target testlibshmipc
[ 90%] Building CXX object testfmu-integration/CMakeFiles/testfmu-integration.dir/LibraryLoad_Tests.cpp.obj
cd /home/jenkins/builds/workspace/shm-fmi-pipe_development/build/win64/testfmu-integration && /usr/bin/x86_64-w64-mingw32-g++    @CMakeFiles/testfmu-integration.dir/includes_CXX.rsp -std=c++11 -DFMI_COSIMULATION -DFMULIB=\"/home/jenkins/builds/workspace/shm-fmi-pipe_development/build/win64/libshmfmu/libshmfmu.dll\" -DTEST_RUNNER_DRIVER_PATH=\"/home/jenkins/builds/workspace/shm-fmi-pipe_development/build/win64/testfmu-integration/testfmu-integration-driver\"   -o CMakeFiles/testfmu-integration.dir/LibraryLoad_Tests.cpp.obj -c /home/jenkins/builds/workspace/shm-fmi-pipe_development/testfmu-integration/LibraryLoad_Tests.cpp
[ 92%] Linking CXX executable testlibshmfmu.exe
cd /home/jenkins/builds/workspace/shm-fmi-pipe_development/build/win64/testlibshmfmu && /usr/bin/cmake -E cmake_link_script CMakeFiles/testlibshmfmu.dir/link.txt --verbose=1
/usr/bin/cmake -E remove -f CMakeFiles/testlibshmfmu.dir/objects.a
/usr/bin/x86_64-w64-mingw32-ar cr CMakeFiles/testlibshmfmu.dir/objects.a @CMakeFiles/testlibshmfmu.dir/objects1.rsp
/usr/bin/x86_64-w64-mingw32-g++   -std=c++11   -static-libstdc++ -static-libgcc -Wl,--whole-archive CMakeFiles/testlibshmfmu.dir/objects.a -Wl,--no-whole-archive  -o testlibshmfmu.exe -Wl,--out-implib,libtestlibshmfmu.dll.a -Wl,--major-image-version,0,--minor-image-version,0 @CMakeFiles/testlibshmfmu.dir/linklibs.rsp
[ 94%] Linking CXX executable testlibshmfmi.exe
cd /home/jenkins/builds/workspace/shm-fmi-pipe_development/build/win64/testlibshmfmi && /usr/bin/cmake -E cmake_link_script CMakeFiles/testlibshmfmi.dir/link.txt --verbose=1
/usr/bin/cmake -E remove -f CMakeFiles/testlibshmfmi.dir/objects.a
/usr/bin/x86_64-w64-mingw32-ar cr CMakeFiles/testlibshmfmi.dir/objects.a @CMakeFiles/testlibshmfmi.dir/objects1.rsp
/usr/bin/x86_64-w64-mingw32-g++   -std=c++11   -static-libstdc++ -static-libgcc -Wl,--whole-archive CMakeFiles/testlibshmfmi.dir/objects.a -Wl,--no-whole-archive  -o testlibshmfmi.exe -Wl,--out-implib,libtestlibshmfmi.dll.a -Wl,--major-image-version,0,--minor-image-version,0 @CMakeFiles/testlibshmfmi.dir/linklibs.rsp
[ 96%] Building CXX object testfmu-integration/CMakeFiles/testfmu-integration.dir/FMU_DualLoad_Tests.cpp.obj
cd /home/jenkins/builds/workspace/shm-fmi-pipe_development/build/win64/testfmu-integration && /usr/bin/x86_64-w64-mingw32-g++    @CMakeFiles/testfmu-integration.dir/includes_CXX.rsp -std=c++11 -DFMI_COSIMULATION -DFMULIB=\"/home/jenkins/builds/workspace/shm-fmi-pipe_development/build/win64/libshmfmu/libshmfmu.dll\" -DTEST_RUNNER_DRIVER_PATH=\"/home/jenkins/builds/workspace/shm-fmi-pipe_development/build/win64/testfmu-integration/testfmu-integration-driver\"   -o CMakeFiles/testfmu-integration.dir/FMU_DualLoad_Tests.cpp.obj -c /home/jenkins/builds/workspace/shm-fmi-pipe_development/testfmu-integration/FMU_DualLoad_Tests.cpp
[ 98%] Building CXX object testfmu-integration/CMakeFiles/testfmu-integration.dir/resource_location.cpp.obj
cd /home/jenkins/builds/workspace/shm-fmi-pipe_development/build/win64/testfmu-integration && /usr/bin/x86_64-w64-mingw32-g++    @CMakeFiles/testfmu-integration.dir/includes_CXX.rsp -std=c++11 -DFMI_COSIMULATION -DFMULIB=\"/home/jenkins/builds/workspace/shm-fmi-pipe_development/build/win64/libshmfmu/libshmfmu.dll\" -DTEST_RUNNER_DRIVER_PATH=\"/home/jenkins/builds/workspace/shm-fmi-pipe_development/build/win64/testfmu-integration/testfmu-integration-driver\"   -o CMakeFiles/testfmu-integration.dir/resource_location.cpp.obj -c /home/jenkins/builds/workspace/shm-fmi-pipe_development/testfmu-integration/resource_location.cpp
make[2]: Leaving directory '/home/jenkins/builds/workspace/shm-fmi-pipe_development/build/win64'
[ 98%] Built target testlibshmfmu
make[2]: Leaving directory '/home/jenkins/builds/workspace/shm-fmi-pipe_development/build/win64'
[ 98%] Built target testlibshmfmi
[100%] Linking CXX executable testfmu-integration.exe
cd /home/jenkins/builds/workspace/shm-fmi-pipe_development/build/win64/testfmu-integration && /usr/bin/cmake -E cmake_link_script CMakeFiles/testfmu-integration.dir/link.txt --verbose=1
/usr/bin/cmake -E remove -f CMakeFiles/testfmu-integration.dir/objects.a
/usr/bin/x86_64-w64-mingw32-ar cr CMakeFiles/testfmu-integration.dir/objects.a @CMakeFiles/testfmu-integration.dir/objects1.rsp
/usr/bin/x86_64-w64-mingw32-g++   -std=c++11 -DFMI_COSIMULATION -DFMULIB=\"/home/jenkins/builds/workspace/shm-fmi-pipe_development/build/win64/libshmfmu/libshmfmu.dll\" -DTEST_RUNNER_DRIVER_PATH=\"/home/jenkins/builds/workspace/shm-fmi-pipe_development/build/win64/testfmu-integration/testfmu-integration-driver\"   -static-libstdc++ -static-libgcc -Wl,--whole-archive CMakeFiles/testfmu-integration.dir/objects.a -Wl,--no-whole-archive  -o testfmu-integration.exe -Wl,--out-implib,libtestfmu-integration.dll.a -Wl,--major-image-version,0,--minor-image-version,0 @CMakeFiles/testfmu-integration.dir/linklibs.rsp
make[2]: Leaving directory '/home/jenkins/builds/workspace/shm-fmi-pipe_development/build/win64'
[100%] Built target testfmu-integration
make[1]: Leaving directory '/home/jenkins/builds/workspace/shm-fmi-pipe_development/build/win64'
/usr/bin/cmake -E cmake_progress_start /home/jenkins/builds/workspace/shm-fmi-pipe_development/build/win64/CMakeFiles 0
make: Leaving directory '/home/jenkins/builds/workspace/shm-fmi-pipe_development/build/win64'
make: Entering directory '/home/jenkins/builds/workspace/shm-fmi-pipe_development/build/win64'
Running tests...
/usr/bin/ctest --force-new-ctest-process 
Test project /home/jenkins/builds/workspace/shm-fmi-pipe_development/build/win64
    Start 1: AllTestsIn-testlibshmipc
1/4 Test #1: AllTestsIn-testlibshmipc .........   Passed    4.84 sec
    Start 2: AllTestsIn-testlibshmfmi
2/4 Test #2: AllTestsIn-testlibshmfmi .........   Passed    8.07 sec
    Start 3: AllTestsIn-testlibshmfmu
3/4 Test #3: AllTestsIn-testlibshmfmu .........   Passed    4.88 sec
    Start 4: AllTestsIn-testfmu-integration
4/4 Test #4: AllTestsIn-testfmu-integration ...   Passed   36.74 sec

100% tests passed, 0 tests failed out of 4

Total Test time (real) =  54.53 sec
make: Leaving directory '/home/jenkins/builds/workspace/shm-fmi-pipe_development/build/win64'
[Pipeline] }
Lock released on resource [SHM-FMI-TEST]
[Pipeline] // lock
[Pipeline] sh
+ ./list-dependencies.sh
Listing dependencies

*.dylib
./build/darwin64/shmfmi-server/libsharedmemory.dylib
./build/darwin64/shmfmi-server/libsharedmemory.dylib:
	/home/jenkins/builds/workspace/shm-fmi-pipe_development/build/darwin64/shmfmi-server/libsharedmemory.dylib (compatibility version 0.0.0, current version 0.0.0)
	/usr/lib/libSystem.B.dylib (compatibility version 1.0.0, current version 1225.1.1)
./build/darwin64/libshmfmu/liblibshmfmu.dylib
./build/darwin64/libshmfmu/liblibshmfmu.dylib:
	/home/jenkins/builds/workspace/shm-fmi-pipe_development/build/darwin64/libshmfmu/liblibshmfmu.dylib (compatibility version 0.0.0, current version 0.0.0)
	/usr/lib/libSystem.B.dylib (compatibility version 1.0.0, current version 1225.1.1)
./coe-test/fmus/singlewatertank/binaries/darwin64/singlewatertank.dylib
./coe-test/fmus/singlewatertank/binaries/darwin64/singlewatertank.dylib:
	../../../target/fmu/binaries/darwin64/singlewatertank.dylib (compatibility version 0.0.0, current version 0.0.0)
	/usr/lib/libSystem.B.dylib (compatibility version 1.0.0, current version 1213.0.0)

*.so
./build/linux32/shmfmi-server/libsharedmemory.so
	linux-gate.so.1 =>  (0xf7747000)
	libpthread.so.0 => /lib/i386-linux-gnu/libpthread.so.0 (0xf75e8000)
	librt.so.1 => /lib/i386-linux-gnu/librt.so.1 (0xf75df000)
	libgcc_s.so.1 => /lib/i386-linux-gnu/libgcc_s.so.1 (0xf75c1000)
	libc.so.6 => /lib/i386-linux-gnu/libc.so.6 (0xf740b000)
	/lib/ld-linux.so.2 (0x565cd000)
./build/linux32/libshmfmu/liblibshmfmu.so
	linux-gate.so.1 =>  (0xf770d000)
	libpthread.so.0 => /lib/i386-linux-gnu/libpthread.so.0 (0xf727d000)
	librt.so.1 => /lib/i386-linux-gnu/librt.so.1 (0xf7274000)
	libm.so.6 => /lib/i386-linux-gnu/libm.so.6 (0xf721e000)
	libgcc_s.so.1 => /lib/i386-linux-gnu/libgcc_s.so.1 (0xf7201000)
	libc.so.6 => /lib/i386-linux-gnu/libc.so.6 (0xf704b000)
	/lib/ld-linux.so.2 (0x56620000)
./build/linux64/shmfmi-server/libsharedmemory.so
	linux-vdso.so.1 =>  (0x00007ffe235cf000)
	libpthread.so.0 => /lib/x86_64-linux-gnu/libpthread.so.0 (0x00007ff958971000)
	librt.so.1 => /lib/x86_64-linux-gnu/librt.so.1 (0x00007ff958769000)
	libgcc_s.so.1 => /lib/x86_64-linux-gnu/libgcc_s.so.1 (0x00007ff958552000)
	libc.so.6 => /lib/x86_64-linux-gnu/libc.so.6 (0x00007ff958189000)
	/lib64/ld-linux-x86-64.so.2 (0x0000561d30775000)
./build/linux64/libshmfmu/liblibshmfmu.so
	linux-vdso.so.1 =>  (0x00007ffd9bfc7000)
	libpthread.so.0 => /lib/x86_64-linux-gnu/libpthread.so.0 (0x00007f62f27f9000)
	librt.so.1 => /lib/x86_64-linux-gnu/librt.so.1 (0x00007f62f25f1000)
	libm.so.6 => /lib/x86_64-linux-gnu/libm.so.6 (0x00007f62f22e7000)
	libgcc_s.so.1 => /lib/x86_64-linux-gnu/libgcc_s.so.1 (0x00007f62f20d1000)
	libc.so.6 => /lib/x86_64-linux-gnu/libc.so.6 (0x00007f62f1d08000)
	/lib64/ld-linux-x86-64.so.2 (0x000055c254573000)
./coe-test/fmus/singlewatertank/binaries/linux32/singlewatertank.so
	linux-gate.so.1 =>  (0xf7773000)
	libc.so.6 => /lib/i386-linux-gnu/libc.so.6 (0xf759c000)
	/lib/ld-linux.so.2 (0x5663e000)
./coe-test/fmus/singlewatertank/binaries/linux64/singlewatertank.so
	linux-vdso.so.1 =>  (0x00007ffca43f7000)
	libc.so.6 => /lib/x86_64-linux-gnu/libc.so.6 (0x00007fc706b50000)
	/lib64/ld-linux-x86-64.so.2 (0x000055c1feb29000)

*.dll
./build/win32/shmfmi-server/sharedmemory.dll
	DLL Name: KERNEL32.dll
	DLL Name: msvcrt.dll
./build/win32/libshmfmu/libshmfmu.dll
	DLL Name: ADVAPI32.dll
	DLL Name: KERNEL32.dll
	DLL Name: msvcrt.dll
	DLL Name: USER32.dll
./build/win64/shmfmi-server/sharedmemory.dll
	DLL Name: KERNEL32.dll
	DLL Name: msvcrt.dll
./build/win64/libshmfmu/libshmfmu.dll
	DLL Name: ADVAPI32.dll
	DLL Name: KERNEL32.dll
	DLL Name: msvcrt.dll
	DLL Name: USER32.dll
./coe-test/fmus/singlewatertank/binaries/win32/singlewatertank.dll
	DLL Name: KERNEL32.dll
	DLL Name: msvcrt.dll
./coe-test/fmus/singlewatertank/binaries/win64/singlewatertank.dll
	DLL Name: KERNEL32.dll
	DLL Name: msvcrt.dll
[Pipeline] stash
Stashed 22 file(s)
[Pipeline] }
[Pipeline] // node
[Pipeline] }
[Pipeline] // parallel
[Pipeline] }
[Pipeline] // stage
[Pipeline] End of Pipeline

GitHub has been notified of this commit’s build result

ERROR: script returned exit code 2
Finished: FAILURE