Not builtConsole Output

[INFO] Installing /var/lib/jenkins/workspace/overture-development/pom.xml to /var/lib/jenkins/workspace/overture-development/.repository/org/overturetool/root/2.7.3-SNAPSHOT/root-2.7.3-SNAPSHOT.pom
[WARNING] Failed to notify spy hudson.maven.Maven3Builder$JenkinsEventSpy: java.util.concurrent.ExecutionException: Invalid object ID 16 iota=97
[WARNING] Failed to notify spy hudson.maven.Maven3Builder$JenkinsEventSpy: java.util.concurrent.ExecutionException: Invalid object ID 16 iota=97
[WARNING] Failed to notify spy hudson.maven.Maven3Builder$JenkinsEventSpy: java.util.concurrent.ExecutionException: Invalid object ID 75 iota=97
[INFO]                                                                         
[INFO] ------------------------------------------------------------------------
[INFO] Building Overture External Resources 2.7.3-SNAPSHOT
[INFO] ------------------------------------------------------------------------
Started
Running as SYSTEM
Build failed before it gets to this module
Started calculate disk usage of build
Finished Calculation of disk usage of build in 0 seconds
Started calculate disk usage of workspace
Finished Calculation of disk usage of workspace in 0 seconds
Finished: NOT_BUILT