Not builtConsole Output

[INFO] Final Memory: 135M/592M
[INFO] ------------------------------------------------------------------------
[WARNING] The requested profile "force-download-externals" could not be activated because it does not exist.
[ERROR] Failed to execute goal org.apache.maven.plugins:maven-surefire-plugin:2.19.1:test (default-test) on project interpreter: Execution default-test of goal org.apache.maven.plugins:maven-surefire-plugin:2.19.1:test failed: The forked VM terminated without properly saying goodbye. VM crash or System.exit called?
[ERROR] Command was /bin/sh -c cd /var/lib/jenkins/workspace/overture-development/core/interpreter && /usr/lib/jvm/java-8-oracle/jre/bin/java '-javaagent:/var/lib/jenkins/workspace/overture-development/.repository/org/jacoco/org.jacoco.agent/0.7.6.201602180812/org.jacoco.agent-0.7.6.201602180812-runtime.jar=destfile=/var/lib/jenkins/workspace/overture-development/core/interpreter/target/coverage-reports/jacoco-unit.exec,excludes=**/org/overture/ast/analysis/**/*.*:**/org/overture/ast/expressions/**/*.*:**/org/overture/ast/modules/**/*.*:**/org/overture/ast/node/**/*.*:**/org/overture/ast/patterns/**/*.*:**/org/overture/ast/statements/**/*.*:**/org/overture/ast/types/**/*.*:**/org/overture/codegen/ir/**/*:**/org/overture/ide/**/*' -jar /var/lib/jenkins/workspace/overture-development/core/interpreter/target/surefire/surefirebooter7116250202953004578.jar /var/lib/jenkins/workspace/overture-development/core/interpreter/target/surefire/surefire1474905854668478305tmp /var/lib/jenkins/workspace/overture-development/core/interpreter/target/surefire/surefire_44420927903792825478tmp
[ERROR] -> [Help 1]
[ERROR] 
[ERROR] To see the full stack trace of the errors, re-run Maven with the -e switch.
[ERROR] Re-run Maven using the -X switch to enable full debug logging.
[ERROR] 
[ERROR] For more information about the errors and possible solutions, please read the following articles:
[ERROR] [Help 1] http://cwiki.apache.org/confluence/display/MAVEN/PluginExecutionException
[ERROR] 
[ERROR] After correcting the problems, you can resume the build with the command
[ERROR]   mvn <goals> -rf :interpreter
Started
Running as SYSTEM
Build failed before it gets to this module
Finished: NOT_BUILT