FailedConsole Output

Skipping 412 KB.. Full Log
enkins/workspace/multibranch-pipeline_development/c/vdmclibdist/src/main/asn1crt.c
     [exec] cd /var/lib/jenkins/workspace/multibranch-pipeline_development/c/vdmclibdist && /usr/bin/cc  -I/var/lib/jenkins/workspace/multibranch-pipeline_development/c/vdmclibdist -I/var/lib/jenkins/workspace/multibranch-pipeline_development/c/vdmclib/src/test/resources -I/var/lib/jenkins/workspace/multibranch-pipeline_development/c/vdmclibdist/src/main -I/var/lib/jenkins/workspace/multibranch-pipeline_development/c/vdmclibdist/../vdmclib/src/main -I/var/lib/jenkins/workspace/multibranch-pipeline_development/c/third_party/googletest/googletest/include  -Wall -fmessage-length=0 -std=c89   -o CMakeFiles/vdmclibdist.dir/src/main/asn1vdm.c.o   -c /var/lib/jenkins/workspace/multibranch-pipeline_development/c/vdmclibdist/src/main/asn1vdm.c
     [exec] cd /var/lib/jenkins/workspace/multibranch-pipeline_development/c/vdmclibdist && /usr/bin/cc  -I/var/lib/jenkins/workspace/multibranch-pipeline_development/c/vdmclibdist -I/var/lib/jenkins/workspace/multibranch-pipeline_development/c/vdmclib/src/test/resources -I/var/lib/jenkins/workspace/multibranch-pipeline_development/c/vdmclibdist/src/main -I/var/lib/jenkins/workspace/multibranch-pipeline_development/c/vdmclibdist/../vdmclib/src/main -I/var/lib/jenkins/workspace/multibranch-pipeline_development/c/third_party/googletest/googletest/include  -Wall -fmessage-length=0 -std=c89   -o CMakeFiles/vdmclibdist.dir/src/main/basicTypes.c.o   -c /var/lib/jenkins/workspace/multibranch-pipeline_development/c/vdmclibdist/src/main/basicTypes.c
     [exec] [ 33%] Building C object vdmclibdist/CMakeFiles/vdmclibdist.dir/src/main/real.c.o
     [exec] cd /var/lib/jenkins/workspace/multibranch-pipeline_development/c/vdmclibdist && /usr/bin/cc  -I/var/lib/jenkins/workspace/multibranch-pipeline_development/c/vdmclibdist -I/var/lib/jenkins/workspace/multibranch-pipeline_development/c/vdmclib/src/test/resources -I/var/lib/jenkins/workspace/multibranch-pipeline_development/c/vdmclibdist/src/main -I/var/lib/jenkins/workspace/multibranch-pipeline_development/c/vdmclibdist/../vdmclib/src/main -I/var/lib/jenkins/workspace/multibranch-pipeline_development/c/third_party/googletest/googletest/include  -Wall -fmessage-length=0 -std=c89   -o CMakeFiles/vdmclibdist.dir/src/main/real.c.o   -c /var/lib/jenkins/workspace/multibranch-pipeline_development/c/vdmclibdist/src/main/real.c
     [exec] [ 37%] Building C object vdmclibdist/CMakeFiles/vdmclibdist.dir/src/main/serialise.c.o
     [exec] cd /var/lib/jenkins/workspace/multibranch-pipeline_development/c/vdmclibdist && /usr/bin/cc  -I/var/lib/jenkins/workspace/multibranch-pipeline_development/c/vdmclibdist -I/var/lib/jenkins/workspace/multibranch-pipeline_development/c/vdmclib/src/test/resources -I/var/lib/jenkins/workspace/multibranch-pipeline_development/c/vdmclibdist/src/main -I/var/lib/jenkins/workspace/multibranch-pipeline_development/c/vdmclibdist/../vdmclib/src/main -I/var/lib/jenkins/workspace/multibranch-pipeline_development/c/third_party/googletest/googletest/include  -Wall -fmessage-length=0 -std=c89   -o CMakeFiles/vdmclibdist.dir/src/main/serialise.c.o   -c /var/lib/jenkins/workspace/multibranch-pipeline_development/c/vdmclibdist/src/main/serialise.c
     [exec] [ 41%] Building C object vdmclibdist/CMakeFiles/vdmclibdist.dir/__/vdmclib/src/main/CSVLib.c.o
     [exec] cd /var/lib/jenkins/workspace/multibranch-pipeline_development/c/vdmclibdist && /usr/bin/cc  -I/var/lib/jenkins/workspace/multibranch-pipeline_development/c/vdmclibdist -I/var/lib/jenkins/workspace/multibranch-pipeline_development/c/vdmclib/src/test/resources -I/var/lib/jenkins/workspace/multibranch-pipeline_development/c/vdmclibdist/src/main -I/var/lib/jenkins/workspace/multibranch-pipeline_development/c/vdmclibdist/../vdmclib/src/main -I/var/lib/jenkins/workspace/multibranch-pipeline_development/c/third_party/googletest/googletest/include  -Wall -fmessage-length=0 -std=c89   -o CMakeFiles/vdmclibdist.dir/__/vdmclib/src/main/CSVLib.c.o   -c /var/lib/jenkins/workspace/multibranch-pipeline_development/c/vdmclib/src/main/CSVLib.c
     [exec] [ 45%] Building C object vdmclibdist/CMakeFiles/vdmclibdist.dir/__/vdmclib/src/main/IOLib.c.o
     [exec] cd /var/lib/jenkins/workspace/multibranch-pipeline_development/c/vdmclibdist && /usr/bin/cc  -I/var/lib/jenkins/workspace/multibranch-pipeline_development/c/vdmclibdist -I/var/lib/jenkins/workspace/multibranch-pipeline_development/c/vdmclib/src/test/resources -I/var/lib/jenkins/workspace/multibranch-pipeline_development/c/vdmclibdist/src/main -I/var/lib/jenkins/workspace/multibranch-pipeline_development/c/vdmclibdist/../vdmclib/src/main -I/var/lib/jenkins/workspace/multibranch-pipeline_development/c/third_party/googletest/googletest/include  -Wall -fmessage-length=0 -std=c89   -o CMakeFiles/vdmclibdist.dir/__/vdmclib/src/main/IOLib.c.o   -c /var/lib/jenkins/workspace/multibranch-pipeline_development/c/vdmclib/src/main/IOLib.c
     [exec] [ 50%] Building C object vdmclibdist/CMakeFiles/vdmclibdist.dir/__/vdmclib/src/main/MATHLib.c.o
     [exec] cd /var/lib/jenkins/workspace/multibranch-pipeline_development/c/vdmclibdist && /usr/bin/cc  -I/var/lib/jenkins/workspace/multibranch-pipeline_development/c/vdmclibdist -I/var/lib/jenkins/workspace/multibranch-pipeline_development/c/vdmclib/src/test/resources -I/var/lib/jenkins/workspace/multibranch-pipeline_development/c/vdmclibdist/src/main -I/var/lib/jenkins/workspace/multibranch-pipeline_development/c/vdmclibdist/../vdmclib/src/main -I/var/lib/jenkins/workspace/multibranch-pipeline_development/c/third_party/googletest/googletest/include  -Wall -fmessage-length=0 -std=c89   -o CMakeFiles/vdmclibdist.dir/__/vdmclib/src/main/MATHLib.c.o   -c /var/lib/jenkins/workspace/multibranch-pipeline_development/c/vdmclib/src/main/MATHLib.c
     [exec] [ 54%] Building C object vdmclibdist/CMakeFiles/vdmclibdist.dir/__/vdmclib/src/main/PatternBindMatch.c.o
     [exec] cd /var/lib/jenkins/workspace/multibranch-pipeline_development/c/vdmclibdist && /usr/bin/cc  -I/var/lib/jenkins/workspace/multibranch-pipeline_development/c/vdmclibdist -I/var/lib/jenkins/workspace/multibranch-pipeline_development/c/vdmclib/src/test/resources -I/var/lib/jenkins/workspace/multibranch-pipeline_development/c/vdmclibdist/src/main -I/var/lib/jenkins/workspace/multibranch-pipeline_development/c/vdmclibdist/../vdmclib/src/main -I/var/lib/jenkins/workspace/multibranch-pipeline_development/c/third_party/googletest/googletest/include  -Wall -fmessage-length=0 -std=c89   -o CMakeFiles/vdmclibdist.dir/__/vdmclib/src/main/PatternBindMatch.c.o   -c /var/lib/jenkins/workspace/multibranch-pipeline_development/c/vdmclib/src/main/PatternBindMatch.c
     [exec] [ 58%] Building C object vdmclibdist/CMakeFiles/vdmclibdist.dir/__/vdmclib/src/main/PrettyPrint.c.o
     [exec] cd /var/lib/jenkins/workspace/multibranch-pipeline_development/c/vdmclibdist && /usr/bin/cc  -I/var/lib/jenkins/workspace/multibranch-pipeline_development/c/vdmclibdist -I/var/lib/jenkins/workspace/multibranch-pipeline_development/c/vdmclib/src/test/resources -I/var/lib/jenkins/workspace/multibranch-pipeline_development/c/vdmclibdist/src/main -I/var/lib/jenkins/workspace/multibranch-pipeline_development/c/vdmclibdist/../vdmclib/src/main -I/var/lib/jenkins/workspace/multibranch-pipeline_development/c/third_party/googletest/googletest/include  -Wall -fmessage-length=0 -std=c89   -o CMakeFiles/vdmclibdist.dir/__/vdmclib/src/main/PrettyPrint.c.o   -c /var/lib/jenkins/workspace/multibranch-pipeline_development/c/vdmclib/src/main/PrettyPrint.c
     [exec] [ 62%] Building C object vdmclibdist/CMakeFiles/vdmclibdist.dir/__/vdmclib/src/main/TypedValue.c.o
     [exec] cd /var/lib/jenkins/workspace/multibranch-pipeline_development/c/vdmclibdist && /usr/bin/cc  -I/var/lib/jenkins/workspace/multibranch-pipeline_development/c/vdmclibdist -I/var/lib/jenkins/workspace/multibranch-pipeline_development/c/vdmclib/src/test/resources -I/var/lib/jenkins/workspace/multibranch-pipeline_development/c/vdmclibdist/src/main -I/var/lib/jenkins/workspace/multibranch-pipeline_development/c/vdmclibdist/../vdmclib/src/main -I/var/lib/jenkins/workspace/multibranch-pipeline_development/c/third_party/googletest/googletest/include  -Wall -fmessage-length=0 -std=c89   -o CMakeFiles/vdmclibdist.dir/__/vdmclib/src/main/TypedValue.c.o   -c /var/lib/jenkins/workspace/multibranch-pipeline_development/c/vdmclib/src/main/TypedValue.c
     [exec] [ 66%] Building C object vdmclibdist/CMakeFiles/vdmclibdist.dir/__/vdmclib/src/main/VdmBasicTypes.c.o
     [exec] cd /var/lib/jenkins/workspace/multibranch-pipeline_development/c/vdmclibdist && /usr/bin/cc  -I/var/lib/jenkins/workspace/multibranch-pipeline_development/c/vdmclibdist -I/var/lib/jenkins/workspace/multibranch-pipeline_development/c/vdmclib/src/test/resources -I/var/lib/jenkins/workspace/multibranch-pipeline_development/c/vdmclibdist/src/main -I/var/lib/jenkins/workspace/multibranch-pipeline_development/c/vdmclibdist/../vdmclib/src/main -I/var/lib/jenkins/workspace/multibranch-pipeline_development/c/third_party/googletest/googletest/include  -Wall -fmessage-length=0 -std=c89   -o CMakeFiles/vdmclibdist.dir/__/vdmclib/src/main/VdmBasicTypes.c.o   -c /var/lib/jenkins/workspace/multibranch-pipeline_development/c/vdmclib/src/main/VdmBasicTypes.c
     [exec] [ 70%] Building C object vdmclibdist/CMakeFiles/vdmclibdist.dir/__/vdmclib/src/main/VdmClass.c.o
     [exec] cd /var/lib/jenkins/workspace/multibranch-pipeline_development/c/vdmclibdist && /usr/bin/cc  -I/var/lib/jenkins/workspace/multibranch-pipeline_development/c/vdmclibdist -I/var/lib/jenkins/workspace/multibranch-pipeline_development/c/vdmclib/src/test/resources -I/var/lib/jenkins/workspace/multibranch-pipeline_development/c/vdmclibdist/src/main -I/var/lib/jenkins/workspace/multibranch-pipeline_development/c/vdmclibdist/../vdmclib/src/main -I/var/lib/jenkins/workspace/multibranch-pipeline_development/c/third_party/googletest/googletest/include  -Wall -fmessage-length=0 -std=c89   -o CMakeFiles/vdmclibdist.dir/__/vdmclib/src/main/VdmClass.c.o   -c /var/lib/jenkins/workspace/multibranch-pipeline_development/c/vdmclib/src/main/VdmClass.c
     [exec] [ 75%] Building C object vdmclibdist/CMakeFiles/vdmclibdist.dir/__/vdmclib/src/main/VdmGC.c.o
     [exec] [ 79%] Building C object vdmclibdist/CMakeFiles/vdmclibdist.dir/__/vdmclib/src/main/VdmMap.c.o
     [exec] cd /var/lib/jenkins/workspace/multibranch-pipeline_development/c/vdmclibdist && /usr/bin/cc  -I/var/lib/jenkins/workspace/multibranch-pipeline_development/c/vdmclibdist -I/var/lib/jenkins/workspace/multibranch-pipeline_development/c/vdmclib/src/test/resources -I/var/lib/jenkins/workspace/multibranch-pipeline_development/c/vdmclibdist/src/main -I/var/lib/jenkins/workspace/multibranch-pipeline_development/c/vdmclibdist/../vdmclib/src/main -I/var/lib/jenkins/workspace/multibranch-pipeline_development/c/third_party/googletest/googletest/include  -Wall -fmessage-length=0 -std=c89   -o CMakeFiles/vdmclibdist.dir/__/vdmclib/src/main/VdmGC.c.o   -c /var/lib/jenkins/workspace/multibranch-pipeline_development/c/vdmclib/src/main/VdmGC.c
     [exec] cd /var/lib/jenkins/workspace/multibranch-pipeline_development/c/vdmclibdist && /usr/bin/cc  -I/var/lib/jenkins/workspace/multibranch-pipeline_development/c/vdmclibdist -I/var/lib/jenkins/workspace/multibranch-pipeline_development/c/vdmclib/src/test/resources -I/var/lib/jenkins/workspace/multibranch-pipeline_development/c/vdmclibdist/src/main -I/var/lib/jenkins/workspace/multibranch-pipeline_development/c/vdmclibdist/../vdmclib/src/main -I/var/lib/jenkins/workspace/multibranch-pipeline_development/c/third_party/googletest/googletest/include  -Wall -fmessage-length=0 -std=c89   -o CMakeFiles/vdmclibdist.dir/__/vdmclib/src/main/VdmMap.c.o   -c /var/lib/jenkins/workspace/multibranch-pipeline_development/c/vdmclib/src/main/VdmMap.c
     [exec] [ 83%] Building C object vdmclibdist/CMakeFiles/vdmclibdist.dir/__/vdmclib/src/main/VdmProduct.c.o
     [exec] cd /var/lib/jenkins/workspace/multibranch-pipeline_development/c/vdmclibdist && /usr/bin/cc  -I/var/lib/jenkins/workspace/multibranch-pipeline_development/c/vdmclibdist -I/var/lib/jenkins/workspace/multibranch-pipeline_development/c/vdmclib/src/test/resources -I/var/lib/jenkins/workspace/multibranch-pipeline_development/c/vdmclibdist/src/main -I/var/lib/jenkins/workspace/multibranch-pipeline_development/c/vdmclibdist/../vdmclib/src/main -I/var/lib/jenkins/workspace/multibranch-pipeline_development/c/third_party/googletest/googletest/include  -Wall -fmessage-length=0 -std=c89   -o CMakeFiles/vdmclibdist.dir/__/vdmclib/src/main/VdmProduct.c.o   -c /var/lib/jenkins/workspace/multibranch-pipeline_development/c/vdmclib/src/main/VdmProduct.c
     [exec] [ 87%] Building C object vdmclibdist/CMakeFiles/vdmclibdist.dir/__/vdmclib/src/main/VdmSeq.c.o
     [exec] [ 91%] Building C object vdmclibdist/CMakeFiles/vdmclibdist.dir/__/vdmclib/src/main/VdmSet.c.o
     [exec] cd /var/lib/jenkins/workspace/multibranch-pipeline_development/c/vdmclibdist && /usr/bin/cc  -I/var/lib/jenkins/workspace/multibranch-pipeline_development/c/vdmclibdist -I/var/lib/jenkins/workspace/multibranch-pipeline_development/c/vdmclib/src/test/resources -I/var/lib/jenkins/workspace/multibranch-pipeline_development/c/vdmclibdist/src/main -I/var/lib/jenkins/workspace/multibranch-pipeline_development/c/vdmclibdist/../vdmclib/src/main -I/var/lib/jenkins/workspace/multibranch-pipeline_development/c/third_party/googletest/googletest/include  -Wall -fmessage-length=0 -std=c89   -o CMakeFiles/vdmclibdist.dir/__/vdmclib/src/main/VdmSet.c.o   -c /var/lib/jenkins/workspace/multibranch-pipeline_development/c/vdmclib/src/main/VdmSet.c
     [exec] cd /var/lib/jenkins/workspace/multibranch-pipeline_development/c/vdmclibdist && /usr/bin/cc  -I/var/lib/jenkins/workspace/multibranch-pipeline_development/c/vdmclibdist -I/var/lib/jenkins/workspace/multibranch-pipeline_development/c/vdmclib/src/test/resources -I/var/lib/jenkins/workspace/multibranch-pipeline_development/c/vdmclibdist/src/main -I/var/lib/jenkins/workspace/multibranch-pipeline_development/c/vdmclibdist/../vdmclib/src/main -I/var/lib/jenkins/workspace/multibranch-pipeline_development/c/third_party/googletest/googletest/include  -Wall -fmessage-length=0 -std=c89   -o CMakeFiles/vdmclibdist.dir/__/vdmclib/src/main/VdmSeq.c.o   -c /var/lib/jenkins/workspace/multibranch-pipeline_development/c/vdmclib/src/main/VdmSeq.c
     [exec] [ 95%] Building C object vdmclibdist/CMakeFiles/vdmclibdist.dir/__/vdmclib/src/main/VdmUnpackString.c.o
     [exec] cd /var/lib/jenkins/workspace/multibranch-pipeline_development/c/vdmclibdist && /usr/bin/cc  -I/var/lib/jenkins/workspace/multibranch-pipeline_development/c/vdmclibdist -I/var/lib/jenkins/workspace/multibranch-pipeline_development/c/vdmclib/src/test/resources -I/var/lib/jenkins/workspace/multibranch-pipeline_development/c/vdmclibdist/src/main -I/var/lib/jenkins/workspace/multibranch-pipeline_development/c/vdmclibdist/../vdmclib/src/main -I/var/lib/jenkins/workspace/multibranch-pipeline_development/c/third_party/googletest/googletest/include  -Wall -fmessage-length=0 -std=c89   -o CMakeFiles/vdmclibdist.dir/__/vdmclib/src/main/VdmUnpackString.c.o   -c /var/lib/jenkins/workspace/multibranch-pipeline_development/c/vdmclib/src/main/VdmUnpackString.c
     [exec] [100%] Linking CXX executable target/vdmclibdist
     [exec] cd /var/lib/jenkins/workspace/multibranch-pipeline_development/c/vdmclibdist && /usr/bin/cmake -E cmake_link_script CMakeFiles/vdmclibdist.dir/link.txt --verbose=1
     [exec] /usr/bin/c++   -fmessage-length=0  -rdynamic CMakeFiles/vdmclibdist.dir/src/main/asn1crt.c.o CMakeFiles/vdmclibdist.dir/src/main/asn1vdm.c.o CMakeFiles/vdmclibdist.dir/src/main/basicTypes.c.o CMakeFiles/vdmclibdist.dir/src/main/real.c.o CMakeFiles/vdmclibdist.dir/src/main/serialise.c.o CMakeFiles/vdmclibdist.dir/__/vdmclib/src/main/CSVLib.c.o CMakeFiles/vdmclibdist.dir/__/vdmclib/src/main/IOLib.c.o CMakeFiles/vdmclibdist.dir/__/vdmclib/src/main/MATHLib.c.o CMakeFiles/vdmclibdist.dir/__/vdmclib/src/main/PatternBindMatch.c.o CMakeFiles/vdmclibdist.dir/__/vdmclib/src/main/PrettyPrint.c.o CMakeFiles/vdmclibdist.dir/__/vdmclib/src/main/TypedValue.c.o CMakeFiles/vdmclibdist.dir/__/vdmclib/src/main/VdmBasicTypes.c.o CMakeFiles/vdmclibdist.dir/__/vdmclib/src/main/VdmClass.c.o CMakeFiles/vdmclibdist.dir/__/vdmclib/src/main/VdmGC.c.o CMakeFiles/vdmclibdist.dir/__/vdmclib/src/main/VdmMap.c.o CMakeFiles/vdmclibdist.dir/__/vdmclib/src/main/VdmProduct.c.o CMakeFiles/vdmclibdist.dir/__/vdmclib/src/main/VdmSeq.c.o CMakeFiles/vdmclibdist.dir/__/vdmclib/src/main/VdmSet.c.o CMakeFiles/vdmclibdist.dir/__/vdmclib/src/main/VdmUnpackString.c.o  -o target/vdmclibdist ../third_party/googletest/googletest/libgtest_main.a ../third_party/googletest/googletest/libgtest.a -lpthread 
     [exec] make[2]: Leaving directory '/var/lib/jenkins/workspace/multibranch-pipeline_development/c'
     [exec] [100%] Built target vdmclibdist
     [exec] make[1]: Leaving directory '/var/lib/jenkins/workspace/multibranch-pipeline_development/c'
     [exec] /usr/bin/cmake -E cmake_progress_start /var/lib/jenkins/workspace/multibranch-pipeline_development/c/CMakeFiles 0
     [exec] Running tests...
     [exec] /usr/bin/ctest --force-new-ctest-process 
     [exec] Test project /var/lib/jenkins/workspace/multibranch-pipeline_development/c/vdmclibdist
     [exec] No tests were found!!!
[INFO] Executed tasks
[INFO] 
[INFO] --- maven-jar-plugin:2.4:jar (default-jar) @ vdmclibdist ---
[INFO] Building jar: /var/lib/jenkins/workspace/multibranch-pipeline_development/c/vdmclibdist/target/vdmclibdist-0.2.3-SNAPSHOT.jar
[INFO] 
[INFO] --- jacoco-maven-plugin:0.7.6.201602180812:report (jacoco-site) @ vdmclibdist ---
[INFO] Skipping JaCoCo execution due to missing execution data file:/var/lib/jenkins/workspace/multibranch-pipeline_development/c/vdmclibdist/target/coverage-reports/jacoco-unit.exec
[INFO] 
[INFO] --- maven-jarsigner-plugin:1.2:sign (sign) @ vdmclibdist ---
[WARNING] Picked up JAVA_TOOL_OPTIONS: -Dmaven.ext.class.path="/var/lib/jenkins/workspace/multibranch-pipeline_development@tmp/withMaven4a080c53/pipeline-maven-spy.jar" -Dorg.jenkinsci.plugins.pipeline.maven.reportsFolder="/var/lib/jenkins/workspace/multibranch-pipeline_development@tmp/withMaven4a080c53" 
[INFO] 1 archive(s) processed
[INFO] 
[INFO] --- maven-install-plugin:2.4:install (default-install) @ vdmclibdist ---
[INFO] Installing /var/lib/jenkins/workspace/multibranch-pipeline_development/c/vdmclibdist/target/vdmclibdist-0.2.3-SNAPSHOT.jar to /var/lib/jenkins/workspace/multibranch-pipeline_development/.repository/org/overturetool/vdm2c/c/vdmclibdist/0.2.3-SNAPSHOT/vdmclibdist-0.2.3-SNAPSHOT.jar
[INFO] Installing /var/lib/jenkins/workspace/multibranch-pipeline_development/c/vdmclibdist/pom.xml to /var/lib/jenkins/workspace/multibranch-pipeline_development/.repository/org/overturetool/vdm2c/c/vdmclibdist/0.2.3-SNAPSHOT/vdmclibdist-0.2.3-SNAPSHOT.pom
[INFO] 
[INFO] --------------------< org.overturetool.vdm2c:core >---------------------
[INFO] Building Core Tools for vdm2c 0.2.3-SNAPSHOT                      [5/11]
[INFO] --------------------------------[ pom ]---------------------------------
[INFO] 
[INFO] --- maven-enforcer-plugin:1.0:enforce (enforce-maven) @ core ---
[INFO] 
[INFO] --- jacoco-maven-plugin:0.7.6.201602180812:prepare-agent (jacoco-initialize) @ core ---
[INFO] argLine set to -javaagent:/var/lib/jenkins/workspace/multibranch-pipeline_development/.repository/org/jacoco/org.jacoco.agent/0.7.6.201602180812/org.jacoco.agent-0.7.6.201602180812-runtime.jar=destfile=/var/lib/jenkins/workspace/multibranch-pipeline_development/core/target/coverage-reports/jacoco-unit.exec,excludes=org/overture/cgc/extast/analysis/**/*.*:org/overture/codegen/vdm2c/extast/expressions/**/*:org/overture/codegen/vdm2c/extast/declarations/**/*:org/overture/codegen/vdm2c/extast/statements/**/*:org/overture/cgc/extast/node/**/*:org/overture/codegen/vdm2c/ast/preview/**/*
[INFO] 
[INFO] --- jacoco-maven-plugin:0.7.6.201602180812:report (jacoco-site) @ core ---
[INFO] Skipping JaCoCo execution due to missing execution data file:/var/lib/jenkins/workspace/multibranch-pipeline_development/core/target/coverage-reports/jacoco-unit.exec
[INFO] 
[INFO] --- maven-jarsigner-plugin:1.2:sign (sign) @ core ---
[INFO] 0 archive(s) processed
[INFO] 
[INFO] --- maven-javadoc-plugin:2.9:jar (attach-javadocs) @ core ---
[INFO] Downloading from remote-repos: http://overture.au.dk/artifactory/remote-repos/commons-cli/commons-cli/1.2/commons-cli-1.2.pom
[INFO] Downloaded from remote-repos: http://overture.au.dk/artifactory/remote-repos/commons-cli/commons-cli/1.2/commons-cli-1.2.pom (8.0 kB at 347 kB/s)
[INFO] Downloading from remote-repos: http://overture.au.dk/artifactory/remote-repos/org/apache/commons/commons-parent/11/commons-parent-11.pom
[INFO] Downloaded from remote-repos: http://overture.au.dk/artifactory/remote-repos/org/apache/commons/commons-parent/11/commons-parent-11.pom (25 kB at 1.0 MB/s)
[INFO] Downloading from remote-repos: http://overture.au.dk/artifactory/remote-repos/org/apache/maven/shared/maven-invoker/2.0.9/maven-invoker-2.0.9.pom
[INFO] Downloaded from remote-repos: http://overture.au.dk/artifactory/remote-repos/org/apache/maven/shared/maven-invoker/2.0.9/maven-invoker-2.0.9.pom (5.8 kB at 275 kB/s)
[INFO] Downloading from remote-repos: http://overture.au.dk/artifactory/remote-repos/org/apache/maven/shared/maven-common-artifact-filters/1.3/maven-common-artifact-filters-1.3.pom
[INFO] Downloaded from remote-repos: http://overture.au.dk/artifactory/remote-repos/org/apache/maven/shared/maven-common-artifact-filters/1.3/maven-common-artifact-filters-1.3.pom (3.7 kB at 176 kB/s)
[INFO] Downloading from remote-repos: http://overture.au.dk/artifactory/remote-repos/org/apache/maven/shared/maven-shared-components/12/maven-shared-components-12.pom
[INFO] Downloaded from remote-repos: http://overture.au.dk/artifactory/remote-repos/org/apache/maven/shared/maven-shared-components/12/maven-shared-components-12.pom (9.3 kB at 406 kB/s)
[INFO] Downloading from remote-repos: http://overture.au.dk/artifactory/remote-repos/org/apache/maven/maven-plugin-api/2.0.8/maven-plugin-api-2.0.8.pom
[INFO] Downloaded from remote-repos: http://overture.au.dk/artifactory/remote-repos/org/apache/maven/maven-plugin-api/2.0.8/maven-plugin-api-2.0.8.pom (1.5 kB at 65 kB/s)
[INFO] Downloading from remote-repos: http://overture.au.dk/artifactory/remote-repos/org/codehaus/plexus/plexus-utils/1.4.9/plexus-utils-1.4.9.pom
[INFO] Downloaded from remote-repos: http://overture.au.dk/artifactory/remote-repos/org/codehaus/plexus/plexus-utils/1.4.9/plexus-utils-1.4.9.pom (2.3 kB at 115 kB/s)
[INFO] Downloading from remote-repos: http://overture.au.dk/artifactory/remote-repos/org/apache/maven/doxia/doxia-site-renderer/1.0/doxia-site-renderer-1.0.pom
[INFO] Downloaded from remote-repos: http://overture.au.dk/artifactory/remote-repos/org/apache/maven/doxia/doxia-site-renderer/1.0/doxia-site-renderer-1.0.pom (4.4 kB at 211 kB/s)
[INFO] Downloading from remote-repos: http://overture.au.dk/artifactory/remote-repos/org/apache/maven/doxia/doxia-sitetools/1.0/doxia-sitetools-1.0.pom
[INFO] Downloaded from remote-repos: http://overture.au.dk/artifactory/remote-repos/org/apache/maven/doxia/doxia-sitetools/1.0/doxia-sitetools-1.0.pom (9.6 kB at 399 kB/s)
[INFO] Downloading from remote-repos: http://overture.au.dk/artifactory/remote-repos/org/apache/maven/doxia/doxia-core/1.0/doxia-core-1.0.pom
[INFO] Downloaded from remote-repos: http://overture.au.dk/artifactory/remote-repos/org/apache/maven/doxia/doxia-core/1.0/doxia-core-1.0.pom (2.4 kB at 120 kB/s)
[INFO] Downloading from remote-repos: http://overture.au.dk/artifactory/remote-repos/org/codehaus/plexus/plexus-utils/1.5.7/plexus-utils-1.5.7.pom
[INFO] Downloaded from remote-repos: http://overture.au.dk/artifactory/remote-repos/org/codehaus/plexus/plexus-utils/1.5.7/plexus-utils-1.5.7.pom (8.1 kB at 366 kB/s)
[INFO] Downloading from remote-repos: http://overture.au.dk/artifactory/remote-repos/org/apache/maven/doxia/doxia-decoration-model/1.0/doxia-decoration-model-1.0.pom
[INFO] Downloaded from remote-repos: http://overture.au.dk/artifactory/remote-repos/org/apache/maven/doxia/doxia-decoration-model/1.0/doxia-decoration-model-1.0.pom (3.2 kB at 158 kB/s)
[INFO] Downloading from remote-repos: http://overture.au.dk/artifactory/remote-repos/org/apache/maven/doxia/doxia-module-apt/1.0/doxia-module-apt-1.0.pom
[INFO] Downloaded from remote-repos: http://overture.au.dk/artifactory/remote-repos/org/apache/maven/doxia/doxia-module-apt/1.0/doxia-module-apt-1.0.pom (2.3 kB at 113 kB/s)
[INFO] Downloading from remote-repos: http://overture.au.dk/artifactory/remote-repos/org/apache/maven/doxia/doxia-modules/1.0/doxia-modules-1.0.pom
[INFO] Downloaded from remote-repos: http://overture.au.dk/artifactory/remote-repos/org/apache/maven/doxia/doxia-modules/1.0/doxia-modules-1.0.pom (2.4 kB at 114 kB/s)
[INFO] Downloading from remote-repos: http://overture.au.dk/artifactory/remote-repos/org/apache/maven/doxia/doxia-module-fml/1.0/doxia-module-fml-1.0.pom
[INFO] Downloaded from remote-repos: http://overture.au.dk/artifactory/remote-repos/org/apache/maven/doxia/doxia-module-fml/1.0/doxia-module-fml-1.0.pom (2.7 kB at 122 kB/s)
[INFO] Downloading from remote-repos: http://overture.au.dk/artifactory/remote-repos/org/apache/maven/doxia/doxia-module-xdoc/1.0/doxia-module-xdoc-1.0.pom
[INFO] Downloaded from remote-repos: http://overture.au.dk/artifactory/remote-repos/org/apache/maven/doxia/doxia-module-xdoc/1.0/doxia-module-xdoc-1.0.pom (2.2 kB at 102 kB/s)
[INFO] Downloading from remote-repos: http://overture.au.dk/artifactory/remote-repos/org/apache/maven/doxia/doxia-module-xhtml/1.0/doxia-module-xhtml-1.0.pom
[INFO] Downloaded from remote-repos: http://overture.au.dk/artifactory/remote-repos/org/apache/maven/doxia/doxia-module-xhtml/1.0/doxia-module-xhtml-1.0.pom (1.6 kB at 76 kB/s)
[INFO] Downloading from remote-repos: http://overture.au.dk/artifactory/remote-repos/org/apache/maven/wagon/wagon-provider-api/1.0-beta-6/wagon-provider-api-1.0-beta-6.pom
[INFO] Downloaded from remote-repos: http://overture.au.dk/artifactory/remote-repos/org/apache/maven/wagon/wagon-provider-api/1.0-beta-6/wagon-provider-api-1.0-beta-6.pom (1.8 kB at 80 kB/s)
[INFO] Downloading from remote-repos: http://overture.au.dk/artifactory/remote-repos/org/apache/maven/wagon/wagon/1.0-beta-6/wagon-1.0-beta-6.pom
[INFO] Downloaded from remote-repos: http://overture.au.dk/artifactory/remote-repos/org/apache/maven/wagon/wagon/1.0-beta-6/wagon-1.0-beta-6.pom (12 kB at 539 kB/s)
[INFO] Downloading from remote-repos: http://overture.au.dk/artifactory/remote-repos/commons-logging/commons-logging/1.1.1/commons-logging-1.1.1.pom
[INFO] Downloaded from remote-repos: http://overture.au.dk/artifactory/remote-repos/commons-logging/commons-logging/1.1.1/commons-logging-1.1.1.pom (18 kB at 798 kB/s)
[INFO] Downloading from remote-repos: http://overture.au.dk/artifactory/remote-repos/org/apache/commons/commons-parent/5/commons-parent-5.pom
[INFO] Downloaded from remote-repos: http://overture.au.dk/artifactory/remote-repos/org/apache/commons/commons-parent/5/commons-parent-5.pom (16 kB at 764 kB/s)
[INFO] Downloading from remote-repos: http://overture.au.dk/artifactory/remote-repos/log4j/log4j/1.2.14/log4j-1.2.14.pom
[INFO] Downloaded from remote-repos: http://overture.au.dk/artifactory/remote-repos/log4j/log4j/1.2.14/log4j-1.2.14.pom (2.4 kB at 95 kB/s)
[INFO] Downloading from remote-repos: http://overture.au.dk/artifactory/remote-repos/com/thoughtworks/qdox/qdox/1.12/qdox-1.12.pom
[INFO] Downloaded from remote-repos: http://overture.au.dk/artifactory/remote-repos/com/thoughtworks/qdox/qdox/1.12/qdox-1.12.pom (19 kB at 773 kB/s)
[INFO] Downloading from remote-repos: http://overture.au.dk/artifactory/remote-repos/org/codehaus/plexus/plexus-archiver/2.1.2/plexus-archiver-2.1.2.pom
[INFO] Downloaded from remote-repos: http://overture.au.dk/artifactory/remote-repos/org/codehaus/plexus/plexus-archiver/2.1.2/plexus-archiver-2.1.2.pom (3.8 kB at 172 kB/s)
[INFO] Downloading from remote-repos: http://overture.au.dk/artifactory/remote-repos/org/codehaus/plexus/plexus-utils/3.0.2/plexus-utils-3.0.2.pom
[INFO] Downloaded from remote-repos: http://overture.au.dk/artifactory/remote-repos/org/codehaus/plexus/plexus-utils/3.0.2/plexus-utils-3.0.2.pom (2.5 kB at 120 kB/s)
[INFO] Downloading from remote-repos: http://overture.au.dk/artifactory/remote-repos/org/codehaus/plexus/plexus-io/2.0.4/plexus-io-2.0.4.pom
[INFO] Downloaded from remote-repos: http://overture.au.dk/artifactory/remote-repos/org/codehaus/plexus/plexus-io/2.0.4/plexus-io-2.0.4.pom (1.7 kB at 83 kB/s)
[INFO] Downloading from remote-repos: http://overture.au.dk/artifactory/remote-repos/commons-cli/commons-cli/1.2/commons-cli-1.2.jar
[INFO] Downloading from remote-repos: http://overture.au.dk/artifactory/remote-repos/org/apache/maven/shared/maven-invoker/2.0.9/maven-invoker-2.0.9.jar
[INFO] Downloading from remote-repos: http://overture.au.dk/artifactory/remote-repos/org/apache/maven/shared/maven-common-artifact-filters/1.3/maven-common-artifact-filters-1.3.jar
[INFO] Downloading from remote-repos: http://overture.au.dk/artifactory/remote-repos/org/apache/maven/doxia/doxia-sink-api/1.0/doxia-sink-api-1.0.jar
[INFO] Downloading from remote-repos: http://overture.au.dk/artifactory/remote-repos/org/apache/maven/doxia/doxia-site-renderer/1.0/doxia-site-renderer-1.0.jar
[INFO] Downloaded from remote-repos: http://overture.au.dk/artifactory/remote-repos/commons-cli/commons-cli/1.2/commons-cli-1.2.jar (41 kB at 1.6 MB/s)
[INFO] Downloading from remote-repos: http://overture.au.dk/artifactory/remote-repos/org/apache/maven/doxia/doxia-core/1.0/doxia-core-1.0.jar
[INFO] Downloaded from remote-repos: http://overture.au.dk/artifactory/remote-repos/org/apache/maven/shared/maven-common-artifact-filters/1.3/maven-common-artifact-filters-1.3.jar (31 kB at 1.1 MB/s)
[INFO] Downloading from remote-repos: http://overture.au.dk/artifactory/remote-repos/org/apache/maven/doxia/doxia-decoration-model/1.0/doxia-decoration-model-1.0.jar
[INFO] Downloaded from remote-repos: http://overture.au.dk/artifactory/remote-repos/org/apache/maven/shared/maven-invoker/2.0.9/maven-invoker-2.0.9.jar (28 kB at 764 kB/s)
[INFO] Downloading from remote-repos: http://overture.au.dk/artifactory/remote-repos/org/apache/maven/doxia/doxia-module-apt/1.0/doxia-module-apt-1.0.jar
[INFO] Downloaded from remote-repos: http://overture.au.dk/artifactory/remote-repos/org/apache/maven/doxia/doxia-site-renderer/1.0/doxia-site-renderer-1.0.jar (47 kB at 1.2 MB/s)
[INFO] Downloading from remote-repos: http://overture.au.dk/artifactory/remote-repos/org/apache/maven/doxia/doxia-module-fml/1.0/doxia-module-fml-1.0.jar
[INFO] Downloaded from remote-repos: http://overture.au.dk/artifactory/remote-repos/org/apache/maven/doxia/doxia-sink-api/1.0/doxia-sink-api-1.0.jar (10 kB at 234 kB/s)
[INFO] Downloading from remote-repos: http://overture.au.dk/artifactory/remote-repos/org/apache/maven/doxia/doxia-module-xdoc/1.0/doxia-module-xdoc-1.0.jar
[INFO] Downloaded from remote-repos: http://overture.au.dk/artifactory/remote-repos/org/apache/maven/doxia/doxia-core/1.0/doxia-core-1.0.jar (55 kB at 1.3 MB/s)
[INFO] Downloading from remote-repos: http://overture.au.dk/artifactory/remote-repos/org/apache/maven/doxia/doxia-module-xhtml/1.0/doxia-module-xhtml-1.0.jar
[INFO] Downloaded from remote-repos: http://overture.au.dk/artifactory/remote-repos/org/apache/maven/doxia/doxia-decoration-model/1.0/doxia-decoration-model-1.0.jar (49 kB at 1.1 MB/s)
[INFO] Downloading from remote-repos: http://overture.au.dk/artifactory/remote-repos/org/apache/maven/wagon/wagon-provider-api/1.0-beta-6/wagon-provider-api-1.0-beta-6.jar
[INFO] Downloaded from remote-repos: http://overture.au.dk/artifactory/remote-repos/org/apache/maven/doxia/doxia-module-xdoc/1.0/doxia-module-xdoc-1.0.jar (28 kB at 505 kB/s)
[INFO] Downloading from remote-repos: http://overture.au.dk/artifactory/remote-repos/commons-logging/commons-logging/1.1.1/commons-logging-1.1.1.jar
[INFO] Downloaded from remote-repos: http://overture.au.dk/artifactory/remote-repos/org/apache/maven/doxia/doxia-module-fml/1.0/doxia-module-fml-1.0.jar (19 kB at 325 kB/s)
[INFO] Downloading from remote-repos: http://overture.au.dk/artifactory/remote-repos/log4j/log4j/1.2.14/log4j-1.2.14.jar
[INFO] Downloaded from remote-repos: http://overture.au.dk/artifactory/remote-repos/org/apache/maven/doxia/doxia-module-apt/1.0/doxia-module-apt-1.0.jar (47 kB at 759 kB/s)
[INFO] Downloading from remote-repos: http://overture.au.dk/artifactory/remote-repos/com/thoughtworks/qdox/qdox/1.12/qdox-1.12.jar
[INFO] Downloaded from remote-repos: http://overture.au.dk/artifactory/remote-repos/org/apache/maven/doxia/doxia-module-xhtml/1.0/doxia-module-xhtml-1.0.jar (22 kB at 330 kB/s)
[INFO] Downloading from remote-repos: http://overture.au.dk/artifactory/remote-repos/org/codehaus/plexus/plexus-archiver/2.1.2/plexus-archiver-2.1.2.jar
[INFO] Downloaded from remote-repos: http://overture.au.dk/artifactory/remote-repos/org/apache/maven/wagon/wagon-provider-api/1.0-beta-6/wagon-provider-api-1.0-beta-6.jar (53 kB at 749 kB/s)
[INFO] Downloading from remote-repos: http://overture.au.dk/artifactory/remote-repos/org/codehaus/plexus/plexus-io/2.0.4/plexus-io-2.0.4.jar
[INFO] Downloaded from remote-repos: http://overture.au.dk/artifactory/remote-repos/org/codehaus/plexus/plexus-io/2.0.4/plexus-io-2.0.4.jar (58 kB at 571 kB/s)
[INFO] Downloaded from remote-repos: http://overture.au.dk/artifactory/remote-repos/com/thoughtworks/qdox/qdox/1.12/qdox-1.12.jar (180 kB at 1.7 MB/s)
[INFO] Downloaded from remote-repos: http://overture.au.dk/artifactory/remote-repos/commons-logging/commons-logging/1.1.1/commons-logging-1.1.1.jar (61 kB at 562 kB/s)
[INFO] Downloaded from remote-repos: http://overture.au.dk/artifactory/remote-repos/log4j/log4j/1.2.14/log4j-1.2.14.jar (367 kB at 3.3 MB/s)
[INFO] Downloaded from remote-repos: http://overture.au.dk/artifactory/remote-repos/org/codehaus/plexus/plexus-archiver/2.1.2/plexus-archiver-2.1.2.jar (185 kB at 1.6 MB/s)
[INFO] Not executing Javadoc as the project is not a Java classpath-capable package
[INFO] 
[INFO] --- maven-install-plugin:2.4:install (default-install) @ core ---
[INFO] Installing /var/lib/jenkins/workspace/multibranch-pipeline_development/core/pom.xml to /var/lib/jenkins/workspace/multibranch-pipeline_development/.repository/org/overturetool/vdm2c/core/0.2.3-SNAPSHOT/core-0.2.3-SNAPSHOT.pom
[INFO] 
[INFO] -----------------< org.overturetool.vdm2c.core:vdm2c >------------------
[INFO] Building The C Code Generator 0.2.3-SNAPSHOT                      [6/11]
[INFO] --------------------------------[ jar ]---------------------------------
[INFO] Downloading from remote-repos: http://overture.au.dk/artifactory/remote-repos/org/apache/maven/plugins/maven-assembly-plugin/2.4/maven-assembly-plugin-2.4.pom
[INFO] Downloaded from remote-repos: http://overture.au.dk/artifactory/remote-repos/org/apache/maven/plugins/maven-assembly-plugin/2.4/maven-assembly-plugin-2.4.pom (17 kB at 702 kB/s)
[INFO] Downloading from remote-repos: http://overture.au.dk/artifactory/remote-repos/org/apache/maven/plugins/maven-assembly-plugin/2.4/maven-assembly-plugin-2.4.jar
[INFO] Downloaded from remote-repos: http://overture.au.dk/artifactory/remote-repos/org/apache/maven/plugins/maven-assembly-plugin/2.4/maven-assembly-plugin-2.4.jar (226 kB at 6.8 MB/s)
[INFO] 
[INFO] --- maven-enforcer-plugin:1.0:enforce (enforce-maven) @ vdm2c ---
[INFO] 
[INFO] --- jacoco-maven-plugin:0.7.6.201602180812:prepare-agent (jacoco-initialize) @ vdm2c ---
[INFO] argLine set to -javaagent:/var/lib/jenkins/workspace/multibranch-pipeline_development/.repository/org/jacoco/org.jacoco.agent/0.7.6.201602180812/org.jacoco.agent-0.7.6.201602180812-runtime.jar=destfile=/var/lib/jenkins/workspace/multibranch-pipeline_development/core/vdm2c/target/coverage-reports/jacoco-unit.exec,excludes=org/overture/cgc/extast/analysis/**/*.*:org/overture/codegen/vdm2c/extast/expressions/**/*:org/overture/codegen/vdm2c/extast/declarations/**/*:org/overture/codegen/vdm2c/extast/statements/**/*:org/overture/cgc/extast/node/**/*:org/overture/codegen/vdm2c/ast/preview/**/*
[INFO] 
[INFO] --- astcreator-plugin:1.6.8:generate (generate-ast) @ vdm2c ---
[INFO] Preparing for tree generation...
[INFO] Configuring extension
[INFO] 	Extension base dependency is: "org.overturetool.core.codegen:ir"
[INFO] 	Searching for base dependency artifact
[INFO] 	Extension base artifact found - exstracting base tree definition files
[INFO] 	Setting base definition files to:
[INFO] 		base: /var/lib/jenkins/workspace/multibranch-pipeline_development/core/vdm2c/target/ir.ast
[INFO] 		base tostring: /var/lib/jenkins/workspace/multibranch-pipeline_development/core/vdm2c/target/ir.ast.tostring
[INFO] 	Extension base artifact configured.
[INFO] Checking if generation required.
[INFO] Extended AST unchanged
[INFO] Nothing to generate, source already up-to-date
[INFO] 
[INFO] --- build-helper-maven-plugin:1.7:add-source (add-source) @ vdm2c ---
[INFO] Source directory: /var/lib/jenkins/workspace/multibranch-pipeline_development/core/vdm2c/target/generated-sources/astCreator added.
[INFO] 
[INFO] --- maven-resources-plugin:2.6:resources (default-resources) @ vdm2c ---
[INFO] Using 'UTF-8' encoding to copy filtered resources.
[INFO] Copying 90 resources
[INFO] 
[INFO] --- maven-compiler-plugin:3.0:compile (default-compile) @ vdm2c ---
[INFO] Changes detected - recompiling the module!
[INFO] Compiling 142 source files to /var/lib/jenkins/workspace/multibranch-pipeline_development/core/vdm2c/target/classes
[WARNING] /var/lib/jenkins/workspace/multibranch-pipeline_development/core/vdm2c/src/main/java/org/overture/codegen/vdm2c/CGen.java: Some input files use unchecked or unsafe operations.
[WARNING] /var/lib/jenkins/workspace/multibranch-pipeline_development/core/vdm2c/src/main/java/org/overture/codegen/vdm2c/CGen.java: Recompile with -Xlint:unchecked for details.
[INFO] 
[INFO] --- maven-resources-plugin:2.6:testResources (default-testResources) @ vdm2c ---
[INFO] Using 'UTF-8' encoding to copy filtered resources.
[INFO] Copying 287 resources
[INFO] 
[INFO] --- maven-compiler-plugin:3.0:testCompile (default-testCompile) @ vdm2c ---
[INFO] Changes detected - recompiling the module!
[INFO] Compiling 26 source files to /var/lib/jenkins/workspace/multibranch-pipeline_development/core/vdm2c/target/test-classes
[INFO] 
[INFO] --- maven-surefire-plugin:2.19:test (default-test) @ vdm2c ---
[INFO] Downloading from remote-repos: http://overture.au.dk/artifactory/remote-repos/org/apache/maven/surefire/surefire-junit4/2.19/surefire-junit4-2.19.pom
[INFO] Downloaded from remote-repos: http://overture.au.dk/artifactory/remote-repos/org/apache/maven/surefire/surefire-junit4/2.19/surefire-junit4-2.19.pom (3.3 kB at 131 kB/s)
[INFO] Downloading from remote-repos: http://overture.au.dk/artifactory/remote-repos/org/apache/maven/surefire/surefire-providers/2.19/surefire-providers-2.19.pom
[INFO] Downloaded from remote-repos: http://overture.au.dk/artifactory/remote-repos/org/apache/maven/surefire/surefire-providers/2.19/surefire-providers-2.19.pom (2.6 kB at 128 kB/s)
[INFO] Downloading from remote-repos: http://overture.au.dk/artifactory/remote-repos/org/apache/maven/surefire/surefire-junit4/2.19/surefire-junit4-2.19.jar
[INFO] Downloaded from remote-repos: http://overture.au.dk/artifactory/remote-repos/org/apache/maven/surefire/surefire-junit4/2.19/surefire-junit4-2.19.jar (76 kB at 2.4 MB/s)

-------------------------------------------------------
 T E S T S
-------------------------------------------------------
Picked up JAVA_TOOL_OPTIONS: -Dmaven.ext.class.path="/var/lib/jenkins/workspace/multibranch-pipeline_development@tmp/withMaven4a080c53/pipeline-maven-spy.jar" -Dorg.jenkinsci.plugins.pipeline.maven.reportsFolder="/var/lib/jenkins/workspace/multibranch-pipeline_development@tmp/withMaven4a080c53" 
Running org.overture.codegen.vdm2c.IsExpTypeEncoderTest
Tests run: 23, Failures: 0, Errors: 0, Skipped: 0, Time elapsed: 0.173 sec - in org.overture.codegen.vdm2c.IsExpTypeEncoderTest
Running org.overture.codegen.vdm2c.ContractsTests
Tests run: 1, Failures: 0, Errors: 0, Skipped: 0, Time elapsed: 16.283 sec - in org.overture.codegen.vdm2c.ContractsTests
Running org.overture.codegen.vdm2c.ValueTypeGarbageCollectionTests
Tests run: 3, Failures: 0, Errors: 0, Skipped: 0, Time elapsed: 19.975 sec - in org.overture.codegen.vdm2c.ValueTypeGarbageCollectionTests
Running org.overture.codegen.vdm2c.ClassAssocAnalysisTest
Tests run: 6, Failures: 0, Errors: 0, Skipped: 0, Time elapsed: 0.019 sec - in org.overture.codegen.vdm2c.ClassAssocAnalysisTest
Running org.overture.codegen.vdm2c.DistributionTests
Tests run: 1, Failures: 0, Errors: 0, Skipped: 0, Time elapsed: 17.05 sec - in org.overture.codegen.vdm2c.DistributionTests
Running org.overture.codegen.vdm2c.IsExpUnionTypeFinderTest
Tests run: 6, Failures: 0, Errors: 0, Skipped: 0, Time elapsed: 0.01 sec - in org.overture.codegen.vdm2c.IsExpUnionTypeFinderTest
Running org.overture.codegen.vdm2c.ValueTypesTests
Tests run: 3, Failures: 0, Errors: 0, Skipped: 0, Time elapsed: 19.433 sec - in org.overture.codegen.vdm2c.ValueTypesTests
Running org.overture.codegen.vdm2c.NativeGarbageCollectionTest
Tests run: 24, Failures: 0, Errors: 0, Skipped: 0, Time elapsed: 154.786 sec - in org.overture.codegen.vdm2c.NativeGarbageCollectionTest
Running org.overture.codegen.vdm2c.PaperExampleTests
Tests run: 4, Failures: 0, Errors: 0, Skipped: 0, Time elapsed: 23.069 sec - in org.overture.codegen.vdm2c.PaperExampleTests
Running org.overture.codegen.vdm2c.NativeClassesTests
Tests run: 26, Failures: 0, Errors: 0, Skipped: 1, Time elapsed: 157.298 sec - in org.overture.codegen.vdm2c.NativeClassesTests
Running org.overture.codegen.vdm2c.ExplicitMemoryManagementTests
java.io.IOException: Cannot run program "valgrind": error=2, No such file or directory
	at java.lang.ProcessBuilder.start(ProcessBuilder.java:1048)
	at java.lang.Runtime.exec(Runtime.java:620)
	at java.lang.Runtime.exec(Runtime.java:450)
	at java.lang.Runtime.exec(Runtime.java:347)
	at org.overture.codegen.vdm2c.MemoryManagementTestBase.isValgrindInstalled(MemoryManagementTestBase.java:30)
	at org.overture.codegen.vdm2c.MemoryManagementTestBase.runAdditionalTests(MemoryManagementTestBase.java:42)
	at org.overture.codegen.vdm2c.NativeTestBase.runTests(NativeTestBase.java:196)
	at org.overture.codegen.vdm2c.NativeTestBase.compileAndTest(NativeTestBase.java:185)
	at org.overture.codegen.vdm2c.ExplicitMemoryManagementTests.SimpleCases(ExplicitMemoryManagementTests.java:14)
	at sun.reflect.NativeMethodAccessorImpl.invoke0(Native Method)
	at sun.reflect.NativeMethodAccessorImpl.invoke(NativeMethodAccessorImpl.java:62)
	at sun.reflect.DelegatingMethodAccessorImpl.invoke(DelegatingMethodAccessorImpl.java:43)
	at java.lang.reflect.Method.invoke(Method.java:498)
	at org.junit.runners.model.FrameworkMethod$1.runReflectiveCall(FrameworkMethod.java:47)
	at org.junit.internal.runners.model.ReflectiveCallable.run(ReflectiveCallable.java:12)
	at org.junit.runners.model.FrameworkMethod.invokeExplosively(FrameworkMethod.java:44)
	at org.junit.internal.runners.statements.InvokeMethod.evaluate(InvokeMethod.java:17)
	at org.junit.internal.runners.statements.RunBefores.evaluate(RunBefores.java:26)
	at org.junit.rules.TestWatcher$1.evaluate(TestWatcher.java:55)
	at org.junit.rules.RunRules.evaluate(RunRules.java:20)
	at org.junit.runners.ParentRunner.runLeaf(ParentRunner.java:271)
	at org.junit.runners.BlockJUnit4ClassRunner.runChild(BlockJUnit4ClassRunner.java:70)
	at org.junit.runners.BlockJUnit4ClassRunner.runChild(BlockJUnit4ClassRunner.java:50)
	at org.junit.runners.ParentRunner$3.run(ParentRunner.java:238)
	at org.junit.runners.ParentRunner$1.schedule(ParentRunner.java:63)
	at org.junit.runners.ParentRunner.runChildren(ParentRunner.java:236)
	at org.junit.runners.ParentRunner.access$000(ParentRunner.java:53)
	at org.junit.runners.ParentRunner$2.evaluate(ParentRunner.java:229)
	at org.junit.internal.runners.statements.RunBefores.evaluate(RunBefores.java:26)
	at org.junit.runners.ParentRunner.run(ParentRunner.java:309)
	at org.apache.maven.surefire.junit4.JUnit4Provider.execute(JUnit4Provider.java:344)
	at org.apache.maven.surefire.junit4.JUnit4Provider.executeWithRerun(JUnit4Provider.java:269)
	at org.apache.maven.surefire.junit4.JUnit4Provider.executeTestSet(JUnit4Provider.java:240)
	at org.apache.maven.surefire.junit4.JUnit4Provider.invoke(JUnit4Provider.java:184)
	at org.apache.maven.surefire.booter.ForkedBooter.invokeProviderInSameClassLoader(ForkedBooter.java:286)
	at org.apache.maven.surefire.booter.ForkedBooter.runSuitesInProcess(ForkedBooter.java:240)
	at org.apache.maven.surefire.booter.ForkedBooter.main(ForkedBooter.java:121)
Caused by: java.io.IOException: error=2, No such file or directory
	at java.lang.UNIXProcess.forkAndExec(Native Method)
	at java.lang.UNIXProcess.<init>(UNIXProcess.java:247)
	at java.lang.ProcessImpl.start(ProcessImpl.java:134)
	at java.lang.ProcessBuilder.start(ProcessBuilder.java:1029)
	... 36 more
Tests run: 1, Failures: 0, Errors: 0, Skipped: 1, Time elapsed: 6.456 sec - in org.overture.codegen.vdm2c.ExplicitMemoryManagementTests
Running org.overture.codegen.vdm2c.TimeFinderTest
Tests run: 1, Failures: 0, Errors: 0, Skipped: 0, Time elapsed: 0 sec - in org.overture.codegen.vdm2c.TimeFinderTest
Running org.overture.codegen.vdm2c.NameManglerTests
Tests run: 20, Failures: 0, Errors: 0, Skipped: 0, Time elapsed: 0 sec - in org.overture.codegen.vdm2c.NameManglerTests
Running org.overture.codegen.vdm2c.NativeClassesGarbageCollectionTest
Tests run: 26, Failures: 0, Errors: 0, Skipped: 1, Time elapsed: 161.938 sec - in org.overture.codegen.vdm2c.NativeClassesGarbageCollectionTest
Running org.overture.codegen.vdm2c.DistSystemAnalysisTests
Tests run: 1, Failures: 0, Errors: 0, Skipped: 0, Time elapsed: 0.072 sec - in org.overture.codegen.vdm2c.DistSystemAnalysisTests
Running org.overture.codegen.vdm2c.CasesTest
Tests run: 4, Failures: 0, Errors: 0, Skipped: 0, Time elapsed: 22.493 sec - in org.overture.codegen.vdm2c.CasesTest
Running org.overture.codegen.vdm2c.FeatureAnalysisTest
Tests run: 17, Failures: 0, Errors: 0, Skipped: 0, Time elapsed: 0.022 sec - in org.overture.codegen.vdm2c.FeatureAnalysisTest
Running org.overture.codegen.vdm2c.ExternalTests
Tests run: 1, Failures: 0, Errors: 0, Skipped: 0, Time elapsed: 0.002 sec - in org.overture.codegen.vdm2c.ExternalTests
Running org.overture.codegen.vdm2c.NativeTests
Tests run: 24, Failures: 0, Errors: 0, Skipped: 0, Time elapsed: 151.045 sec - in org.overture.codegen.vdm2c.NativeTests
Running org.overture.codegen.vdm2c.ContractsGarbageCollectionTests
Tests run: 1, Failures: 0, Errors: 0, Skipped: 0, Time elapsed: 7.018 sec - in org.overture.codegen.vdm2c.ContractsGarbageCollectionTests

Results :

Tests run: 193, Failures: 0, Errors: 0, Skipped: 3

[INFO] 
[INFO] --- maven-jar-plugin:2.4:jar (default-jar) @ vdm2c ---
[INFO] Building jar: /var/lib/jenkins/workspace/multibranch-pipeline_development/core/vdm2c/target/vdm2c-0.2.3-SNAPSHOT.jar
[INFO] 
[INFO] --- jacoco-maven-plugin:0.7.6.201602180812:report (jacoco-site) @ vdm2c ---
[INFO] Analyzed bundle 'The C Code Generator' with 110 classes
[INFO] 
[INFO] --- maven-jarsigner-plugin:1.2:sign (sign) @ vdm2c ---
[WARNING] Picked up JAVA_TOOL_OPTIONS: -Dmaven.ext.class.path="/var/lib/jenkins/workspace/multibranch-pipeline_development@tmp/withMaven4a080c53/pipeline-maven-spy.jar" -Dorg.jenkinsci.plugins.pipeline.maven.reportsFolder="/var/lib/jenkins/workspace/multibranch-pipeline_development@tmp/withMaven4a080c53" 
[INFO] 1 archive(s) processed
[INFO] 
[INFO] --- maven-assembly-plugin:2.4:single (make-my-jar-with-dependencies) @ vdm2c ---
[INFO] Downloading from remote-repos: http://overture.au.dk/artifactory/remote-repos/org/apache/maven/shared/maven-common-artifact-filters/1.4/maven-common-artifact-filters-1.4.pom
[INFO] Downloaded from remote-repos: http://overture.au.dk/artifactory/remote-repos/org/apache/maven/shared/maven-common-artifact-filters/1.4/maven-common-artifact-filters-1.4.pom (3.8 kB at 52 kB/s)
[INFO] Downloading from remote-repos: http://overture.au.dk/artifactory/remote-repos/org/codehaus/plexus/plexus-utils/2.1/plexus-utils-2.1.pom
[INFO] Downloaded from remote-repos: http://overture.au.dk/artifactory/remote-repos/org/codehaus/plexus/plexus-utils/2.1/plexus-utils-2.1.pom (4.0 kB at 175 kB/s)
[INFO] Downloading from remote-repos: http://overture.au.dk/artifactory/remote-repos/org/codehaus/plexus/plexus-archiver/2.2/plexus-archiver-2.2.pom
[INFO] Downloaded from remote-repos: http://overture.au.dk/artifactory/remote-repos/org/codehaus/plexus/plexus-archiver/2.2/plexus-archiver-2.2.pom (3.2 kB at 169 kB/s)
[INFO] Downloading from remote-repos: http://overture.au.dk/artifactory/remote-repos/org/codehaus/plexus/plexus-components/1.1.20/plexus-components-1.1.20.pom
[INFO] Downloaded from remote-repos: http://overture.au.dk/artifactory/remote-repos/org/codehaus/plexus/plexus-components/1.1.20/plexus-components-1.1.20.pom (2.8 kB at 104 kB/s)
[INFO] Downloading from remote-repos: http://overture.au.dk/artifactory/remote-repos/org/apache/maven/shared/file-management/1.1/file-management-1.1.pom
[INFO] Downloaded from remote-repos: http://overture.au.dk/artifactory/remote-repos/org/apache/maven/shared/file-management/1.1/file-management-1.1.pom (2.7 kB at 127 kB/s)
[INFO] Downloading from remote-repos: http://overture.au.dk/artifactory/remote-repos/org/apache/maven/shared/maven-shared-components/4/maven-shared-components-4.pom
[INFO] Downloaded from remote-repos: http://overture.au.dk/artifactory/remote-repos/org/apache/maven/shared/maven-shared-components/4/maven-shared-components-4.pom (2.2 kB at 110 kB/s)
[INFO] Downloading from remote-repos: http://overture.au.dk/artifactory/remote-repos/org/apache/maven/maven-parent/4/maven-parent-4.pom
[INFO] Downloaded from remote-repos: http://overture.au.dk/artifactory/remote-repos/org/apache/maven/maven-parent/4/maven-parent-4.pom (10.0 kB at 500 kB/s)
[INFO] Downloading from remote-repos: http://overture.au.dk/artifactory/remote-repos/org/apache/maven/shared/maven-shared-io/1.0/maven-shared-io-1.0.pom
[INFO] Downloaded from remote-repos: http://overture.au.dk/artifactory/remote-repos/org/apache/maven/shared/maven-shared-io/1.0/maven-shared-io-1.0.pom (3.0 kB at 159 kB/s)
[INFO] Downloading from remote-repos: http://overture.au.dk/artifactory/remote-repos/org/codehaus/plexus/plexus-utils/1.2/plexus-utils-1.2.pom
[INFO] Downloaded from remote-repos: http://overture.au.dk/artifactory/remote-repos/org/codehaus/plexus/plexus-utils/1.2/plexus-utils-1.2.pom (767 B at 40 kB/s)
[INFO] Downloading from remote-repos: http://overture.au.dk/artifactory/remote-repos/org/codehaus/plexus/plexus/1.0.5/plexus-1.0.5.pom
[INFO] Downloaded from remote-repos: http://overture.au.dk/artifactory/remote-repos/org/codehaus/plexus/plexus/1.0.5/plexus-1.0.5.pom (5.9 kB at 270 kB/s)
[INFO] Downloading from remote-repos: http://overture.au.dk/artifactory/remote-repos/org/codehaus/plexus/plexus-io/2.0.6/plexus-io-2.0.6.pom
[INFO] Downloaded from remote-repos: http://overture.au.dk/artifactory/remote-repos/org/codehaus/plexus/plexus-io/2.0.6/plexus-io-2.0.6.pom (2.2 kB at 92 kB/s)
[INFO] Downloading from remote-repos: http://overture.au.dk/artifactory/remote-repos/org/apache/maven/shared/maven-repository-builder/1.0-alpha-2/maven-repository-builder-1.0-alpha-2.pom
[INFO] Downloaded from remote-repos: http://overture.au.dk/artifactory/remote-repos/org/apache/maven/shared/maven-repository-builder/1.0-alpha-2/maven-repository-builder-1.0-alpha-2.pom (3.2 kB at 104 kB/s)
[INFO] Downloading from remote-repos: http://overture.au.dk/artifactory/remote-repos/org/apache/maven/shared/maven-common-artifact-filters/1.0-alpha-1/maven-common-artifact-filters-1.0-alpha-1.pom
[INFO] Downloaded from remote-repos: http://overture.au.dk/artifactory/remote-repos/org/apache/maven/shared/maven-common-artifact-filters/1.0-alpha-1/maven-common-artifact-filters-1.0-alpha-1.pom (1.8 kB at 100 kB/s)
[INFO] Downloading from remote-repos: http://overture.au.dk/artifactory/remote-repos/org/apache/maven/shared/maven-shared-components/6/maven-shared-components-6.pom
[INFO] Downloaded from remote-repos: http://overture.au.dk/artifactory/remote-repos/org/apache/maven/shared/maven-shared-components/6/maven-shared-components-6.pom (3.1 kB at 124 kB/s)
[INFO] Downloading from remote-repos: http://overture.au.dk/artifactory/remote-repos/org/apache/maven/shared/maven-common-artifact-filters/1.4/maven-common-artifact-filters-1.4.jar
[INFO] Downloading from remote-repos: http://overture.au.dk/artifactory/remote-repos/org/codehaus/plexus/plexus-archiver/2.2/plexus-archiver-2.2.jar
[INFO] Downloading from remote-repos: http://overture.au.dk/artifactory/remote-repos/org/apache/maven/shared/file-management/1.1/file-management-1.1.jar
[INFO] Downloading from remote-repos: http://overture.au.dk/artifactory/remote-repos/org/codehaus/plexus/plexus-io/2.0.6/plexus-io-2.0.6.jar
[INFO] Downloading from remote-repos: http://overture.au.dk/artifactory/remote-repos/org/apache/maven/shared/maven-repository-builder/1.0-alpha-2/maven-repository-builder-1.0-alpha-2.jar
[INFO] Downloaded from remote-repos: http://overture.au.dk/artifactory/remote-repos/org/apache/maven/shared/maven-common-artifact-filters/1.4/maven-common-artifact-filters-1.4.jar (32 kB at 658 kB/s)
[INFO] Downloaded from remote-repos: http://overture.au.dk/artifactory/remote-repos/org/apache/maven/shared/file-management/1.1/file-management-1.1.jar (31 kB at 528 kB/s)
[INFO] Downloaded from remote-repos: http://overture.au.dk/artifactory/remote-repos/org/apache/maven/shared/maven-repository-builder/1.0-alpha-2/maven-repository-builder-1.0-alpha-2.jar (23 kB at 368 kB/s)
[INFO] Downloaded from remote-repos: http://overture.au.dk/artifactory/remote-repos/org/codehaus/plexus/plexus-io/2.0.6/plexus-io-2.0.6.jar (58 kB at 874 kB/s)
[INFO] Downloaded from remote-repos: http://overture.au.dk/artifactory/remote-repos/org/codehaus/plexus/plexus-archiver/2.2/plexus-archiver-2.2.jar (185 kB at 2.5 MB/s)
[INFO] Building jar: /var/lib/jenkins/workspace/multibranch-pipeline_development/core/vdm2c/target/vdm2c-0.2.3-SNAPSHOT-jar-with-dependencies.jar
[INFO] 
[INFO] --- maven-javadoc-plugin:2.9:jar (attach-javadocs) @ vdm2c ---
[INFO] Skipping javadoc generation
[INFO] 
[INFO] --- maven-install-plugin:2.4:install (default-install) @ vdm2c ---
[INFO] Installing /var/lib/jenkins/workspace/multibranch-pipeline_development/core/vdm2c/target/vdm2c-0.2.3-SNAPSHOT.jar to /var/lib/jenkins/workspace/multibranch-pipeline_development/.repository/org/overturetool/vdm2c/core/vdm2c/0.2.3-SNAPSHOT/vdm2c-0.2.3-SNAPSHOT.jar
[INFO] Installing /var/lib/jenkins/workspace/multibranch-pipeline_development/core/vdm2c/pom.xml to /var/lib/jenkins/workspace/multibranch-pipeline_development/.repository/org/overturetool/vdm2c/core/vdm2c/0.2.3-SNAPSHOT/vdm2c-0.2.3-SNAPSHOT.pom
[INFO] Installing /var/lib/jenkins/workspace/multibranch-pipeline_development/core/vdm2c/target/vdm2c-0.2.3-SNAPSHOT-jar-with-dependencies.jar to /var/lib/jenkins/workspace/multibranch-pipeline_development/.repository/org/overturetool/vdm2c/core/vdm2c/0.2.3-SNAPSHOT/vdm2c-0.2.3-SNAPSHOT-jar-with-dependencies.jar
[INFO] 
[INFO] ---------------------< org.overturetool.vdm2c:ide >---------------------
[INFO] Building Overture FMI IDE Top-level 0.2.3-SNAPSHOT                [7/11]
[INFO] --------------------------------[ pom ]---------------------------------
[INFO] 
[INFO] --- maven-enforcer-plugin:1.0:enforce (enforce-maven) @ ide ---
[INFO] 
[INFO] --- jacoco-maven-plugin:0.7.6.201602180812:prepare-agent (jacoco-initialize) @ ide ---
[INFO] argLine set to -javaagent:/var/lib/jenkins/workspace/multibranch-pipeline_development/.repository/org/jacoco/org.jacoco.agent/0.7.6.201602180812/org.jacoco.agent-0.7.6.201602180812-runtime.jar=destfile=/var/lib/jenkins/workspace/multibranch-pipeline_development/ide/target/coverage-reports/jacoco-unit.exec,excludes=org/overture/cgc/extast/analysis/**/*.*:org/overture/codegen/vdm2c/extast/expressions/**/*:org/overture/codegen/vdm2c/extast/declarations/**/*:org/overture/codegen/vdm2c/extast/statements/**/*:org/overture/cgc/extast/node/**/*:org/overture/codegen/vdm2c/ast/preview/**/*
[INFO] 
[INFO] --- jacoco-maven-plugin:0.7.6.201602180812:report (jacoco-site) @ ide ---
[INFO] Skipping JaCoCo execution due to missing execution data file:/var/lib/jenkins/workspace/multibranch-pipeline_development/ide/target/coverage-reports/jacoco-unit.exec
[INFO] 
[INFO] --- maven-jarsigner-plugin:1.2:sign (sign) @ ide ---
[INFO] 0 archive(s) processed
[INFO] 
[INFO] --- maven-javadoc-plugin:2.10.4:jar (attach-javadocs) @ ide ---
[INFO] Downloading from remote-repos: http://overture.au.dk/artifactory/remote-repos/org/apache/maven/shared/maven-invoker/2.2/maven-invoker-2.2.pom
[INFO] Downloaded from remote-repos: http://overture.au.dk/artifactory/remote-repos/org/apache/maven/shared/maven-invoker/2.2/maven-invoker-2.2.pom (5.9 kB at 234 kB/s)
[INFO] Downloading from remote-repos: http://overture.au.dk/artifactory/remote-repos/org/apache/maven/shared/maven-shared-components/21/maven-shared-components-21.pom
[INFO] Downloaded from remote-repos: http://overture.au.dk/artifactory/remote-repos/org/apache/maven/shared/maven-shared-components/21/maven-shared-components-21.pom (4.9 kB at 198 kB/s)
[INFO] Downloading from remote-repos: http://overture.au.dk/artifactory/remote-repos/org/apache/maven/maven-parent/25/maven-parent-25.pom
[INFO] Downloaded from remote-repos: http://overture.au.dk/artifactory/remote-repos/org/apache/maven/maven-parent/25/maven-parent-25.pom (38 kB at 1.0 MB/s)
[INFO] Downloading from remote-repos: http://overture.au.dk/artifactory/remote-repos/org/apache/apache/15/apache-15.pom
[INFO] Downloaded from remote-repos: http://overture.au.dk/artifactory/remote-repos/org/apache/apache/15/apache-15.pom (15 kB at 465 kB/s)
[INFO] Downloading from remote-repos: http://overture.au.dk/artifactory/remote-repos/org/codehaus/plexus/plexus-utils/3.0.20/plexus-utils-3.0.20.pom
[INFO] Downloaded from remote-repos: http://overture.au.dk/artifactory/remote-repos/org/codehaus/plexus/plexus-utils/3.0.20/plexus-utils-3.0.20.pom (3.8 kB at 173 kB/s)
[INFO] Downloading from remote-repos: http://overture.au.dk/artifactory/remote-repos/org/codehaus/plexus/plexus/3.3.1/plexus-3.3.1.pom
[INFO] Downloaded from remote-repos: http://overture.au.dk/artifactory/remote-repos/org/codehaus/plexus/plexus/3.3.1/plexus-3.3.1.pom (20 kB at 889 kB/s)
[INFO] Downloading from remote-repos: http://overture.au.dk/artifactory/remote-repos/org/apache/maven/doxia/doxia-sink-api/1.4/doxia-sink-api-1.4.pom
[INFO] Downloaded from remote-repos: http://overture.au.dk/artifactory/remote-repos/org/apache/maven/doxia/doxia-sink-api/1.4/doxia-sink-api-1.4.pom (1.5 kB at 81 kB/s)
[INFO] Downloading from remote-repos: http://overture.au.dk/artifactory/remote-repos/org/apache/maven/doxia/doxia/1.4/doxia-1.4.pom
[INFO] Downloaded from remote-repos: http://overture.au.dk/artifactory/remote-repos/org/apache/maven/doxia/doxia/1.4/doxia-1.4.pom (18 kB at 816 kB/s)
[INFO] Downloading from remote-repos: http://overture.au.dk/artifactory/remote-repos/org/apache/maven/doxia/doxia-logging-api/1.4/doxia-logging-api-1.4.pom
[INFO] Downloaded from remote-repos: http://overture.au.dk/artifactory/remote-repos/org/apache/maven/doxia/doxia-logging-api/1.4/doxia-logging-api-1.4.pom (1.5 kB at 77 kB/s)
[INFO] Downloading from remote-repos: http://overture.au.dk/artifactory/remote-repos/org/apache/maven/doxia/doxia-site-renderer/1.4/doxia-site-renderer-1.4.pom
[INFO] Downloaded from remote-repos: http://overture.au.dk/artifactory/remote-repos/org/apache/maven/doxia/doxia-site-renderer/1.4/doxia-site-renderer-1.4.pom (6.1 kB at 306 kB/s)
[INFO] Downloading from remote-repos: http://overture.au.dk/artifactory/remote-repos/org/apache/maven/doxia/doxia-sitetools/1.4/doxia-sitetools-1.4.pom
[INFO] Downloaded from remote-repos: http://overture.au.dk/artifactory/remote-repos/org/apache/maven/doxia/doxia-sitetools/1.4/doxia-sitetools-1.4.pom (17 kB at 746 kB/s)
[INFO] Downloading from remote-repos: http://overture.au.dk/artifactory/remote-repos/org/apache/maven/doxia/doxia-core/1.4/doxia-core-1.4.pom
[INFO] Downloaded from remote-repos: http://overture.au.dk/artifactory/remote-repos/org/apache/maven/doxia/doxia-core/1.4/doxia-core-1.4.pom (4.1 kB at 214 kB/s)
[INFO] Downloading from remote-repos: http://overture.au.dk/artifactory/remote-repos/org/codehaus/plexus/plexus-utils/3.0.10/plexus-utils-3.0.10.pom
[INFO] Downloaded from remote-repos: http://overture.au.dk/artifactory/remote-repos/org/codehaus/plexus/plexus-utils/3.0.10/plexus-utils-3.0.10.pom (3.1 kB at 157 kB/s)
[INFO] Downloading from remote-repos: http://overture.au.dk/artifactory/remote-repos/xerces/xercesImpl/2.9.1/xercesImpl-2.9.1.pom
[INFO] Downloaded from remote-repos: http://overture.au.dk/artifactory/remote-repos/xerces/xercesImpl/2.9.1/xercesImpl-2.9.1.pom (236 B at 9.1 kB/s)
[INFO] Downloading from remote-repos: http://overture.au.dk/artifactory/remote-repos/org/apache/httpcomponents/httpclient/4.0.2/httpclient-4.0.2.pom
[INFO] Downloaded from remote-repos: http://overture.au.dk/artifactory/remote-repos/org/apache/httpcomponents/httpclient/4.0.2/httpclient-4.0.2.pom (7.5 kB at 375 kB/s)
[INFO] Downloading from remote-repos: http://overture.au.dk/artifactory/remote-repos/org/apache/httpcomponents/httpcomponents-client/4.0.2/httpcomponents-client-4.0.2.pom
[INFO] Downloaded from remote-repos: http://overture.au.dk/artifactory/remote-repos/org/apache/httpcomponents/httpcomponents-client/4.0.2/httpcomponents-client-4.0.2.pom (9.0 kB at 472 kB/s)
[INFO] Downloading from remote-repos: http://overture.au.dk/artifactory/remote-repos/org/apache/httpcomponents/project/4.1/project-4.1.pom
[INFO] Downloaded from remote-repos: http://overture.au.dk/artifactory/remote-repos/org/apache/httpcomponents/project/4.1/project-4.1.pom (16 kB at 683 kB/s)
[INFO] Downloading from remote-repos: http://overture.au.dk/artifactory/remote-repos/org/apache/httpcomponents/httpcore/4.0.1/httpcore-4.0.1.pom
[INFO] Downloaded from remote-repos: http://overture.au.dk/artifactory/remote-repos/org/apache/httpcomponents/httpcore/4.0.1/httpcore-4.0.1.pom (4.9 kB at 272 kB/s)
[INFO] Downloading from remote-repos: http://overture.au.dk/artifactory/remote-repos/org/apache/httpcomponents/httpcomponents-core/4.0.1/httpcomponents-core-4.0.1.pom
[INFO] Downloaded from remote-repos: http://overture.au.dk/artifactory/remote-repos/org/apache/httpcomponents/httpcomponents-core/4.0.1/httpcomponents-core-4.0.1.pom (9.4 kB at 468 kB/s)
[INFO] Downloading from remote-repos: http://overture.au.dk/artifactory/remote-repos/org/apache/httpcomponents/project/4.0/project-4.0.pom
[INFO] Downloaded from remote-repos: http://overture.au.dk/artifactory/remote-repos/org/apache/httpcomponents/project/4.0/project-4.0.pom (6.3 kB at 299 kB/s)
[INFO] Downloading from remote-repos: http://overture.au.dk/artifactory/remote-repos/commons-codec/commons-codec/1.3/commons-codec-1.3.pom
[INFO] Downloaded from remote-repos: http://overture.au.dk/artifactory/remote-repos/commons-codec/commons-codec/1.3/commons-codec-1.3.pom (6.1 kB at 321 kB/s)
[INFO] Downloading from remote-repos: http://overture.au.dk/artifactory/remote-repos/org/apache/maven/doxia/doxia-decoration-model/1.4/doxia-decoration-model-1.4.pom
[INFO] Downloaded from remote-repos: http://overture.au.dk/artifactory/remote-repos/org/apache/maven/doxia/doxia-decoration-model/1.4/doxia-decoration-model-1.4.pom (2.7 kB at 134 kB/s)
[INFO] Downloading from remote-repos: http://overture.au.dk/artifactory/remote-repos/org/apache/maven/doxia/doxia-module-xhtml/1.4/doxia-module-xhtml-1.4.pom
[INFO] Downloaded from remote-repos: http://overture.au.dk/artifactory/remote-repos/org/apache/maven/doxia/doxia-module-xhtml/1.4/doxia-module-xhtml-1.4.pom (1.6 kB at 82 kB/s)
[INFO] Downloading from remote-repos: http://overture.au.dk/artifactory/remote-repos/org/apache/maven/doxia/doxia-modules/1.4/doxia-modules-1.4.pom
[INFO] Downloaded from remote-repos: http://overture.au.dk/artifactory/remote-repos/org/apache/maven/doxia/doxia-modules/1.4/doxia-modules-1.4.pom (2.6 kB at 114 kB/s)
[INFO] Downloading from remote-repos: http://overture.au.dk/artifactory/remote-repos/org/apache/maven/doxia/doxia-module-fml/1.4/doxia-module-fml-1.4.pom
[INFO] Downloaded from remote-repos: http://overture.au.dk/artifactory/remote-repos/org/apache/maven/doxia/doxia-module-fml/1.4/doxia-module-fml-1.4.pom (4.8 kB at 150 kB/s)
[INFO] Downloading from remote-repos: http://overture.au.dk/artifactory/remote-repos/org/apache/velocity/velocity-tools/2.0/velocity-tools-2.0.pom
[INFO] Downloaded from remote-repos: http://overture.au.dk/artifactory/remote-repos/org/apache/velocity/velocity-tools/2.0/velocity-tools-2.0.pom (18 kB at 337 kB/s)
[INFO] Downloading from remote-repos: http://overture.au.dk/artifactory/remote-repos/commons-digester/commons-digester/1.8/commons-digester-1.8.pom
[INFO] Downloaded from remote-repos: http://overture.au.dk/artifactory/remote-repos/commons-digester/commons-digester/1.8/commons-digester-1.8.pom (7.0 kB at 369 kB/s)
[INFO] Downloading from remote-repos: http://overture.au.dk/artifactory/remote-repos/commons-logging/commons-logging/1.1/commons-logging-1.1.pom
[INFO] Downloaded from remote-repos: http://overture.au.dk/artifactory/remote-repos/commons-logging/commons-logging/1.1/commons-logging-1.1.pom (6.2 kB at 343 kB/s)
[INFO] Downloading from remote-repos: http://overture.au.dk/artifactory/remote-repos/logkit/logkit/1.0.1/logkit-1.0.1.pom
[INFO] Downloaded from remote-repos: http://overture.au.dk/artifactory/remote-repos/logkit/logkit/1.0.1/logkit-1.0.1.pom (147 B at 8.2 kB/s)
[INFO] Downloading from remote-repos: http://overture.au.dk/artifactory/remote-repos/avalon-framework/avalon-framework/4.1.3/avalon-framework-4.1.3.pom
[INFO] Downloaded from remote-repos: http://overture.au.dk/artifactory/remote-repos/avalon-framework/avalon-framework/4.1.3/avalon-framework-4.1.3.pom (167 B at 9.3 kB/s)
[INFO] Downloading from remote-repos: http://overture.au.dk/artifactory/remote-repos/javax/servlet/servlet-api/2.3/servlet-api-2.3.pom
[INFO] Downloaded from remote-repos: http://overture.au.dk/artifactory/remote-repos/javax/servlet/servlet-api/2.3/servlet-api-2.3.pom (156 B at 8.7 kB/s)
[INFO] Downloading from remote-repos: http://overture.au.dk/artifactory/remote-repos/commons-chain/commons-chain/1.1/commons-chain-1.1.pom
[INFO] Downloaded from remote-repos: http://overture.au.dk/artifactory/remote-repos/commons-chain/commons-chain/1.1/commons-chain-1.1.pom (6.0 kB at 301 kB/s)
[INFO] Downloading from remote-repos: http://overture.au.dk/artifactory/remote-repos/commons-validator/commons-validator/1.3.1/commons-validator-1.3.1.pom
[INFO] Downloaded from remote-repos: http://overture.au.dk/artifactory/remote-repos/commons-validator/commons-validator/1.3.1/commons-validator-1.3.1.pom (9.0 kB at 501 kB/s)
[INFO] Downloading from remote-repos: http://overture.au.dk/artifactory/remote-repos/dom4j/dom4j/1.1/dom4j-1.1.pom
[INFO] Downloaded from remote-repos: http://overture.au.dk/artifactory/remote-repos/dom4j/dom4j/1.1/dom4j-1.1.pom (142 B at 7.9 kB/s)
[INFO] Downloading from remote-repos: http://overture.au.dk/artifactory/remote-repos/sslext/sslext/1.2-0/sslext-1.2-0.pom
[INFO] Downloaded from remote-repos: http://overture.au.dk/artifactory/remote-repos/sslext/sslext/1.2-0/sslext-1.2-0.pom (653 B at 36 kB/s)
[INFO] Downloading from remote-repos: http://overture.au.dk/artifactory/remote-repos/org/apache/struts/struts-core/1.3.8/struts-core-1.3.8.pom
[INFO] Downloaded from remote-repos: http://overture.au.dk/artifactory/remote-repos/org/apache/struts/struts-core/1.3.8/struts-core-1.3.8.pom (4.3 kB at 240 kB/s)
[INFO] Downloading from remote-repos: http://overture.au.dk/artifactory/remote-repos/org/apache/struts/struts-parent/1.3.8/struts-parent-1.3.8.pom
[INFO] Downloaded from remote-repos: http://overture.au.dk/artifactory/remote-repos/org/apache/struts/struts-parent/1.3.8/struts-parent-1.3.8.pom (9.4 kB at 361 kB/s)
[INFO] Downloading from remote-repos: http://overture.au.dk/artifactory/remote-repos/org/apache/struts/struts-master/4/struts-master-4.pom
[INFO] Downloaded from remote-repos: http://overture.au.dk/artifactory/remote-repos/org/apache/struts/struts-master/4/struts-master-4.pom (12 kB at 394 kB/s)
[INFO] Downloading from remote-repos: http://overture.au.dk/artifactory/remote-repos/org/apache/apache/2/apache-2.pom
[INFO] Downloaded from remote-repos: http://overture.au.dk/artifactory/remote-repos/org/apache/apache/2/apache-2.pom (3.1 kB at 129 kB/s)
[INFO] Downloading from remote-repos: http://overture.au.dk/artifactory/remote-repos/antlr/antlr/2.7.2/antlr-2.7.2.pom
[INFO] Downloaded from remote-repos: http://overture.au.dk/artifactory/remote-repos/antlr/antlr/2.7.2/antlr-2.7.2.pom (145 B at 8.5 kB/s)
[INFO] Downloading from remote-repos: http://overture.au.dk/artifactory/remote-repos/org/apache/struts/struts-taglib/1.3.8/struts-taglib-1.3.8.pom
[INFO] Downloaded from remote-repos: http://overture.au.dk/artifactory/remote-repos/org/apache/struts/struts-taglib/1.3.8/struts-taglib-1.3.8.pom (3.1 kB at 171 kB/s)
[INFO] Downloading from remote-repos: http://overture.au.dk/artifactory/remote-repos/org/apache/struts/struts-tiles/1.3.8/struts-tiles-1.3.8.pom
[INFO] Downloaded from remote-repos: http://overture.au.dk/artifactory/remote-repos/org/apache/struts/struts-tiles/1.3.8/struts-tiles-1.3.8.pom (2.9 kB at 161 kB/s)
[INFO] Downloading from remote-repos: http://overture.au.dk/artifactory/remote-repos/org/apache/velocity/velocity/1.6.2/velocity-1.6.2.pom
[INFO] Downloaded from remote-repos: http://overture.au.dk/artifactory/remote-repos/org/apache/velocity/velocity/1.6.2/velocity-1.6.2.pom (11 kB at 559 kB/s)
[INFO] Downloading from remote-repos: http://overture.au.dk/artifactory/remote-repos/commons-io/commons-io/2.5/commons-io-2.5.pom
[INFO] Downloaded from remote-repos: http://overture.au.dk/artifactory/remote-repos/commons-io/commons-io/2.5/commons-io-2.5.pom (13 kB at 604 kB/s)
[INFO] Downloading from remote-repos: http://overture.au.dk/artifactory/remote-repos/org/apache/commons/commons-parent/39/commons-parent-39.pom
[INFO] Downloaded from remote-repos: http://overture.au.dk/artifactory/remote-repos/org/apache/commons/commons-parent/39/commons-parent-39.pom (62 kB at 2.7 MB/s)
[INFO] Downloading from remote-repos: http://overture.au.dk/artifactory/remote-repos/org/apache/httpcomponents/httpclient/4.2.3/httpclient-4.2.3.pom
[INFO] Downloaded from remote-repos: http://overture.au.dk/artifactory/remote-repos/org/apache/httpcomponents/httpclient/4.2.3/httpclient-4.2.3.pom (5.9 kB at 328 kB/s)
[INFO] Downloading from remote-repos: http://overture.au.dk/artifactory/remote-repos/org/apache/httpcomponents/httpcomponents-client/4.2.3/httpcomponents-client-4.2.3.pom
[INFO] Downloaded from remote-repos: http://overture.au.dk/artifactory/remote-repos/org/apache/httpcomponents/httpcomponents-client/4.2.3/httpcomponents-client-4.2.3.pom (15 kB at 490 kB/s)
[INFO] Downloading from remote-repos: http://overture.au.dk/artifactory/remote-repos/org/apache/httpcomponents/project/6/project-6.pom
[INFO] Downloaded from remote-repos: http://overture.au.dk/artifactory/remote-repos/org/apache/httpcomponents/project/6/project-6.pom (24 kB at 760 kB/s)
[INFO] Downloading from remote-repos: http://overture.au.dk/artifactory/remote-repos/org/apache/httpcomponents/httpcore/4.2.2/httpcore-4.2.2.pom
[INFO] Downloaded from remote-repos: http://overture.au.dk/artifactory/remote-repos/org/apache/httpcomponents/httpcore/4.2.2/httpcore-4.2.2.pom (5.7 kB at 284 kB/s)
[INFO] Downloading from remote-repos: http://overture.au.dk/artifactory/remote-repos/org/apache/httpcomponents/httpcomponents-core/4.2.2/httpcomponents-core-4.2.2.pom
[INFO] Downloaded from remote-repos: http://overture.au.dk/artifactory/remote-repos/org/apache/httpcomponents/httpcomponents-core/4.2.2/httpcomponents-core-4.2.2.pom (11 kB at 637 kB/s)
[INFO] Downloading from remote-repos: http://overture.au.dk/artifactory/remote-repos/commons-codec/commons-codec/1.6/commons-codec-1.6.pom
[INFO] Downloaded from remote-repos: http://overture.au.dk/artifactory/remote-repos/commons-codec/commons-codec/1.6/commons-codec-1.6.pom (11 kB at 620 kB/s)
[INFO] Downloading from remote-repos: http://overture.au.dk/artifactory/remote-repos/com/thoughtworks/qdox/qdox/1.12.1/qdox-1.12.1.pom
[INFO] Downloaded from remote-repos: http://overture.au.dk/artifactory/remote-repos/com/thoughtworks/qdox/qdox/1.12.1/qdox-1.12.1.pom (18 kB at 926 kB/s)
[INFO] Downloading from remote-repos: http://overture.au.dk/artifactory/remote-repos/org/codehaus/plexus/plexus-archiver/3.3/plexus-archiver-3.3.pom
[INFO] Downloaded from remote-repos: http://overture.au.dk/artifactory/remote-repos/org/codehaus/plexus/plexus-archiver/3.3/plexus-archiver-3.3.pom (5.3 kB at 254 kB/s)
[INFO] Downloading from remote-repos: http://overture.au.dk/artifactory/remote-repos/org/codehaus/plexus/plexus-utils/3.0.24/plexus-utils-3.0.24.pom
[INFO] Downloaded from remote-repos: http://overture.au.dk/artifactory/remote-repos/org/codehaus/plexus/plexus-utils/3.0.24/plexus-utils-3.0.24.pom (4.1 kB at 206 kB/s)
[INFO] Downloading from remote-repos: http://overture.au.dk/artifactory/remote-repos/org/codehaus/plexus/plexus/4.0/plexus-4.0.pom
[INFO] Downloaded from remote-repos: http://overture.au.dk/artifactory/remote-repos/org/codehaus/plexus/plexus/4.0/plexus-4.0.pom (22 kB at 1.0 MB/s)
[INFO] Downloading from remote-repos: http://overture.au.dk/artifactory/remote-repos/org/codehaus/plexus/plexus-io/2.7.1/plexus-io-2.7.1.pom
[INFO] Downloaded from remote-repos: http://overture.au.dk/artifactory/remote-repos/org/codehaus/plexus/plexus-io/2.7.1/plexus-io-2.7.1.pom (4.9 kB at 259 kB/s)
[INFO] Downloading from remote-repos: http://overture.au.dk/artifactory/remote-repos/org/codehaus/plexus/plexus-utils/3.0.22/plexus-utils-3.0.22.pom
[INFO] Downloaded from remote-repos: http://overture.au.dk/artifactory/remote-repos/org/codehaus/plexus/plexus-utils/3.0.22/plexus-utils-3.0.22.pom (3.8 kB at 192 kB/s)
[INFO] Downloading from remote-repos: http://overture.au.dk/artifactory/remote-repos/org/apache/commons/commons-compress/1.11/commons-compress-1.11.pom
[INFO] Downloaded from remote-repos: http://overture.au.dk/artifactory/remote-repos/org/apache/commons/commons-compress/1.11/commons-compress-1.11.pom (13 kB at 661 kB/s)
[INFO] Downloading from remote-repos: http://overture.au.dk/artifactory/remote-repos/org/iq80/snappy/snappy/0.4/snappy-0.4.pom
[INFO] Downloaded from remote-repos: http://overture.au.dk/artifactory/remote-repos/org/iq80/snappy/snappy/0.4/snappy-0.4.pom (14 kB at 536 kB/s)
[INFO] Downloading from remote-repos: http://overture.au.dk/artifactory/remote-repos/org/tukaani/xz/1.5/xz-1.5.pom
[INFO] Downloaded from remote-repos: http://overture.au.dk/artifactory/remote-repos/org/tukaani/xz/1.5/xz-1.5.pom (1.9 kB at 106 kB/s)
[INFO] Downloading from remote-repos: http://overture.au.dk/artifactory/remote-repos/org/apache/maven/shared/maven-invoker/2.2/maven-invoker-2.2.jar
[INFO] Downloading from remote-repos: http://overture.au.dk/artifactory/remote-repos/org/apache/maven/doxia/doxia-sink-api/1.4/doxia-sink-api-1.4.jar
[INFO] Downloading from remote-repos: http://overture.au.dk/artifactory/remote-repos/org/apache/maven/doxia/doxia-logging-api/1.4/doxia-logging-api-1.4.jar
[INFO] Downloading from remote-repos: http://overture.au.dk/artifactory/remote-repos/org/apache/maven/doxia/doxia-site-renderer/1.4/doxia-site-renderer-1.4.jar
[INFO] Downloading from remote-repos: http://overture.au.dk/artifactory/remote-repos/org/apache/maven/doxia/doxia-core/1.4/doxia-core-1.4.jar
[INFO] Downloaded from remote-repos: http://overture.au.dk/artifactory/remote-repos/org/apache/maven/shared/maven-invoker/2.2/maven-invoker-2.2.jar (30 kB at 1.1 MB/s)
[INFO] Downloading from remote-repos: http://overture.au.dk/artifactory/remote-repos/xerces/xercesImpl/2.9.1/xercesImpl-2.9.1.jar
[INFO] Downloaded from remote-repos: http://overture.au.dk/artifactory/remote-repos/org/apache/maven/doxia/doxia-sink-api/1.4/doxia-sink-api-1.4.jar (11 kB at 386 kB/s)
[INFO] Downloading from remote-repos: http://overture.au.dk/artifactory/remote-repos/org/apache/maven/doxia/doxia-decoration-model/1.4/doxia-decoration-model-1.4.jar
[INFO] Downloaded from remote-repos: http://overture.au.dk/artifactory/remote-repos/org/apache/maven/doxia/doxia-site-renderer/1.4/doxia-site-renderer-1.4.jar (53 kB at 1.7 MB/s)
[INFO] Downloading from remote-repos: http://overture.au.dk/artifactory/remote-repos/org/apache/maven/doxia/doxia-module-xhtml/1.4/doxia-module-xhtml-1.4.jar
[INFO] Downloaded from remote-repos: http://overture.au.dk/artifactory/remote-repos/org/apache/maven/doxia/doxia-core/1.4/doxia-core-1.4.jar (165 kB at 3.7 MB/s)
[INFO] Downloading from remote-repos: http://overture.au.dk/artifactory/remote-repos/org/apache/maven/doxia/doxia-module-fml/1.4/doxia-module-fml-1.4.jar
[INFO] Downloaded from remote-repos: http://overture.au.dk/artifactory/remote-repos/org/apache/maven/doxia/doxia-logging-api/1.4/doxia-logging-api-1.4.jar (11 kB at 251 kB/s)
[INFO] Downloading from remote-repos: http://overture.au.dk/artifactory/remote-repos/org/apache/velocity/velocity-tools/2.0/velocity-tools-2.0.jar
[INFO] Downloaded from remote-repos: http://overture.au.dk/artifactory/remote-repos/org/apache/maven/doxia/doxia-decoration-model/1.4/doxia-decoration-model-1.4.jar (61 kB at 817 kB/s)
[INFO] Downloading from remote-repos: http://overture.au.dk/artifactory/remote-repos/commons-digester/commons-digester/1.8/commons-digester-1.8.jar
[INFO] Downloaded from remote-repos: http://overture.au.dk/artifactory/remote-repos/org/apache/maven/doxia/doxia-module-xhtml/1.4/doxia-module-xhtml-1.4.jar (15 kB at 205 kB/s)
[INFO] Downloading from remote-repos: http://overture.au.dk/artifactory/remote-repos/commons-chain/commons-chain/1.1/commons-chain-1.1.jar
[INFO] Downloaded from remote-repos: http://overture.au.dk/artifactory/remote-repos/org/apache/maven/doxia/doxia-module-fml/1.4/doxia-module-fml-1.4.jar (38 kB at 498 kB/s)
[INFO] Downloading from remote-repos: http://overture.au.dk/artifactory/remote-repos/commons-validator/commons-validator/1.3.1/commons-validator-1.3.1.jar
[INFO] Downloaded from remote-repos: http://overture.au.dk/artifactory/remote-repos/org/apache/velocity/velocity-tools/2.0/velocity-tools-2.0.jar (347 kB at 3.9 MB/s)
[INFO] Downloading from remote-repos: http://overture.au.dk/artifactory/remote-repos/dom4j/dom4j/1.1/dom4j-1.1.jar
[INFO] Downloaded from remote-repos: http://overture.au.dk/artifactory/remote-repos/commons-digester/commons-digester/1.8/commons-digester-1.8.jar (144 kB at 1.2 MB/s)
[INFO] Downloading from remote-repos: http://overture.au.dk/artifactory/remote-repos/sslext/sslext/1.2-0/sslext-1.2-0.jar
[INFO] Downloaded from remote-repos: http://overture.au.dk/artifactory/remote-repos/commons-chain/commons-chain/1.1/commons-chain-1.1.jar (90 kB at 720 kB/s)
[INFO] Downloading from remote-repos: http://overture.au.dk/artifactory/remote-repos/org/apache/struts/struts-core/1.3.8/struts-core-1.3.8.jar
[INFO] Downloaded from remote-repos: http://overture.au.dk/artifactory/remote-repos/commons-validator/commons-validator/1.3.1/commons-validator-1.3.1.jar (139 kB at 1.1 MB/s)
[INFO] Downloading from remote-repos: http://overture.au.dk/artifactory/remote-repos/antlr/antlr/2.7.2/antlr-2.7.2.jar
[INFO] Downloaded from remote-repos: http://overture.au.dk/artifactory/remote-repos/sslext/sslext/1.2-0/sslext-1.2-0.jar (26 kB at 183 kB/s)
[INFO] Downloading from remote-repos: http://overture.au.dk/artifactory/remote-repos/org/apache/struts/struts-taglib/1.3.8/struts-taglib-1.3.8.jar
[INFO] Downloaded from remote-repos: http://overture.au.dk/artifactory/remote-repos/dom4j/dom4j/1.1/dom4j-1.1.jar (457 kB at 2.5 MB/s)
[INFO] Downloading from remote-repos: http://overture.au.dk/artifactory/remote-repos/org/apache/struts/struts-tiles/1.3.8/struts-tiles-1.3.8.jar
[INFO] Downloaded from remote-repos: http://overture.au.dk/artifactory/remote-repos/org/apache/struts/struts-core/1.3.8/struts-core-1.3.8.jar (329 kB at 1.8 MB/s)
[INFO] Downloading from remote-repos: http://overture.au.dk/artifactory/remote-repos/commons-io/commons-io/2.5/commons-io-2.5.jar
[INFO] Downloaded from remote-repos: http://overture.au.dk/artifactory/remote-repos/xerces/xercesImpl/2.9.1/xercesImpl-2.9.1.jar (1.2 MB at 6.6 MB/s)
[INFO] Downloading from remote-repos: http://overture.au.dk/artifactory/remote-repos/org/apache/httpcomponents/httpclient/4.2.3/httpclient-4.2.3.jar
[INFO] Downloaded from remote-repos: http://overture.au.dk/artifactory/remote-repos/org/apache/struts/struts-taglib/1.3.8/struts-taglib-1.3.8.jar (252 kB at 1.3 MB/s)
[INFO] Downloading from remote-repos: http://overture.au.dk/artifactory/remote-repos/org/apache/httpcomponents/httpcore/4.2.2/httpcore-4.2.2.jar
[INFO] Downloaded from remote-repos: http://overture.au.dk/artifactory/remote-repos/antlr/antlr/2.7.2/antlr-2.7.2.jar (358 kB at 1.9 MB/s)
[INFO] Downloading from remote-repos: http://overture.au.dk/artifactory/remote-repos/commons-codec/commons-codec/1.6/commons-codec-1.6.jar
[INFO] Downloaded from remote-repos: http://overture.au.dk/artifactory/remote-repos/org/apache/struts/struts-tiles/1.3.8/struts-tiles-1.3.8.jar (120 kB at 570 kB/s)
[INFO] Downloading from remote-repos: http://overture.au.dk/artifactory/remote-repos/com/thoughtworks/qdox/qdox/1.12.1/qdox-1.12.1.jar
[INFO] Downloaded from remote-repos: http://overture.au.dk/artifactory/remote-repos/commons-io/commons-io/2.5/commons-io-2.5.jar (209 kB at 962 kB/s)
[INFO] Downloading from remote-repos: http://overture.au.dk/artifactory/remote-repos/org/codehaus/plexus/plexus-archiver/3.3/plexus-archiver-3.3.jar
[INFO] Downloaded from remote-repos: http://overture.au.dk/artifactory/remote-repos/commons-codec/commons-codec/1.6/commons-codec-1.6.jar (233 kB at 991 kB/s)
[INFO] Downloading from remote-repos: http://overture.au.dk/artifactory/remote-repos/org/codehaus/plexus/plexus-io/2.7.1/plexus-io-2.7.1.jar
[INFO] Downloaded from remote-repos: http://overture.au.dk/artifactory/remote-repos/org/apache/httpcomponents/httpcore/4.2.2/httpcore-4.2.2.jar (224 kB at 947 kB/s)
[INFO] Downloading from remote-repos: http://overture.au.dk/artifactory/remote-repos/org/apache/commons/commons-compress/1.11/commons-compress-1.11.jar
[INFO] Downloaded from remote-repos: http://overture.au.dk/artifactory/remote-repos/org/apache/httpcomponents/httpclient/4.2.3/httpclient-4.2.3.jar (433 kB at 1.8 MB/s)
[INFO] Downloading from remote-repos: http://overture.au.dk/artifactory/remote-repos/org/iq80/snappy/snappy/0.4/snappy-0.4.jar
[INFO] Downloaded from remote-repos: http://overture.au.dk/artifactory/remote-repos/com/thoughtworks/qdox/qdox/1.12.1/qdox-1.12.1.jar (180 kB at 743 kB/s)
[INFO] Downloading from remote-repos: http://overture.au.dk/artifactory/remote-repos/org/tukaani/xz/1.5/xz-1.5.jar
[INFO] Downloaded from remote-repos: http://overture.au.dk/artifactory/remote-repos/org/codehaus/plexus/plexus-archiver/3.3/plexus-archiver-3.3.jar (185 kB at 742 kB/s)
[INFO] Downloading from remote-repos: http://overture.au.dk/artifactory/remote-repos/org/codehaus/plexus/plexus-utils/3.0.24/plexus-utils-3.0.24.jar
[INFO] Downloaded from remote-repos: http://overture.au.dk/artifactory/remote-repos/org/codehaus/plexus/plexus-io/2.7.1/plexus-io-2.7.1.jar (86 kB at 329 kB/s)
[INFO] Downloaded from remote-repos: http://overture.au.dk/artifactory/remote-repos/org/iq80/snappy/snappy/0.4/snappy-0.4.jar (58 kB at 221 kB/s)
[INFO] Downloaded from remote-repos: http://overture.au.dk/artifactory/remote-repos/org/tukaani/xz/1.5/xz-1.5.jar (100 kB at 361 kB/s)
[INFO] Downloaded from remote-repos: http://overture.au.dk/artifactory/remote-repos/org/apache/commons/commons-compress/1.11/commons-compress-1.11.jar (426 kB at 1.5 MB/s)
[INFO] Downloaded from remote-repos: http://overture.au.dk/artifactory/remote-repos/org/codehaus/plexus/plexus-utils/3.0.24/plexus-utils-3.0.24.jar (247 kB at 830 kB/s)
[INFO] Skipping javadoc generation
[INFO] 
[INFO] --- maven-install-plugin:2.4:install (default-install) @ ide ---
[INFO] Installing /var/lib/jenkins/workspace/multibranch-pipeline_development/ide/pom.xml to /var/lib/jenkins/workspace/multibranch-pipeline_development/.repository/org/overturetool/vdm2c/ide/0.2.3-SNAPSHOT/ide-0.2.3-SNAPSHOT.pom
[INFO] 
[INFO] -----< org.overturetool.vdm2c.ide:org.overturetool.vdm2c.ide.cgen >-----
[INFO] Building The C Code Generator Plugin 0.2.3-SNAPSHOT               [8/11]
[INFO] ---------------------------[ eclipse-plugin ]---------------------------
[INFO] 
[INFO] --- tycho-packaging-plugin:0.24.0:build-qualifier (default-build-qualifier) @ org.overturetool.vdm2c.ide.cgen ---
[INFO] The project's OSGi version is 0.2.3.202009220748
[INFO] 
[INFO] --- tycho-packaging-plugin:0.24.0:validate-id (default-validate-id) @ org.overturetool.vdm2c.ide.cgen ---
[INFO] 
[INFO] --- tycho-packaging-plugin:0.24.0:validate-version (default-validate-version) @ org.overturetool.vdm2c.ide.cgen ---
[INFO] 
[INFO] --- maven-enforcer-plugin:1.0:enforce (enforce-maven) @ org.overturetool.vdm2c.ide.cgen ---
[INFO] 
[INFO] --- jacoco-maven-plugin:0.7.6.201602180812:prepare-agent (jacoco-initialize) @ org.overturetool.vdm2c.ide.cgen ---
[INFO] argLine set to -javaagent:/var/lib/jenkins/workspace/multibranch-pipeline_development/.repository/org/jacoco/org.jacoco.agent/0.7.6.201602180812/org.jacoco.agent-0.7.6.201602180812-runtime.jar=destfile=/var/lib/jenkins/workspace/multibranch-pipeline_development/ide/cgen/target/coverage-reports/jacoco-unit.exec,excludes=org/overture/cgc/extast/analysis/**/*.*:org/overture/codegen/vdm2c/extast/expressions/**/*:org/overture/codegen/vdm2c/extast/declarations/**/*:org/overture/codegen/vdm2c/extast/statements/**/*:org/overture/cgc/extast/node/**/*:org/overture/codegen/vdm2c/ast/preview/**/*
[INFO] 
[INFO] --- maven-dependency-plugin:2.6:copy (copy-dependencies) @ org.overturetool.vdm2c.ide.cgen ---
[INFO] Downloading from remote-repos: http://overture.au.dk/artifactory/remote-repos/org/apache/maven/reporting/maven-reporting-impl/2.0.5/maven-reporting-impl-2.0.5.pom
[INFO] Downloaded from remote-repos: http://overture.au.dk/artifactory/remote-repos/org/apache/maven/reporting/maven-reporting-impl/2.0.5/maven-reporting-impl-2.0.5.pom (4.2 kB at 184 kB/s)
[INFO] Downloading from remote-repos: http://overture.au.dk/artifactory/remote-repos/org/apache/maven/shared/maven-doxia-tools/1.0.2/maven-doxia-tools-1.0.2.pom
[INFO] Downloaded from remote-repos: http://overture.au.dk/artifactory/remote-repos/org/apache/maven/shared/maven-doxia-tools/1.0.2/maven-doxia-tools-1.0.2.pom (5.9 kB at 293 kB/s)
[INFO] Downloading from remote-repos: http://overture.au.dk/artifactory/remote-repos/org/codehaus/plexus/plexus-utils/3.0.9/plexus-utils-3.0.9.pom
[INFO] Downloaded from remote-repos: http://overture.au.dk/artifactory/remote-repos/org/codehaus/plexus/plexus-utils/3.0.9/plexus-utils-3.0.9.pom (3.1 kB at 175 kB/s)
[INFO] Downloading from remote-repos: http://overture.au.dk/artifactory/remote-repos/org/apache/maven/shared/maven-dependency-analyzer/1.3/maven-dependency-analyzer-1.3.pom
[INFO] Downloaded from remote-repos: http://overture.au.dk/artifactory/remote-repos/org/apache/maven/shared/maven-dependency-analyzer/1.3/maven-dependency-analyzer-1.3.pom (5.2 kB at 271 kB/s)
[INFO] Downloading from remote-repos: http://overture.au.dk/artifactory/remote-repos/asm/asm/3.3.1/asm-3.3.1.pom
[INFO] Downloaded from remote-repos: http://overture.au.dk/artifactory/remote-repos/asm/asm/3.3.1/asm-3.3.1.pom (266 B at 14 kB/s)
[INFO] Downloading from remote-repos: http://overture.au.dk/artifactory/remote-repos/asm/asm-parent/3.3.1/asm-parent-3.3.1.pom
[INFO] Downloaded from remote-repos: http://overture.au.dk/artifactory/remote-repos/asm/asm-parent/3.3.1/asm-parent-3.3.1.pom (4.3 kB at 228 kB/s)
[INFO] Downloading from remote-repos: http://overture.au.dk/artifactory/remote-repos/org/apache/maven/maven-project/2.0.5/maven-project-2.0.5.pom
[INFO] Downloaded from remote-repos: http://overture.au.dk/artifactory/remote-repos/org/apache/maven/maven-project/2.0.5/maven-project-2.0.5.pom (1.8 kB at 97 kB/s)
[INFO] Downloading from remote-repos: http://overture.au.dk/artifactory/remote-repos/org/apache/maven/maven/2.0.5/maven-2.0.5.pom
[INFO] Downloaded from remote-repos: http://overture.au.dk/artifactory/remote-repos/org/apache/maven/maven/2.0.5/maven-2.0.5.pom (5.7 kB at 300 kB/s)
[INFO] Downloading from remote-repos: http://overture.au.dk/artifactory/remote-repos/org/apache/maven/maven-settings/2.0.5/maven-settings-2.0.5.pom
[INFO] Downloaded from remote-repos: http://overture.au.dk/artifactory/remote-repos/org/apache/maven/maven-settings/2.0.5/maven-settings-2.0.5.pom (1.7 kB at 76 kB/s)
[INFO] Downloading from remote-repos: http://overture.au.dk/artifactory/remote-repos/org/apache/maven/maven-model/2.0.5/maven-model-2.0.5.pom
[INFO] Downloaded from remote-repos: http://overture.au.dk/artifactory/remote-repos/org/apache/maven/maven-model/2.0.5/maven-model-2.0.5.pom (2.7 kB at 80 kB/s)
[INFO] Downloading from remote-repos: http://overture.au.dk/artifactory/remote-repos/org/apache/maven/maven-profile/2.0.5/maven-profile-2.0.5.pom
[INFO] Downloaded from remote-repos: http://overture.au.dk/artifactory/remote-repos/org/apache/maven/maven-profile/2.0.5/maven-profile-2.0.5.pom (1.7 kB at 87 kB/s)
[INFO] Downloading from remote-repos: http://overture.au.dk/artifactory/remote-repos/org/apache/maven/maven-artifact-manager/2.0.5/maven-artifact-manager-2.0.5.pom
[INFO] Downloaded from remote-repos: http://overture.au.dk/artifactory/remote-repos/org/apache/maven/maven-artifact-manager/2.0.5/maven-artifact-manager-2.0.5.pom (1.8 kB at 102 kB/s)
[INFO] Downloading from remote-repos: http://overture.au.dk/artifactory/remote-repos/org/apache/maven/maven-repository-metadata/2.0.5/maven-repository-metadata-2.0.5.pom
[INFO] Downloaded from remote-repos: http://overture.au.dk/artifactory/remote-repos/org/apache/maven/maven-repository-metadata/2.0.5/maven-repository-metadata-2.0.5.pom (1.5 kB at 74 kB/s)
[INFO] Downloading from remote-repos: http://overture.au.dk/artifactory/remote-repos/org/apache/maven/maven-artifact/2.0.5/maven-artifact-2.0.5.pom
[INFO] Downloaded from remote-repos: http://overture.au.dk/artifactory/remote-repos/org/apache/maven/maven-artifact/2.0.5/maven-artifact-2.0.5.pom (727 B at 40 kB/s)
[INFO] Downloading from remote-repos: http://overture.au.dk/artifactory/remote-repos/org/apache/maven/shared/maven-dependency-tree/2.0/maven-dependency-tree-2.0.pom
[INFO] Downloaded from remote-repos: http://overture.au.dk/artifactory/remote-repos/org/apache/maven/shared/maven-dependency-tree/2.0/maven-dependency-tree-2.0.pom (4.7 kB at 246 kB/s)
[INFO] Downloading from remote-repos: http://overture.au.dk/artifactory/remote-repos/org/apache/maven/maven-project/2.2.0/maven-project-2.2.0.pom
[INFO] Downloaded from remote-repos: http://overture.au.dk/artifactory/remote-repos/org/apache/maven/maven-project/2.2.0/maven-project-2.2.0.pom (2.8 kB at 146 kB/s)
[INFO] Downloading from remote-repos: http://overture.au.dk/artifactory/remote-repos/org/apache/maven/maven/2.2.0/maven-2.2.0.pom
[INFO] Downloaded from remote-repos: http://overture.au.dk/artifactory/remote-repos/org/apache/maven/maven/2.2.0/maven-2.2.0.pom (22 kB at 936 kB/s)
[INFO] Downloading from remote-repos: http://overture.au.dk/artifactory/remote-repos/org/apache/maven/maven-settings/2.2.0/maven-settings-2.2.0.pom
[INFO] Downloaded from remote-repos: http://overture.au.dk/artifactory/remote-repos/org/apache/maven/maven-settings/2.2.0/maven-settings-2.2.0.pom (2.2 kB at 121 kB/s)
[INFO] Downloading from remote-repos: http://overture.au.dk/artifactory/remote-repos/org/apache/maven/maven-model/2.2.0/maven-model-2.2.0.pom
[INFO] Downloaded from remote-repos: http://overture.au.dk/artifactory/remote-repos/org/apache/maven/maven-model/2.2.0/maven-model-2.2.0.pom (3.2 kB at 171 kB/s)
[INFO] Downloading from remote-repos: http://overture.au.dk/artifactory/remote-repos/org/apache/maven/maven-profile/2.2.0/maven-profile-2.2.0.pom
[INFO] Downloaded from remote-repos: http://overture.au.dk/artifactory/remote-repos/org/apache/maven/maven-profile/2.2.0/maven-profile-2.2.0.pom (2.2 kB at 114 kB/s)
[INFO] Downloading from remote-repos: http://overture.au.dk/artifactory/remote-repos/org/apache/maven/maven-artifact-manager/2.2.0/maven-artifact-manager-2.2.0.pom
[INFO] Downloaded from remote-repos: http://overture.au.dk/artifactory/remote-repos/org/apache/maven/maven-artifact-manager/2.2.0/maven-artifact-manager-2.2.0.pom (3.1 kB at 163 kB/s)
[INFO] Downloading from remote-repos: http://overture.au.dk/artifactory/remote-repos/org/apache/maven/maven-repository-metadata/2.2.0/maven-repository-metadata-2.2.0.pom
[INFO] Downloaded from remote-repos: http://overture.au.dk/artifactory/remote-repos/org/apache/maven/maven-repository-metadata/2.2.0/maven-repository-metadata-2.2.0.pom (1.9 kB at 104 kB/s)
[INFO] Downloading from remote-repos: http://overture.au.dk/artifactory/remote-repos/org/apache/maven/maven-artifact/2.2.0/maven-artifact-2.2.0.pom
[INFO] Downloaded from remote-repos: http://overture.au.dk/artifactory/remote-repos/org/apache/maven/maven-artifact/2.2.0/maven-artifact-2.2.0.pom (1.6 kB at 83 kB/s)
[INFO] Downloading from remote-repos: http://overture.au.dk/artifactory/remote-repos/org/apache/maven/maven-plugin-registry/2.2.0/maven-plugin-registry-2.2.0.pom
[INFO] Downloaded from remote-repos: http://overture.au.dk/artifactory/remote-repos/org/apache/maven/maven-plugin-registry/2.2.0/maven-plugin-registry-2.2.0.pom (1.9 kB at 96 kB/s)
[INFO] Downloading from remote-repos: http://overture.au.dk/artifactory/remote-repos/org/apache/maven/shared/maven-invoker/2.0.11/maven-invoker-2.0.11.pom
[INFO] Downloaded from remote-repos: http://overture.au.dk/artifactory/remote-repos/org/apache/maven/shared/maven-invoker/2.0.11/maven-invoker-2.0.11.pom (5.1 kB at 254 kB/s)
[INFO] Downloading from remote-repos: http://overture.au.dk/artifactory/remote-repos/commons-lang/commons-lang/2.6/commons-lang-2.6.pom
[INFO] Downloaded from remote-repos: http://overture.au.dk/artifactory/remote-repos/commons-lang/commons-lang/2.6/commons-lang-2.6.pom (17 kB at 530 kB/s)
[INFO] Downloading from remote-repos: http://overture.au.dk/artifactory/remote-repos/org/apache/commons/commons-parent/17/commons-parent-17.pom
[INFO] Downloaded from remote-repos: http://overture.au.dk/artifactory/remote-repos/org/apache/commons/commons-parent/17/commons-parent-17.pom (31 kB at 843 kB/s)
[INFO] Downloading from remote-repos: http://overture.au.dk/artifactory/remote-repos/org/apache/maven/reporting/maven-reporting-impl/2.0.5/maven-reporting-impl-2.0.5.jar
[INFO] Downloading from remote-repos: http://overture.au.dk/artifactory/remote-repos/org/apache/maven/shared/maven-doxia-tools/1.0.2/maven-doxia-tools-1.0.2.jar
[INFO] Downloading from remote-repos: http://overture.au.dk/artifactory/remote-repos/org/codehaus/plexus/plexus-utils/3.0.9/plexus-utils-3.0.9.jar
[INFO] Downloading from remote-repos: http://overture.au.dk/artifactory/remote-repos/asm/asm/3.3.1/asm-3.3.1.jar
[INFO] Downloading from remote-repos: http://overture.au.dk/artifactory/remote-repos/org/apache/maven/shared/maven-dependency-analyzer/1.3/maven-dependency-analyzer-1.3.jar
[INFO] Downloaded from remote-repos: http://overture.au.dk/artifactory/remote-repos/org/apache/maven/reporting/maven-reporting-impl/2.0.5/maven-reporting-impl-2.0.5.jar (21 kB at 665 kB/s)
[INFO] Downloading from remote-repos: http://overture.au.dk/artifactory/remote-repos/org/apache/maven/shared/maven-dependency-tree/2.0/maven-dependency-tree-2.0.jar
[INFO] Downloaded from remote-repos: http://overture.au.dk/artifactory/remote-repos/org/apache/maven/shared/maven-dependency-analyzer/1.3/maven-dependency-analyzer-1.3.jar (27 kB at 831 kB/s)
[INFO] Downloading from remote-repos: http://overture.au.dk/artifactory/remote-repos/org/apache/maven/shared/maven-invoker/2.0.11/maven-invoker-2.0.11.jar
[INFO] Downloaded from remote-repos: http://overture.au.dk/artifactory/remote-repos/org/apache/maven/shared/maven-doxia-tools/1.0.2/maven-doxia-tools-1.0.2.jar (41 kB at 1.1 MB/s)
[INFO] Downloading from remote-repos: http://overture.au.dk/artifactory/remote-repos/commons-lang/commons-lang/2.6/commons-lang-2.6.jar
[INFO] Downloaded from remote-repos: http://overture.au.dk/artifactory/remote-repos/asm/asm/3.3.1/asm-3.3.1.jar (44 kB at 1.1 MB/s)
[INFO] Downloaded from remote-repos: http://overture.au.dk/artifactory/remote-repos/org/codehaus/plexus/plexus-utils/3.0.9/plexus-utils-3.0.9.jar (232 kB at 5.0 MB/s)
[INFO] Downloaded from remote-repos: http://overture.au.dk/artifactory/remote-repos/org/apache/maven/shared/maven-dependency-tree/2.0/maven-dependency-tree-2.0.jar (56 kB at 1.0 MB/s)
[INFO] Downloaded from remote-repos: http://overture.au.dk/artifactory/remote-repos/org/apache/maven/shared/maven-invoker/2.0.11/maven-invoker-2.0.11.jar (29 kB at 507 kB/s)
[INFO] Downloaded from remote-repos: http://overture.au.dk/artifactory/remote-repos/commons-lang/commons-lang/2.6/commons-lang-2.6.jar (284 kB at 4.1 MB/s)
[INFO] Configured Artifact: org.overturetool.core.codegen:ir:2.6.4:jar
[INFO] Configured Artifact: org.overturetool.core.codegen:platform:2.6.4:jar
[INFO] Configured Artifact: org.overturetool.vdm2c.core:vdm2c:0.2.3-SNAPSHOT:jar
[INFO] Configured Artifact: org.overturetool.vdm2c.c:vdmclib:0.2.3-SNAPSHOT:jar
[INFO] Configured Artifact: org.overturetool.vdm2c.c:vdmclibdist:0.2.3-SNAPSHOT:jar
[INFO] Configured Artifact: org.apache.velocity:velocity:1.7:jar
[INFO] Configured Artifact: commons-collections:commons-collections:3.2.2:jar
[INFO] Downloading from remote-repos: http://overture.au.dk/artifactory/remote-repos/commons-collections/commons-collections/3.2.2/commons-collections-3.2.2.jar
[INFO] Downloaded from remote-repos: http://overture.au.dk/artifactory/remote-repos/commons-collections/commons-collections/3.2.2/commons-collections-3.2.2.jar (588 kB at 11 MB/s)
[INFO] Configured Artifact: commons-lang:commons-lang:2.4:jar
[INFO] Configured Artifact: jalopy:jalopy:1.5rc3:jar
[INFO] Downloading from remote-repos: http://overture.au.dk/artifactory/remote-repos/jalopy/jalopy/1.5rc3/jalopy-1.5rc3.jar
[INFO] Downloaded from remote-repos: http://overture.au.dk/artifactory/remote-repos/jalopy/jalopy/1.5rc3/jalopy-1.5rc3.jar (1.3 MB at 14 MB/s)
[INFO] Configured Artifact: org.slf4j:slf4j-api:1.7.21:jar
[INFO] Downloading from remote-repos: http://overture.au.dk/artifactory/remote-repos/org/slf4j/slf4j-api/1.7.21/slf4j-api-1.7.21.jar
[INFO] Downloaded from remote-repos: http://overture.au.dk/artifactory/remote-repos/org/slf4j/slf4j-api/1.7.21/slf4j-api-1.7.21.jar (41 kB at 1.7 MB/s)
[INFO] Configured Artifact: log4j:log4j:1.2.17:jar
[INFO] Configured Artifact: org.slf4j:slf4j-log4j12:1.7.21:jar
[INFO] Downloading from remote-repos: http://overture.au.dk/artifactory/remote-repos/org/slf4j/slf4j-log4j12/1.7.21/slf4j-log4j12-1.7.21.jar
[INFO] Downloaded from remote-repos: http://overture.au.dk/artifactory/remote-repos/org/slf4j/slf4j-log4j12/1.7.21/slf4j-log4j12-1.7.21.jar (10.0 kB at 499 kB/s)
[INFO] Copying ir-2.6.4.jar to /var/lib/jenkins/workspace/multibranch-pipeline_development/ide/cgen/jars/ir.jar
[INFO] Copying platform-2.6.4.jar to /var/lib/jenkins/workspace/multibranch-pipeline_development/ide/cgen/jars/platform.jar
[INFO] Copying vdm2c-0.2.3-SNAPSHOT.jar to /var/lib/jenkins/workspace/multibranch-pipeline_development/ide/cgen/jars/vdm2c.jar
[INFO] Copying vdmclib-0.2.3-SNAPSHOT.jar to /var/lib/jenkins/workspace/multibranch-pipeline_development/ide/cgen/jars/vdmclib.jar
[INFO] Copying vdmclibdist-0.2.3-SNAPSHOT.jar to /var/lib/jenkins/workspace/multibranch-pipeline_development/ide/cgen/jars/vdmclibdist.jar
[INFO] Copying velocity-1.7.jar to /var/lib/jenkins/workspace/multibranch-pipeline_development/ide/cgen/jars/velocity.jar
[INFO] Copying commons-collections-3.2.2.jar to /var/lib/jenkins/workspace/multibranch-pipeline_development/ide/cgen/jars/commons-collections.jar
[INFO] Copying commons-lang-2.4.jar to /var/lib/jenkins/workspace/multibranch-pipeline_development/ide/cgen/jars/commons-lang.jar
[INFO] Copying jalopy-1.5rc3.jar to /var/lib/jenkins/workspace/multibranch-pipeline_development/ide/cgen/jars/jalopy.jar
[INFO] Copying slf4j-api-1.7.21.jar to /var/lib/jenkins/workspace/multibranch-pipeline_development/ide/cgen/jars/slf4j-api.jar
[INFO] Copying log4j-1.2.17.jar to /var/lib/jenkins/workspace/multibranch-pipeline_development/ide/cgen/jars/log4j.jar
[INFO] Copying slf4j-log4j12-1.7.21.jar to /var/lib/jenkins/workspace/multibranch-pipeline_development/ide/cgen/jars/slf4j-log4j12.jar
[INFO] 
[INFO] --- maven-resources-plugin:2.6:resources (default-resources) @ org.overturetool.vdm2c.ide.cgen ---
[INFO] Using 'UTF-8' encoding to copy filtered resources.
[INFO] skip non existing resourceDirectory /var/lib/jenkins/workspace/multibranch-pipeline_development/ide/cgen/src/main/resources
[INFO] 
[INFO] --- tycho-compiler-plugin:0.24.0:compile (default-compile) @ org.overturetool.vdm2c.ide.cgen ---
[INFO] Downloading from remote-repos: http://overture.au.dk/artifactory/remote-repos/org/apache/maven/maven-compat/3.0/maven-compat-3.0.pom
[INFO] Downloaded from remote-repos: http://overture.au.dk/artifactory/remote-repos/org/apache/maven/maven-compat/3.0/maven-compat-3.0.pom (4.0 kB at 212 kB/s)
[INFO] Downloading from remote-repos: http://overture.au.dk/artifactory/remote-repos/org/codehaus/plexus/plexus-compiler-manager/2.2/plexus-compiler-manager-2.2.pom
[INFO] Downloaded from remote-repos: http://overture.au.dk/artifactory/remote-repos/org/codehaus/plexus/plexus-compiler-manager/2.2/plexus-compiler-manager-2.2.pom (690 B at 38 kB/s)
[INFO] Downloading from remote-repos: http://overture.au.dk/artifactory/remote-repos/org/codehaus/plexus/plexus-compiler/2.2/plexus-compiler-2.2.pom
[INFO] Downloaded from remote-repos: http://overture.au.dk/artifactory/remote-repos/org/codehaus/plexus/plexus-compiler/2.2/plexus-compiler-2.2.pom (3.6 kB at 181 kB/s)
[INFO] Downloading from remote-repos: http://overture.au.dk/artifactory/remote-repos/org/codehaus/plexus/plexus-components/1.3.1/plexus-components-1.3.1.pom
[INFO] Downloaded from remote-repos: http://overture.au.dk/artifactory/remote-repos/org/codehaus/plexus/plexus-components/1.3.1/plexus-components-1.3.1.pom (2.8 kB at 113 kB/s)
[INFO] Downloading from remote-repos: http://overture.au.dk/artifactory/remote-repos/org/codehaus/plexus/plexus-compiler-api/2.2/plexus-compiler-api-2.2.pom
[INFO] Downloaded from remote-repos: http://overture.au.dk/artifactory/remote-repos/org/codehaus/plexus/plexus-compiler-api/2.2/plexus-compiler-api-2.2.pom (865 B at 43 kB/s)
[INFO] Downloading from remote-repos: http://overture.au.dk/artifactory/remote-repos/org/eclipse/tycho/tycho-compiler-jdt/0.24.0/tycho-compiler-jdt-0.24.0.pom
[INFO] Downloaded from remote-repos: http://overture.au.dk/artifactory/remote-repos/org/eclipse/tycho/tycho-compiler-jdt/0.24.0/tycho-compiler-jdt-0.24.0.pom (1.8 kB at 102 kB/s)
[INFO] Downloading from remote-repos: http://overture.au.dk/artifactory/remote-repos/org/eclipse/tycho/org.eclipse.jdt.core/3.11.1.v20150902-1521/org.eclipse.jdt.core-3.11.1.v20150902-1521.pom
[INFO] Downloaded from remote-repos: http://overture.au.dk/artifactory/remote-repos/org/eclipse/tycho/org.eclipse.jdt.core/3.11.1.v20150902-1521/org.eclipse.jdt.core-3.11.1.v20150902-1521.pom (1.0 kB at 55 kB/s)
[INFO] Downloading from remote-repos: http://overture.au.dk/artifactory/remote-repos/org/eclipse/tycho/org.eclipse.jdt.compiler.apt/1.2.0.v20150514-0146/org.eclipse.jdt.compiler.apt-1.2.0.v20150514-0146.pom
[INFO] Downloaded from remote-repos: http://overture.au.dk/artifactory/remote-repos/org/eclipse/tycho/org.eclipse.jdt.compiler.apt/1.2.0.v20150514-0146/org.eclipse.jdt.compiler.apt-1.2.0.v20150514-0146.pom (1.1 kB at 59 kB/s)
[INFO] Downloading from remote-repos: http://overture.au.dk/artifactory/remote-repos/org/apache/maven/maven-compat/3.0/maven-compat-3.0.jar
[INFO] Downloading from remote-repos: http://overture.au.dk/artifactory/remote-repos/org/codehaus/plexus/plexus-compiler-manager/2.2/plexus-compiler-manager-2.2.jar
[INFO] Downloading from remote-repos: http://overture.au.dk/artifactory/remote-repos/org/codehaus/plexus/plexus-compiler-api/2.2/plexus-compiler-api-2.2.jar
[INFO] Downloading from remote-repos: http://overture.au.dk/artifactory/remote-repos/org/eclipse/tycho/tycho-compiler-jdt/0.24.0/tycho-compiler-jdt-0.24.0.jar
[INFO] Downloading from remote-repos: http://overture.au.dk/artifactory/remote-repos/org/eclipse/tycho/org.eclipse.jdt.core/3.11.1.v20150902-1521/org.eclipse.jdt.core-3.11.1.v20150902-1521.jar
[INFO] Downloaded from remote-repos: http://overture.au.dk/artifactory/remote-repos/org/codehaus/plexus/plexus-compiler-manager/2.2/plexus-compiler-manager-2.2.jar (4.6 kB at 190 kB/s)
[INFO] Downloading from remote-repos: http://overture.au.dk/artifactory/remote-repos/org/eclipse/tycho/org.eclipse.jdt.compiler.apt/1.2.0.v20150514-0146/org.eclipse.jdt.compiler.apt-1.2.0.v20150514-0146.jar
[INFO] Downloaded from remote-repos: http://overture.au.dk/artifactory/remote-repos/org/codehaus/plexus/plexus-compiler-api/2.2/plexus-compiler-api-2.2.jar (25 kB at 961 kB/s)
[INFO] Downloaded from remote-repos: http://overture.au.dk/artifactory/remote-repos/org/apache/maven/maven-compat/3.0/maven-compat-3.0.jar (285 kB at 6.2 MB/s)
[INFO] Downloaded from remote-repos: http://overture.au.dk/artifactory/remote-repos/org/eclipse/tycho/tycho-compiler-jdt/0.24.0/tycho-compiler-jdt-0.24.0.jar (16 kB at 278 kB/s)
[INFO] Downloaded from remote-repos: http://overture.au.dk/artifactory/remote-repos/org/eclipse/tycho/org.eclipse.jdt.compiler.apt/1.2.0.v20150514-0146/org.eclipse.jdt.compiler.apt-1.2.0.v20150514-0146.jar (168 kB at 2.9 MB/s)
[INFO] Downloaded from remote-repos: http://overture.au.dk/artifactory/remote-repos/org/eclipse/tycho/org.eclipse.jdt.core/3.11.1.v20150902-1521/org.eclipse.jdt.core-3.11.1.v20150902-1521.jar (5.7 MB at 16 MB/s)
[INFO] Compiling 11 source files to /var/lib/jenkins/workspace/multibranch-pipeline_development/ide/cgen/target/classes
[INFO] ------------------------------------------------------------------------
[INFO] Reactor Summary for Overture VDM 2 C Translator Root 0.2.3-SNAPSHOT:
[INFO] 
[INFO] Overture VDM 2 C Translator Root ................... SUCCESS [  0.853 s]
[INFO] C native root vdm2c ................................ SUCCESS [  4.168 s]
[INFO] The C Code Generator VDM library sources ........... SUCCESS [ 17.769 s]
[INFO] The C Code Generator VDM distribution library sources SUCCESS [  2.580 s]
[INFO] Core Tools for vdm2c ............................... SUCCESS [  1.242 s]
[INFO] The C Code Generator ............................... SUCCESS [12:50 min]
[INFO] Overture FMI IDE Top-level ......................... SUCCESS [  2.537 s]
[INFO] The C Code Generator Plugin ........................ FAILURE [  4.658 s]
[INFO] Overture IDE Eclipse VDM2C features ................ SKIPPED
[INFO] Overture IDE Eclipse C Code Generator feature ...... SKIPPED
[INFO] Overture IDE Eclipse repository .................... SKIPPED
[INFO] ------------------------------------------------------------------------
[INFO] BUILD FAILURE
[INFO] ------------------------------------------------------------------------
[INFO] Total time:  16:26 min
[INFO] Finished at: 2020-09-22T09:48:43+02:00
[INFO] ------------------------------------------------------------------------
[WARNING] The requested profile "force-download-externals" could not be activated because it does not exist.
[INFO] [jenkins-event-spy] Generated /var/lib/jenkins/workspace/multibranch-pipeline_development@tmp/withMaven4a080c53/maven-spy-20200922-093216-3985969739930219111415.log
[ERROR] Failed to execute goal org.eclipse.tycho:tycho-compiler-plugin:0.24.0:compile (default-compile) on project org.overturetool.vdm2c.ide.cgen: Compilation failure: Compilation failure: 
[ERROR] /var/lib/jenkins/workspace/multibranch-pipeline_development/ide/cgen/src/main/java/org/overture/ide/plugins/cgen/commands/Vdm2CCommand.java:[111] 
[ERROR] 	VdmTypeCheckerUi.typeCheck(HandlerUtil.getActiveShell(event), vdmProject);
[ERROR] 	                           ^^^^^^^^^^^^^^^^^^^^^^^^^^^^^^^^^
[ERROR] The type org.eclipse.swt.widgets.Shell cannot be resolved. It is indirectly referenced from required .class files
[ERROR] /var/lib/jenkins/workspace/multibranch-pipeline_development/ide/cgen/src/main/java/org/overture/ide/plugins/cgen/commands/Vdm2CCommand.java:[111] 
[ERROR] 	VdmTypeCheckerUi.typeCheck(HandlerUtil.getActiveShell(event), vdmProject);
[ERROR] 	                                       ^^^^^^^^^^^^^^
[ERROR] The method getActiveShell(ExecutionEvent) from the type HandlerUtil refers to the missing type Shell
[ERROR] /var/lib/jenkins/workspace/multibranch-pipeline_development/ide/cgen/src/main/java/org/overture/ide/plugins/cgen/util/PluginVdm2CUtil.java:[47] 
[ERROR] 	import org.eclipse.swt.widgets.Shell;
[ERROR] 	       ^^^^^^^^^^^^^^^^^^^^^^^^^^^^^
[ERROR] The import org.eclipse.swt.widgets.Shell cannot be resolved
[ERROR] /var/lib/jenkins/workspace/multibranch-pipeline_development/ide/cgen/src/main/java/org/overture/ide/plugins/cgen/util/PluginVdm2CUtil.java:[348] 
[ERROR] 	Shell shell = PlatformUI.getWorkbench().getDisplay().getActiveShell();
[ERROR] 	^^^^^
[ERROR] Shell cannot be resolved to a type
[ERROR] /var/lib/jenkins/workspace/multibranch-pipeline_development/ide/cgen/src/main/java/org/overture/ide/plugins/cgen/util/PluginVdm2CUtil.java:[348] 
[ERROR] 	Shell shell = PlatformUI.getWorkbench().getDisplay().getActiveShell();
[ERROR] 	              ^^^^^^^^^^^^^^^^^^^^^^^^^^^^^^^^^^^^^^
[ERROR] The type org.eclipse.swt.widgets.Display cannot be resolved. It is indirectly referenced from required .class files
[ERROR] /var/lib/jenkins/workspace/multibranch-pipeline_development/ide/cgen/src/main/java/org/overture/ide/plugins/cgen/util/PluginVdm2CUtil.java:[348] 
[ERROR] 	Shell shell = PlatformUI.getWorkbench().getDisplay().getActiveShell();
[ERROR] 	                                        ^^^^^^^^^^
[ERROR] The method getDisplay() from the type IWorkbench refers to the missing type Display
[ERROR] /var/lib/jenkins/workspace/multibranch-pipeline_development/ide/cgen/src/main/java/org/overture/ide/plugins/cgen/commands/AboutCommand.java:[31] 
[ERROR] 	import org.eclipse.swt.widgets.Shell;
[ERROR] 	       ^^^^^^^^^^^^^^^^^^^^^^^^^^^^^
[ERROR] The import org.eclipse.swt.widgets.Shell cannot be resolved
[ERROR] /var/lib/jenkins/workspace/multibranch-pipeline_development/ide/cgen/src/main/java/org/overture/ide/plugins/cgen/commands/AboutCommand.java:[47] 
[ERROR] 	Shell shell = HandlerUtil.getActiveWorkbenchWindow(event).getShell();
[ERROR] 	^^^^^
[ERROR] Shell cannot be resolved to a type
[ERROR] /var/lib/jenkins/workspace/multibranch-pipeline_development/ide/cgen/src/main/java/org/overture/ide/plugins/cgen/commands/AboutCommand.java:[47] 
[ERROR] 	Shell shell = HandlerUtil.getActiveWorkbenchWindow(event).getShell();
[ERROR] 	                                                          ^^^^^^^^
[ERROR] The method getShell() from the type IWorkbenchWindow refers to the missing type Shell
[ERROR] /var/lib/jenkins/workspace/multibranch-pipeline_development/ide/cgen/src/main/java/org/overture/ide/plugins/cgen/CodeGenConsole.java:[1] 
[ERROR] 	/*
[ERROR] 	^
[ERROR] The type org.eclipse.swt.graphics.Color cannot be resolved. It is indirectly referenced from required .class files
[ERROR] /var/lib/jenkins/workspace/multibranch-pipeline_development/ide/cgen/src/main/java/org/overture/ide/plugins/cgen/CodeGenConsole.java:[27] 
[ERROR] 	import org.eclipse.swt.SWT;
[ERROR] 	       ^^^^^^^^^^^^^^^^^^^
[ERROR] The import org.eclipse.swt.SWT cannot be resolved
[ERROR] /var/lib/jenkins/workspace/multibranch-pipeline_development/ide/cgen/src/main/java/org/overture/ide/plugins/cgen/CodeGenConsole.java:[28] 
[ERROR] 	import org.eclipse.swt.widgets.Display;
[ERROR] 	       ^^^^^^^^^^^^^^^^^^^^^^^^^^^^^^^
[ERROR] The import org.eclipse.swt.widgets.Display cannot be resolved
[ERROR] /var/lib/jenkins/workspace/multibranch-pipeline_development/ide/cgen/src/main/java/org/overture/ide/plugins/cgen/CodeGenConsole.java:[62] 
[ERROR] 	errConsole.setColor(Display.getCurrent().getSystemColor(SWT.COLOR_RED));
[ERROR] 	                    ^^^^^^^
[ERROR] Display cannot be resolved
[ERROR] /var/lib/jenkins/workspace/multibranch-pipeline_development/ide/cgen/src/main/java/org/overture/ide/plugins/cgen/CodeGenConsole.java:[62] 
[ERROR] 	errConsole.setColor(Display.getCurrent().getSystemColor(SWT.COLOR_RED));
[ERROR] 	                                                        ^^^
[ERROR] SWT cannot be resolved to a variable
[ERROR] /var/lib/jenkins/workspace/multibranch-pipeline_development/ide/cgen/src/main/java/org/overture/ide/plugins/cgen/commands/ConfigCommand.java:[37] 
[ERROR] 	PreferenceDialog dialog = PreferencesUtil.createPreferenceDialogOn(HandlerUtil.getActiveShell(event), "org.overture.ide.plugins.cgen.pageMain", null, null);
[ERROR] 	                                                                               ^^^^^^^^^^^^^^
[ERROR] The method getActiveShell(ExecutionEvent) from the type HandlerUtil refers to the missing type Shell
[ERROR] 15 problems (15 errors)
[ERROR] -> [Help 1]
[ERROR] 
[ERROR] To see the full stack trace of the errors, re-run Maven with the -e switch.
[ERROR] Re-run Maven using the -X switch to enable full debug logging.
[ERROR] 
[ERROR] For more information about the errors and possible solutions, please read the following articles:
[ERROR] [Help 1] http://cwiki.apache.org/confluence/display/MAVEN/MojoFailureException
[ERROR] 
[ERROR] After correcting the problems, you can resume the build with the command
[ERROR]   mvn <goals> -rf :org.overturetool.vdm2c.ide.cgen
[Pipeline] }
[withMaven] artifactsPublisher - Archive artifact pom.xml under org/overturetool/vdm2c/root/0.2.3-SNAPSHOT/root-0.2.3-SNAPSHOT.pom
[withMaven] artifactsPublisher - Archive artifact c/pom.xml under org/overturetool/vdm2c/c/0.2.3-SNAPSHOT/c-0.2.3-SNAPSHOT.pom
[withMaven] artifactsPublisher - Archive artifact c/vdmclib/pom.xml under org/overturetool/vdm2c/c/vdmclib/0.2.3-SNAPSHOT/vdmclib-0.2.3-SNAPSHOT.pom
[withMaven] artifactsPublisher - Archive artifact c/vdmclib/target/vdmclib-0.2.3-SNAPSHOT.jar under org/overturetool/vdm2c/c/vdmclib/0.2.3-SNAPSHOT/vdmclib-0.2.3-SNAPSHOT.jar
[withMaven] artifactsPublisher - Archive artifact c/vdmclibdist/pom.xml under org/overturetool/vdm2c/c/vdmclibdist/0.2.3-SNAPSHOT/vdmclibdist-0.2.3-SNAPSHOT.pom
[withMaven] artifactsPublisher - Archive artifact c/vdmclibdist/target/vdmclibdist-0.2.3-SNAPSHOT.jar under org/overturetool/vdm2c/c/vdmclibdist/0.2.3-SNAPSHOT/vdmclibdist-0.2.3-SNAPSHOT.jar
[withMaven] artifactsPublisher - Archive artifact core/pom.xml under org/overturetool/vdm2c/core/0.2.3-SNAPSHOT/core-0.2.3-SNAPSHOT.pom
[withMaven] artifactsPublisher - Archive artifact core/vdm2c/pom.xml under org/overturetool/vdm2c/core/vdm2c/0.2.3-SNAPSHOT/vdm2c-0.2.3-SNAPSHOT.pom
[withMaven] artifactsPublisher - Archive artifact core/vdm2c/target/vdm2c-0.2.3-SNAPSHOT.jar under org/overturetool/vdm2c/core/vdm2c/0.2.3-SNAPSHOT/vdm2c-0.2.3-SNAPSHOT.jar
[withMaven] artifactsPublisher - Archive artifact core/vdm2c/target/vdm2c-0.2.3-SNAPSHOT-jar-with-dependencies.jar under org/overturetool/vdm2c/core/vdm2c/0.2.3-SNAPSHOT/vdm2c-0.2.3-SNAPSHOT-jar-with-dependencies.jar
[withMaven] artifactsPublisher - Archive artifact ide/pom.xml under org/overturetool/vdm2c/ide/0.2.3-SNAPSHOT/ide-0.2.3-SNAPSHOT.pom
[withMaven] junitPublisher - Archive test results for Maven artifact org.overturetool.vdm2c.c:vdmclib:jar:0.2.3-SNAPSHOT generated by maven-surefire-plugin:test (default-test): c/vdmclib/target/surefire-reports/*.xml
[withMaven] junitPublisher - Archive test results for Maven artifact org.overturetool.vdm2c.c:vdmclibdist:jar:0.2.3-SNAPSHOT generated by maven-surefire-plugin:test (default-test): c/vdmclibdist/target/surefire-reports/*.xml
[withMaven] junitPublisher - Archive test results for Maven artifact org.overturetool.vdm2c.core:vdm2c:jar:0.2.3-SNAPSHOT generated by maven-surefire-plugin:test (default-test): core/vdm2c/target/surefire-reports/*.xml
[withMaven] junitPublisher - Jenkins JUnit Attachments Plugin not found, can't publish test attachments.Recording test results
[withMaven] jacocoPublisher - Archive JaCoCo analysis results for Maven artifact MavenArtifact{org.overturetool.vdm2c:root:pom:0.2.3-SNAPSHOT(version: 0.2.3-SNAPSHOT, snapshot:false) } generated by PluginInvocation{org.jacoco:jacoco-maven-plugin:0.7.6.201602180812@prepare-agent  jacoco-initialize}: execFile: target/coverage-reports/jacoco-unit.exec, sources: src/main/java, classes: target/classes
[withMaven] jacocoPublisher - Archive JaCoCo analysis results for Maven artifact MavenArtifact{org.overturetool.vdm2c:c:pom:0.2.3-SNAPSHOT(version: 0.2.3-SNAPSHOT, snapshot:false) } generated by PluginInvocation{org.jacoco:jacoco-maven-plugin:0.7.6.201602180812@prepare-agent  jacoco-initialize}: execFile: c/target/coverage-reports/jacoco-unit.exec, sources: c/src/main/java, classes: c/target/classes
[withMaven] jacocoPublisher - Archive JaCoCo analysis results for Maven artifact MavenArtifact{org.overturetool.vdm2c.c:vdmclib:jar:0.2.3-SNAPSHOT(version: 0.2.3-SNAPSHOT, snapshot:false) } generated by PluginInvocation{org.jacoco:jacoco-maven-plugin:0.7.6.201602180812@prepare-agent  jacoco-initialize}: execFile: c/vdmclib/target/coverage-reports/jacoco-unit.exec, sources: c/vdmclib/src/main/java, classes: c/vdmclib/target/classes
[withMaven] jacocoPublisher - Archive JaCoCo analysis results for Maven artifact MavenArtifact{org.overturetool.vdm2c.c:vdmclibdist:jar:0.2.3-SNAPSHOT(version: 0.2.3-SNAPSHOT, snapshot:false) } generated by PluginInvocation{org.jacoco:jacoco-maven-plugin:0.7.6.201602180812@prepare-agent  jacoco-initialize}: execFile: c/vdmclibdist/target/coverage-reports/jacoco-unit.exec, sources: c/vdmclibdist/src/main/java, classes: c/vdmclibdist/target/classes
[withMaven] jacocoPublisher - Archive JaCoCo analysis results for Maven artifact MavenArtifact{org.overturetool.vdm2c:core:pom:0.2.3-SNAPSHOT(version: 0.2.3-SNAPSHOT, snapshot:false) } generated by PluginInvocation{org.jacoco:jacoco-maven-plugin:0.7.6.201602180812@prepare-agent  jacoco-initialize}: execFile: core/target/coverage-reports/jacoco-unit.exec, sources: core/src/main/java, classes: core/target/classes
[withMaven] jacocoPublisher - Archive JaCoCo analysis results for Maven artifact MavenArtifact{org.overturetool.vdm2c.core:vdm2c:jar:0.2.3-SNAPSHOT(version: 0.2.3-SNAPSHOT, snapshot:false) } generated by PluginInvocation{org.jacoco:jacoco-maven-plugin:0.7.6.201602180812@prepare-agent  jacoco-initialize}: execFile: core/vdm2c/target/coverage-reports/jacoco-unit.exec, sources: core/vdm2c/src/main/java, classes: core/vdm2c/target/classes
[withMaven] jacocoPublisher - Archive JaCoCo analysis results for Maven artifact MavenArtifact{org.overturetool.vdm2c:ide:pom:0.2.3-SNAPSHOT(version: 0.2.3-SNAPSHOT, snapshot:false) } generated by PluginInvocation{org.jacoco:jacoco-maven-plugin:0.7.6.201602180812@prepare-agent  jacoco-initialize}: execFile: ide/target/coverage-reports/jacoco-unit.exec, sources: ide/src/main/java, classes: ide/target/classes
[withMaven] jacocoPublisher - Archive JaCoCo analysis results for Maven artifact MavenArtifact{org.overturetool.vdm2c.ide:org.overturetool.vdm2c.ide.cgen:eclipse-plugin:0.2.3-SNAPSHOT(version: 0.2.3-SNAPSHOT, snapshot:false) } generated by PluginInvocation{org.jacoco:jacoco-maven-plugin:0.7.6.201602180812@prepare-agent  jacoco-initialize}: execFile: ide/cgen/target/coverage-reports/jacoco-unit.exec, sources: ide/cgen/src/main/java, classes: ide/cgen/target/classes
[JaCoCo plugin] Collecting JaCoCo coverage data...
[JaCoCo plugin] target/coverage-reports/jacoco-unit.exec,c/target/coverage-reports/jacoco-unit.exec,c/vdmclib/target/coverage-reports/jacoco-unit.exec,c/vdmclibdist/target/coverage-reports/jacoco-unit.exec,core/target/coverage-reports/jacoco-unit.exec,core/vdm2c/target/coverage-reports/jacoco-unit.exec,ide/target/coverage-reports/jacoco-unit.exec,ide/cgen/target/coverage-reports/jacoco-unit.exec;target/classes,c/target/classes,c/vdmclib/target/classes,c/vdmclibdist/target/classes,core/target/classes,core/vdm2c/target/classes,ide/target/classes,ide/cgen/target/classes;src/main/java,c/src/main/java,c/vdmclib/src/main/java,c/vdmclibdist/src/main/java,core/src/main/java,core/vdm2c/src/main/java,ide/src/main/java,ide/cgen/src/main/java; locations are configured
[JaCoCo plugin] Number of found exec files for pattern target/coverage-reports/jacoco-unit.exec,c/target/coverage-reports/jacoco-unit.exec,c/vdmclib/target/coverage-reports/jacoco-unit.exec,c/vdmclibdist/target/coverage-reports/jacoco-unit.exec,core/target/coverage-reports/jacoco-unit.exec,core/vdm2c/target/coverage-reports/jacoco-unit.exec,ide/target/coverage-reports/jacoco-unit.exec,ide/cgen/target/coverage-reports/jacoco-unit.exec: 1
[JaCoCo plugin] Saving matched execfiles:  /var/lib/jenkins/workspace/multibranch-pipeline_development/core/vdm2c/target/coverage-reports/jacoco-unit.exec
[JaCoCo plugin] Saving matched class directories for class-pattern: target/classes,c/target/classes,c/vdmclib/target/classes,c/vdmclibdist/target/classes,core/target/classes,core/vdm2c/target/classes,ide/target/classes,ide/cgen/target/classes: 
[JaCoCo plugin]  - /var/lib/jenkins/workspace/multibranch-pipeline_development/c/vdmclib/target/classes 0 files
[JaCoCo plugin]  - /var/lib/jenkins/workspace/multibranch-pipeline_development/c/vdmclibdist/target/classes 0 files
[JaCoCo plugin]  - /var/lib/jenkins/workspace/multibranch-pipeline_development/core/vdm2c/target/classes 153 files
[JaCoCo plugin]  - /var/lib/jenkins/workspace/multibranch-pipeline_development/ide/cgen/target/classes 5 files
[JaCoCo plugin] Saving matched source directories for source-pattern: src/main/java,c/src/main/java,c/vdmclib/src/main/java,c/vdmclibdist/src/main/java,core/src/main/java,core/vdm2c/src/main/java,ide/src/main/java,ide/cgen/src/main/java: 
[JaCoCo plugin] Source Inclusions: **/*.java,**/*.groovy,**/*.kt,**/*.kts
[JaCoCo plugin] Source Exclusions: 
[JaCoCo plugin] - /var/lib/jenkins/workspace/multibranch-pipeline_development/core/vdm2c/src/main/java 108 files
[JaCoCo plugin] - /var/lib/jenkins/workspace/multibranch-pipeline_development/ide/cgen/src/main/java 11 files
[JaCoCo plugin] Loading inclusions files..
[JaCoCo plugin] inclusions: []
[JaCoCo plugin] exclusions: []
[JaCoCo plugin] Thresholds: JacocoHealthReportThresholds [minClass=0, maxClass=0, minMethod=0, maxMethod=0, minLine=0, maxLine=0, minBranch=0, maxBranch=0, minInstruction=0, maxInstruction=0, minComplexity=0, maxComplexity=0]
[JaCoCo plugin] Publishing the results..
[JaCoCo plugin] Loading packages..
[JaCoCo plugin] Done.
[JaCoCo plugin] Overall coverage: class: 85, method: 57, line: 63, branch: 45, instruction: 65, complexity: 40
[withMaven] openTasksPublisher - Scan Tasks for Maven artifact org.overturetool.vdm2c.core:vdm2c:jar:0.2.3-SNAPSHOT in source directory core/vdm2c/src/main/java
[withMaven] openTasksPublisher - Scan Tasks for Maven artifact org.overturetool.vdm2c.ide:org.overturetool.vdm2c.ide.cgen:eclipse-plugin:0.2.3-SNAPSHOT in source directory ide/cgen/src/main/java
[TASKS] Scanning folder '/var/lib/jenkins/workspace/multibranch-pipeline_development' for files matching the pattern 'core/vdm2c/src/main/java/**/*,ide/cgen/src/main/java/**/*' - excludes: null
[TASKS] Found 119 files to scan for tasks
[TASKS] Found 29 open tasks.
Skipping warnings blame since pipelines do not have an SCM link.%n
[TASKS] Computing warning deltas based on reference build #161
[withMaven] Publishers: Pipeline Graph Publisher: 50 ms, Generated Artifacts Publisher: 616 ms, Invoker Publisher: 2 ms, Junit Publisher: 124 ms, Jacoco Publisher: 316 ms, Open Task Scanner Publisher: 192 ms
[Pipeline] // withMaven
[Pipeline] }
[Pipeline] // stage
[Pipeline] stage
[Pipeline] { (Clean up workspace)
[Pipeline] cleanWs
[WS-CLEANUP] Deleting project workspace...
[WS-CLEANUP] Deferred wipeout is used...
[WS-CLEANUP] done
[Pipeline] }
[Pipeline] // stage
[Pipeline] stage
[Pipeline] { (Reporting)
[Pipeline] emailextrecipients
Not sending mail to user casper.thule@eng.au.dk with no permission to view vdm2c-multibranch-pipeline » development #168[Pipeline] emailext
An attempt to send an e-mail to empty list of recipients, ignored.
[Pipeline] }
[Pipeline] // stage
[Pipeline] }
[Pipeline] // node
[Pipeline] End of Pipeline

GitHub has been notified of this commit’s build result

ERROR: script returned exit code 1
Finished: FAILURE